##TITLE=1H_CA-9361-3
 200.13MHz,CDCl3,
 8 sc
 
 8.7.2025
##JCAMPDX= 6.0         $$ Bruker NMR JCAMP-DX V2.0
##DATA TYPE= NMR SPECTRUM
##DATA CLASS= NTUPLES
##ORIGIN= UXNMR, Bruker Analytische Messtechnik GmbH
##OWNER= pz
$$ XWIN-NMR		Version 3.5
$$ Tue Jul  8 15:52:00 2025 Russian Standard Time (UT+4h)  she@DPX200
##.OBSERVE FREQUENCY= 200.1313
##.OBSERVE NUCLEUS= ^1H
##.ACQUISITION MODE= SIMULTANEOUS
##.ACQUISITION SCHEME= undefined
##.AVERAGES= 8
##.DIGITISER RES= 18
##SPECTROMETER/DATA SYSTEM= spect
##.PULSE SEQUENCE= zg30
##.SOLVENT NAME= CDCl3
##.SHIFT REFERENCE= (INTERNAL, CDCl3, 0, 15.5067)
##AUDIT TRAIL= $$ (NUMBER, WHEN, WHO, WHERE, WHAT)
$$ ##TITLE= Audit trail, XWIN-NMR		Version 3.5
$$ ##JCAMPDX= 5.01
$$ ##ORIGIN= Bruker BioSpin GmbH
$$ ##OWNER= she
$$ F:/spectra/data/she/nmr/H-C/1/pdata/1/auditp.txt
$$ ##AUDIT TRAIL=  $$ (NUMBER, WHEN, WHO, WHERE, WHAT)
(   1,<2025-07-08 15:50:37.15 +0400>,<she>,<DPX200>,
      <created by zg, POWCHK disabled, PULCHK disabled
       configuration hash MD5:
       00 E9 B6 7A A2 85 ED C7 34 08 36 98 17 FE 4E 26
       data hash MD5: 16K
       79 B0 50 EC D7 E8 DC 13 79 BB 91 F0 96 11 6B 36>)
(   2,<2025-07-08 15:50:40.85 +0400>,<she>,<DPX200>,
      <Start of raw data processing
       efp BC_mod = 2 LB = 0.25 FT_mod = 6 PKNL = 1 PHC0 = -1196.859 PHC1 = 4.192379 SI = 16K 
       data hash MD5: 16K
       FC 70 CC 7E 0D C3 54 47 CB CE 7C 94 63 0F B1 6A>)
(   3,<2025-07-08 15:51:06.45 +0400>,<she>,<DPX200>,
      <pk PHC0 = -1.266469 PHC1 = 8.400002 
       data hash MD5: 16K
       B0 62 73 C4 3B D2 24 2C C0 61 BE C2 EE FD 69 02>)
(   4,<2025-07-08 15:51:10.65 +0400>,<she>,<DPX200>,
      <abs ABSG = 5 
       data hash MD5: 16K
       A7 D8 2E 8B 9C 4B B2 84 73 35 B2 3D 2B 1A 62 F2>)
$$ ##END=
$$ 
$$ hash MD5
$$ 99 58 CC 71 6B EA D6 EC 92 2F 62 52 73 CC E9 EE
##$RELAX= 
##$RELAX= 
##$RELAX= 
##$RELAX= 
##$RELAX= 
##$RELAX= 
$$ Bruker specific parameters
$$ --------------------------
##$DU= <F:/spectra>
##$EXPNO= 1
##$NAME= <H-C>
##$PROCNO= 1
##$TYPE= <nmr>
##$USER= <she>
##$AMP= (0..31)
100 100 100 100 100 100 100 100 100 100 100 100 100 100 100 100 100 100 
100 100 100 100 100 100 100 100 100 100 100 100 100 100 
##$AQSEQ= 0
##$AQ_mod= 1
##$AUNM= <au_zg>
##$AUTOPOS= <>
##$BF1= 200.13
##$BF2= 200.13
##$BF3= 200.13
##$BF4= 200.13
##$BF5= 200.13
##$BF6= 200.13
##$BF7= 200.13
##$BF8= 200.13
##$BYTORDA= 1
##$CFDGTYP= 0
##$CFRGTYP= 5
##$CHEMSTR= <none>
##$CNST= (0..31)
1 1 145 1 1 1 1 1 1 1 1 1 1 1 1 1 1 1 1 1 1 1 1 1 1 1 1 1 1 1 1 1 
##$CPDPRG= <>
##$CPDPRG1= <>
##$CPDPRG2= <>
##$CPDPRG3= <>
##$CPDPRG4= <mlev>
##$CPDPRG5= <mlev>
##$CPDPRG6= <mlev>
##$CPDPRG7= <mlev>
##$CPDPRG8= <mlev>
##$CPDPRGB= <>
##$CPDPRGT= <>
##$D= (0..31)
0 0.7 0 0 0 0 0 0 0 0 0 0.03 0 0 0 0 0 0 0 0 0 0 0 0 0 0 0 0 0 0 0 0 
##$DATE= 1751975436
##$DBL= (0..7)
120 120 120 120 120 120 120 120 
##$DBP= (0..7)
150 150 150 150 150 150 150 150 
##$DBP07= 0
##$DBPNAM0= <>
##$DBPNAM1= <>
##$DBPNAM2= <>
##$DBPNAM3= <>
##$DBPNAM4= <>
$$ [...]
##$SUBNAM3= <"">
##$SUBNAM4= <"">
##$SUBNAM5= <"">
##$SUBNAM6= <"">
##$SUBNAM7= <"">
##$SUBNAM8= <"">
##$SUBNAM9= <"">
##$SW= 18.0517328524113
##$SWIBOX= (0..15)
0 0 2 0 0 0 0 0 0 0 0 0 0 0 0 0 
##$SW_h= 3612.71676300578
##$TD= 16384
##$TD0= 1
##$TE= 0
##$TE2= 300
##$TE3= 300
##$TEG= 300
##$TL= (0..7)
0 120 120 120 120 120 120 120 
##$TP= (0..7)
150 150 150 150 150 150 150 150 
##$TP07= 0
##$TPNAME0= <>
##$TPNAME1= <>
##$TPNAME2= <>
##$TPNAME3= <>
##$TPNAME4= <>
##$TPNAME5= <>
##$TPNAME6= <>
##$TPNAME7= <>
##$TPOAL= (0..7)
0.5 0.5 0.5 0.5 0.5 0.5 0.5 0.5 
##$TPOFFS= (0..7)
0 0 0 0 0 0 0 0 
##$TUNHIN= 0
##$TUNHOUT= 0
##$TUNXOUT= 0
##$USERA1= <user>
##$USERA2= <user>
##$USERA3= <user>
##$USERA4= <user>
##$USERA5= <user>
##$V9= 5
##$VALIST= <valist>
##$VCLIST= <CCCCCCCCCCCCCCC>
##$VD= 0
##$VDLIST= <DDDDDDDDDDDDDDD>
##$VPLIST= <PPPPPPPPPPPPPPP>
##$VTLIST= <TTTTTTTTTTTTTTT>
##$WBST= 1024
##$WBSW= 4
##$XGAIN= (0..3)
0 0 0 0 
##$XL= 0
##$YL= 0
##$YMAX_a= 396284
##$YMIN_a= -540799
##$ZGOPTNS= <>
##$ZL1= 120
##$ZL2= 120
##$ZL3= 120
##$ZL4= 120
##$ABSF1= 15.48576
##$ABSF2= -2.56609
##$ABSG= 5
##$ABSL= 3
##$ALPHA= 0
##$AQORDER= 0
##$ASSFAC= 0
##$ASSFACI= 0
##$ASSFACX= 0
##$ASSWID= 0
##$AUNMP= <proc_1d>
##$AZFE= 0.1
##$AZFW= 0.1
##$BCFW= 0
##$BC_mod= 2
##$BYTORDP= 0
##$COROFFS= 0
##$CY= -3
##$DATMOD= 1
##$DC= 0
##$DFILT= <>
##$DTYPP= 0
##$F1P= 0
##$F2P= 0
##$FCOR= 1
##$FTSIZE= 16384
##$FT_mod= 6
##$GAMMA= 0
##$GB= 0
##$INTBC= 1
##$INTSCL= 3.241238e-09
##$ISEN= 128
##$LB= 0.25
##$LEV0= 0
##$LPBIN= 0
##$MAXI= 10000
##$MC2= 0
##$MEAN= 0
##$ME_mod= 0
##$MI= 1.114404
##$NCOEF= 0
##$NC_proc= -8
##$NLEV= 6
##$NOISF1= 3.799351
##$NOISF2= 2.8
##$NSP= 0
##$NTH_PI= 0
##$NZP= 0
##$OFFSET= 15.5067
##$PC= 1
##$PHC0= -1198.125
##$PHC1= 12.59238
##$PH_mod= 1
##$PKNL= yes
##$PPARMOD= 0
##$PSCAL= 0
##$PSIGN= 0
##$REVERSE= no
##$SF= 200.130003002245
##$SI= 16384
##$SIGF1= 3
##$SIGF2= 2
##$SINO= 0.751879
##$SIOLD= 32768
##$SREGLST= <19F.Aceton>
##$SSB= 0
##$STSI= 16384
##$STSR= 0
##$SW_p= 3612.71676300578
##$SYMM= 0
##$S_DEV= 0
##$TDeff= 16384
##$TDoff= 0
##$TI= <>
##$TILT= no
##$TM1= 0
##$TM2= 0
##$TOPLEV= 0
##$USERP1= <user>
##$USERP2= <user>
##$USERP3= <user>
##$USERP4= <user>
##$USERP5= <user>
##$WDW= 1
##$XDIM= 16384
##$YMAX_p= 351112401
##$YMIN_p= -1031437
$$ End of Bruker specific parameters
$$ ---------------------------------
##NTUPLES= NMR SPECTRUM
##VAR_NAME=  FREQUENCY,     SPECTRUM/REAL,   SPECTRUM/IMAG
##SYMBOL=    X,             R,               I
##VAR_TYPE=  INDEPENDENT,   DEPENDENT,       DEPENDENT
##VAR_FORM=  AFFN,          ASDF,            ASDF
##VAR_DIM=   16384,         16384,           16384
##UNITS=     HZ,            ARBITRARY UNITS, ARBITRARY UNITS
##FACTOR=    0.220516191357247, 1,           1
##FIRST=     3103.35582991253, 0,            0
##LAST=      -509.360933093249, 0,           0
##MIN=       -509.360933093249, -1031437,    0
##MAX=       3103.35582991253, 351112401,    0
$$ Real data points
##PAGE= N=1
##DATA TABLE= (X++(R..R)), XYDATA
$$ [...]
8226 19726650 19133439 18865238 18498802 17942330 18104574 17952335 17332851 17281744 17371672 17027390
8216 17027390 16897038 16828376 16473423 16353436 16189621 15734673 15663289 15443122 15458857 15758448
8206 15758448 15428466 14872956 14987419 15032895 14879833 14529285 14275675 14423213 14366789 13603747
8196 13603747 13772989 13487385 13409140 11515090 11973086 14671100 14460523 14475692 13640441
8187 13640441 13435717 13566752 13243932 12927931 12869968 12938044 12589346 12597871 12845540 12587263
8177 12587263 12474009 12265991 12555888 12656600 12474358 12089465 11926832 11898912 11698638 11694642
8167 11694642 11374306 11394900 11370417 11107499 10979887 10633207 11153973 11393220 11639761 11449375
8157 11449375 10842598 11357347 11291509 11237260 11226523 10817729 11040564 10787080 11016012 11169836
8147 11169836 10899294 10969153 11080232 11284153 11044929 10899065 10800929 10815634 10911022 11075328
8137 11075328 11306364 11637046 11369140 11219463 10741674 11049203 10785550 10455274 10349263
8128 10349263 10684474 10725687 10670593 10873735 10557809 10620726 10650044 10447308 10035063 9924128
8118 9924128 9804761 10049434 9525296 9244578 9600641 9260646 9031569 8958673 8959801 8815238
8108 8815238 8636114 8679522 8538636 8602259 8153528 8028606 8017219 7820314 7533455 7486848
8098 7486848 7530108 7832620 7840023 7955166 7681275 7244529 7170612 7500575 7435486 7234192
8088 7234192 7007104 7469037 7399399 7144367 7152183 6899417 6967620 6698188 6840607 7023914
8078 7023914 7439980 7518277 7167054 7071174 7024622 6316162 6918317 6659330 6249237 6386596
8068 6386596 6585620 6448213 6474011 7127067 7119016 7116147 6993823 7144372 7266547 6977594
8058 6977594 6662807 6828547 6755692 6979112 7246794 6678317 6483117 6181189 6030036 6296567
8048 6296567 6072924 6138620 6450539 5896499 5184165 5401228 5612949 5327099 5350575 5282319
8038 5282319 5324385 5393144 5169083 4889328 4855493 5070560 4914388 4737832 5146429 4738198
8028 4738198 5032190 5134158 4893463 4743606 4581856 4721168 4977388 4747440 4434311 4382717
8018 4382717 4282838 4355902 4353032 4609492 4466182 4158409 4226310 4245363 4344205 3842736 4038523
8007 4038523 4305933 3572783 3891755 4039755 3992803 4403415 4164433 4363389 4244002 3896592
7997 3896592 4133802 3808562 3759409 4027135 3973060 3946391 4107237 3620286 3509134 3682757
7987 3682757 3558596 3442925 3526172 3228046 3549854 3361397 3301356 3479774 3697957 3637265
7977 3637265 3468597 3427791 3544910 3901888 3873152 4038099 4130802 3519752 2965717 2995247
7967 2995247 3118438 3337134 3016299 2835778 3141252 3377768 3403229 3505536 3829542 3372553
7957 3372553 2847712 2847230 2958393 2448049 2794715 3299246 3035803 2684745 3007815 3231647
7947 3231647 2877646 3316785 3855177 3347945 3029608 3126637 3292431 2960809 3021175 3285920
7937 3285920 3123174 3023161 2994741 2811043 2442582 2320097 2500749 2838606 2464434 2642380
7927 2642380 2960957 2981542 2467831 2324953 2740970 2893113 2853569 3128489 3039354 3108040
7917 3108040 2758214 2852654 2692989 2851575 2955730 2280486 2602100 2736779 2498337 2588992
7907 2588992 2640017 2712700 2698888 2473495 2745782 2813531 2621518 2632626 2609613 2667219 2391307
7896 2391307 2279416 2406305 2678090 2791524 2698396 2499815 2237001 1894818 2418935 2152386
7886 2152386 2104737 2613960 2234629 2292602 2558162 2627658 2321146 2209499 2054739 2181963
7876 2181963 2103636 2027674 2482094 2509842 2575912 2436587 2380357 2394309 2319927 2554347 2435667
7865 2435667 2115094 2124153 2379214 2131001 2220390 2284663 2268586 2406309 2556518 2406207
7855 2406207 2811932 2356455 2337694 2282069 2525913 2596920 2123189 1989004 1938143 2142276
7845 2142276 1838948 2291785 2420393 2291425 2169194 1972293 1824314 2045127 2313838 1967066
7835 1967066 2143893 2250851 2523810 2340002 2006269 2115411 2551804 2503195 1798013 1705111
7825 1705111 1890503 2365663 2301195 2653259 2764409 2279627 2003932 2074673 2234459 2011683
7815 2011683 2387246 2508976 1966440 2210352 2384541 1876195 1887445 2549830 2660242 3219318
7805 3219318 2090509 1134413 1399818 1910291 2416026 2320805 2308069 2617180 2396892 1876425
7795 1876425 2063978 2323656 2728841 2607042 2322386 2264087 1869559 1985058 2198485 2076506
7785 2076506 2320425 2684783 2737009 2515797 2390735 2119268 1548698 1452086 1739726 1870423
7775 1870423 1713124 1543901 1926916 2224987 2533603 2166612 1896990 1856928 1932610 1952551
7765 1952551 2339446 2245938 2082589 2310974 2152362 2507549 2622588 2501775 2430293 2139176
7755 2139176 2150425 2119598 2131280 2261335 2159658 1662251 1800755 2012075 2119543 2415017
7745 2415017 2486711 2390075 1855185 2009127 2361077 1935637 1709997 1841672 1898237 2078328
7735 2078328 2352699 1930720 1738204 1892372 1911560 2122883 2066836 1929936 1738155 1888872
7725 1888872 1782063 2052795 2070148 2393104 2125110 2115851 2264372 2086670 2163471 2273341
7715 2273341 2313539 2201717 2404414 2851601 2811124 2528282 2853954 2194274 2057245 2260528
7705 2260528 2458156 2280939 2257041 1836345 1862927 1913380 2064359 1981094 1837160 2163926
7695 2163926 2381283 2190450 2120938 2301233 2351449 2297818 2279552 2070527 1581914 1923993
7685 1923993 1655122 1929985 1704278 2066419 1777717 1794392 1820552 1664599 1719467 1758396
7675 1758396 2048452 2139216 2643537 2679801 2500325 2293689 1823670 1737739 2343396 2254112
7665 2254112 2078663 2135583 1968789 2003193 1999307 1979609 2314520 2625842 2860920 2319363
7655 2319363 2143553 2238957 2401479 2370807 2280403 2555995 2459776 2118498 2290777 1936660
7645 1936660 2109399 2322166 2393607 2377006 2066704 2120915 2372873 2364531 2320580 2330839 2409021
7634 2409021 2500573 2591121 2574985 2224584 2247695 2196947 2189096 1864563 1967380 2260992 1807123
7623 1807123 1859658 2337351 2080137 2028499 2047078 1838288 1960705 2243063 2612761 2565196
7613 2565196 2536078 2306189 2495458 2318916 2198180 2359298 2341221 2296510 2141632 2227798
7603 2227798 2139700 2294592 2355945 2158071 2093258 2307100 2144141 2258128 2348635 2233015
7593 2233015 2276079 2179691 2126881 2205484 2316706 2396500 2383679 2163405 2073196 2099669 1992315
7582 1992315 2292966 2229869 2638069 2536803 2797925 2701550 2522268 2153731 1894850 1829309
7572 1829309 2168996 2352636 2439510 2532765 2634257 2183317 1855283 2158922 2162248 2010445
7562 2010445 1925390 2169201 2121371 2416072 2456739 2063426 2343363 2495542 2074145 2433446
7552 2433446 2317289 2081997 1392765 1640081 1742240 2366833 2504408 1962593 2173227 1944561
7542 1944561 1783504 2028439 1808479 1638913 1825738 1985154 2594291 2717356 2373012 2401204
7532 2401204 2120559 2161812 2211425 2034333 2313226 2545587 2631894 2585757 2461793 2764443
7522 2764443 2432931 2248410 2474247 2219034 2033074 2326344 2630662 2516818 2301601 2340736
7512 2340736 2617360 2640736 2593049 2117636 2499398 2484851 2586183 2443832 2598677 2421863
7502 2421863 2220326 2274318 2271595 2468977 2156392 2452265 2400946 2578501 2490545 2469928 2610098
7491 2610098 2497630 2631622 2581101 2831914 2820867 2248474 2277117 2603785 2641578 2750974
7481 2750974 2978979 2657260 2665023 2608326 2775075 3100581 2797641 2625866 2410793 2296527
7471 2296527 2293788 2192467 2423315 2670471 2485574 2308111 2600858 2620203 2857457 2734528
7461 2734528 2983164 3048463 2556059 2600656 2573233 2545373 2886490 2679026 2919839 2683250
7451 2683250 2471141 2474433 2784391 2872673 2456322 2052307 2263751 2595903 2599354 2834054
7441 2834054 2856538 2911374 2874290 2840555 2981187 3070913 2876327 3096090 3477463 3636259
7431 3636259 3015591 2867922 3090162 3185668 2727170 3091717 2963314 2804276 3057947 2829486
7421 2829486 2744129 3113666 2928473 2836234 2432919 2414823 2453877 2481887 2702350 2762800 3183606
7410 3183606 3075069 2973372 3018675 2913512 2772231 2917448 3285315 3218446 3248012 3453783
7400 3453783 3349763 3405255 3448932 2982582 3334978 3088412 2873172 3035220 3112378 3697849
7390 3697849 3701288 3400580 3310950 3347147 2929861 3315365 3336732 3299622 3271459 3214538 2875916
7379 2875916 2904260 3394289 3707566 3639649 3506182 3343971 2957220 2827174 3034116 3458051
7369 3458051 3484507 3858666 3722123 3052104 3155060 2983050 2896032 3375621 3762518 3779688
7359 3779688 3596551 3841104 3613590 3073705 2942563 3196365 3398742 3611957 3644103 3760046
7349 3760046 3643943 3368284 3289834 3288101 3442903 3508915 3076327 3726415 3512691 3646363
7339 3646363 3561521 3337006 3404482 3152552 2987099 2911346 3766529 3608175 3288456 3599899
7329 3599899 3718650 3769189 3694288 3638134 3905398 3543268 3640968 3759782 3766386 3862955 3821525
7318 3821525 3537966 4146727 3933969 3823753 4071452 4119722 4126323 4135038 4032887 4192547
7308 4192547 3790589 3983998 3921023 3625377 3658965 4043836 3753094 3895280 4276444 4055000
7298 4055000 3862793 3944211 4509248 4083356 3978518 4030546 4488122 4743679 4580619 4635147
7288 4635147 4340515 3741426 3740811 3839381 3960138 3902696 4215045 4023675 3629010 3621998 4268325
7277 4268325 4152740 3784921 3884430 3925697 4122088 4116660 4237763 4179823 4077846 4239273
7267 4239273 4485616 4439739 4705252 4739259 4533462 4589444 4619757 4315909 4331890 4556229
7257 4556229 4458171 4443290 4281117 4802840 5287812 5025887 4913161 5050833 4566507 4373295
7247 4373295 4374105 4488419 4458825 4332792 4597011 4997747 4917679 4991095 4868117 4742793 4719519
7236 4719519 4949198 5496651 5263573 5310612 5039954 4594855 4916300 5174402 4949851 4633772
7226 4633772 4537576 4908707 5001009 5173404 5332278 4944681 5178377 5199863 5216053 5106535
7216 5106535 5341385 5142494 5231476 5317927 5612384 5400003 5241181 5535796 5267370 5486836
7206 5486836 5376794 5625391 6156642 5932195 5142477 5216329 5391473 5193944 5416110 5714895
7196 5714895 5711304 5507412 5365193 5851927 6133833 6027429 6108896 6245297 5891883 6035745
7186 6035745 5516928 5668803 5920776 6254893 6631402 6652031 6509373 6260187 5998021 6103063
7176 6103063 6027874 6278672 6431118 6489043 6168762 5739170 6087859 6685157 6561795 6320304
7166 6320304 7140316 7203206 7085915 7301439 6872560 6708001 6947380 6826687 6972407 6953204
7156 6953204 6807410 7330591 7982928 7568082 7493603 7688349 7593755 7858548 8525237 8497336
7146 8497336 8196062 8123152 8393103 8232218 7919805 8364217 8271211 8504126 8664477 8661714
7136 8661714 8919635 9109831 9759935 9683125 9372164 9595573 9938683 10159163 10380028 10487828
7126 10487828 10553020 10583065 11012227 11196860 11556605 11781781 12335002 13216323 13679109 13730384
7116 13730384 13827059 14014518 13827030 13443688 13208715 13006726 12813534 12383753 12132197 12265167
7106 12265167 12467471 12270006 11927900 11686147 11787580 11547820 11098745 11013963 10856369 10430092
7096 10430092 10517857 10450339 10338826 10356904 10279099 9949612 9868475 9760028 9627095 9038245
7086 9038245 8690613 8586843 8191782 8346365 7543075 7438846 7528251 7104935 7028033 7004430
7076 7004430 6787464 6390301 6255249 6216834 6154683 6113228 5752031 5864223 6004073 6352594
7066 6352594 6423167 6114991 5977147 5770550 6019067 6265979 6111854 6227158 6034618 6069852
7056 6069852 5980857 6018146 5952368 6316421 6253420 6249601 6000783 5750849 5971075 5698117 5863577
7045 5863577 6144106 5560628 5659811 5770011 5453814 5531522 5409599 5437800 5540456 5904334
7035 5904334 6081871 6091962 6169793 5658478 5728020 5684480 5585502 5589173 5625423 5861585 5416232
7024 5416232 5364304 5766450 5724447 5438043 5172672 5546780 5186470 5202145 5240719 4928660
7014 4928660 5228625 5215893 5446318 5258938 5033437 5056131 5672730 6027821 5877750 5777232
7004 5777232 5851005 5579653 5571287 5427206 5657093 5691966 5752071 5660679 5548750 5824046 5763488
6993 5763488 5891233 5520024 5283398 5435021 5233424 5466669 5948147 5887421 5710218 5793798
6983 5793798 5513571 5379557 5645235 5912178 5681305 5379863 5083855 5049601 4973892 5065506
6973 5065506 5528078 5722062 5155362 5112540 5630869 5602573 5278358 5458601 5279623 5590420
6963 5590420 5774922 5513007 5781747 5847780 6179614 6076581 5790063 5767004 5908489 5650767
6953 5650767 5186518 5468574 5727066 5196831 5334821 5688019 5631619 5467905 5429731 5622565
6943 5622565 5476390 5840425 5929893 5750307 5895073 5567414 5674662 5958978 5740566 5926338
6933 5926338 6063173 5757705 5933606 6352132 6412370 6415941 6500031 6101833 6338369 6058566
6923 6058566 5935807 6006764 6030605 6130066 6367264 6326341 6119562 6204652 6132929 5960884 5749208
6912 5749208 6125521 6469528 6249503 6035544 5993980 6023736 6056181 5729273 6230725 6241564
6902 6241564 6002155 6076873 6119622 6491800 6163042 6093326 6227407 6263633 6636563 6575825
6892 6575825 6304866 6489881 6645956 6635946 6454314 6129031 6046313 6299768 6423059 6306639
6882 6306639 6647596 6666565 6510083 6689749 6661513 6641792 6575086 6430839 6902103 7150994
6872 7150994 7084845 7265802 7251006 6664228 6352566 6702502 6780014 7068824 6899174 6722426
6862 6722426 6646329 6755769 6841303 6514592 6428520 6667652 6832892 6933211 6569897 6588254
6852 6588254 6419702 6276327 6292870 6418483 6534156 6510206 6236828 6148256 6636718 6741976
6842 6741976 6607828 6395131 6663040 6644912 6673860 6594016 6609938 6706887 6890679 6628181
6832 6628181 6797133 6763771 6429836 6407619 6021025 5847952 6075595 5870048 6171755 6540372
6822 6540372 6845832 6760624 6481420 6407680 6706142 6566590 6594272 6650182 6604393 6421851
6812 6421851 6342466 6088364 5865366 6527822 6856914 6999578 6917862 7015823 6774703 6736743
6802 6736743 6975483 7004345 7028355 6795509 6946149 7078314 7006301 6955903 6925042 7172425
6792 7172425 7122903 6646235 6458498 6646905 6406483 6378377 7024009 7367429 7075831 7135536
6782 7135536 6862522 7192026 7053050 7277208 7187162 7230006 7332463 7313210 7584604 7156817
6772 7156817 7045659 7358752 7074701 7085281 7189716 7208986 7253798 6806539 7113313 7434742
6762 7434742 7466556 7519105 7652047 7918667 8004414 7871702 7417434 7776564 7649389 7330368
6752 7330368 7334868 7358471 7373461 7835034 8136825 7716109 7744667 7660251 7404715 7141354 7494679
6741 7494679 7945234 7572592 7538258 7464992 7621044 7834212 7854982 7754177 7485153 7483808
6731 7483808 7299225 7661215 7872475 7923851 8136129 8225898 7835171 7888506 8040422 8159692
6721 8159692 8326324 7842927 7914792 8392553 7889510 8045823 8553970 8577551 8302225 8298269
6711 8298269 8464672 8383553 8087654 7913382 8120369 8197844 7981028 8297256 8395468 8387980
6701 8387980 8340541 8630482 8816120 8563712 8255416 7965563 7744854 8271385 8383088 8794882
6691 8794882 9022349 8865184 8753548 8491376 8507908 8582338 7920912 7943683 8344553 8642814
6681 8642814 8431253 7931008 7941812 7881938 8353714 8458332 8510054 7938943 8124724 8479049
6671 8479049 8674511 8792120 9024428 8751737 8250492 8324285 7922588 8316801 8620699 8605674
6661 8605674 8595232 8389365 8602975 9091930 8681872 8627400 8725772 9061601 9283019 9087206
6651 9087206 9083363 8924950 9221956 9096242 8970441 9083990 9263716 9265001 9286451 9342692 9757287
6640 9757287 9493923 9603879 9650568 10093925 9987443 9562643 8994626 9243831 9335563 9774111
6630 9774111 10082152 9676229 9710969 9723147 9965721 9663331 9621235 9765125 9560133 9808064
6620 9808064 10018557 10013908 9977159 9716862 10220961 10539036 10229015 9999342 10359843 10127222
6610 10127222 10162537 10518280 10323436 10401444 10180209 9959552 9948978 10103884 10139945 10186887
6600 10186887 10053693 10258854 10489328 10284573 10421718 10682276 10827235 10670240 10205822
6591 10205822 10141235 10548652 10696363 10540687 10212895 10132908 10275428 10801162 11060564 10907245
6581 10907245 11008965 10656641 10469005 11152053 11070471 11157196 11125197 11371968 10958847 10764624
6571 10764624 11101014 11043978 10994749 10773808 10883071 11098291 11373606 11424290 11267360 11498830
6561 11498830 11595532 11601912 11578798 11372390 11373339 11795092 11436804 11871407 11974288 11953802 12037548
6550 12037548 11772095 11799826 11716984 11768661 11426694 12046735 12378743 12375218 12234579 12007712
6540 12007712 11881472 12423556 12493346 12338061 12570060 12597807 12695259 12824996 13116664 12799127
6530 12799127 12626371 13200954 13182915 13131824 12647129 12456226 12717270 12865002 13128188 12972514
6520 12972514 13284758 13065118 13421353 13831157 13612161 13366592 13161746 13299952 13261852 13397403
6510 13397403 13372544 13672542 13769301 13699866 13784606 13856313 13589304 13469265 13471215 13766868 13780323
6499 13780323 14150248 13621376 13517579 13451117 13386137 13738185 13814332 13823393 13953347 14253889
6489 14253889 14527815 14783148 14869829 15154216 14818321 14490891 14568888 14746613 14294993 14837558
6479 14837558 14766914 15079594 15232921 15167334 14922518 14994627 15254578 15065558 15285804 15427501
6469 15427501 15200595 15246854 15388571 15204582 15535730 16071657 15751824 16044924 16365796 16217369
6459 16217369 16557456 16434809 16258554 16770712 16807485 16745937 16645228 16717631 16726007 16699260
6449 16699260 17184998 17381119 17467641 17410214 17613019 17644646 17563589 17421488 17640595 17916190
6439 17916190 18239829 18076883 17670043 17767161 17960950 18413831 18630886 18380704 18556180 18890019
6429 18890019 19120967 18934382 18923788 18622101 18318821 18619716 18956332 19323690 19000242 19138729
6419 19138729 19571568 19801025 19619297 19399112 19441085 19212290 19125200 18970807 19264130 19518608
6409 19518608 19793980 19805198 20041146 20333571 19979870 19774634 20192172 20470489 20635666 21142957
6399 21142957 21184806 21055779 21585814 21479959 20992999 20996358 21107465 21183198 21309064 21512963
6389 21512963 21656617 22148963 22196107 22106815 22618782 22588289 22352331 22908773 22929715 23015869
6379 23015869 23712373 23399101 23543591 23643960 23546078 23991456 24559951 24801121 24914831 25007495
6369 25007495 25005832 25121356 25665227 25579787 25918358 26105114 25853013 25760189 25743914 26152093
6359 26152093 26053864 26283225 26289320 26140903 26187484 26630972 26901715 26879992 26995936 27020826
6349 27020826 26968125 26940834 26824725 26983739 26656865 27090420 27170786 26625884 26684032 26951153
6339 26951153 26401443 26894966 27377843 27026500 27248331 27151561 27209904 27331702 27274359 26988663
6329 26988663 26572402 26377180 26405045 26218656 26408720 26447481 26244063 26550037 26726681 26571536
6319 26571536 26160193 25765045 25982765 26020653 25913855 26337596 26463761 26179181 26013373 25494367
6309 25494367 25400459 25799878 25834724 25606219 25553177 25571012 25569660 25299924 24985501 24980146 25132177
6298 25132177 25713565 25726412 25769994 25765029 25238690 25058912 25256484 25382800 24916193 25134641
6288 25134641 25230179 25730711 25914768 26314225 26296528 25897494 26045363 26203208 26001427 25504339
6278 25504339 25463539 25591130 25586971 25280534 25537287 25494724 25564345 25443465 25558079 25917283
6268 25917283 25615639 25907843 26107287 26183024 26361796 26442650 26354472 26140660 26345051 26186827
6258 26186827 26572221 26172729 26269109 26588938 26542825 26488800 26574257 26706270 26186641 26423680
6248 26423680 26569047 26795025 26385653 26233491 26588898 26530992 26971782 26893610 26809404 26770776
6238 26770776 26697025 26984554 26881867 26446254 26875882 26958437 26874861 27083655 27310379 27252444
6228 27252444 27067738 27099250 27128744 27306994 27669740 27544576 27407590 27156106 26956598 27483330
6218 27483330 27534105 27705275 27668758 27273040 27496927 27716519 27644140 27319723 27612776 27475331
6208 27475331 27231160 27548548 27361516 27586634 27713405 27471676 27262124 27208085 27797331 27999769
6198 27999769 27641779 27465959 27481209 27650418 27916943 28042140 27882684 27855354 27917749 28457828
6188 28457828 28307496 28384360 28081399 28037400 27973756 28027163 28006809 27795934 28049356 27982260
6178 27982260 27668970 27755523 28224491 28356770 28312911 28712670 28932591 29004842 29133388 28894495
6168 28894495 29122292 29165914 29215605 29360049 29170112 29403693 28950824 29253963 29341351 29437015
6158 29437015 29670835 29422278 29478931 29125871 29237566 29688362 30045441 30046134 29797352 29841263
6148 29841263 29821197 29773866 30081867 30328788 30196688 30569373 30703484 30141800 29896695 30048722
6138 30048722 30343918 30199710 30212229 30268797 30082869 30136038 30164933 30620005 30545678 30607789
6128 30607789 30735273 30929859 31287154 31537848 31595963 31402593 31240547 30940082 31063943 30769424
6118 30769424 30888145 30893883 31192977 31064479 30949794 31199025 31679587 31325499 30857393 31180656
6108 31180656 31449481 31791043 32000209 31725873 31545435 31622211 32069074 31993885 31720135 31797985
6098 31797985 31847742 31740365 31951270 32314473 32319349 32038273 32092544 31917594 31914950 32289790
6088 32289790 32631322 32752087 32718173 32683876 32476071 32621961 32859305 32806110 33139282 32990297
6078 32990297 32969242 33209525 33153451 32804033 32890120 33527656 33424165 33700697 33816506 33435545
6068 33435545 33442283 33525254 33490249 33825229 33693969 33925334 34207891 33885631 33774264 34125945
6058 34125945 34159286 34264853 34246463 34401856 34801280 34724629 34637833 34562773 34822352 34960418
6048 34960418 34701462 34791234 35132102 35186218 34860541 34825015 35147149 35153411 35360693 35495893
6038 35495893 35209525 35244525 35300805 35024131 35291758 35844827 35719646 35578625 35728097 35676668
6028 35676668 36092603 36071140 35857858 36086722 36132133 35935362 36032692 35916453 35834789 36588327
6018 36588327 36355260 36040954 36009064 36098208 36396651 36711526 36735461 36609833 36202616 36315188
6008 36315188 36836299 36760096 36404182 36341507 36180684 36074133 36211719 36628159 36766496 36695550
5998 36695550 36639702 36522008 36409213 36456613 36911294 36617225 36325375 36533921 36967507 37191876
5988 37191876 36956085 36842004 36698538 36561917 36720485 36955488 36907448 36722027 36317937 36151531
5978 36151531 36430840 36761214 36736378 36872143 36800508 36972300 37139090 37393668 37393667 37459826 37280938
5967 37280938 36979615 36954396 37057186 36980247 36871913 37025663 36982163 36836863 36579292 36693123
5957 36693123 36757115 36957103 37018877 36812763 36952677 37157751 37028413 37277448 37265167 37466403
5947 37466403 37401693 37347117 37319302 37349626 37191957 37224581 37342046 37517730 37220930 37300960
5937 37300960 37287167 37356466 37096134 37077437 37478754 37168837 36764818 36873100 36964364 37302534
5927 37302534 38010441 37870574 37671261 37951190 37983585 37513544 37539688 37744874 37989739 37523276
5917 37523276 37808510 38277160 38194268 37872817 38197158 38198807 38130706 38641473 38416268 38417116 38639868
5906 38639868 38692363 38677219 38677373 38755901 38350386 38532002 38882604 38996016 39276439 39405940
5896 39405940 39150998 38891338 38713368 38928389 39091648 39272666 39487106 39683437 39701087 39822652
5886 39822652 39646504 39267321 39138364 39464214 39482094 38903029 38959416 38824795 39011942 39140590
5876 39140590 38807181 38490288 38548132 38900580 38965024 38964347 39056797 38734115 38556174 38511884 38516636
5865 38516636 38765843 38600082 38285185 37933929 37438086 37527087 37672268 37579512 37190849 37233159
5855 37233159 37174012 37164067 36631017 36519718 36146443 36073956 36472615 36874749 36720223 36305335
5845 36305335 36135982 36113076 36466546 36295056 36067898 36084939 36047912 35885843 35655703 35742743
5835 35742743 35155543 35364483 35312481 34724468 34692991 34660018 34673904 35007733 34829976 34678214
5825 34678214 34584995 34972404 35017803 34729487 34811972 34685081 34785505 34879155 35173834 34717829
5815 34717829 34707833 34823149 34923165 34839399 35248948 35095867 34894415 34759426 35084358 34951704
5805 34951704 35111407 35380745 35409316 35496369 35449899 35174216 35480380 35869473 35679313 35058343
5795 35058343 35048645 35244699 35244198 35449801 35290634 35062848 35122778 35072998 35083213 35414719 35338754
5784 35338754 35198373 35333313 35321185 35530407 35245243 35534405 36134975 36075511 35936200 35824658
5774 35824658 35700800 35725868 35796037 35628590 35555754 35379900 35879591 36432355 36152734 36040136
5764 36040136 36021276 35904535 35863832 35998135 36531932 36539882 36000808 35681208 36191399 36161866
5754 36161866 35869009 36317977 37019387 37130016 36709483 36621947 36467232 36286976 36265753 36345613
5744 36345613 36427742 36325286 36035934 36050392 36376565 36312966 36522960 36528775 36290932 36124840
5734 36124840 36419503 36383042 36235182 36102811 36182419 36371111 36196012 36643446 36674076 36501592
5724 36501592 36510545 36423912 36436114 36247183 36407904 36189100 36142162 36280780 36424536 36784962
5714 36784962 36762828 36311346 35956217 35884368 36158500 36525069 36512766 36644323 36621101 36380882
5704 36380882 36243364 36053024 36366509 36330598 36227412 36453947 36603010 36560013 36513928 36210136
5694 36210136 35776158 36189664 36035567 35897111 36553123 36605039 36200755 36593073 36527516 36527888
5684 36527888 36402295 36411306 36161349 35861653 35816743 36173076 36318908 36170586 36616375 36914760
5674 36914760 36845365 36448825 36476740 36448935 36483128 36590799 36832675 36789824 36808175 36558777
5664 36558777 36658627 36645021 36588209 36713564 36619964 36614111 37074479 36680741 36578327 36962549
5654 36962549 37480130 37440748 37247147 37134433 36945598 36777284 36864513 37224761 37280281 37011933
5644 37011933 36625687 36230075 36685231 36829929 36586016 37168177 37021089 37228210 37130236 37027602
5634 37027602 37609908 37597416 37293050 37500597 37525058 37295752 37342885 37505213 37355555 37381688
5624 37381688 37396604 37439907 37179735 37279937 37656691 37724847 37454440 37377900 37228949 37456670
5614 37456670 37794769 37833639 37528305 37528205 37407992 37868070 37978433 37792189 37644988 37500711
5604 37500711 37670797 37671470 37825964 37700520 38015242 38104622 38114969 38150180 38156620 38176705 38331607
5593 38331607 38373666 38293198 37987441 38480947 38293786 38055584 38254441 38606382 38985351 38687336
5583 38687336 38680321 38541144 38449691 38642454 38309737 38581653 38687056 38574778 38707957 38633695
5573 38633695 39155534 39254592 39205624 38937473 38998443 39138527 39019891 39193849 39279958 39296070
5563 39296070 39342033 39291244 39405256 39179448 38726100 38826298 39592322 39823036 39969118 39859454
5553 39859454 39710145 39654265 39843087 39603451 39955997 40635467 40226241 40108506 40121194 40223510
5543 40223510 40166357 40378974 40586100 40383557 40393839 40628470 40639932 40410469 40659537 40690828
5533 40690828 40605000 40641711 41051529 41271459 41301656 41198842 41338040 41176503 40977950 41578081
5523 41578081 41762476 41594994 41829176 41843083 41896520 41909089 41680358 41535435 41800193 41567903
5513 41567903 41375554 41585251 41552338 41472015 41613940 41695404 41863068 42211913 42223840 42520678
5503 42520678 42450764 42480059 42198145 42381582 42452411 42491623 42298454 43034083 43250310 42653729
5493 42653729 43340478 43319634 43372365 43243949 43286447 43713998 43820642 43785023 43522419 43675316
5483 43675316 43767399 43626272 44019301 43928891 43496923 43995361 43717153 43728394 43994953 44031173
5473 44031173 44305060 44265187 44038189 44681554 44842321 44820244 44844459 44381561 44899795 45173598
5463 45173598 44819465 44928879 44946519 45100054 44969544 45215551 45294363 45135017 45424035 45686309
5453 45686309 45749175 46016498 46026109 45925973 45627262 45466880 45718119 46077356 46076523 46342837
5443 46342837 46360371 46130422 46599989 46641060 46696345 46924170 46594043 46091085 46409551 46348639
5433 46348639 46266678 46267908 46082418 46195742 46258837 46295123 46073345 46114342 46120431 45871301 45842815
5422 45842815 46053258 46074301 45972519 45883219 45939479 45916243 45867974 45888943 45753994 45529301
5412 45529301 45334274 45894187 45801083 45669735 45665842 45716716 45496176 44973900 45302369 45516679
5402 45516679 45327250 45596663 45463061 45263350 45497003 45469540 45377572 45070559 45154342 45146966
5392 45146966 45064022 45438190 45016725 44570051 44425893 44322228 44655465 44116345 43731064 44261405
5382 44261405 44482875 44166269 44366785 44804324 44672152 44506506 44306208 44047941 44042859 44338222
5372 44338222 44506949 44463620 44398070 44447734 44095412 44136995 43975083 44359599 44316486 44317256 44350198
5361 44350198 44280125 44159501 44400228 44384815 44439249 44465830 44545334 44832930 44833795 44928702 44800009
5350 44800009 44780590 44918760 45025872 45075928 44759352 44670528 44939706 45356482 45345119 45378803
5340 45378803 45574246 45511300 45666223 45822891 45636814 45508411 45298534 45049979 45094933 45253680
5330 45253680 45176557 45225907 45444850 45673000 45529001 45566678 45650628 45755618 45879617 45821854
5320 45821854 46213476 46251495 46191975 46104290 46454218 46303205 46217657 46133209 46569000 46868518
5310 46868518 46657860 46789300 47019811 46987719 46734935 46892894 46781350 46376701 46939154 47010856
5300 47010856 47073043 47307759 47287970 47114919 47422473 47234353 47521134 47724942 47592822 47946120
5290 47946120 47985970 47986291 48068405 48246711 48561803 48558111 48362673 48436168 48885829 49021466 48946830
5279 48946830 48838628 49002431 48903306 49041335 49028519 49308157 49678917 49668196 49850517 49517999
5269 49517999 49450138 49808531 49719866 49458431 49738398 49810295 49810785 49931416 50496087 50963430
5259 50963430 50899972 50199099 50144881 50650400 50940784 50522803 50835388 51328532 51564213 51321056
5249 51321056 51108100 51320135 51203189 51389761 51433287 51745679 51952594 51740734 51953379 51777178
5239 51777178 51725208 52066984 52530884 52556122 52628847 52764730 52759643 52996810 52898369 52725981
5229 52725981 53138157 53705672 53793064 54030030 54136629 53923442 54246433 53929423 53803145 53976573
5219 53976573 54113048 54228862 54321425 54753300 54293416 54871958 54956672 54815768 55273504 55420196
5209 55420196 55464431 56126663 55816622 55812524 55926402 56135582 56255034 56378222 56520388 56673796
5199 56673796 56950148 56787480 56778060 56891887 57253826 57467459 57087433 57100430 57601660 57918627
5189 57918627 58190858 58354339 58055929 57897541 58404549 58854683 59291288 59525010 59317105
5180 59317105 59500588 60185481 59623479 59389933 59516790 59804297 60244598 60788943 60698724 60786455
5170 60786455 61046141 60996460 61462603 62005619 61739182 61535487 62035917 62314478 62779962 63002179
5160 63002179 63000441 63421873 63741293 64173251 64259682 64000084 64142492 64591792 64650375 64682274
5150 64682274 65227441 65770930 65541238 65527274 65819969 65841210 65647629 65657963 65979057 66598289
5140 66598289 66875716 66776149 66680846 67038466 67180084 67218418 67348144 67644306 67648616 67350840
5130 67350840 67559825 68211225 68439000 68303213 68326704 67982650 67916369 68674031 68921083 68783421
5120 68783421 69117435 69237109 69286479 69655816 70030794 69996410 70173847 70297771 70533277 70787660
5110 70787660 70723282 71210316 70899153 70830026 71259798 71624803 71655944 71888841 71937501 72331356
5100 72331356 72688468 73048922 73373253 72862569 72842178 73258928 73556443 74128735 74400169 74399017
5090 74399017 74399150 74887757 75153912 75159081 75508771 75766798 75979994 75894495 76300195 76717435
5080 76717435 76974045 77101417 77404931 77689805 78046964 78293584 78459511 78572641 78875778
5071 78875778 79034437 79109040 79553804 79828426 79884894 80491211 81056782 81429059 81619610 81638852
5061 81638852 81707197 82489451 82693843 82774954 83390455 83874305 83660866 84054088 84466512 85195699
5051 85195699 85574401 85634367 86146072 86506667 86809173 87713325 88085477 88532963 88859150 89139131
5041 89139131 89392882 89934019 90426842 90719647 90919953 91625445 92611921 92917498 93121335
5032 93121335 93512723 94285955 95319669 95589713 95828451 96319382 96946695 97299700 98049714
5023 98049714 99052252 99650285 100459443 100713284 101363277 102291824 103009811 103566054 104323413
5014 104323413 105271625 106039896 106592186 107200086 108362524 109030487 109706318 110460458 111161556
5005 111161556 111813115 112595763 113501787 114354342 115358976 116121027 117334519 118203843 119485720
4996 119485720 120518636 121686750 122875939 123632498 124422705 125522924 126601967 128065776
4988 128065776 129067648 130108012 131582406 133253401 134386111 135625122 136760143 138092538
4980 138092538 139028052 139800030 140914507 141779899 142868201 143715926 144950993 145992482 146949123
4971 146949123 148025939 148860255 149524604 150138284 151399367 152024616 152550281 153413823 154169826
4962 154169826 155016483 155283159 155467038 156294799 156775632 157500692 158390593 158395329 159030652 159493864
4952 159493864 159993684 161036788 161846259 162672232 162625358 163678200 164550706 165373214 166047124
4943 166047124 166850040 167864273 168878007 169690160 169775540 169897545 170227517 170331990 170587208
4934 170587208 170735078 170691254 170878169 171187972 170971489 170681491 170645101 170373799 170641786 170779173
4924 170779173 170627339 170532164 170929263 170683935 170618943 170680883 170571821 170710781 171042160 171431593
4914 171431593 171078004 170282767 169885200 169943521 169230462 168457654 168584174 168083265 167666634
4905 167666634 167092515 166571417 166294268 165860511 165281584 164264912 163469597 162930929 162423827
4896 162423827 161816168 160928048 160183930 159481024 158818686 158054237 157630122 156898845 156326145
4887 156326145 156088346 155213889 153720350 152682870 152252217 151422243 150734509 149902352 148786259
4878 148786259 148312813 147406566 146521165 145572784 144495197 143902486 142771307 141821730 141391428
4869 141391428 141083358 139828729 138706730 137678994 136589492 135911046 134924412 134506366 133509214
4860 133509214 132326686 131659780 130758532 129824698 128800069 128002932 127512554 126405855 125668791
4851 125668791 125092565 124469011 123449430 122694364 122071952 121427067 120386231 119757033 119216475
4842 119216475 118151636 117199235 116526270 116193104 115229041 114632667 113933386 113347683 112759697
4833 112759697 112029413 111290895 110348853 109972296 109131169 108444547 108026478 107447932 106495120
4824 106495120 106112542 105646457 105157708 104779364 104137165 103488110 102985210 102690957 102255342
4815 102255342 101533745 100948436 100635171 100441713 100168557 99897655 99897442 99548537 99110959 98469749
4805 98469749 98242104 98112185 98101189 97684630 97074343 96968232 97084124 96721468 96243739 96134415
4795 96134415 96283281 96353490 95829998 96018651 96054578 95153174 94647459 93844286 93516361 93182740
4785 93182740 92854541 92591951 92209080 91565588 90896054 89894890 89588267 89058476 88146535
4776 88146535 87410059 87020581 86475289 85829030 85123147 84451433 84095690 83471852 83416783 83001535
4766 83001535 82281941 81716476 81169623 80819710 80569511 79781325 79098534 78178936 77638272
4757 77638272 77403162 76541816 75823985 75372845 74482268 73968046 73602842 73007806 72909725 72821184
4747 72821184 72764597 71887549 71729674 71764023 71131865 70749108 70587136 70231599 69712274 69732141
4737 69732141 69781755 69640908 69318515 69002145 68685499 68398338 68425743 68354037 67836414 67449656
4727 67449656 67104563 66940236 66443719 66317215 66151012 65689396 65907071 65515141 65469058 65473815
4717 65473815 64808175 64373026 64343555 64608527 64659818 63925048 63897482 63394428 63435957 63230520
4707 63230520 62981045 63016571 62803892 62455463 62232430 61939973 61562632 61928437 61547492 61407967
4697 61407967 60868259 60737015 60265901 60230831 60053231 60088248 60215393 60061474 59684320 59161567
4687 59161567 58627011 58391728 58734369 59042366 58937094 58237654 57709905 57812474 57433683
4678 57433683 57409108 57442676 57199030 56915737 56806177 56586996 56448882 56315682 56177626 56294029
4668 56294029 55834474 55554339 55215083 55111546 54923661 54643106 54462900 54472426 54489131 54366679
4658 54366679 54240757 53915200 53969390 54024369 53684372 53477891 52962835 52888724 53262185 53469720
4648 53469720 53086659 52705517 52646694 52642858 52269167 52311426 52380159 52101966 51626695 51651204
4638 51651204 51785901 51591674 51459202 51068237 50902683 50351686 50154687 50142957 50049971 50290158
4628 50290158 50422677 49916028 50248768 50120237 49803865 49738684 49386818 49501427 49584715 49709420
4618 49709420 49205963 49520265 49724315 49394840 49327499 49624005 49265198 49159112 49181046 49093297
4608 49093297 49188005 48948594 49097189 48864599 48514712 48691715 48087351 48148747 48898645 48547175
4598 48547175 48348216 48715708 48882310 48818211 49188898 49253259 48682551 48280793 48272304 48110714
4588 48110714 48215476 48590916 48587386 48355481 48456699 48586015 49031116 48851968 48725525 48786122
4578 48786122 48729429 48895779 48904380 48733360 48894586 49037322 48605003 48665756 48885846 49167476
4568 49167476 48936740 48964202 49152409 48967928 49404004 49315300 49498793 49413580 49076249 49663336
4558 49663336 49500518 49352873 49532016 49405313 49693034 50096220 50088378 49942220 49824595 49918999
4548 49918999 50058818 50125304 50134714 50278251 50159755 50082303 50345457 50584806 50910814 50891994
4538 50891994 50896208 50860373 50524054 50687719 51274861 51277787 50930993 50877709 51321410 51222329 50963104
4527 50963104 50716418 50944659 51180908 51040709 51117560 51287524 51084662 50609059 50906847 51201874
4517 51201874 51261870 51062496 50976320 50872751 50872915 51097329 50876800 51180577 51513626 50822104
4507 50822104 51091823 51600500 51329754 50844008 51144000 51065553 51221140 51535538 51530091 51487737
4497 51487737 51426637 51300431 51013771 51199910 51268546 51585086 51405614 51536087 51292197 50968551
4487 50968551 51279755 51160207 51252203 51372624 51452938 51716707 51497745 51570338 51752460 51630723
4477 51630723 51267355 50825889 51326881 51604785 51648366 51825782 51582735 51406593 51368478 51513249
4467 51513249 51646250 51765630 51976865 51957653 52040844 51858027 51654567 51710562 51793520 51786404
4457 51786404 51800659 51855209 51790877 51793326 51784441 51952059 52452619 52282268 52194578 52564017 51940798
4446 51940798 51903426 51741938 51626665 52240320 52313470 51837837 52209108 52161666 52226188 52387115
4436 52387115 52312844 52305696 52053982 51985571 52037229 52372537 52795864 52726812 52303415 52656583
4426 52656583 53086520 52634921 52364890 52237250 52497625 52823315 52614001 52500590 52350120
4417 52350120 52726170 53039270 53230549 52893202 53199541 53095433 53256971 53814742 53985857
4408 53985857 53911554 53581950 53803339 54007915 54024676 53810358 53603129 54135976 54257212 54327680
4398 54327680 54487673 54324700 54338197 55003851 55027442 55094990 55323344 55112521 54784187 55124237
4388 55124237 55714649 55820077 55664388 55751634 55750146 55824061 55686567 55269300 55851051 56305316
4378 56305316 56362666 56641266 56587318 56517987 56735263 57077707 57509808 57413565 57058930 57325824
4368 57325824 57825520 58042723 57768406 57575842 57961020 57728962 58010764 58189896 58659149
4359 58659149 58926714 58626031 58797205 59087201 58928816 59336098 59694383 59796920 59999952
4350 59999952 60177233 60054952 60063787 60787311 61019229 60568778 60648333 60475683 60684826 60625729
4340 60625729 60567321 60745968 60959853 61111644 61208685 61274553 61081300 61308212 61388049 61453524
4330 61453524 61561369 62048753 61917597 61743480 61906635 61968621 61969638 62460551 62812453 62062901
4320 62062901 62124999 61998016 61737576 61973123 62210023 61856459 62217074 62713835 62854637 63084947
4310 63084947 62863952 62890281 62651236 62631403 62772690 62908276 62678332 63298605 63685425 63283202
4300 63283202 63568206 64108525 64104139 64470437 64695834 64556431 64740232 64800545 65344382 65262574
4290 65262574 65570472 65879730 65625715 65677594 66203960 66614104 66796617 67149161 67657839 67094589
4280 67094589 66928585 67202201 67741821 67817097 67853976 68473823 68990960 69073714 69302430 69879384
4270 69879384 69864641 70282488 70898840 71274130 71807744 71932642 71857909 72144925 72737827 73311352
4260 73311352 73602042 74161049 74378536 74888076 75447848 76056350 76796356 77364948 77423951 78404907
4250 78404907 78567838 78701270 79347117 79664353 79775139 80519759 81068550 81555243 81779926
4241 81779926 82460579 83252444 83931380 84246193 84596833 85114233 85439192 86131070 86687357
4232 86687357 87119589 87570637 87705337 88454672 88727230 88926015 89619148 89921548 90064875
4223 90064875 90739578 90811239 90455006 90480200 90614267 90307265 90339686 90823900 90875661 90660743
4213 90660743 90703393 90797930 90509075 90661208 90278519 90215080 90098487 89854302 89921603 89765227
4203 89765227 89081749 88780452 88271644 87598771 87646998 87033322 86358713 86165467 84976084
4194 84976084 84300438 83982834 83678577 83243170 82852646 81943041 81050383 80490296 79420121
4185 79420121 79000420 78292598 77891894 77235069 76601120 76306277 75701346 74611025 74420552
4176 74420552 74005221 73059103 72439211 71638252 71148814 70631485 70098247 69178382 68872032
4167 68872032 68659078 68045550 67283149 66978004 66622177 67121588 66642165 66073248 65783002
4158 65783002 65489156 65421667 64941810 64166339 64294807 63945094 63896287 63486244 63005482 62910139
4148 62910139 62821910 62519764 62251768 62198950 62021457 61975534 61928019 61460750 61458299 61409796 61526895
4137 61526895 61550515 61617026 61947341 61569874 61311219 61335232 61033018 61141271 61325791 61226950
4127 61226950 61083099 60843371 61124343 61138611 61126106 61071536 61387269 61112651 60839902 60938842
4117 60938842 60698638 60606330 60879771 60871902 61046365 61203886 61181450 61016572 61697266 61984476
4107 61984476 61620061 61440933 61704548 61443681 61040455 60790932 61134249 61351319 61313407 61400616
4097 61400616 61803253 61555332 61312509 61649146 61971203 62300605 62624434 62414373 62181461
4088 62181461 62144127 62045386 62239449 62261345 62331398 62304106 62521218 62607783 62348343 62610986
4078 62610986 62987429 62840450 62912510 63053586 63269334 63056423 63142514 63329993 63095025 63319018
4068 63319018 63421235 62960251 63123338 63204591 63426376 63501780 63397536 63425522 63971710 64260152
4058 64260152 64231973 63961988 63840078 64125102 64235368 64557455 64396276 65029012 65141493 64834833
4048 64834833 64669400 64528721 64282103 64573508 64737681 64914683 64902958 65162021 65672433 65868481
4038 65868481 65729059 65796865 65511356 65277994 65503076 65729994 65965624 66122168 65791257 65699298
4028 65699298 65913562 65846573 66250711 66248611 66232957 66206645 66372289 66860679 66895130 67022117
4018 67022117 66883073 66922710 67064070 67185503 67142231 67159914 67139817 67735271 67941145 67705575
4008 67705575 68091354 68203617 68297190 68045354 67741887 67812187 68302115 68083614 68190286 68280433
3998 68280433 68057281 68074260 68398698 68564797 68849999 68866501 69055697 68831670 68977349 69023356
3988 69023356 69061282 69353521 69677204 69764799 70070517 69960147 69843461 69757980 69984729 70386661
3978 70386661 70264395 69980813 70025295 70470252 70494398 71109524 70615388 70740918 71109650 71009402
3968 71009402 70712830 71156571 71484086 70872746 71335033 71198366 71452373 71892491 71949845 71945683
3958 71945683 71913981 72046734 71910108 72018797 72111931 72130759 72051578 72553325 72594386 72663179
3948 72663179 72647266 72411392 72288553 72456353 72563091 72733813 72908788 73032338 73120654 73242004
3938 73242004 73400138 73520554 74007324 73684243 73997133 73944707 73698404 73412711 73948133 74202445
3928 74202445 74236848 74549456 74381453 74525818 74703692 74603943 74959450 75380883 75184581 74833179
3918 74833179 75089357 75266523 75551188 75459042 75629389 75631602 75646160 75984680 76017615 76324477
3908 76324477 76177857 76397614 77079900 77285809 77188132 77416652 77299893 77164652 77547887 77762835
3898 77762835 78172096 78143248 77996576 78310739 77918287 78589099 78853690 78899636 79189757 79226556
3888 79226556 79422362 79517261 79826574 80234283 80171410 80215210 80203348 80344225 80844044 80942259
3878 80942259 80816046 81058239 81436939 81687699 81704452 81688734 81341542 81261765 81667095 82166620
3868 82166620 82349420 82414582 82542145 82754847 82587902 82587996 82750428 82782087 82988531 83267530
3858 83267530 83432000 83587507 83940884 83879843 83886631 84421648 84408312 84694234 84677848 84869370
3848 84869370 85126302 85120844 84841604 85108257 85339287 85666380 85766442 85667336 85860830 85781674
3838 85781674 85902426 85877018 86592589 86520176 86832882 87233034 87081049 87265606 87368877 87490601
3828 87490601 87585381 87565985 87593388 87748484 87967893 87973683 88289785 88663957 88800387 88916158
3818 88916158 88940435 89255217 89415926 89302890 89127389 89061970 89387797 89370252 89259657 89932922
3808 89932922 90516047 90307195 90201914 90396418 90903059 90955774 91565957 91677682 91233509 91156566
3798 91156566 91571620 91788807 91859477 92430305 92204379 92507928 93436450 93583445 93544100 93269457
3788 93269457 93006413 93058584 93921353 94313164 94483098 94437411 94409342 94472272 94548468 94457725
3778 94457725 94847611 95204488 95394372 95562840 95599841 95637737 95810768 96002032 95919608 96317904
3768 96317904 96245464 96608840 96977477 96943692 96980099 97138893 97430156 97773033 97733536 97669180
3758 97669180 98031112 98458504 98456258 98579979 99069080 99122332 99224864 99373753 99120239 99332743
3748 99332743 99881881 100219147 100214586 100597808 101032473 101363424 101295334 101117814 101542524 102009174
3738 102009174 102395635 102525838 102729222 102794915 102918636 103447628 104202676 104605059 104551221 104677249
3728 104677249 105167099 105445414 104960253 105438034 105703038 106155153 106797698 106800762 107248045 108114190
3718 108114190 108066590 108172146 108826813 108994493 109322089 109205888 109613151 110659609 111159005
3709 111159005 111670795 112074680 112084587 112366360 113192537 113408008 114017228 114434827 115046263 115713945
3699 115713945 116234245 116183953 116476169 117544044 118182938 118771090 119066290 119749375 120428155
3690 120428155 120375947 120501939 121164332 121337249 122302118 122865907 123202100 123563226 123774849
3681 123774849 124242196 124825029 125487326 126019610 126621776 127115119 127636254 127619149 127848897
3672 127848897 128331034 128852987 129359106 129675994 130056788 130143573 130474822 130986411 131142411
3663 131142411 131304027 132099832 132593500 133109182 133673782 134528609 135489803 136034716 136467653
3654 136467653 137035885 137685245 138411440 139171239 139684119 139965541 140888052 141914092 142580410
3645 142580410 143582069 144619145 145341908 146574582 147412233 148452943 149475172 150557529
3637 150557529 151751871 152731647 154037424 154834439 155898775 157456640 158933087 160624717
3629 160624717 161788268 162902898 164504490 165894221 167334298 168832541 170575907 172071130
3621 172071130 173375029 174814065 176153789 177445120 179037853 180271443 181311444 182288066
3613 182288066 183234388 183723099 184626759 185142755 185518917 186529256 186612096 186873844 187247979
3604 187247979 187288748 187062035 186799782 186719757 186771834 185601970 184516030 184221930 183562623
3595 183562623 182310790 181519050 180843859 179806783 178755047 177244543 175786551 174743149
3587 174743149 173696440 171695398 170343508 169243231 168038725 166530803 165187713 164089367
3579 164089367 162882638 161715970 160633438 159874854 158818984 158089420 157415462 155886429
3571 155886429 154579663 154141156 153499337 152820599 152270251 151958772 151452879 151135428 150841567
3562 150841567 150315603 149935099 149996259 150290417 150063325 150466528 150982138 151028098 150946010 151157724
3552 151157724 151213602 151825757 152275406 152709146 153379282 153598817 153945692 154385783 154656866
3543 154656866 155179673 155633548 156537057 157546321 158242408 158877213 159578491 160540632 161440557
3534 161440557 162271288 162904330 163423372 164330984 165490574 166605202 167506397 168129536 169558427
3525 169558427 170081671 171157837 172574429 173568746 174379491 175115010 176327030 177359653 178642510
3516 178642510 179798546 181346454 182665118 183779313 184876298 186560550 188197312 189715964
3508 189715964 190938385 192375921 193874328 195999151 198147194 199718981 201407401 202723558
3500 202723558 204672173 206559007 208660834 210370445 212673042 214952771 217487357 219639336
3492 219639336 221364165 223732550 226133291 229072228 231712298 234640899 237382558 240148309
3484 240148309 242904302 245578099 248440169 251312384 254200041 257287324 260361507 263375164
3476 263375164 266290770 269256839 272919692 276646950 280354150 283973249 287578441 291104005
3468 291104005 294472649 298113307 301639028 305272732 308706065 311871384 315367506 318799411
3460 318799411 322263030 324878177 327651522 330661545 333482020 335798311 338238297 340855440
3452 340855440 342667503 344266010 345891684 347137935 348149151 349385716 350442604 350739492
3444 350739492 351001108 351112401 350480004 350061367 349770533 349290474 348893990 347921748 346745067
3435 346745067 345831930 344452914 342575221 340752355 338734155 336546961 334209812 332292040
3427 332292040 330078084 327202752 324319042 321049985 317883106 314727174 310862253 307082123
3419 307082123 303271024 299201410 295459406 291662452 287378933 282980414 278889192 274662013
3411 274662013 270675040 266049579 261910039 258062562 253643880 248897186 244442843 240474074
3403 240474074 235992701 231320871 227523821 223613310 219178753 215016405 210777967 206708440
3395 206708440 202628922 198725539 194641217 191279128 187816082 184105362 180751903 177550325
3387 177550325 174531037 171681843 168624359 165738643 163002783 160309212 157682127 155069903
3379 155069903 152802025 150828597 148720247 146176148 144367776 142418855 140635080 139175523
3371 139175523 137245738 135755828 134622338 133297149 131964409 131195204 130181238 128775700
3363 128775700 128181567 127105548 126569043 126301837 125661527 124830587 124161768 123313479 122479545
3354 122479545 121745969 120959633 120522144 120682504 120304061 119484932 119663761 119447479 118725574
3345 118725574 117815547 117802351 117472364 117190812 116578545 116291077 116394777 116522019 116391024
3336 116391024 116226566 115825199 115787412 115890948 115155915 115115682 115116521 115740429 115823350 115532241
3326 115532241 115726096 115793849 115957660 116347752 116682085 117096741 117360684 117875370 118237152
3317 118237152 118863468 119492741 120087617 120627260 121194176 121960921 122619733 123421531 124781214
3308 124781214 125580970 126508498 127711491 128890756 130385204 131603524 132639227 133681563
3300 133681563 135054401 136197785 137553611 138575915 139646937 140577382 141254844 142019916
3292 142019916 142702649 143512148 143935091 143927508 143857688 143480175 143081705 142534969 141654635 140967191
3282 140967191 140053274 139376568 138569203 137636255 136307775 134836027 133475702 132493254 131099836
3273 131099836 129294213 127569246 125931328 124524894 122925786 121162877 119603027 117542733
3265 117542733 115824122 113828582 111481416 109545180 107814624 105845298 103923684 102245601
3257 102245601 100316433 98635513 96852571 94931006 93389532 92096174 90468720 88685075
3249 88685075 87294222 85963478 84696916 83824050 82560470 81616753 80291666 79374593 78435684
3240 78435684 77744516 76995638 76171918 75400453 75173857 74859914 74180449 73396389 72759386
3231 72759386 72330167 71923926 71613434 71465297 71194763 70767053 70691163 70445313 70386319 70121742
3221 70121742 70097487 69597371 69385844 69701659 69705291 69876115 69453053 69151751 69189948 69247931
3211 69247931 69219265 69292614 69223260 69385464 69882621 70060529 69873125 69963951 70176608 70325955
3201 70325955 70030612 70183407 70311698 70617899 70597276 70787533 71066416 71422992 71572454 71760272
3191 71760272 72157209 72803271 73215324 73053192 73491641 73531387 73789044 73608656 73928598 74698374
3181 74698374 75240650 75574989 75886276 76227546 76872364 77356989 77892163 78300738 78495806
3172 78495806 78921605 79773131 80153472 80570241 81161438 81498817 82051109 82338834 82836706
3163 82836706 83091795 83402751 84304050 84753476 84930987 85809358 86615199 87124937 87632760
3154 87632760 88218013 88909600 89371136 90148118 90946225 91227611 91764907 92620739 93068678
3145 93068678 94105099 94728880 95437522 95758833 96504121 97387593 98330357 99678212 100968750
3136 100968750 101951898 102431176 103414042 104278817 104647772 105781743 107016365 107928996 109354389
3127 109354389 110274741 111272621 112309985 113479606 114976912 116120493 117432537 118729442
3119 118729442 119727636 120693810 122112438 123394416 124321276 125525665 126365279 127909011 129349775
3110 129349775 130686366 132053417 133341062 134838323 136797527 138273935 139930775 141613876
3102 141613876 143366628 145125474 146900854 148925969 151037031 153430277 155588099 157834828
3094 157834828 160122941 162837192 165837810 168610706 171587841 174731909 177574824 180238239
3086 180238239 183532740 186860235 190525981 194807266 198320853 202801789 207072364 211514685
3078 211514685 216661354 221884455 227090881 232478839 237540743 242939540 247955631 252208720
3070 252208720 256649037 262396736 269004333 276622524 284861752 291177599 294800936 297045395
3062 297045395 298071295 298387211 297922399 297191246 296330763 294943256 293320198 291055483 288611607
3053 288611607 286080918 282813473 279055843 275426137 271468743 268305252 265057657 261289199
3045 261289199 257616878 254210480 250954375 248013224 244954982 242412296 239436202 235680766
3037 235680766 231383485 226450404 221082980 215861455 209910438 203970502 198081368 192163746
3029 192163746 186369956 180709141 174706276 168409321 162993740 157179400 151643143 146600906
3021 146600906 141568854 136691591 131840742 127310989 123027172 119229228 115167237 110994954
3013 110994954 106969436 103804330 100773273 97375178 94849181 92002758 89018967 85983694
3005 85983694 82844243 80077669 77185997 73924907 70776712 68277235 65572025 63132265
2997 63132265 61093252 58797102 56272849 54800061 52930564 50196375 48119064 46748487
2989 46748487 45446493 44098511 42649860 41075232 39876636 38751229 37882111 36889947
2981 36889947 36068497 34955924 34259804 33623245 32703432 31984255 31018585 30489689 29990121
2972 29990121 29499938 29044682 28222650 28021811 27294621 27014249 26832288 26035161 25471130
2963 25471130 25256349 25191082 24599815 24191789 23722535 23147127 22864935 22291237 21819470 21533803
2953 21533803 21570410 21176949 21097646 20903374 20768037 20616127 19906421 19716834 19229957 19176143
2943 19176143 19042478 18575335 18170577 17703381 17438246 17408563 17107143 16919951 17098191 17060754
2933 17060754 16681543 16680183 16541396 16017943 15473565 15493057 15621106 15655454 15572243 15214974
2923 15214974 15069780 15117168 15020418 14342933 14241526 14458532 14010522 13746072 13641971 14137307
2913 14137307 14305953 14124918 13663442 13250824 13072746 12944004 12789242 12583807 12814856
2904 12814856 12572675 12632948 12525526 12376010 12641324 12264032 11812830 11991724 11807231 11563481
2894 11563481 11728420 11778762 11255510 11031764 11422102 11136738 11088941 11283616 11451888 11152045
2884 11152045 11096890 10778068 10434755 10345944 10332607 10106639 10188227 10466307 10428913 10648945
2874 10648945 10436700 10420831 10320737 10334204 9923893 9391666 9525237 9713718 9776446 9517255
2864 9517255 9352367 9022974 8770727 9015335 8611032 8678864 8933350 8796486 8500616 9244599
2854 9244599 8562863 8559055 8800577 8565116 8340017 8305897 8322337 8390129 8355724 8110563 7987484
2843 7987484 8236013 8506520 7923252 8007288 8259069 8043856 7468831 7851275 8064070 7992906
2833 7992906 7665912 7403709 7584849 7648053 7447474 7759080 7721887 7405379 7507917 7440856
2823 7440856 7310924 7248062 7752102 7586462 7214323 6980253 6994434 7082273 7104749 7406186
2813 7406186 7411689 7377739 7289838 7170896 7869999 7731779 7473253 7383315 6976927 7164784
2803 7164784 7158274 7393285 7653573 7565366 7496896 7216665 6948901 7026892 7313890 7600615
2793 7600615 7606869 7633850 7272843 7358247 7909258 7817508 7426726 7277730 7139562 7525533
2783 7525533 7734220 7812480 7609937 7576473 7615881 7059607 6821614 7342175 7168063 7209856
2773 7209856 6935955 7233845 7452466 7235259 7200369 7257820 7350530 7115928 6929147 6901135
2763 6901135 6844381 6967069 7060613 6979751 7005101 6994690 6495983 6491044 6840348 6605460 6392105
2752 6392105 6451728 6253877 6929747 6440403 5870333 6302824 6661230 6666725 6115896 6085520
2742 6085520 6267258 6150533 6138164 5992560 5999034 5874306 5436101 5479160 5208113 5693027
2732 5693027 5495234 5103983 5361475 5603170 5558323 5779284 5966064 5581997 5418257 5453947
2722 5453947 5313511 5574731 5140995 5145517 5422321 5289271 5053925 4878670 4817762 4403746
2712 4403746 4685579 4986142 4685941 4507011 4664023 4600153 4571133 4909449 5029543 4961083
2702 4961083 5206866 4937726 4605564 4642073 4374142 4355943 4335581 4211631 4129698 4148197
2692 4148197 4510621 4952825 4406102 4465861 4591750 4546984 4227888 4524212 4938111 4408536
2682 4408536 4387608 4097565 3932175 4358196 4493877 4541989 4700181 4219705 4044382 4267484
2672 4267484 3807512 4036986 4361043 4408469 3972342 3748866 4032896 4379033 4140431 3931645
2662 3931645 3894355 4174702 3705106 3532517 3717608 4004052 3938497 3746959 3907726 3705893
2652 3705893 3819128 3743693 3948368 3844906 4015099 3932675 3827865 3457849 3234862 3656318
2642 3656318 3897092 3826717 3966660 3826844 3937145 3646029 3509381 3569976 3678943 3747791
2632 3747791 3442371 3416328 3546504 3625309 3579375 3571131 3773214 3702131 3543085 4079982 4164270
2621 4164270 3579144 3593135 3665591 3646903 3702969 3508072 3561705 3274911 3230904 3657253 3261342
2610 3261342 3444662 3713641 3710630 3514214 3274742 3212873 3351625 3428636 3025402 3126557
2600 3126557 3075397 3314325 2905116 2922029 3002558 3270339 3572046 3551104 3423046 3274254
2590 3274254 3251345 3095532 2575611 2641399 2917500 3032443 3054195 3568044 3611588 3423902
2580 3423902 3427919 2998211 2814499 2939500 3394895 3536955 3329345 3139789 3761476 3322742
2570 3322742 3108335 2905247 2901830 3377350 3176640 2922069 2974557 3173993 3241127 3068884
2560 3068884 3478279 3109057 2994702 2664909 2892591 2946382 3111630 2910887 2927712 3231786
2550 3231786 3156622 3078907 2877381 3049249 3258045 3019347 2479038 2609342 2859342 3156580
2540 3156580 3126856 3356855 3420244 3242358 3529736 3495613 3391609 3565236 3220605 3184198
2530 3184198 3371621 3155642 2924653 2814708 2666976 3182007 3617759 3077156 2547167 2849519
2520 2849519 2977379 2853633 2671972 2767796 2780029 3085667 3200357 3087175 3124961 2887911
2510 2887911 3001573 2918982 2885658 2990601 2750860 2575985 2765015 3035496 3171754 2929732
2500 2929732 2990169 3042003 3067454 2994831 3230695 3310174 3343185 3374365 3205097 2990849 2647904
2489 2647904 2357301 2405559 2463084 2700518 3038085 2445326 2342229 2651911 2843895 2896844
2479 2896844 3013172 2955229 3286284 3217162 3114503 3279171 3238098 3110390 3107445 2902952
2469 2902952 2976146 2966562 2804657 2753394 3029249 3103167 2993661 3018089 2977529 2848268 2507331
2458 2507331 2787068 3281974 3266085 2991273 2909823 3205230 2812854 2972367 3122012 3215388
2448 3215388 3340058 3183504 3188173 3367444 3266998 3133259 3049136 2938609 3376030 3351363
2438 3351363 2987936 3103935 3108510 3141066 3016220 3381461 4019633 3795177 3604271 3371475
2428 3371475 3391774 3646088 3600182 3582398 3234753 2944853 3016848 2924086 2966976 2690182 3085244
2417 3085244 2935286 3237746 3254803 3147497 3502432 3820278 3670270 3183134 3062311 3143136
2407 3143136 3412722 3709056 3962595 3744311 3413747 3374746 3246377 3525289 3929946 3958106
2397 3958106 4473585 4085308 3775684 3403963 3137062 3500193 3577199 3300718 3227316 3700296
2387 3700296 3934185 4056066 3975727 3890439 3793606 3460772 3362023 3327602 3702982 3466506
2377 3466506 3522590 3971958 3877125 4102130 4622934 4599030 4393406 4352669 3913821 3882656
2367 3882656 3920185 4188113 4525912 4299366 4687319 4641488 4738777 4935290 4824989 5131145
2357 5131145 5171208 4798114 5096920 5232833 5078853 5381979 5121993 5180116 5374010 5248089
2347 5248089 5337049 5614940 6079701 6268304 6577679 6696561 7040191 7186559 6964038 7122409
2337 7122409 7117920 7422643 7531263 7761525 7594134 8097591 8227672 8372069 8462375 8636966
2327 8636966 9283035 9964867 10263083 10427371 10672529 11343786 11392700 11769513 11948935 12710191
2317 12710191 13214334 13679529 14100114 13668371 13565394 13671072 13889852 13650670 13848219
2308 13848219 13648063 13138611 13285484 13346737 12781688 12270928 12091874 11659217 11304653 11110446
2298 11110446 10636663 10362911 10701206 10544502 9728857 9258485 9638187 9561403 8953188 8429794
2288 8429794 8298059 7975519 7850094 7389238 7086109 7031827 6708426 6174754 5676215 5579983
2278 5579983 4995771 4681350 4768139 4834440 4394447 4121280 3547816 3493655 3143601 3366461
2268 3366461 3126278 2942130 2713740 3189146 3067574 2564323 3094459 3016838 2435324 2605780
2258 2605780 2714398 2564872 2263419 2037044 2080800 2095987 1761187 1676663 1491548 1483353
2248 1483353 1407778 1513171 1651286 1973228 2180433 2392478 1902154 1847891 2097451 1717916
2238 1717916 1447244 1530682 1377611 1365087 1229108 1340128 1550463 1429291 1399926 1047031
2228 1047031 1316407 1174522 1195388 893540 946669 1194303 1100209 1537721 1689336 1560994
2218 1560994 1735563 1465536 1454707 1577357 1414383 1472459 1411813 1217395 1488402 1593213
2208 1593213 1394312 1398713 1335572 1066719 1193963 1393258 1214509 1312824 1271990 1037023
2198 1037023 943770 676994 509330 577824 964975 1075233 1272847 1153846 1134132 1428044
2188 1428044 897966 599668 1351401 1445477 958896 1006700 1036858 832052 1090465 1058178
2178 1058178 1151965 1357559 1355778 1117259 813328 624531 937414 982315 845415 579269
2168 579269 1141792 1333627 964403 636450 669195 687576 1047303 934734 833254 478207
2158 478207 709577 872040 793329 954874 998384 1042202 826544 1211999 639948 508645
2148 508645 663204 855300 969205 787995 935375 717706 837136 1071697 1165218 891989
2138 891989 616779 802013 768871 802863 500965 564541 457908 835298 601913 240301
2128 240301 616222 989781 875262 595011 577567 982753 864432 659951 1013394 1243450
2118 1243450 1158629 587425 571124 626844 574150 516701 640552 860321 1034331 1135769
2108 1135769 898171 708715 630890 877848 1041561 1131535 692561 556954 687957 554759
2098 554759 149764 487021 547734 800461 901718 922209 991679 748320 666088 700405 708684
2087 708684 687564 692236 480953 957440 731083 575693 658706 313101 617510 260901
2077 260901 307299 532848 547055 663968 469922 855404 749714 552214 453065 543777
2067 543777 638468 1007755 883018 401100 412533 570495 601209 658415 537098 481100 526453
2056 526453 345565 421728 21840 -160186 422236 732776 432120 764582 966809 850470
2046 850470 697316 709359 983467 848311 487423 627815 1027547 713328 572317 561643
2036 561643 898200 726003 776799 673009 588465 493633 415523 352289 536237 768492 453441
2025 453441 108220 197621 447021 626981 459055 335834 631758 97174 -26080 24867
2015 24867 371071 500179 384719 304147 226254 335995 543020 572753 460439 855234
2005 855234 432581 118602 345899 300274 340969 949416 996432 800136 801284 499777 347992
1994 347992 478518 671236 930919 771694 542114 530361 502980 579127 606154 672145 267892
1983 267892 129982 369795 801221 861332 750126 721110 505964 389842 531184 552336
1973 552336 264207 319243 254270 680365 890908 996983 754143 412907 635850 677525
1963 677525 764865 783326 611615 223596 544312 1077738 610052 454635 526445 67729
1953 67729 113480 577652 520908 451038 553523 445385 454798 220366 123902 197967 355361
1942 355361 51264 250343 247317 416487 361515 252568 169622 252157 272642 361466 308423
1931 308423 111539 323745 567129 536946 457575 5526 301292 444437 356752 117102
1921 117102 206892 618928 733232 586840 554870 407751 257596 188488 264296 355967 32270
1910 32270 64482 665707 838029 618570 287432 272432 385018 319416 352554 278147 474516
1899 474516 415545 187409 -356263 24643 107341 675106 637033 653733 378344 165014
1889 165014 84969 408802 298851 47715 196573 375539 141963 151461 343392 454567
1879 454567 369213 294844 382265 345774 63580 376603 628012 322238 410992 155802 673047
1868 673047 939609 941369 924171 441054 274165 226688 208297 177788 646203 684209 396986
1857 396986 598649 462803 351231 656535 498606 419428 350300 524567 657570 690960
1847 690960 771234 664338 509428 753994 808528 737493 547537 541248 572029 498487 823156
1836 823156 898224 804199 592278 446187 327395 301294 237338 -26247 -12440 249033 -19530
1825 -19530 183460 73482 -159939 223767 521297 476102 698379 371860 422968 219483
1815 219483 371023 221335 -29169 180351 -146976 -167884 358511 519073 299910 263399
1805 263399 527754 686963 604829 476419 443853 -206367 -555969 -409567 -142684 5401
1795 5401 176369 211458 28832 -82490 135072 -107809 -83035 135984 335112 342359 -203721
1784 -203721 387859 491144 406108 414940 142315 158603 203637 170364 555953 732421 316888
1773 316888 -72129 426140 325974 256038 -36169 -30209 216656 534353 496899 -219346
1763 -219346 -4566 450008 761893 342815 338584 219950 337360 543903 804854 665995
1753 665995 332259 277187 536919 773112 389669 268715 418324 737833 655513 742446
1743 742446 570349 500809 488574 295024 120138 -380327 -278867 -243142 84832 279647
1733 279647 153730 98464 416293 478747 152756 -210251 152406 174375 -37168 87877
1723 87877 92600 -60418 128607 383470 628712 772215 402302 367344 373399 180488 61264
1712 61264 142013 104545 340702 -80928 102524 162851 106626 -123859 156304 -205021 -243813
1701 -243813 -31729 5413 561118 925914 578103 320865 379444 331560 358943 442696 304461
1690 304461 167972 412207 180560 58809 144211 3694 -3171 92946 273113 99914
1680 99914 14489 90675 69197 634718 182804 124400 95384 -45135 -198005 -262879 -113367
1669 -113367 339148 498307 680903 976246 669910 427618 -134237 34639 169157 7505
1659 7505 8437 -367399 -19000 -204706 36887 431969 -88251 223823 459480 60618 219308
1648 219308 258637 -42243 16694 38044 -296285 -126991 123150 -59204 -10637 -48274 -61262
1637 -61262 135728 262253 -180671 76083 479556 870439 166852 259397 275063 143464
1627 143464 -28577 -158586 -194573 -65262 161137 311651 133145 140644 244142 271182
1617 271182 59436 -118429 -36403 -171962 320206 107785 477458 471490 189004 52159
1607 52159 -235860 -101066 373123 417758 427040 457336 333622 715101 330811 72216 252668
1596 252668 429314 -180046 -63879 246903 98968 10888 40615 -208183 -320805 80563
1586 80563 79691 762526 432308 1913 -401582 -208747 -50658 -70476 106764 410423 292669
1575 292669 474335 104499 -43272 79066 482417 745491 570033 243496 451803 437699
1565 437699 307662 197988 494961 229489 210109 521059 215806 -42511 -148783 -398808
1555 -398808 -373808 -51626 -49701 108850 -287102 58209 50343 -182252 -157575 -77617 -199621
1544 -199621 -170811 121532 120069 103118 302731 368826 91460 51990 274088 118831 -156108
1533 -156108 -215811 29520 4790 -141190 -71981 122653 -160563 -358806 111887 310262
1523 310262 287506 270356 127125 201817 174834 350872 346723 273311 55379 154546 563733
1512 563733 211041 -14562 93473 -378649 79257 263608 47658 -47180 38115 325354
1502 325354 79021 64717 -4225 -221247 81216 265180 74090 93327 127328 389108
1492 389108 527015 712578 490216 296114 287966 241781 -93954 40742 236428 280675
1482 280675 140836 -321398 -141221 -54179 -78685 125887 178713 217242 192601 273294 500286
1471 500286 -80084 -103308 -188256 333878 622002 517038 879014 486875 72152 225234
1461 225234 267112 157438 91431 214831 497184 273478 286702 -31038 -208762 -149674
1451 -149674 -123567 77114 136262 71789 300013 122100 76489 421321 307480 264650 -140751
1440 -140751 -40527 234933 194429 139264 -92863 196866 261135 -130560 -137696 -221299 14236
1429 14236 270024 35663 -241822 -316432 -606876 -329569 -485464 -443383 -145103 245319
1419 245319 243164 6476 -178815 -264432 -46208 -2095 -171695 -236961 -294408 -577214 -478734
1408 -478734 -239849 -250186 -234471 -159186 -292213 -206585 -21522 -70202 -423772 -113835 254917
1397 254917 47813 -221667 -226635 87316 -62985 -287218 -339119 -233890 24733 -32382
1387 -32382 -33323 -73131 -340453 -248323 20305 32017 39025 -271619 87739 299113 1483
1376 1483 -75804 -281982 -45000 -72968 -296277 -126351 43606 -74137 -584481 -402413
1366 -402413 -368872 -59460 -240357 -15783 -323252 -352383 -227965 -391301 -557592 -501928
1356 -501928 -242488 -12102 -15589 -186233 -483720 -428837 -358951 -58553 166194 247394 274983
1345 274983 374040 655053 317881 100148 73317 -81996 -76360 -65758 51776 109480 -32156
1334 -32156 -126319 -416667 -24035 -169529 56766 106014 26851 8611 -246508 -294547 11131
1323 11131 422588 236482 -320858 -728858 -767072 -494336 169746 432589 623461 755249
1313 755249 458422 117180 77751 176287 -179940 -64690 -343924 -199199 -1795 -330584
1303 -330584 -394013 -164594 106193 -5220 117366 61524 36368 318213 -107402 85322
1293 85322 33549 -342512 -500917 -771460 -585560 -518380 -510871 -256497 131146 315195 179197
1282 179197 289604 54307 -111744 -45472 265414 92285 -173905 -120666 -57592 -89260
1272 -89260 325120 -51126 -250525 -406701 -329364 -260535 -222274 36201 -200068 15339
1262 15339 -169199 -103060 139792 179047 -125896 -46176 -115609 -157155 6083 249662 184843
1251 184843 338049 111296 -228443 -287560 -102496 42336 -129413 -196699 -422996 -419068
1241 -419068 -180985 -41572 -152140 -32916 4790 -571363 -641525 -423652 -472469 -97026
1231 -97026 150924 77263 227117 259987 185859 362004 370186 91818 122569 157655 -106925
1220 -106925 -304317 81569 -168731 14877 108956 145568 50974 -216096 -282431 -114036
1210 -114036 113922 -338776 -459411 -471331 -484269 -146593 -42328 -95942 351178 415953
1200 415953 32451 -356407 -461637 -201602 -287773 -594689 -295630 -186737 -119093 -495114
1190 -495114 -706801 -347781 -188795 108630 -47809 -193320 -327152 -277163 -211074 -143350
1180 -143350 398784 549505 431362 320587 155175 19664 97948 -145797 -584358 -383005
1170 -383005 -181857 -296787 -238321 -213770 26268 -42764 128352 124238 202957 227116 44737
1159 44737 -87257 75909 83967 -86540 -215208 -33083 26715 -101865 101330 -249220
1149 -249220 -408993 -228916 -73483 -23740 -306459 -373732 -370963 -37855 4401 27391 337204
1138 337204 396317 403870 54734 -494127 -391854 -68419 -132434 151365 504535 288478
1128 288478 109571 308444 504501 101014 387562 563136 226459 183342 176047 322595
1118 322595 217875 -194315 -405793 -50400 -212466 -127118 40628 200914 -92979 -33242
1108 -33242 -401199 -218368 -359562 -485750 -457340 -432473 -81207 89526 -422570 -524009
1098 -524009 -560158 -220155 -267377 -255883 44130 -95089 153822 -106874 -296222 -654627
1088 -654627 -309743 108011 188641 -164355 -136072 74900 244456 -83429 125615 18766
1078 18766 -326441 -255981 51297 195690 -380320 -277914 -339069 -566391 -361186 -4037
1068 -4037 -258583 -27806 196256 199813 253442 330725 212476 -92644 -111754 -114901 -511270
1057 -511270 -750632 -243614 -39919 -3484 -126320 -110583 -234661 -86920 29077 83323
1047 83323 40300 -120802 197703 258580 163395 140351 114068 -301299 -574637 -303473 -260465
1036 -260465 -424195 -380342 117328 89613 -318126 63194 546880 347660 49437 -246264
1026 -246264 -434966 -160206 -67743 -421988 -246351 -6994 -83166 16540 -81362 17181 -345882
1015 -345882 33564 -62085 -114516 118208 -243801 -234469 -365039 -283983 74500 182925 -132817
1004 -132817 -286336 -240069 28952 115715 -304655 -72161 220025 78396 -58281 -542106
994 -542106 -617254 -471213 62636 -267776 -170568 -284490 -291121 -273820 -48909 37816 268375
983 268375 215386 522046 313162 416665 406860 145128 -275521 -489750 -461086 -215388 -51748
972 -51748 -113804 508163 554325 -8716 -97111 127929 44071 -53552 7401 201045 -97087
961 -97087 -85645 -206903 141727 -9277 -246046 -521975 -352609 77005 220917 89835
951 89835 296342 84155 90803 279217 -51222 221214 375084 -1275 -32642 277933 -40946
940 -40946 -560629 -593805 -317046 25187 -238587 -51207 -72631 -142509 -44613 165013 -206801
929 -206801 -548609 -279649 -188390 82930 -15682 410197 448526 -261369 -193510 94042 149116
918 149116 23096 -121391 -188663 -46580 -385585 -339661 -206930 104588 -529488 -236920
908 -236920 170017 88524 158499 -7712 123025 -9066 12986 -240336 -642053 -602371 -33690
897 -33690 141658 56651 -26736 -126035 174715 160069 -6805 186649 5088 -40618 -56994
886 -56994 222802 179172 -422425 -3459 -94023 -78550 348699 397492 121696 -152489 29372
875 29372 8221 -219571 -40430 202885 -265537 -282049 -233829 114292 308607 -185559 -250342
864 -250342 -183159 -152616 12592 -203829 160823 395790 215289 66444 487703 209555
854 209555 69875 80844 82941 144083 273973 527080 -260307 -85092 162248 111785 78815
843 78815 -65470 -305522 -281045 -374972 -334472 -92065 -165496 -7450 243238 166459 149085
832 149085 332583 243479 472823 433004 419250 143392 158133 -84405 -539531 -456186 -190805
821 -190805 76326 141356 86239 -218736 -183971 -92655 -79730 -16659 24755 417063 197498
810 197498 -89056 -64558 -121521 -273633 -532579 -537350 -285481 -3716 282107 212801 -286153
799 -286153 -182529 89561 107303 -190031 -6719 277520 2157 -192268 -341047 -79636
789 -79636 -149174 108609 84094 -253854 -464292 -412866 -265794 49371 106064 178308 362095
778 362095 584010 48809 -345356 69956 179654 57191 -162750 156994 140413 129244
768 129244 372295 285191 52809 -392796 -126880 92972 290210 308826 174338 236832
758 236832 223893 52351 -93473 -141545 -37515 -242442 -188413 58041 200345 340251
748 340251 24743 -293384 -500848 9413 121406 227759 170741 -50855 -653480 -382274
738 -382274 -110193 215405 -9634 -127032 -11219 -77539 -167609 -177106 -47101 19317 13311
727 13311 20555 52056 -196768 -272667 -12109 -120300 -95354 441520 14106 -272812 -396115
716 -396115 -516028 -306254 176701 6603 -487044 -133119 83675 -15659 -161686 -185279
706 -185279 -342999 -288075 -475817 -370905 -130922 61403 238468 197303 -66489 -115779
696 -115779 -173916 -144042 201318 245565 250391 412471 234278 -13660 126454 492048 126490
685 126490 -376172 4596 85060 -217689 -74617 182835 330545 534356 -64735 34200
675 34200 535175 -9967 122871 1098 -6371 -13820 -11832 312368 109881 210326 -258499
664 -258499 -347285 -384507 -602660 -258966 152937 398329 176310 10916 -412600 -596569
654 -596569 -53321 -379597 -645598 -555087 -315235 -431817 -460187 -527890 -617021 -828240 -266697
643 -266697 -47763 -240022 -487367 -527289 -143101 105404 -207271 109010 43796 114390
633 114390 639099 203309 -169261 -85825 225195 -32296 92414 -472002 -482200 -749439
623 -749439 -389138 -13514 70972 315313 -101902 -158270 65952 -127710 148746 425925
613 425925 82133 -256078 -72336 9547 -64087 37749 -71940 -251704 192124 680177
603 680177 220200 144509 433708 613105 283707 -30326 -492085 -211231 -30938 240456
593 240456 194724 166377 130089 139286 412095 118150 -178977 -203775 -238619 68641 119943
582 119943 -170723 -73047 -53452 -359974 -406347 -155473 -431552 -148715 -75882 -28428 126760
571 126760 141265 112821 -67288 -245534 -97448 -286605 -245590 124821 166099 -314704 -484001
560 -484001 -121639 -8202 195472 83529 160805 173119 80406 145791 208128 14757 33549
549 33549 114856 -382109 -153754 107010 77322 -147375 -60635 54565 -11011 -42230 -191396
538 -191396 -162446 32554 415990 -162039 -262984 150015 -130266 -199406 80809 136059
528 136059 172201 85389 317353 189072 211790 383287 -5821 88337 170469 53685 58185
517 58185 -244188 -39949 53059 -130862 -466101 -171322 -177997 -202050 -9392 -91000 -38078
506 -38078 -172574 -428195 -212344 195383 84858 118325 545836 151005 -464001 -463852 -347108
495 -347108 -207483 -287282 -221401 -68860 228063 -168172 -176227 -77203 -335009 126200 -35671
484 -35671 -25912 64187 4481 96104 -292362 -291886 -203150 147626 20829 43142 -231917 -254260
472 -254260 29387 -84967 80353 208334 240879 138496 108163 45019 -65890 169180
462 169180 273168 -17539 -356145 -315436 -468680 -226905 -204482 -350490 -265169 -32742
452 -32742 -207154 16906 -171917 -384387 -140849 -108326 -185591 -221022 -336850 -213612 -131270
441 -131270 -46006 -157144 -397443 -212491 83899 148484 -98900 -5755 319774 235524 -275910
430 -275910 -90604 -65215 41128 -27511 -335380 -622834 -558955 -443070 -52888 229018
420 229018 -190880 -205315 -459695 -111268 142032 377648 33122 -499288 -272561 -223759
410 -223759 -369887 -337549 -350174 -415451 -20767 -35928 -367385 -534944 -272287 -12936 52089
399 52089 84420 -395027 -524930 139408 -136877 -323075 -342504 -67647 381116 91885
389 91885 -347136 -442308 -124948 -108511 -233016 154038 115188 289286 128818 -213757 -18300
378 -18300 -42166 -129326 -234986 -269626 -439874 -67281 35335 -243408 -280478 -331223 -253433
367 -253433 -59668 -278314 -301028 -140400 -264758 -375656 -415208 -329193 -546681 -454084 -316603
356 -316603 -186908 -249093 -323192 -366047 -252125 -335951 -7110 -323926 -618186 -203601 -153106
345 -153106 -536863 -296532 -174666 -529159 -613990 -416155 -643832 -691076 -558992 -390628
335 -390628 -584504 -403798 -497117 -415199 -199527 -268969 -180593 -234954 -308859 -280296 -500476
324 -500476 -331163 -208672 -281566 -155972 133664 189232 107595 165953 -18081 65361 -178571
313 -178571 -324843 -411538 -53878 124012 -13712 -57354 -164487 -325615 -352644 6042
303 6042 178089 33478 179266 448547 377591 383743 -310101 -347872 -111364 -233448 -293597
292 -293597 -376899 -174182 -497632 -245849 -187859 235225 386070 238772 -192941 -176795
282 -176795 402311 556976 32651 -230288 97363 -117371 -278192 159223 -184847 -285602
272 -285602 -248965 -480206 -396867 161128 -132743 -153342 -243605 -525075 -635241 -114395 194538
261 194538 140890 -27916 -311198 -159731 -220996 55649 -204426 -359979 -453780 -794442
251 -794442 -575335 -338716 -206821 -112717 16919 -437693 -462264 -88507 25275 -4921
241 -4921 -39298 -279968 -555495 -231645 -95940 -301530 -457485 -538633 -451057 -770277 -476320
230 -476320 -443820 -258348 -602840 -474210 -455718 -137597 -73558 -269282 -441258 -516652 -15585
219 -15585 -342140 40136 123380 -354000 -449532 -244149 -558635 -483485 -467087 -532389 -476986
208 -476986 -568819 -331494 -406108 -404791 -190486 -321566 -438960 -593145 -240770 -304798 -146362
197 -146362 98156 -129880 -161908 -68622 -161459 -45411 -44190 -222620 -561069 -735769 -637665
186 -637665 145697 251003 155037 -44012 -104669 -22138 174564 -75299 -179441 -140667 -209030
175 -209030 -567172 -421322 -284732 -401422 -286898 -154782 -243648 -179960 -281768 -93444
165 -93444 -221503 -405745 -261749 -17092 82933 -440067 -762264 -712138 -666759 -508493
155 -508493 -440671 -226868 45157 -101761 -40009 -275062 -252379 -423231 -353666 -14619 -131574
144 -131574 6452 163529 -254260 -382426 -262301 -284824 -280188 -21399 -16343 -170310 157895
133 157895 158890 83815 66049 82040 280596 127779 -68014 -310642 -522861 -411521 -327824
122 -327824 -171508 -190066 -486859 -436480 -295156 -477643 -343185 -236897 -233858 -143712 -12384
111 -12384 -52249 -265392 -352073 -29009 30210 -89198 -329808 -374914 -360446 -628526 -390463
100 -390463 -290726 -169331 -295036 -400469 -331151 -347105 -267054 -362490 -572515 -224636 -117431
89 -117431 -6698 -85263 -231072 -214789 -287062 -360583 -66998 75378 -76890 -286033 -263560
78 -263560 -222942 -155928 -126808 -151913 -128227 -28495 -131569 -129704 -12868 -347256 -350780 -167966
66 -167966 -261199 -483237 -526817 -691193 -864813 -695210 -667511 -526708 -209338 -431205 -381992
55 -381992 -204113 -486102 -332618 -165100 -227027 -208809 -46585 -150456 97243 -176545
45 -176545 -207754 -320070 -463604 -89707 102549 215020 102883 -96369 -205847 -289184
35 -289184 -356072 -663477 -666594 -554810 -370596 -542311 -486000 -241322 -277070 -26006 -128725
24 -128725 -404287 -271506 -189418 -429005 -198919 -47467 -33250 -231340 -316654 -117231 -160452
13 -160452 -121320 -164620 -123837 -116425 -164069 -188105 -408397 -564865 -481738 -423007 -78660 -134711
1 -134711 -259938
0 -259938
$$ Imaginary data points
##PAGE= N=2
##DATA TABLE= (X++(I..I)), XYDATA
16383 -7103211 -6998035 -7026274 -6996458 -6915352 -6632955 -6517949 -6504269 -6216571 -6227678 -6263663
16373 -6263663 -6168081 -5923221 -5571771 -5486432 -5709728 -5557094 -5157265 -5075841 -4764164 -4922354
16363 -4922354 -4910680 -4705078 -4611824 -4549045 -4503795 -4380735 -4032584 -3890522 -3946982 -3847574
16353 -3847574 -3589802 -3760644 -3761289 -3436177 -3030400 -2890233 -3046476 -2933317 -2608419 -2389162
16343 -2389162 -2421131 -2050037 -2031719 -2162480 -2010153 -2032782 -2056360 -2011134 -1967688 -1658513
16333 -1658513 -1567554 -1364785 -1635138 -1627798 -1303524 -1073200 -879447 -1075376 -721160 -666029
16323 -666029 -529526 -504260 -348395 -365237 -237744 -157962 62670 -118364 10418 289138
16313 289138 675307 603312 359857 661001 1005864 848997 763041 858967 784131 1172062
16303 1172062 1053588 992663 1197485 1341093 1387326 1659948 1667636 1882931 1866410 1957534
16293 1957534 2253032 2131230 2214135 2233505 2401922 2591838 2519559 2825714 2751854 2815876
16283 2815876 3406260 3280806 3053409 3007013 2963833 3156477 3173813 3443871 3627151 3784453
16273 3784453 3832753 3923011 3894211 3858368 4018817 4173575 4033636 3925605 3893693 4526621
16263 4526621 4563487 4428099 3996725 4212519 4394337 4734129 4965562 5347297 4952635 5010942
16253 5010942 5366825 5309023 5488736 5541543 5639140 5958012 5633512 5476961 5466352 5403684
16243 5403684 5279893 5205332 5529632 5518765 6031836 6249369 6021565 6083143 5963311 6064606
16233 6064606 6171927 6546643 6984190 6427228 6358564 6314554 6348323 6735534 6457789 6443613
16223 6443613 6587544 6582240 6592598 6630846 6876113 6910342 7071701 6650600 6560286 6800780
16213 6800780 7175386 7543618 7338289 7124376 7279325 7600881 7435812 7174466 7649116
16204 7649116 8006226 7829478 7844277 7365117 7045574 7483484 7750990 7914242 8055219 8298365
16194 8298365 7869227 8318095 8482142 8680825 8527365 8660399 8413270 8035503 8096044 7716969
16184 7716969 7589629 7943640 8353892 8548101 8600200 8744763 8767822 8675573 8689554 8804156
16174 8804156 8727014 8721036 8678899 8703354 8669578 8800204 8730688 8723747 8861216 8641289 8905438
16163 8905438 9041430 9152680 9002712 8977481 8927376 9259105 9486220 9406345 9417842 9344327
16153 9344327 8769414 9061401 9353192 9055699 9166002 8863733 9068205 9285641 9235089 9430963
16143 9430963 9636622 9473075 9662760 9460368 9288650 9401712 9706340 9668459 9606147 10001646
16133 10001646 9649732 9374025 9388557 8985141 9071066 8973220 8994590 9200880 9454125 9572278
16123 9572278 9519113 9609888 9617309 9772837 9680537 9584504 9710012 9747018 9527239 10025097 10080695
16112 10080695 9777170 9707792 9985734 10067250 9813868 9891504 9727125 9599051 9544421 9501154
16102 9501154 9439142 9546704 9665177 9716480 9674821 9810205 9795654 9854704 10138260 10256048
16092 10256048 9966633 9979268 9823889 9627795 10105986 10384090 10303101 9920972 9844159 9997891
16082 9997891 9617041 10102035 10412476 10451134 10471538 10365862 10260600 10338459 10426874 10512596
16072 10512596 10478175 10161774 10379703 10142682 10202688 9992897 10381758 10080965 9835584 10339157
16062 10339157 10431597 9955867 10236890 10344565 10257479 10136610 10327995 10334064 10305595 10107836
16052 10107836 10297584 10413263 10409997 10441785 9985193 9941170 10052766 10179733 9981567 10040190
16042 10040190 9938900 10428855 10034032 9297287 9145724 9640530 9891880 9972835 10311820
16033 10311820 10221474 10405878 10359809 9865014 9947936 10333893 10103606 10157202 10260723 10420944
16023 10420944 10266840 10562934 10563165 10339439 10676716 10798994 11051065 10819263 10113336 10053360
16013 10053360 10371101 10301666 10318383 10241452 10150733 10330312 10401985 10705186 10871063 10273572
16003 10273572 10043306 10260348 10666445 11114234 10405207 10323285 10103210 10223118 10308399 10462086
15993 10462086 9780399 10043782 9734128 10032891 10158849 9630816 10119577 10350380 10580843
15984 10580843 10583302 10392157 10214000 10370915 10087374 10471435 10226591 10188127 10126944 10447272
15974 10447272 10593198 10368544 10492397 10662209 10472498 10173947 10127111 10019270 9948866 10459914
15964 10459914 10309133 10237429 10276775 10047077 9813240 10095380 10522387 10223613 10336562 10611079
15954 10611079 10540612 10536013 10253293 9871583 10202455 10380042 10100776 10637958 10492859 10552813
15944 10552813 10749067 10415866 10100122 10373559 10585381 10789220 10588357 10501617 10134508
15935 10134508 10263192 10208276 10179755 10129684 10200335 10583139 10552979 10618990 10703521 10507999
15925 10507999 10305464 10361356 10759621 10832680 10527194 10252987 10109060 9684323 10066665 10114409
15915 10114409 10320242 10202418 10332698 10635250 10696711 10889439 10704102 10916115 10690113
15906 10690113 10506018 10403278 10284130 9857103 9746307 10095845 10214773 10633721 10612021
15897 10612021 10470454 10435245 10114758 10197661 10074462 10689809 10605032 10473805 10518547 10462264
15887 10462264 10546022 10535043 10159040 10482442 10289220 10459776 10484838 10044603 10085624 9950581
15877 9950581 10228575 10758832 10691078 10029433 10015772 10300678 10491403 10660724 10613073 10348129
15867 10348129 10381729 10498941 10280099 10561473 10967644 10917322 10680706 10459552 10607768 10448677
15857 10448677 10378474 10656282 10545587 10502887 10094800 10206019 9917555 10314651 10489014 10512630
15847 10512630 10299493 10046131 10652230 10613237 10360922 10438424 10361453 10499393 10668180 10468261
15837 10468261 10681044 10056278 10145805 10391702 10369025 10513402 10888578 11262797 11080694 10925165
15827 10925165 10882395 10633456 10798480 10591556 10292919 10444804 10645587 11091946 10932236
15818 10932236 10719454 10406609 10375319 10494268 10639712 10200223 10496660 10471427 10606040 10666917
15808 10666917 10523699 10323997 10017802 10193965 10036214 9908875 10025658 9916244 9914102 10884894
15798 10884894 10857964 10637969 10689646 10815483 10557054 9921130 10284769 10392681 10581515 10414024
15788 10414024 10506894 10483618 10636893 10279208 10374225 10742496 10879941 10761796 11119609 10908787
15778 10908787 10341191 10445688 10624251 10723357 10743203 10730592 10409130 10378424 10267422 10395050
15768 10395050 10246702 10433456 10524851 10528083 10417618 10781780 10906296 10270059 10187399 10159983
15758 10159983 10390900 10413491 9880759 10053668 10482637 10703191 10382907 10719744 10214812
15749 10214812 10019406 10374265 10187475 10304607 10724772 10805113 10499171 9943887 10327401
15740 10327401 10452673 10065034 9973626 10505786 10930367 10950001 10503715 10345236 10206233 10284646
15730 10284646 10120173 10107304 10027011 10321551 10495956 10417496 10502832 10587338 10539720 10189825
15720 10189825 10078466 10522277 10646881 10214395 10105873 10520986 10540874 10496002 10276924 10171284
15710 10171284 10449515 10639457 10503329 10881843 11116880 10721787 11156956 10919660 10394542
15701 10394542 10634639 10706868 10830779 10882666 10158520 10343235 10478587 10495743 10609389 10467284
15691 10467284 10525491 10129439 9961552 10382660 10546369 10211136 10565463 10753152 10471430
15682 10471430 10190787 10351314 10470300 10423490 10362833 10540390 10615034 10485419 10959411 10568338
15672 10568338 10443062 10239314 10073458 10497688 10792351 10794248 10672371 10488516 10663707 10445484
15662 10445484 10659463 10399218 10599858 11008217 10872730 10409860 10251406 10202653 10421695
15653 10421695 10353875 10757755 10790182 10301745 10298930 10296840 10295883 10325392 10334871 10646968 10928529
15642 10928529 10575130 10627971 10330629 10571059 11020219 10484849 10277352 10243378 10337107 10805788
15632 10805788 10723921 10985974 11166080 10898055 10670063 11197029 11089817 10902844 11162899
15623 11162899 10755950 10881578 10811818 10954369 10928066 10887402 11014297 11183502 10823229 10885723
15613 10885723 10984948 10567048 10705073 11235264 10959408 10565863 10384092 10282323 10444224
15604 10444224 10687809 10902095 11137321 11508315 11204116 10828736 10527410 10838375 10943158
15595 10943158 10997794 10842944 10898219 10469823 10513570 10430393 10311655 10497716 10946144 11264546
15585 11264546 11054113 10943989 10512611 10742946 10643005 10239493 10303412 10452339 10700776 10732088
15575 10732088 10628052 11213283 11261839 10950820 10855125 11108591 10862227 10496690 10341895 10115564
15565 10115564 10521733 10833457 10544843 10536444 10644331 10682805 10674407 10875508 10790636 10869567
15555 10869567 10914465 10870105 10826144 11180556 10916239 10769939 10601949 10757292 10779892 10650593
15545 10650593 10944806 10978265 10899196 10889068 11099329 11004287 11094866 11079981 11050585 10915282
15535 10915282 11231916 10950436 10912149 10766814 10973044 10611690 10695850 10861260 11146166 11373797
15525 11373797 11262173 10867369 10706514 10850140 10834686 10623330 10473489 10644005 11143105
15516 11143105 11055613 10591830 10792360 10640590 10810485 11124971 11108697 11351015 10989343 10837954
15506 10837954 10703019 10499629 10430236 10557266 10588333 10460531 10959717 10793009 10245726 10323913
15496 10323913 10790684 11209850 10713974 10361184 10364202 10460093 10748665 10708199 10973157 10982003
15486 10982003 11230478 11172201 10727236 10761764 10914194 10856045 11072707 10837538 10928890 10734767
15476 10734767 10475172 10487424 10636450 11031313 10693932 10484439 10404911 10254722 10866104 11257959
15466 11257959 10825656 10974863 11328230 11054426 10832019 11308117 11406319 10910239 10808697
15457 10808697 10804397 10706031 10756254 11019175 10751377 11244958 11518714 11077863 10881239 10610464
15447 10610464 10769551 10778822 11133803 10831048 10476646 10806162 10778096 10778389 10815851 10616615
15437 10616615 10381474 10927720 10693952 10671930 11098731 10860351 10866749 10623065 10329111 10658506
15427 10658506 11365312 10889163 10493337 10607625 11118758 10785120 10688196 11221170 11727753
15418 11727753 11070050 10718619 11224758 10797801 10774293 10683860 10557414 10352630 10409185 10657595
15408 10657595 11019144 10779495 10840595 11108854 11147417 11045562 10929197 11025620 11108130 10800128
15398 10800128 10677652 10911681 11041807 10793806 10336953 10720610 11008315 11176589 11177349 10747491
15388 10747491 10693814 10606476 10476304 10688885 11185829 11026096 11076154 11043997 11292425 11320022
15378 11320022 11137378 11057038 11265583 11062364 10814197 11012465 11103561 11294239 11322794 11247442
15368 11247442 11042190 10922132 10733745 10885866 10752732 10890454 10956834 10933656 11042481 10850263
15358 10850263 10764556 10551096 10662098 10461339 10519032 10926249 11313193 10872255 10667737 10869424
15348 10869424 10939601 11155643 10893073 10900310 10895673 11359510 10988688 10682550 10797472 10520971
15338 10520971 10478364 10706345 10924258 10831480 11020041 11189327 11483137 11546105 10931330 10707542
15328 10707542 10393891 10700458 11055476 10569352 11010356 11246058 10907361 10864371 10703366
15319 10703366 10539630 10709319 10570114 10959155 10902217 10866333 11003049 10641818 10939342 11145499
15309 11145499 10860465 10929209 11282857 11415996 11371635 11490232 11220734 11204566 11207432 11415803
15299 11415803 11568609 11671572 11707328 11777890 11859369 11327618 11068018 11062890 11332817 11265084
15289 11265084 11262636 11004704 10853728 10400457 10154078 10850978 10955965 10515401 10740806 11111761
15279 11111761 11434170 10999997 11201386 10998304 10861809 10912667 11164453 10946001 10964113 10881684
15269 10881684 10844016 11124567 11224147 11396285 11526376 11683448 11222730 10879693 10518075 10601596
15259 10601596 10905812 11257063 11152293 10907458 10926669 10669137 11022888 11013925 10952501 10716103
15249 10716103 10911194 10923660 10934628 11165118 11084659 11354898 11098213 10501752 10634782 11077222
15239 11077222 11290087 11263873 11271397 11432422 11359893 11251742 11411946 11491966 11531019 11459043
15229 11459043 11539990 11144286 10676919 10728698 10906215 10923174 10796141 10881944 10909960 10895571
15219 10895571 10675512 10920063 10852691 10980753 10777493 11082072 10932722 10946743 11119001 11311307
15209 11311307 11158328 11031497 10819820 10918610 11101598 11275257 11574240 11167901 11224182 11093636
15199 11093636 10875526 11259349 11361616 10899445 10872042 11046725 10726961 10774496 11028313 11076306
15189 11076306 11152517 11194141 11193666 11162373 11050059 10807318 10803267 10905094 10901626 11228522 11134429
15178 11134429 10947190 10851777 10860120 11149439 11024578 11086848 11066769 11244549 11206646 11159052
15168 11159052 11015794 10966946 11134818 11159093 10896108 10669759 11335808 11232766 11397179 11253850
15158 11253850 11543714 11643600 11589362 11422754 11234196 11134913 11169918 11330192 11471028 10936160
15148 10936160 10591017 10370169 10775563 11266709 11591009 11460800 11212159 11642110 11540805
15139 11540805 11112155 11087546 11135062 10823793 11259572 11025350 10914788 10999368 11258461 10962852
15129 10962852 11130626 11097454 11156093 11154797 11349485 11492692 11626613 11502594 11551568 10920910
15119 10920910 10752943 11342289 11578233 11410174 11261419 11625407 11481378 11194602 11255645
15110 11255645 11705550 11362030 11319572 11736730 11585940 11254003 10906598 11030460 11398674
15101 11398674 11354263 11481837 11184874 10940841 11138017 10923990 11180720 11292445 10910033
15092 10910033 11169213 11433658 11038389 11291614 11502232 11120398 11222673 11555384 11838134
15083 11838134 11736716 11415684 11227109 11346960 11401269 11235220 11019731 11178822 11360989
15074 11360989 11025372 11076050 11285487 11104216 11544747 11307798 11203883 11033049 11226757
15065 11226757 11297440 11271677 11316534 11090578 11265321 11312696 11551615 11597147 11572339 11476278
15055 11476278 11665431 11531446 11546099 11416301 10767025 10849542 10919651 10776704 11091027 10817415
15045 10817415 10888511 11074761 11127916 10815124 10908990 10806359 10995149 11082338 11290162 11355730
15035 11355730 11490637 11248868 10947359 11155464 11292868 11337722 11318436 11175212 11117400 11180080
15025 11180080 11007558 11192621 11518773 11495422 11415465 11400704 11314322 11131489 11394007 11416296
$$ [...]
##END NTUPLES=NMR SPECTRUM
##END=
