##TITLE=1H_CA-9361-2
 200.13MHz,CDCl3,
 8 sc
 
 8.7.2025
##JCAMPDX= 6.0         $$ Bruker NMR JCAMP-DX V2.0
##DATA TYPE= NMR SPECTRUM
##DATA CLASS= NTUPLES
##ORIGIN= UXNMR, Bruker Analytische Messtechnik GmbH
##OWNER= pz
$$ XWIN-NMR		Version 3.5
$$ Tue Jul  8 15:40:50 2025 Russian Standard Time (UT+4h)  she@DPX200
##.OBSERVE FREQUENCY= 200.1313
##.OBSERVE NUCLEUS= ^1H
##.ACQUISITION MODE= SIMULTANEOUS
##.ACQUISITION SCHEME= undefined
##.AVERAGES= 8
##.DIGITISER RES= 18
##SPECTROMETER/DATA SYSTEM= spect
##.PULSE SEQUENCE= zg30
##.SOLVENT NAME= CDCl3
##.SHIFT REFERENCE= (INTERNAL, CDCl3, 0, 15.4858)
##AUDIT TRAIL= $$ (NUMBER, WHEN, WHO, WHERE, WHAT)
$$ ##TITLE= Audit trail, XWIN-NMR		Version 3.5
$$ ##JCAMPDX= 5.01
$$ ##ORIGIN= Bruker BioSpin GmbH
$$ ##OWNER= she
$$ F:/spectra/data/she/nmr/H-C/1/pdata/1/auditp.txt
$$ ##AUDIT TRAIL=  $$ (NUMBER, WHEN, WHO, WHERE, WHAT)
(   1,<2025-07-08 15:39:24.06 +0400>,<she>,<DPX200>,
      <created by zg, POWCHK disabled, PULCHK disabled
       configuration hash MD5:
       00 E9 B6 7A A2 85 ED C7 34 08 36 98 17 FE 4E 26
       data hash MD5: 16K
       08 E5 12 B0 65 04 9E 15 6D 31 74 D0 0E F8 4E E3>)
(   2,<2025-07-08 15:39:26.43 +0400>,<she>,<DPX200>,
      <Start of raw data processing
       efp BC_mod = 2 LB = 0.25 FT_mod = 6 PKNL = 1 PHC0 = -1205.043 PHC1 = 14.59238 SI = 16K 
       data hash MD5: 16K
       B5 BC 6F 55 1A BF 97 93 C6 FC 58 7B FC 04 20 08>)
(   3,<2025-07-08 15:39:49.12 +0400>,<she>,<DPX200>,
      <pk PHC0 = 8.183578 PHC1 = -10.4 
       data hash MD5: 16K
       8E 32 49 94 37 9B 91 41 12 E2 C7 A4 54 B5 D9 6C>)
(   4,<2025-07-08 15:39:55.53 +0400>,<she>,<DPX200>,
      <abs ABSG = 5 
       data hash MD5: 16K
       30 13 AD C7 A3 5F 81 3E AB D9 DA D7 EF E4 07 7D>)
$$ ##END=
$$ 
$$ hash MD5
$$ 74 29 26 17 08 38 EE 89 F8 25 A2 B7 A4 50 C6 5B
##$RELAX= 
##$RELAX= 
##$RELAX= 
##$RELAX= 
##$RELAX= 
##$RELAX= 
$$ Bruker specific parameters
$$ --------------------------
##$DU= <F:/spectra>
##$EXPNO= 1
##$NAME= <H-C>
##$PROCNO= 1
##$TYPE= <nmr>
##$USER= <she>
##$AMP= (0..31)
100 100 100 100 100 100 100 100 100 100 100 100 100 100 100 100 100 100 
100 100 100 100 100 100 100 100 100 100 100 100 100 100 
##$AQSEQ= 0
##$AQ_mod= 1
##$AUNM= <au_zg>
##$AUTOPOS= <>
##$BF1= 200.13
##$BF2= 200.13
##$BF3= 200.13
##$BF4= 200.13
##$BF5= 200.13
##$BF6= 200.13
##$BF7= 200.13
##$BF8= 200.13
##$BYTORDA= 1
##$CFDGTYP= 0
##$CFRGTYP= 5
##$CHEMSTR= <none>
##$CNST= (0..31)
1 1 145 1 1 1 1 1 1 1 1 1 1 1 1 1 1 1 1 1 1 1 1 1 1 1 1 1 1 1 1 1 
##$CPDPRG= <>
##$CPDPRG1= <>
##$CPDPRG2= <>
##$CPDPRG3= <>
##$CPDPRG4= <mlev>
##$CPDPRG5= <mlev>
##$CPDPRG6= <mlev>
##$CPDPRG7= <mlev>
##$CPDPRG8= <mlev>
##$CPDPRGB= <>
##$CPDPRGT= <>
##$D= (0..31)
0 0.7 0 0 0 0 0 0 0 0 0 0.03 0 0 0 0 0 0 0 0 0 0 0 0 0 0 0 0 0 0 0 0 
##$DATE= 1751974763
##$DBL= (0..7)
120 120 120 120 120 120 120 120 
##$DBP= (0..7)
150 150 150 150 150 150 150 150 
##$DBP07= 0
##$DBPNAM0= <>
##$DBPNAM1= <>
##$DBPNAM2= <>
##$DBPNAM3= <>
##$DBPNAM4= <>
$$ [...]
##$SUBNAM3= <"">
##$SUBNAM4= <"">
##$SUBNAM5= <"">
##$SUBNAM6= <"">
##$SUBNAM7= <"">
##$SUBNAM8= <"">
##$SUBNAM9= <"">
##$SW= 18.0517328524113
##$SWIBOX= (0..15)
0 0 2 0 0 0 0 0 0 0 0 0 0 0 0 0 
##$SW_h= 3612.71676300578
##$TD= 16384
##$TD0= 1
##$TE= 0
##$TE2= 300
##$TE3= 300
##$TEG= 300
##$TL= (0..7)
0 120 120 120 120 120 120 120 
##$TP= (0..7)
150 150 150 150 150 150 150 150 
##$TP07= 0
##$TPNAME0= <>
##$TPNAME1= <>
##$TPNAME2= <>
##$TPNAME3= <>
##$TPNAME4= <>
##$TPNAME5= <>
##$TPNAME6= <>
##$TPNAME7= <>
##$TPOAL= (0..7)
0.5 0.5 0.5 0.5 0.5 0.5 0.5 0.5 
##$TPOFFS= (0..7)
0 0 0 0 0 0 0 0 
##$TUNHIN= 0
##$TUNHOUT= 0
##$TUNXOUT= 0
##$USERA1= <user>
##$USERA2= <user>
##$USERA3= <user>
##$USERA4= <user>
##$USERA5= <user>
##$V9= 5
##$VALIST= <valist>
##$VCLIST= <CCCCCCCCCCCCCCC>
##$VD= 0
##$VDLIST= <DDDDDDDDDDDDDDD>
##$VPLIST= <PPPPPPPPPPPPPPP>
##$VTLIST= <TTTTTTTTTTTTTTT>
##$WBST= 1024
##$WBSW= 4
##$XGAIN= (0..3)
0 0 0 0 
##$XL= 0
##$YL= 0
##$YMAX_a= 440757
##$YMIN_a= -727713
##$ZGOPTNS= <>
##$ZL1= 120
##$ZL2= 120
##$ZL3= 120
##$ZL4= 120
##$ABSF1= 15.42516
##$ABSF2= -2.626687
##$ABSG= 5
##$ABSL= 3
##$ALPHA= 0
##$AQORDER= 0
##$ASSFAC= 0
##$ASSFACI= 0
##$ASSFACX= 0
##$ASSWID= 0
##$AUNMP= <proc_1d>
##$AZFE= 0.1
##$AZFW= 0.1
##$BCFW= 0
##$BC_mod= 2
##$BYTORDP= 0
##$COROFFS= 0
##$CY= -3
##$DATMOD= 1
##$DC= 0
##$DFILT= <>
##$DTYPP= 0
##$F1P= 0
##$F2P= 0
##$FCOR= 1
##$FTSIZE= 16384
##$FT_mod= 6
##$GAMMA= 0
##$GB= 0
##$INTBC= 1
##$INTSCL= 3.241238e-09
##$ISEN= 128
##$LB= 0.25
##$LEV0= 0
##$LPBIN= 0
##$MAXI= 10000
##$MC2= 0
##$MEAN= 0
##$ME_mod= 0
##$MI= 1.114404
##$NCOEF= 0
##$NC_proc= -7
##$NLEV= 6
##$NOISF1= 3.799351
##$NOISF2= 2.8
##$NSP= 0
##$NTH_PI= 0
##$NZP= 0
##$OFFSET= 15.48576
##$PC= 1
##$PHC0= -1196.859
##$PHC1= 4.19238
##$PH_mod= 1
##$PKNL= yes
##$PPARMOD= 0
##$PSCAL= 0
##$PSIGN= 0
##$REVERSE= no
##$SF= 200.13000719249
##$SI= 16384
##$SIGF1= 3
##$SIGF2= 2
##$SINO= 0.751879
##$SIOLD= 32768
##$SREGLST= <19F.Aceton>
##$SSB= 0
##$STSI= 16384
##$STSR= 0
##$SW_p= 3612.71676300578
##$SYMM= 0
##$S_DEV= 0
##$TDeff= 16384
##$TDoff= 0
##$TI= <>
##$TILT= no
##$TM1= 0
##$TM2= 0
##$TOPLEV= 0
##$USERP1= <user>
##$USERP2= <user>
##$USERP3= <user>
##$USERP4= <user>
##$USERP5= <user>
##$WDW= 1
##$XDIM= 16384
##$YMAX_p= 456921976
##$YMIN_p= -1828794
$$ End of Bruker specific parameters
$$ ---------------------------------
##NTUPLES= NMR SPECTRUM
##VAR_NAME=  FREQUENCY,     SPECTRUM/REAL,   SPECTRUM/IMAG
##SYMBOL=    X,             R,               I
##VAR_TYPE=  INDEPENDENT,   DEPENDENT,       DEPENDENT
##VAR_FORM=  AFFN,          ASDF,            ASDF
##VAR_DIM=   16384,         16384,           16384
##UNITS=     HZ,            ARBITRARY UNITS, ARBITRARY UNITS
##FACTOR=    0.220516191357247, 1,           1
##FIRST=     3099.16520716822, 0,            0
##LAST=      -513.55155583756, 0,            0
##MIN=       -513.55155583756, -1828794,     0
##MAX=       3099.16520716822, 456921976,    0
$$ Real data points
##PAGE= N=1
##DATA TABLE= (X++(R..R)), XYDATA
$$ [...]
6198A8220386J56006J38817k32276J26496J4192J47122J32436M7006K35802M6640
6188A9032627K58455L86536K95721M14678K12284M48035M45767M10640M54599
6179B2359342M46010K73885K93820M07385L58574O23482J32323k48261k13008
6170B4433552k1844J046o9541J80274j06834o7137J22430j19570N3015O047j6680
6159B4394758l36423j37496K0258j2545J80530J73850J72756N2905k17937p3034
6149B4217622j8200K75197o7179k74542r6682K40119M06203J85226M0662m8573
6139B4859853J71097l90100j92278k2485k42565l30888k89104K0327j35546P9837
6129B3528148J64092k04600O1028m0625L63848J29863J35665p7771K98619M88667
$$ plain form
6198 18220386 18376392 18515209 18282933 18409429 18423621 18570743 18703179 18750185 18985987 19032627
6188 19032627 19291082 19677618 19973339 20388017 20600301 21048336 21494103 21904743 22359342
6179 22359342 22805352 23079237 23373057 23780442 24139016 24762498 24894821 24646560 24433552
6170 24433552 24411708 24412754 24343213 24523487 24416653 24349516 24471946 24352376 24405391 24411438 24394758
6159 24394758 24058335 23920839 23941097 23928552 24109082 24282932 24455688 24508593 24290656 24217622
6149 24217622 24199422 24474619 24407440 24132898 24036216 24276335 24682538 24867764 24908426 24859853
6139 24859853 25030950 24640850 24448572 24426087 24183522 23852634 23563530 23583857 23448311 23528148
6129 23528148 23692240 23487640 23548668 23508043 23871891 24001754 24137419 24059648 24358267 24846934
6119B4846934J72683J55498k49445M9781J60805J48241J2606j33125J77506L26657
6109B5668141J30252J03207R238K3813l45318m58234k81537j47949Q0491l03756
6099B4478348n01145q4296K53825K23343n9286J52675k36532k92833k5024j09942
6089B3799133p4144o2401k9475J41315J4907p1228Q0232J02094J60190J44230
6079B4204853J0953J3062P7930K28544K04994p2284K9140k35043n49116n79661
6069B3333372j62562R1594k1723L0J28678j7874k48465J55746J90192K7834l76780
6058B3100042j52718Q1964p8499n91415J0363q740k92508n8847k62010r2211J64696
6047B1820117j00243j90585p8564q7090P9049J8016N8750k04252M8041n44695
$$ plain form
6119 24846934 25019617 25175115 24925670 24975451 25136256 25284497 25297103 25163978 25341484 25668141
6109 25668141 25798393 25901600 25910838 25934651 25589333 25131099 24849562 24701613 24782104 24478348
6099 24478348 23977203 23892907 24146732 24370075 24310789 24463464 24226932 23934099 23909075 23799133
6089 23799133 23724989 23662588 23633113 23774428 23789335 23718107 23798339 23900433 24060623 24204853
6079 24204853 24215806 24228868 24306798 24535342 24740336 24668052 24697192 24462149 23913033 23333372
6069 23333372 23170810 23262404 23240681 23240711 23369389 23351515 23103050 23258796 23448988 23476822 23100042
6058 23100042 22947324 23029288 22950789 22359374 22369737 22360997 22068489 22009642 21747632 21655421 21820117
6047 21820117 21719874 21529289 21450725 21363635 21442684 21460700 21519450 21315198 21363239 20818544
6037B0818544l74731J06263o6503j78064l05573j16773K23778L05929N8819K2702
6027B0494391l2671J27178N7403Q0045O7926J61619L43412m5914p7457O1031L67838
6016B1604801N07184J38711J23496K0515M5077L2769l629L46417Q6154q0104k12289
6005B2609102k03509m4305K15600j0984R2359J16363P5505K20293J00411j01063
5995B3069772R2647K27506L70256N044K195K57459J64089k55085j26477K56769
5985B4064175J89998n3895k3346j00762o5983j91662j35520P8983m1135k99828
5975B3421025j34461K41355J90650m7936K25602j00254m75171K97279J97050O0198
5965B3875337q6306K34488L06040K08299k7427K12497J61869J05697O8912J01194
$$ plain form
6037 20818544 20443813 20550076 20483573 20305509 19999936 19883163 20106941 20412870 20471689 20494391
6027 20494391 20461720 20588898 20646301 20726346 20794272 20955891 21299303 21253389 21175932 21236963 21604801
6016 21604801 22111985 22250696 22374192 22394707 22439784 22472553 22468924 22815341 22901495 22821391 22609102
6005 22609102 22405593 22361288 22576888 22565904 22658263 22774626 22850131 23070424 23170835 23069772
5995 23069772 23162419 23389925 23760181 23765225 23767420 24024879 24188968 23933883 23807406 24064175
5985 24064175 24254173 24200278 24176932 24076170 24010187 23818525 23683005 23761988 23720853 23421025
5975 23421025 23286564 23527919 23718569 23670633 23896235 23795981 23320810 23618089 23815139 23875337
5965 23875337 23789031 24023519 24329559 24537858 24510431 24722928 24884797 24990494 25059406 25160600
5955B5160600J84617K67468j58662J03781R5567N2158K0438k5523K47307L39533
5945B6287284L12590M18068P3000J13732L53284L29552K79616M53478K93269O77688
5935B9591561L36981J78419J80274j37281K16876K41225j49223m8824j59232q0889
5925C0169887k94055l85534J22139K5391M9394Q6848L05043L04343L86791m160
5915C0766087N03711K68488M23194L34957K94082L75289L09300J36245K9718j96276
5905C3244795l00823j19019k01086l14660l69860l77549m91125j63750l82249
5896C0524674O7589J06429J1524q8837j1163J94348K20485J73647M6129Q1015
5886C1325840J49459J40965l31253O0454L1049q1765l73359j93715q7261L465
$$ plain form
5955 25160600 25345217 25612685 25454023 25557804 25653371 25705529 25725967 25700444 25947751 26287284
5945 26287284 26599874 27017942 27090942 27204674 27557958 27887510 28167126 28620604 28913873 29591561
5935 29591561 29928542 30106961 30287235 30149954 30366830 30608055 30458832 30410008 30250776 30169887
5925 30169887 29875832 29490298 29612437 29637828 29687222 29774070 30079113 30383456 30770247 30766087
5915 30766087 31269798 31538286 31961480 32296437 32590519 32965808 33275108 33411353 33441071 33244795
5905 33244795 32943972 32824953 32623867 32309207 31939347 31561798 31070673 30906923 30524674
5896 30524674 30592263 30698692 30710216 30621379 30610216 30804564 31025049 31198696 31244825 31325840
5886 31325840 31475299 31616264 31285011 31345465 31376514 31294749 30921390 30727675 30640414 30643879
5876C0643879P3121j12800p3553L22000j56093o8873m1712n4280Q0635l81493
5866C0230831m7836L6416l31816j50267R8735p1642N1515j70550J00979K47864
5856B9994229P0799j28540l19067R475k83939k69563K1347N6049o7367P5535J50231
5845B9309189R450O9273j9891J33448K68636K15734K63323n60444k93961J94584
5835B9589341p1896P48o106j65003p6976L81390P7056j83518k85500N26013K49961
5824C0035510j83593q9555K35504K25615M811j59770k77626P8948L91444J89957
5814C0451245j68125p4364K18980K52214o7560j38374P8573N9121o664L09157
5804C0914203n3481p1469j36686n2864R1683J80520K26120O7339j55248j07681
$$ plain form
5876 30643879 30717000 30604200 30530647 30852647 30696554 30627681 30585969 30531689 30612324 30230831
5866 30230831 30182995 30219411 29887595 29737328 29836063 29764421 29815936 29645386 29746365 29994229
5856 29994229 30065028 29936488 29617421 29626896 29342957 29073394 29094741 29150790 29083423 29158958 29309189
5845 29309189 29318639 29387912 29368021 29501469 29770105 29985839 30249162 29688718 29394757 29589341
5835 29589341 29517445 29518193 29512087 29347084 29270108 29651498 29728554 29545036 29259536 29785549 30035510
5824 30035510 29851917 29762362 29997866 30223481 30228292 30068522 29790896 29869844 30261288 30451245
5814 30451245 30283120 30208756 30427736 30679950 30612390 30474016 30552589 30611710 30605046 30914203
5804 30914203 30860722 30789253 30652567 30599703 30691386 30871906 31098026 31165365 31010117 30902436
5794C0902436J05287Q3898Q7318L9317J74937J43863k53193k13514J99758L08605
5784C1578712j2525j82192N2286k19789Q6375j08260o5485O5910J65549q1759
5774C1278822j0184K52340k33705J63875P396k46277j15739l3462l8489Q5473
5764C1110050K11430l58210k42027k2274J41733L650j65631j2294j29194j04741
5754C0432492J99251n6670J43466j49530p8358j6340m5046J14797j20855o2019
5744C0361188M6321k90224k88125k0213k0691J18347l67690K6037J3932k42330
5734B9336552k6512K42668r5798J35682o7306P5806n943m60266j82725k42108
5724B8710050m30887j34584O908J27388j90248k58548K3248j66169l27266j44187
$$ plain form
5794 30902436 31007723 31091621 31178939 31218256 31393193 31537056 31283863 31070349 31270107 31578712
5784 31578712 31566187 31383995 31436281 31216492 31302867 31194607 31129122 31195032 31360581 31278822
5774 31278822 31268638 31520978 31287273 31451148 31458544 31212267 31096528 31063066 31024577 31110050
5764 31110050 31321480 30963270 30721243 30698969 30840702 30844352 30678721 30666427 30537233 30432492
5754 30432492 30631743 30575073 30718539 30569009 30490651 30474311 30429265 30544062 30423207 30361188
5744 30361188 30407509 30117285 29829160 29808947 29788256 29906603 29538913 29564950 29578882 29336552
5734 29336552 29310040 29552708 29456910 29592592 29525286 29601092 29595149 29134883 28952158 28710050
5724 28710050 28279163 28144579 28151487 28278875 28088627 27830079 27853327 27687158 27359892 27215705
5714B7215705Q6541k5525j14694k66628n9783J73137k52014r9735R1194q8J9325
5703B6767435q5316j17591L29115K06576l9287K70434K59539k04914m87710m53033
5693B6445248l17157k01693k91941k08919l66496q8315k00158q5443M9031k99976
5683B4434181k80917R82J521K54858P1930k64064L1999K965O5280J98146q4332
5672B4432549j05960l6055K36728K21499M1069l2734L53861N79047n5354n04261
5662B5130389p86403o41075q2054p9881k6384j48086j74398k25300j47553J1795
5652B2831050J30351l8940j64829L3230n7155l34677q294J27806J69266j03341
5642B2584467j73793J85383k19505l07781p5629r2135j30544m9183K98474j92943
$$ plain form
5714 27215705 27302246 27276721 27162027 26895399 26835616 27008753 26756739 26657004 26748198 26748110 26767435
5703 26767435 26682119 26564528 26893643 27100219 27060932 27331366 27590905 27385991 26898281 26445248
5693 26445248 26128091 25926398 25634457 25425538 25059042 24970727 24770569 24685126 24734157 24434181
5683 24434181 24153264 24154246 24155767 24410625 24482555 24218491 24250490 24253455 24318735 24516881 24432549
5672 24432549 24326589 24290534 24527262 24748761 24789830 24757096 25110957 25690004 25634650 25130389
5662 25130389 24343986 23702911 23620857 23540976 23514592 23366506 23192108 22966808 22819255 22831050
5652 22831050 22961401 22922461 22757632 22790862 22733707 22399030 22390736 22518542 22687808 22584467
5642 22584467 22410674 22596057 22376552 22068771 21993142 21901007 21770463 21721280 22019754 21826811
5632B1826811j49080k63991l88070j03428L1359J64156k85253l25099l79390K0169
5622B0148184N1552N4958o0272l12640j49227J24593j04485p5580k34341J39690
5612A9582432j27380j84832N4914j89504O8011N8538k94813n6666j41565j88861
5602A8580274L12331K1985M7022J36431m0094k79677p8146J7412j0235j67164
5592A8540139l79613J11291J94973K74839l23946j73171K47719K9915k1692J0557
5582A8511011k40605K94246K3086j46072P7173n2287k33820L486K49418j30484
5572A8355152Q7776J07661K18524m0918j3596l3446J75337J04462J20581j3897
5562A9067636p8015k4019J55965l8202J717m8926j97834Q5757j3268J42715k59604
$$ plain form
5632 21826811 21677731 21413740 21025670 20922242 20953601 21117757 20832504 20507405 20128015 20148184
5622 20148184 20199736 20254694 20194422 19881782 19732555 19857148 19752663 19677083 19442742 19582432
5612 19582432 19455052 19270220 19325134 19135630 19203641 19262179 18967366 18910700 18769135 18580274
5602 18580274 18892605 18914590 18961612 19098043 19057949 18778272 18700126 18717538 18707303 18540139
5592 18540139 18160526 18271817 18466790 18741629 18417683 18244512 18492231 18522146 18500454 18511011
5582 18511011 18270406 18564652 18587738 18441666 18518839 18466552 18232732 18236218 18485636 18355152
5572 18355152 18442928 18550589 18769113 18728195 18714599 18681153 18856490 18960952 19081533 19067636
5562 19067636 18989621 18965602 19121567 19083365 19085082 19036156 18838322 18924079 18910811 19053526 18793922
5551A8793922K67482J84522N7900N02438j88248K02324L6237k02634J11372O4871
5541A9830186P1481j6142n8868p5836K4677k86455j18765J88974J8904j8341K24329
5530A9784144q7430q1324j25159k64645J15623K3586L807P6995P1437K60626o649
5519A9771011k03482j56269K08741J53864L9259J99460M781m3830J11337K66647
5509B0351519K13783K20939O3409O18663L58882L07705O98556L88965j62755j7194
5499B3042472n9655m31296k2818j75455K9905J72937J21290M2935l65592l79314
5489B1975409k31268m51103j96465P2687J27177J22984k30837o1827J91104J75121
5479B1492982K00064J64997K69443K20109k77749L6619k11792k73822k29014R8541
$$ plain form
5551 18793922 19061404 19245926 19303826 19806264 19618016 19820340 19856577 19653943 19765315 19830186
5541 19830186 19901667 19885525 19826657 19750821 19775498 19489043 19370278 19559252 19578156 19559815 19784144
5530 19784144 19696714 19615390 19490231 19225586 19341209 19364795 19368602 19445597 19517034 19777660 19771011
5519 19771011 19567529 19411260 19620001 19773865 19813124 20012584 20017365 19973535 20084872 20351519
5509 20351519 20565302 20786241 20849650 21468313 21827195 22134900 22833456 23222421 23059666 23042472
5499 23042472 22982817 22551521 22528703 22353248 22383153 22556090 22677380 22720315 22354723 21975409
5489 21975409 21744141 21293038 21096573 21169260 21296437 21419421 21188584 21126757 21317861 21492982
5479 21492982 21693046 21858043 22127486 22347595 22069846 22106465 21894673 21620851 21391837 21490378
5469B1490378j31166j05370l94414m03183k86340J19820j17864J5873q265J86220
5459B0365689O54023O59272J168691Q35204M1510j528319j916529j244409p99271
5450A8235861o49889k42788l20232q7005r5762m24371k55937j23726J08159j80048
5440A5964262j93188j59670k89051k39879j43312j55368k06967L4622k66493K039
5430A4346995J39347q6452o5434j53917j51459K41411P424k5871M4264o9484r7198
5419A4129626j52846p2462j29433l05833L2040P4228K7638J05800q4630r269k6790
5408A3588069j5559L09071M3309Q9728m70879K1236K14227P4989k39984k05619
5398A3408588L05252Q3864m2653P7620r5646J19150n4716q7314j43115k20860
$$ plain form
5469 21490378 21359212 21253842 20859428 20456245 20169905 20289725 20171861 20187734 20179469 20365689
5459 20365689 21019712 21678984 22847675 23682879 23724389 22196070 20279541 19035132 18235861
5450 18235861 17585972 17343184 17022952 16935947 16840185 16415814 16159877 16036151 16144310 15964262
5440 15964262 15771074 15611404 15322353 15082474 14939162 14783794 14576827 14611449 14344956 14346995
5430 14346995 14486342 14399890 14334456 14180539 14029080 14270491 14277915 14252044 14296308 14226824 14129626
5419 14129626 13976780 13904318 13774885 13469052 13501092 13575320 13602958 13708758 13624128 13614859 13588069
5408 13588069 13572510 13881581 13924890 14014618 13543739 13564975 13779202 13854191 13614207 13408588
5398 13408588 13713840 13797704 13755051 13832671 13737025 13856175 13801459 13714145 13571030 13350170
5388A3350170J15298M29269O3342j9968j04506j52148j45924o8105o7487m0877
5378A3359064K18512k42403r5037j8875K54284J49661N5526k81689Q3058J46934
5368A3629035l892k26532K51732O8761k29135j01190K81393N5568n9950q1428
5358A3584362j3642M8035j78176K68787j3413q7244J19928J37112J21073L909
5348A3990731J04547j1399j01578K35535q7596O365j32794L18206L35787j4242
5338A4643562Q8498M4184N7071Q4973K53287K82396m4263j47138J60807J58985
5328A5582362J79906K59835M48473R8113M11271J38344J31751J5159K03114K58409
5318A7726737K77680N13050K41544K89422j06571J29386L84263J52956J20612
$$ plain form
5388 13350170 13465468 13894737 13958079 13938111 13833605 13681457 13535533 13467428 13399941 13359064
5378 13359064 13577576 13335173 13240136 13221261 13475545 13625206 13680732 13399043 13482101 13629035
5368 13629035 13625143 13398611 13650343 13719104 13489969 13388779 13670172 13725740 13665790 13584362
5358 13584362 13570720 13618755 13440579 13709366 13695953 13608709 13728637 13865749 13986822 13990731
5348 13990731 14095278 14083879 13982301 14217836 14130240 14136605 14003811 14322017 14657804 14643562
5338 14643562 14732060 14776244 14833315 14918288 15171575 15453971 15409708 15262570 15423377 15582362
5328 15582362 15762268 16022103 16470576 16568689 16979960 17118304 17250055 17265214 17468328 17726737
5318 17726737 18004417 18517467 18759011 19048433 18941862 19071248 19455511 19608467 19729079
5309A9729079Q7802J6384L14487J42936r6447J05829r4375j08748k38208k14499
5299A9644240O9188K12457R6464l01672j63377J27392K13675k13208p4757k6772
5289A9583630j60554k81592k95277j5413m4464P9321n4956j56185N8672j95543
5279A8517639k18235J24723K56535J17140J95911K23338o1864J96455J12101L22049
5269A9785792K21260Q4286K11318N79824L55569L05488M72082K38576K08863K68799
5259B2731857J73965k25998O9344J9164j09298l27256J42319o9617k33817J54284
5249B2324947l10039L57593p1878r7068l03876k95104P4447l34180J13051K19748
5239B1677641N3343j32647J40530J10215j64971p0001R557m7382L4161J75677
$$ plain form
5309 19729079 19816881 19833265 20147752 20290688 20194241 20300070 20205695 20096947 19858739 19644240
5299 19644240 19713428 19925885 20022349 19720677 19557300 19684692 19898367 19685159 19610402 19583630
5289 19583630 19423076 19141484 18846207 18830794 18786330 18865651 18810695 18654510 18713182 18517639
5279 18517639 18299404 18424127 18680662 18797802 18993713 19217051 19155187 19351642 19463743 19785792
5269 19785792 20007052 20091338 20302656 20882480 21238049 21543537 22015619 22254195 22463058 22731857
5259 22731857 22905822 22679824 22749168 22768332 22659034 22331778 22474097 22404480 22170663 22324947
5249 22324947 22014908 22372501 22300623 22203555 21899679 21604575 21679022 21344842 21457893 21677641
5239 21677641 21730984 21598337 21738867 21849082 21684111 21614110 21623667 21576285 21610446 21786123
5229B1786123J26243j67831N9740J91877J48587L38800L70307J12054J40046k16494
5219B2889452m2198l1397j5225k52752j869K17168m981K81716J78138J48489K63861
5208B3630402K12655J97507K40422K2071L57781M18425L15909J03662j20620K36991
5198B5615205j9898K24890M88013l4165L61169K61515J10158L11004L34685K99847
5188B7952423R468L01024M62297K57064K77983O90337K28598N36670P04463M20896
5178C1841223P76739N98209P32205O68183R83161Q74454J120298Q46676P53618
5169C9194766J50507o01692j373117j065829p47869o49641m27029n34593k80122
5160C3665381l04212r6160q9190J51057Q8419M4094j40133L87440J70220N0554
$$ plain form
5229 21786123 21912366 21744535 21804275 21996152 22144739 22483539 22853846 22965900 23105946 22889452
5219 22889452 22847254 22815857 22800632 22547880 22546011 22763179 22758198 23039914 23218052 23366541 23630402
5208 23630402 23843057 24040564 24280986 24303057 24660838 25079263 25395172 25498834 25378214 25615205
5198 25615205 25595307 25820197 26308210 26274045 26635214 26896729 27006887 27317891 27652576 27952423
5188 27952423 27961891 28262915 28725212 28982276 29260259 29950596 30179194 30715864 31420327 31841223
5178 31841223 32617962 33216171 33948376 34616559 35599720 36474174 37594472 38441148 39194766
5169 39194766 39345273 38743581 37370464 36304635 35556766 34907125 34480096 33945503 33665381
5160 33665381 33361169 33265009 33175819 33326876 33415295 33459389 33319256 33706696 33876916 33927470
5150C3927470m6189J01389k292P634J791n5307k73016l61938J13955j23499p3565
5139C3216433N5398J55092R7119K58312J27540J65971K16571L76555K35636J95116
5129C5099743M12968J86845M69039k1895J02727J03094r1027J40871o9228N5527
5119C6388664l6804J40092M16330j72311K69120Q2387P0485q059k91405J34453
5109C6992952J48643M401J51870j36462k46582L4202j98669J12639m0436Q634
5099C6831192J91912K8521k70460k3231j19472R4475K45372j57647M06508K39525
5089C7466695K8778M36041K20633N2378J78916K40670Q4901K72182K79489J66216
5079C9426899j05065L53322M36469M94227N35417M24717L24161N19545K82836
$$ plain form
5150 33927470 33881281 33982670 33980378 33988012 33989803 33934496 33661480 33299542 33413497 33289998 33216433
5139 33216433 33271831 33426923 33524042 33782354 33909894 34075865 34292436 34668991 34904627 35099743
5129 35099743 35512711 35699556 36168595 36146700 36249427 36352521 36261494 36402365 36333137 36388664
5119 36388664 36351860 36491952 36908282 36735971 37005091 37087478 37157963 37149904 36858499 36992952
5109 36992952 37141595 37145996 37297866 37161404 36914822 36949024 36750355 36862994 36822558 36831192
5099 36831192 37023104 37051625 36781165 36757934 36638462 36732937 36978309 36820662 37227170 37466695
5089 37466695 37495473 37931514 38152147 38204525 38383441 38624111 38709012 38981194 39260683 39426899
5079 39426899 39321834 39675156 40111625 40605852 41141269 41565986 41890147 42409692 42692528
5070D2692528K49982J56064K39910N86039K57021N13169L94833K72651N09884
5061D5872081M54582L68023K67003K71351M90752N07757J55652J35721M76369
5052D8999291M90410N02843P58492J036943O98402R05283P71720Q64717P84309
5043E5812410R69913R68581Q86499J133222J056665Q22207R43422J033915J286095
5034F4912929J275716J260515J711644J717842K164221J969874J444799J686980
5026G8144520J298562J442631J862761K104872K303339K361038K773746K907299
5018I5198768L304042L376360L984323M390281M504764M799013M620306N182241
5010A29360098N676129O131088O818306P656542Q737409Q705919R243478J0687175
$$ plain form
5070 42692528 42942510 43098574 43338484 43924523 44181544 44694713 45089546 45362197 45872081
5061 45872081 46326663 46694686 46961689 47233040 47723792 48231549 48387201 48522922 48999291
5052 48999291 49489701 49992544 50751036 51787979 52486381 53391664 54163384 55028101 55812410
5043 55812410 56782323 57750904 58637403 59770625 60827290 61649497 62592919 63626834 64912929
5034 64912929 66188645 67449160 69160804 70878646 73042867 75012741 76457540 78144520
5026 78144520 79443082 80885713 82748474 84853346 87156685 89517723 92291469 95198768
5018 95198768 98502810 101879170 105863493 110253774 114758538 119557551 124177857 129360098
5010 129360098 135036227 141167315 147985621 155642163 164379572 173085491 182328969 193016144
5002A93016144J3085830J5884687J8844447K0512144J8240307R902454j660006
4995B87826007r164557q212832k974665K343159P197881J1012351J2981162J2184026
4987C13192532N763970m642239j0461611q987009n596755m301849o192971r563671
4979B69210397j0773852r205294p889543o596175n663282n099336l741028k203453
4971B18038434o28980N48908J625480L410532N174001O878342R079185J0721054
4963B54846956J1802596J1905689J2663251J5337743K0879894K7798096L3913868
4956C89148093L7097576K9147086J529221l3923888m9753812m3947034l2711642
4949B96585600k3343184j7027531j2866294r787479p647251o525658n389859l757644
$$ plain form
5002 193016144 206101974 221986661 240831108 261343252 279583559 289486013 287826007
4995 287826007 278661450 270448618 267473953 269817112 277014993 288027344 301008506 313192532
4987 313192532 318956502 314314263 303852652 294865643 289268888 284967039 278774068 269210397
4979 269210397 258436545 249231251 241341708 234745533 229082251 223982915 220241887 218038434
4971 218038434 217409454 217958362 219583842 222994374 228168375 235046717 244125902 254846956
4963 254846956 266649552 278555241 291218492 306556235 327436129 355234225 389148093
4956 389148093 426245669 455392755 456921976 422998088 373244276 329297242 296585600
4949 296585600 273242416 256214885 243348591 233561112 225913861 219388203 213998344 210240700
4941B10240700k168111l50895J295160K056355K031161p66814l639951l865468
4933B04832137k584784j730352k346495k557896l205590m878804m729338l782200
4925A79016678k708011j422022L2681N58948j208k155560m875345o009791n409767
4916A57026603m316928l133351k565546k394626k075758k423539k761166k557344
4908A34798345k539966k325333k127242j546778j128327j078355j325553j851197
4900A20875594k922754l466194l330089k793602k550846k307319j966789j825725
4892I9712276j607566j266300j359508j382152j367648j236405j156922q27243
4884H9508532j389724j021089r85138p39348o68128j078900p96522o31390m53365
$$ plain form
4941 210240700 208072589 207721694 209016854 211073209 213104370 212337556 208697605 204832137
4933 204832137 202247353 200517001 198170506 195612610 192407020 187528216 182798878 179016678
4925 179016678 176308667 174886645 174919326 175478274 175477066 173321506 168446161 162436370 157026603
4916 157026603 152709675 149576324 147010778 144616152 142540394 140116855 137355689 134798345
4908 134798345 132258379 129933046 127805804 126259026 125130699 124052344 122726791 120875594
4900 120875594 117952840 114486646 111156557 108362955 105812109 103504790 101538001 99712276
4892 99712276 98104710 96838410 95478902 94096750 92729102 91492697 90335775 89508532
4884 89508532 88118808 87097719 86112581 85373233 84705105 83626205 82829683 82198293 81744928
4875H1744928p01645m30269p64725q11080o22268m51250k62686k38678m62717
4866G6999610n26744o12645p73889q36933n68882q23731m41308n74534n93156
4857G1247788l14295k70516m14556l04147p14730n22607n05396l23431k82268
4848F7595842l15801k52353j05427k19861K26596J65003j77386K14126L73151
4839F7503890L69730M96080M43863K97074L75638M36230M06431M22377L88141
4830G1139454L45562L70331N97343L94531Q04786J116513J317510J575375J835758
4821G9497163K632684K897094L220879L813977M716894N383984O211867O734859
4813A15109401O835829O702086P901375R933578J3102060J6728153J8963145J7800400
$$ plain form
4875 81744928 81043283 80613014 79848289 79037209 78414941 77963691 77701005 77462327 76999610
4866 76999610 76472866 75860221 75086332 74249399 73680517 72856786 72415478 71840944 71247788
4857 71247788 70933493 70662977 70248421 69944274 69229544 68706937 68201541 67878110 67595842
4848 67595842 67280041 67027688 66922261 66702400 66928996 67093999 66916613 67130739 67503890
4839 67503890 67873620 68369700 68813563 69110637 69486275 69922505 70328936 70751313 71139454
4830 71139454 71485016 71855347 72452690 72847221 73652007 74768520 76086030 77661405 79497163
4821 79497163 82129847 85026941 88247820 92061797 96778691 102162675 108374542 115109401
4813 115109401 121945230 128647316 136548691 146482269 159584329 176312482 195275627 213076027
4805B13076027N963707j4347521k5906489k3249726j7845498j3048154r948158
4798A14694188p991489p033412n901617m761650m257729l729926l210747k962357
4790G4845261k879078k573005k436396k358682k126342k085619j961621j619136
4782E6805382j509660j358347j120968j318938j266542q57414q52782o27095q46989
4773D7046647m69077o81618m75215m40750l98121k52175m66352k32354k2488k51470
4763D3357027l54222k45312n3525l54395k28834n63962q43472r43370r73110r45189
4753C7851636o96856q97001o63940k34989k75094p00994m12585l47920o62508
4744C2959749k00648l68089j94340m9364m06737l39293l36952k42379P6728j41406
$$ plain form
4805 213076027 219039734 204692213 178785724 155535998 137690500 124642346 114694188
4798 114694188 106702699 99669287 93767670 89006020 84748291 81018365 77807618 74845261
4790 74845261 71966183 69393178 66956782 64598100 62471758 60386139 58424518 56805382
4782 56805382 55295722 53937375 52816407 51497469 50230927 49373513 48520731 47893636 47046647
4773 47046647 46577570 45895952 45420737 44979987 44581866 44329691 43863339 43630985 43608497 43357027
4763 43357027 43002805 42757493 42703968 42349573 42120739 41556777 40713305 39769935 38796825 37851636
4753 37851636 37154780 36257779 35593839 35358850 35083756 34382762 33970177 33622257 32959749
4744 32959749 32759101 32391012 32196672 32147308 31740571 31401278 31064326 30821947 30898675 30757269
4734C0757269K9161l25895l13319K2312l34374k42935j15739j21303l1863j40159
4724B9183155k73457j04285K483M9480k04812n53619l58533K21444k1687q8909
4714B7851260n5930l53824l41055m20751o22562j99323J34212k13230m07106j91595
4704B5180096m23145l3640R9550r6592k09028k21613J6452j58930m11914j07601
4694B3633635M36056j35363j81326j35504j96048j86034j43660n038j18671k05496
4684B2762551p1253N5118m6030j30886r286J91094k33847m05119j61819r6125
4674B1854398l32630m20363r938m28309l3740k37760k49772k9523l62223j3593
4664A9736547j83513J55832p4700l65936j2358R615m95556p6010L1333l01377
$$ plain form
4734 30757269 30786430 30460535 30147216 30169528 29835154 29592219 29476480 29355177 29323314 29183155
4724 29183155 28909698 28805413 28807896 28857376 28652564 28098945 27740412 27961856 27940169 27851260
4714 27851260 27795330 27441506 27100451 26679700 26057138 25857815 25992027 25778797 25371691 25180096
4704 25180096 24756951 24723311 24822861 24726269 24517241 24295628 24312080 24153150 23741236 23633635
4694 23633635 24069691 23934328 23753002 23617498 23421450 23235416 23091756 23086718 22968047 22762551
4684 22762551 22691298 22746416 22700386 22569500 22560214 22751308 22517461 22112342 21950523 21854398
4674 21854398 21521768 21101405 21091467 20663158 20629418 20391658 20141886 20112363 19750140 19736547
4664 19736547 19553034 19708866 19634166 19268230 19255872 19265487 18769931 18693921 18725254 18423877
4654A8423877J03951K692m6630j01587j2357K20297K44184J38087O6666j51123
4644A8888057m92788m38102l23990k8688j50760m84770k02570l197J39821j42124
4634A6760889k50667l11729J54152m9897p3747J18938K0140j61644k18930J61770
4624A6149275J68037l50757j08153K01658O8926r0837k17883P303l462o9305o2
4613A5754740J54329M6631j255J18332J23074q8271j14710J46805K61331p8966
4603A6322040Q7946J1421M0091K32534P1043J0679J99497L46121L08734K15146
4593A7845252j0723l7321j84333m91116n68305k61250m868m1341k50087j12679
4583A5883229l95793j84413k39196m48785O8298M1123j15189O2129j32182j78886
$$ plain form
4654 18423877 18527828 18530520 18483890 18382303 18369946 18590243 18834427 18972514 19039180 18888057
4644 18888057 18395269 17957167 17633177 17604489 17453729 16968959 16766389 16763192 16903013 16760889
4634 16760889 16510222 16198493 16352645 16302748 16229001 16347939 16368079 16206435 15987505 16149275
4624 16149275 16317312 15966555 15858402 16060060 16128986 16038149 15820266 15827569 15824107 15754802 15754740
4613 15754740 15909069 15955700 15954445 16072777 16195851 16107580 15992870 16139675 16401006 16322040
4603 16322040 16409986 16421407 16461498 16694032 16765075 16775754 16975251 17321372 17630106 17845252
4593 17845252 17834529 17797208 17612875 17121759 16553454 16292204 16287336 16245995 15995908 15883229
4583 15883229 15487436 15303023 15063827 14615042 14683340 14724463 14609274 14671403 14539221 14360335
4573A4360335j48006j0806l78369m0849n2715o6329k65789l74160j17067j85561
4563A2720684O9380j03114K373k01133k01824K3423k42559O6763L839o4954O0279
4552A2133157j803k92423k06554M3396J68580J71504o4078j10677K7929l03234
4542A1565797k06701R3607N0834P7525m0610j52516l8550j04735j1129K56454
4532A1489976j99796j16948j53370J31830R182R062J56430K25054N0605j31804
4522A1470221k32737o4233K42762j03641j66973j91776j10903O8653j04800j82476
4512A0624097k54245o8851n0351K41177l5074K83138m6398k78189L31680Q4196
4502A0831180p5476j20753N9098M92427k790J06378R1425L49420J61770l5608
$$ plain form
4573 14360335 14212329 14201523 13823154 13782305 13729590 13663261 13397472 13023312 12906245 12720684
4563 12720684 12790064 12686950 12689323 12488190 12286366 12309789 12067230 12133993 12137832 12072878 12133157
4552 12133157 12131354 11838931 11632377 11675773 11844353 12015857 11951779 11841102 11869031 11565797
4542 11565797 11359096 11452703 11503537 11581062 11540452 11387936 11349386 11244651 11233522 11489976
4532 11489976 11290180 11173232 11019862 11151692 11160874 11169936 11326366 11551420 11602025 11470221
4522 11470221 11237484 11173251 11416013 11312372 11145399 10953623 10842720 10911373 10806573 10624097
4512 10624097 10369852 10301001 10250650 10491827 10456753 10739891 10693493 10415304 10746984 10831180
4502 10831180 10755704 10634951 10694049 11186476 11183686 11290064 11381489 11730909 11892679 11857071
4492A1857071L22878L28485K56864K09739R8461L11999O02120K79767m48751q67665
4482A2950968p02002m89567o96447l58117j13860r4142K5218p1167L4060k5028
4472A0459916m01102k29219J42224n6847J1808N8804k54017L43643N1187l2263
4462A0094134k84946M5430J98196K73470k19697l39745K60603n7267k33794k14275
4452I522109p2628J9633L37164J65453j57710o1107K48880j35591N00103m8091
4442A0318215m3748L2526j16136l6123q7487R2191J8970j86216K27151j98160
4432A0021183j66605J44035J7545P3568K13577J38442k8608J76749q337j79332
4422A0402217K13303k67660k36379K78470J19025J54037L57962j15771O9588J41705
$$ plain form
4492 11857071 12179949 12508434 12765298 12975037 13073498 13385497 13987617 14267384 13818633 12950968
4482 12950968 12248966 11759399 11062952 10704835 10590975 10496833 10522051 10450884 10484944 10459916
4472 10459916 10058814 9829595 9971819 9914972 9926780 9985584 9731567 10075210 10126397 10094134
4462 10094134 9809188 9854618 10052814 10326284 10106587 9766842 10027445 9970178 9736384 9522109
4452 9522109 9449481 9469114 9806278 9971731 9814021 9752914 10001794 9866203 10366306 10318215
4442 10318215 10274467 10306993 10190857 10154734 10067247 10159438 10178408 9992192 10219343 10021183
4432 10021183 9854578 9998613 10016158 10089726 10303303 10441745 10413137 10589886 10581549 10402217
4422 10402217 10615520 10347860 10111481 10389951 10508976 10663013 11020975 10905204 10974792 11116497
4412A1116497J03692M3515P9498J9932k95529K53809M68231j16672J71338Q682
4402A1852993O3165q8554J47130O8773J05163q6893R1994K94366J2413N1378j9093
4391A2492835M90258Q3723L68062N19786K49268K83635K40957J31334N71372N32417
4381A5963647L99354J106480Q40501j01157o97351p69394n97365j89895P4177
4372A6028997j29701q7432k82762k58255J07944j0123j58989K74693L26209J50915
4362A5961496j02765n690K72148M29312P4453j08579K2761K17000L7250J0976
4352A6808362J73486K10444J21106J37187M04523q0059L4452K80385M228J86159
4342A8280273K1953j79249n7680j52176j1624Q0295J7853j24461p3587J70552
$$ plain form
4412 11116497 11220189 11263704 11343202 11363134 11067605 11321414 11789645 11672973 11844311 11852993
4402 11852993 11916158 11827604 11974734 12043507 12148670 12061777 12153771 12448137 12460550 12511928 12492835
4391 12492835 12983093 13066816 13434878 13954664 14203932 14487567 14728524 14859858 15431230 15963647
4381 15963647 16363001 17469481 18309982 18208825 17511474 16742080 16144715 15954820 16028997
4372 16028997 15899296 15811864 15529102 15270847 15378791 15368668 15209679 15484372 15810581 15961496
4362 15961496 15858731 15853041 16125189 16554501 16628954 16520375 16543136 16760136 16797386 16808362
4352 16808362 16981848 17192292 17313398 17450585 17855108 17775049 17809501 18089886 18094114 18280273
4342 18280273 18302226 18122977 18065297 17913121 17901497 17981792 17999645 17875184 17801597 17972149
4332A7972149K53084l46694l6586J70296k42657K317J68445Q1916n9771j03730
4322A7858769r3832J22649P3610R8588l5294P3117P1854J8111R9199M44692L60206
4311A9091669J81358L91396N10569N14964O97613N54894R86568P19187O03928
4302B4252146N87655Q86197J489749J653426J946489K509270J984226r11767l253117
4293C1144274k749637j981562j263666r51173n50453l93124o56525k14076n8203
4284B2325855j04354j86808m86634l3267L44251l3052J28440j11911p0251R3773
4274B1866042J17345J87191N60927J76006M6428J95202J0793j5450J39917L4968
4264B3319369j88146L98379L25334K77734Q4563J2720J77860L47765N2621K00827
$$ plain form
4332 17972149 18225233 17878539 17841953 18012249 17769592 17771909 17940354 18022270 17962499 17858769
4322 17858769 17764937 17887586 17961196 18059784 18024490 18097607 18169461 18187572 18286771 18731463 19091669
4311 19091669 19273027 19664423 20174992 20689956 21387569 21942463 22929031 23648218 24252146
4302 24252146 24839801 25725998 27215747 28869173 30815662 33324932 35309158 34397391 31144274
4293 31144274 28394637 26413075 25149409 24198236 23647783 23254659 22598134 22384058 22325855
4284 22325855 22221501 22034693 21548059 21514792 21859043 21825991 21954431 21842520 21772269 21866042
4274 21866042 21983387 22170578 22731505 22907511 22953939 23149141 23159934 23144484 23284401 23319369
4264 23319369 23131223 23529602 23854936 24132670 24217233 24229953 24407813 24755578 24808199 25009026
4254B5009026K10396L85616M61803K912J62215j1272P4831K74666P00270J74876
4244B7445339j42890O34818K37974M18305L31416J4674L10090J26307j09610N6826
4234B9323249M72654M4476K14477k49713j06658K7175R1043l3396r3942j20075
4224B9569290j15361j95173k48784n84540m53875k63041l61394m76375m23405
4215B6447342m48482l60421l59561m05182k28031j83269n94530m79907l53787
4206B3034172p98406o16116p99871o02215j63623n01719o92064n63396o98996
4197A7597766l50448k13873l62501m72553o12431m36475l39674o99422k00473
4188A3909916m13227l08141m86532l30103r0904j92714l56340k84656J0334l90979
$$ plain form
4254 25009026 25219422 25605038 26066841 26069753 26231968 26220696 26295527 26570193 27270463 27445339
4244 27445339 27302449 27937267 28175241 28593546 28924962 28939636 29249726 29376033 29266423 29323249
4234 29323249 29795903 29840379 30054856 29805143 29698485 29725660 29816703 29783307 29689365 29569290
4224 29569290 29453929 29258756 29009972 28425432 27971557 27708516 27347122 26870747 26447342
4215 26447342 25998860 25638439 25278878 24873696 24645665 24462396 23867866 23387959 23034172
4206 23034172 22235766 21619650 20819779 20217564 20053941 19552222 18860158 18296762 17597766
4197 17597766 17247318 17033445 16670944 16198391 15585960 15149485 14809811 14110389 13909916
4188 13909916 13496689 13188548 12702016 12371913 12281009 12088295 11731955 11447299 11457633 11066654
4178A1066654l61711K05607q5460k46960j75183o0228j00198k83784j25567P1992
4168I905162l4912k06588k24832m8705j58254K8967J9568l97298o1848j38239
4158H683021j6949k07512K45778o0627r0167P0064k4587L8776m7760q0029M3369
4147H553377o303p8656p1944K46877j71662K3093Q9786o7435j53916J17182J02854
4136H583253O7231L03801k65600N02m3257n9136K1597Q0554j02362k21053j54511
4125H211019J91755K8469l34180j2007K60665m7818J66135Q592M498p1723k01971
4114H203434l00299j13509L85584K0179K84686j7838Q6619j0889q7576o9998j17957
4103H262436P9904K9762J32026N6972J63812q3741j61102Q3571M5358k878J64604
$$ plain form
4178 11066654 10704943 10910550 10825090 10578130 10402947 10342719 10242521 9958737 9833170 9905162
4168 9905162 9870250 9663662 9438830 9390125 9231871 9260838 9280406 8883108 8821260 8683021
4158 8683021 8666072 8458560 8704338 8643711 8553544 8623608 8599021 8637797 8590037 8510008 8553377
4147 8553377 8547074 8468418 8396474 8643351 8471689 8494782 8584568 8517133 8363217 8480399 8583253
4136 8583253 8650484 8954285 8688685 8689187 8645930 8586794 8608391 8688945 8586583 8365530 8211019
4125 8211019 8402774 8431243 8097063 8085056 8345721 8297903 8464038 8472630 8477128 8405405 8203434
4114 8203434 7903135 7789626 8175210 8195389 8480075 8462237 8548856 8537967 8450391 8380393 8262436
4103 8262436 8342340 8372102 8504128 8561100 8724912 8641171 8480069 8563640 8608998 8606120 8770724
4092H770724J55341M1974j6005j15759K59131R8556J925K09740J33741p7332l01419
4081I160617O1685K79787j57987J58682Q3805p0560J00269j18200n1552O1291
4071I507837L40380k15586O403j66984J06838q9605j66143L05227k0636J82697
4061I790428j6003o2030o7080o4600k0296j35190J01158K7939J72299n2818J49749
4050I823556J01678k76664j79129L51450R4391j64103J17675j70533N0334K95356
4040A0044011l15000k99006Q5981J42975k3327k5233R278K20883J27940n2200
4030I916302J77611J40502j46964p7882J85418M6417K33995n6123L2694L24363
4020A0776333K34550m5247J17942j53567j40825J54184K87938M948j31560j02437
$$ plain form
4092 8770724 8926065 8968039 8952034 8836275 9095406 9193962 9195887 9405627 9539368 9462036 9160617
4081 9160617 9222302 9502089 9344102 9502784 9586589 9516029 9616298 9498098 9446546 9507837
4071 9507837 9848217 9632631 9639034 9472050 9578888 9489283 9323140 9628367 9607731 9790428
4061 9790428 9774425 9712395 9645315 9580715 9560419 9425229 9526387 9554326 9726625 9673807 9823556
4050 9823556 9925234 9648570 9469441 9820891 9915282 9751179 9868854 9698321 9748655 10044011
4040 10044011 9729011 9430005 9515986 9658961 9635634 9610401 9619679 9840562 9968502 9916302
4030 9916302 10093913 10234415 10087451 10009569 10194987 10241404 10475399 10419276 10451970 10776333
4020 10776333 11010883 10965636 11083578 10930011 10789186 10943370 11231308 11236256 11104696 11002259
4010A1002259J63801M13677J02833J90667J95056K2571q7154J49018N34860M01523
4000A3089111O3080j18957j8505K40264J20059L43827K00782N5055j91734K37372
3990A4020354K2704L34497J76673j36473l552L2342l5608J97K7861k84328j22151
3979A4032516j01117K27699N365k05697J53284L2628j06041o8694k95982j37211
3969A3536750J43677j36716j32875K37782n352j03862j10527J23266k4181j1673
3959A3516289n7423K02911J5797q5086l9562L03413J164j39334Q6480K15434R1031
3948A4111114j4705j58531J39075J36587J36101J14646Q8924p8570J37427M3333
3938A4655401J54860L28812j602K46187J34500N5361J15147J14449K95289J86731
$$ plain form
4010 11002259 11166060 11579737 11682570 11873237 12068293 12090864 12003710 12152728 12687588 13089111
4000 13089111 13152191 13033234 13014729 13254993 13375052 13718879 13919661 13974716 13782982 14020354
3990 14020354 14043058 14377555 14554228 14417755 14414203 14446545 14410937 14411134 14438995 14154667 14032516
3979 14032516 13931399 14159098 14164463 13958766 14112050 14144678 14038637 13969943 13673961 13536750
3969 13536750 13680427 13543711 13410836 13648618 13643266 13539404 13428877 13552143 13527962 13516289
3959 13516289 13458866 13661777 13677574 13592488 13552926 13856339 13857503 13718169 13804649 14020083 14111114
3948 14111114 14096409 13937878 14076953 14213540 14349641 14464287 14553211 14474641 14612068 14655401
3938 14655401 14810261 15139073 15137471 15383658 15518158 15573519 15688666 15803115 16098404 16285135
3928A6285135J02146L62093M22546J96278j5544M80313J20322J66107J88999M82844
3918A8791239K40003K86571K77304k9138K51164M30692J90465K52420M38698K43043
3908B1372461L08300K30180K58067L28784M06303K57313K64762J63324O31833
3899B4221327L53925P51850O15303K21307M36651N97875N55994J09984K34891
3890B8099107L24709L21703l7021K47822j13491J90082M00978L9800P4708K20593
3880B9768990L31883K49734J39109r2093L7499O3309J6000J43289J95957j13195
3870C0740482j73892R2690L75194l4828j16655j76188k5131L3834J71454l3598
3860C0853362q1225q4516J68166L5898n7271L2028q4108L37526J87216J17956
$$ plain form
3928 16285135 16387281 16749374 17171920 17368198 17352654 17832967 17953289 18119396 18308395 18791239
3918 18791239 19031242 19317813 19595117 19565979 19817143 20247835 20438300 20690720 21129418 21372461
3908 21372461 21680761 21910941 22169008 22497792 22904095 23161408 23426170 23589494 24221327
3899 24221327 24575252 25327102 25942405 26163712 26600363 27198238 27754232 27864216 28099107
3890 28099107 28423816 28745519 28708498 28956320 28842829 29032911 29433889 29473689 29548397 29768990
3880 29768990 30100873 30350607 30489716 30397623 30435122 30498431 30514431 30657720 30853677 30740482
3870 30740482 30566590 30659280 31034474 30999646 30882991 30706803 30681672 30715506 30886960 30853362
3860 30853362 30772137 30687621 30855787 30891685 30834414 30866442 30782334 31119860 31307076 31425032
3850C1425032J08146K71769J00201K65004J02969J33072K85502M03793R542O161
3840C3111191J87252J49945R5491L0170J53483K54557L48662L18167L21313K37228
3830C5207459L88085Q73361M82640N58887M39684M38867Q18582Q72522Q23045
3821D0903132P67039O44966O49648R19750J319113R80490J514103J708127J115546
3812E0521914K17712j155085j442084r10790p62885m05359m49120n39574o39124
3803D4435605l53800k58556n27209l23731m93124n37913k28672j07643k16955
3794D1388002m37016k49727j48799O7066P3378l94225k76786J33756N906j05416
3784D0056139K55513n7987L74827K8580l3401J45057K93218L93902M44301K36305
$$ plain form
3850 31425032 31533178 31804947 31905148 32170152 32273121 32406193 32691695 33095488 33105030 33111191
3840 33111191 33298443 33448388 33543879 33574049 33727532 33982089 34330751 34648918 34970231 35207459
3830 35207459 35595544 36468905 36951545 37510432 37950116 38388983 39207565 40080087 40903132
3821 40903132 41670171 42315137 42964785 43884535 45203648 46184138 47698241 49406368 50521914
3812 50521914 50739626 49584541 48142457 47231667 46468782 46063423 45614303 45074729 44435605
3803 44435605 44081805 43823249 43296040 42972309 42479185 41941272 41712600 41604957 41388002
3794 41388002 40950986 40701259 40552460 40619526 40692904 40298679 40021893 40155649 40161555 40056139
3784 40056139 40311652 40253665 40628492 40657072 40623671 40768728 41061946 41455848 41900149 42136454
3774D2136454J52544J04825J1048O19720J75859M05035J49205K20303P41928K15243
3764D4932164K99833M79813L05625L68905J69457J40200J43510j5530o8366P6116
3754D6831727J4149m5103j85780k38057n4944m19203l21044l27192n29244k25639
3744D4499670k81452o46860k04039l44566m21354l73577j8442l40320q3481j40651
3734D1644928j90421M6816Q5848J41020K31022P7846M40915K52720K91871M32382
3724D3454947N25052M63481M58543P81007N49687N73972O37070O90288R38246
3715D9072293M22383L63842N39113O16416N00494O71381N79261N57363M69933
3706E3792479N55720Q96026O75043M54215L04824L43622K25829K91187K34708
$$ plain form
3774 42136454 42288998 42393823 42404871 43024591 43200450 43605485 43754690 43974993 44716921 44932164
3764 44932164 45231997 45711810 46017435 46386340 46555797 46695997 46839507 46823977 46755611 46831727
3754 46831727 46845876 46800773 46614993 46376936 46321992 45902789 45581745 45254553 44725309 44499670
3744 44499670 44218218 43571358 43367319 43022753 42601399 42227822 42209380 41869060 41785579 41644928
3734 41644928 41454507 41501323 41587171 41728191 41959213 42037059 42477974 42730694 43022565 43454947
3724 43454947 43979999 44443480 44902023 45683030 46232717 46806689 47443759 48134047 49072293
3715 49072293 49494676 49858518 50397631 51014047 51514541 52185922 52765183 53322546 53792479
3706 53792479 54348199 55244225 55919268 56373483 56678307 57021929 57247758 57538945 57773653
3697E7773653M4969p9940l02587q6830j39024j08218k08267k97494K4924k00666
3687E6420520Q3971Q8621K69279J54502k883K02938N17977L46161M87739M71228
3677E9040053N41129P62913O11348Q29935J221419J175346J111421J295582J546806
3668F8135952J701808J338862J078549J281193J090681J140949N69149P87695
3660G7124838L73865L71998N12132K23066J79572L55870J55614Q68717K57639
3651H0423311O9706j61645m32292j35782m23107q23232j263067j019767j482367
3642G4751758j031245j143177j001484r20320p90737r63444o18059m54281m62933
3633F7366078m05334j88660J30863j00241j9111K24073J65303J61171q1595N8580
$$ plain form
3697 57773653 57818622 57738682 57436095 57349265 57210241 57102023 56893756 56596262 56621186 56420520
3687 56420520 56504491 56593112 56862391 57016893 57014010 57216948 57734925 58081086 58568825 59040053
3677 59040053 59581182 60344095 60955443 61785378 63006797 64182143 65293564 66589146 68135952
3668 68135952 69837760 71176622 72255171 73536364 74627045 75767994 76337143 77124838
3660 77124838 77498703 77870701 78382833 78605899 78785471 79141341 79296955 80165672 80423311
3651 80423311 80493017 80331372 79899080 79763298 79340191 78516959 77253892 76234125 74751758
3642 74751758 73720513 72577336 71575852 70655532 69864795 68901351 68283292 67829011 67366078
3633 67366078 66960744 66772084 66902947 66802706 66783595 67007668 67172971 67334142 67252547 67311127
3623F7311127M83461L12571J68831L02512O32564L85539M63101M47643L30418
3614G0837767O46330L40588L64596M61389N25733L98359M86600O16874J56519
3605G4834755K25519M71301N75927O28912O47375R18351O52872P30273R40576
3596H0625861J135366J214633R98958J487167J075720J049095J101869J354341
3588I0043010J554723J234762J162100J303226J468404Q74453J129323J189545
3580I9959546R09179J194983J096938R60697Q67360R38187O87625Q73014J095094
3571A08582623O03782O98060Q31151J052025R27681R95471J123083R67149J117130
3562A16898155J068878Q79574J131758J480316J197420J381502J303673R26085
$$ plain form
3623 67311127 67794588 68107159 68275990 68578502 69211066 69596605 70059706 70507349 70837767
3614 70837767 71484097 71824685 72189281 72650670 73176403 73574762 74061362 74678236 74834755
3605 74834755 75060274 75531575 76107502 76736414 77383789 78302140 78955012 79685285 80625861
3596 80625861 81761227 82975860 83974818 85461985 86537705 87586800 88688669 90043010
3588 90043010 91597733 92832495 93994595 95297821 96766225 97640678 98770001 99959546
3580 99959546 100868725 102063708 103160646 104121343 104988703 105926890 106614515 107487529 108582623
3571 108582623 109186405 109884465 110715616 111767641 112695322 113690793 114813876 115781025 116898155
3562 116898155 117967033 118846607 119978365 121458681 122656101 124037603 125341276 126267361
3554A26267361Q47559J045706N30450P77362N76794L03403M22756P34449P70377
3545A32276217Q47604N83632O48939P59528N94769O53331M63836L20653J35131
3536A37283640K80689K80309L44762N06168P95786Q13967R44624Q05154P85034
3527A42840133M99991M21236L92697L83349O91517O51068P02499M94617O13780
3518A47690887O97314P20767N53507N45233R15728J134093J206519J150776J612110
3509A56226934J755459J920270J927219J808027J796676K386473K217930K404218
3501A72443206K520173K858901K594370K617361L340895L965339L901382L888821
3493A98130448M371604M042954L738443L984271M512755N533351N808446N916060
$$ plain form
3554 126267361 127114920 128160626 128691076 129468438 130045232 130348635 130771391 131505840 132276217
3545 132276217 133123821 133707453 134356392 135115920 135710689 136364020 136827856 137148509 137283640
3536 137283640 137564329 137844638 138189400 138695568 139491354 140305321 141249945 142055099 142840133
3527 142840133 143340124 143761360 144154057 144537406 145228923 145879991 146582490 147077107 147690887
3518 147690887 148388201 149108968 149662475 150207708 151123436 152257529 153464048 154614824 156226934
3509 156226934 157982393 159902663 161829882 163637909 165434585 167821058 170038988 172443206
3501 172443206 174963379 177822280 180416650 183034011 186374906 190340245 194241627 198130448
3493 198130448 202502052 206545006 210283449 214267720 218780475 224313826 230122272 236038332
3485B36038332O608200P017107P884155Q850028R366064J0597669J1390209J1954086
3477C09705850J2717436J2936921J3402958J3724949J4126978J3935763J3572806
3470D04123661J2096010R540816O141064J364788l192363q083647j1817548j3384661
3462C96788120j3097405j3244054j2853544j2065725j1187194j0416657r754968
3455C14168573r293691q952292r070348r136914r015709q823802q983094q661129
3447B42231594q323435q081991p897333p623433o998907o395404n834647n410313
3439A85666131n218388n280279n274237n626437n291986m607009l939081l655073
3431A46773641k778864k683834k307095k606708l006397l572635l105326k711145
$$ plain form
3485 236038332 242646532 249663639 257547794 266397822 275763886 286361555 297751764 309705850
3477 309705850 322423286 335360207 348763165 362488114 376615092 390550855 404123661
3470 404123661 416219671 425760487 431901551 433266339 430073976 421990329 410172781 396788120
3462 396788120 383690715 370446661 357593117 345527392 334340198 323923541 314168573
3455 314168573 304874882 295922590 286852242 277715328 268699619 259875817 250892723 242231594
3447 242231594 233908159 225826168 217928835 210305402 203306495 196911091 191076444 185666131
3439 185666131 180447743 175167464 169893227 164266790 158974804 154367795 150428714 146773641
3431 146773641 143994777 141310943 139003848 136397140 133390743 129818108 126712782 124001637
3423A24001637k717307k673064k226033j640987j516391j589717j398909j297952
3415A08941277p76815o88254q22262q32104o46658m61609l19471o20836j87039
3406A03586229l79702q11455m53109k62756l86436m14345q9524r8867o97259m00010
3396I9592766n32840n69513l88855m69398n07815p22378r08043q92548r47128
3387I3654248j008231p84184r07816p61594q05667n32794j100391p76103m56442
3378H6521026m47998n16656q80390p88448r83120q71097n49467o03991r06472
3369G9973387j037334p46745n35881q07224o97606r52664p47231o20840j190193
3360G2637669n60198n31557p95036q06039q25780q24778p18743n20199m96318
$$ plain form
3423 124001637 121284330 118611266 116385233 114744246 113227855 111638138 110239229 108941277
3415 108941277 108164462 107476208 106653946 105821842 105175184 104713575 104394104 103773268 103586229
3406 103586229 103206527 102395072 101941963 101679207 101292771 100878426 100788902 100690035 99992776 99592766
3396 99592766 99059926 98490413 98101558 97632160 97124345 96401967 95493924 94601376 93654248
3387 93654248 92646017 91861833 90954017 90192423 89386756 88853962 87753571 86977468 86521026
3378 86521026 86073028 85556372 84675982 83887534 82904414 82033317 81483850 80879859 79973387
3369 79973387 78936053 78189308 77653427 76846203 76148597 75195933 74448702 73827862 72637669
3360 72637669 72077471 71545914 70750878 69944839 69119059 68294281 67575538 67055339 66559021
3351F6559021l22446k35665k96941j63220j14713j26720J21535K45075k354J81505
3341F5845077L77773J72872m0648O7068K97241J65635m7129N1484L39200L39736
3331F7568309M73614L83915L44172L35521K95841L87714L06724N72851O93875
3322G1362536P98486J89004J72721L00620N91812J96897M83536L58369M29480
3313G4883461M85878N96645P08689N51731Q20104O60353P30436R23915Q69525
3304H1230737R78063N86517N90967P30018K80571L84064J87605k39166o14135
3295H4115241l16914k97675r71055j266503j271686j625612j784236j794171k307585
3286G2479804k551570k439823k467455k287819k493232k215120j820212j916531
$$ plain form
3351 66559021 66236575 66000910 65703969 65540749 65426036 65299316 65420851 65665926 65663572 65845077
3341 65845077 66222850 66395722 66355074 66422142 66719383 66885018 66837889 66889373 67228573 67568309
3331 67568309 68041923 68425838 68770010 69105531 69401372 69789086 70095810 70668661 71362536
3322 71362536 72161022 72350026 72522747 72823367 73415179 73612076 74095612 74453981 74883461
3313 74883461 75369339 75965984 76674673 77226404 78046508 78706861 79437297 80361212 81230737
3304 81230737 82208800 82795317 83386284 84116302 84396873 84780937 84968542 84729376 84115241
3295 84115241 83798327 83500652 82529597 81263094 79991408 78365796 76581560 74787389 72479804
3286 72479804 69928234 67488411 65020956 62733137 60239905 58024785 56204573 54288042
3278E4288042j901718j549891j398647j310371j255193j442442j066952j112683
3270D3250145r14307q48620r83409q02336o37704m55239m80619n03781o22119
3261C7002011n14210m80561l36480l20442j04647k72853k14667j46558k63700
3252C4347893k91815n3417O0914K6624o6797K1257K27038N10339L16116k2149
3242C5076003K24288M06841N47546M92068O53556L20463J86855Q30191P38749
3233C9476560P88233O07210J094925O16608K85609N95154j53509K24787p6817
3224D3458760j28622Q3625k25461L259j36187J59851J80866J37403O2971m2024
3214D3554441J51464j9358L77357N32992N26236J178388J062008J003195J332614
$$ plain form
3278 54288042 52386324 50836433 49437786 48127415 46872222 45429780 44362828 43250145
3270 43250145 42335838 41487218 40503809 39701473 39063769 38608530 38127911 37624130 37002011
3261 37002011 36487801 36007240 35670760 35350318 35245671 34972818 34758151 34611593 34347893
3252 34347893 34056078 34002661 34063575 34090199 34023402 34044659 34271697 34782036 35098152 35076003
3242 35076003 35300291 35707132 36254678 36746746 37400302 37720765 37907620 38737811 39476560
3233 39476560 40264793 40872003 41966928 42583536 42869145 43464299 43310790 43535577 43458760
3224 43458760 43330138 43413763 43188302 43191561 43055374 43215225 43396091 43533494 43596465 43554441
3214 43554441 43705905 43686547 44063904 44596896 45123132 46301520 47363528 48366723 49699337
3205D9699337J218909J367300J685868J803820J943675J824112J689503J554080
3197F2786604J578921J939383J755139J432814J219124J172203Q74434N81993
3189G3340615r0929j094089j085019j40922K78498K54878L54527L51332M59887
3180G2628778L75674m9855j78690M25388O59267J058759J065696J116837J636379
3171G8738233J254986J487007J293852J555713J459524J673060J451335J785228
3163I0698938J636679J504878K177551K112398K238052J857199J932514J865036
3155A06023245J397333J174482R79427O75195J027161J491437J919537K087548
3147A16775365K189902K556347K630316K694713K971606L465244L985648M580347
$$ plain form
3205 49699337 50918246 52285546 53971414 55775234 57718909 59543021 61232524 62786604
3197 62786604 64365525 66304908 68060047 69492861 70711985 71884188 72758622 73340615
3189 73340615 73249686 72155597 71070578 70929656 71208154 71463032 71817559 72168891 72628778
3180 72628778 73004452 72954597 72775907 73201295 73860562 74919321 75985017 77101854 78738233
3171 78738233 79993219 81480226 82774078 84329791 85789315 87462375 88913710 90698938
3163 90698938 92335617 93840495 96018046 98130444 100368496 102225695 104158209 106023245
3155 106023245 107420578 108595060 109574487 110249682 111276843 112768280 114687817 116775365
3147 116775365 118965267 121521614 124151930 126846643 129818249 133283493 137269141 141849488
3139A41849488N160660N264759N423881M240202K591682J366786J343711J767927
3131A69009096K115690J852466L06922n20592j242943j101854j430157j393478
3123A67595150j171632q36043J92813L93550P51996J004328J379198J644800K247674
3114A73201834J967806O20279r38509j749002j605667j324196m33216N35058N12331
3105A70786718J270387J930581J947198K193815K487010K392959K688032K789544
3097A88486244K707684L018027K492963J355908r35066k798089m172064n138037
3089A85017570m673201l791740k528874j413698m09906K89108M33558P71659J124733
3080A74819209R69301J018928Q63439N76813k29054r88896j398033j005987q17313
$$ plain form
3139 141849488 147010148 152274907 157698788 161938990 164530672 165897458 167241169 169009096
3131 169009096 171124786 172977252 173284174 172763582 171520639 170418785 168988628 167595150
3123 167595150 166423518 165587475 165780288 166173838 166925834 167930162 169309360 170954160 173201834
3114 173201834 175169640 175789919 174851410 173102408 171496741 170172545 169739329 170274387 170786718
3105 170786718 172057105 173987686 175934884 178128699 180615709 183008668 185696700 188486244
3097 188486244 191193928 194211955 196704918 198060826 197125760 194327671 190155607 185017570
3089 185017570 180344369 176552629 174023755 172610057 172200151 172489259 172922817 173694476 174819209
3080 174819209 175788510 176807438 177670877 178247690 178018636 177029740 175631707 174625720 173808407
3071A73808407j8177P73185J487894K272280K398212L304179M096809N206791
3063A93329580O544188Q003048Q622308P280757M201693j677684q032712j2872816
3055B05398362j4133020j2966817j1217407q747986p303024n512332m420690l386144
3047A37710942k998707k068788j530075r64175k29348K67152O61126K37800M25303
3038A31511230l03809j472162j926843k435008k620159k071677j936748k254286
3030A16490538j888753k836812l708684m597377n050082n223289n258299n111730
3022H2815512m786247m261983l776509l384384l215480k988235k806743k443143
3014E5152788k236883k087170k445321j682853j303457j393547j331685j113849
$$ plain form
3071 173808407 173790230 174563415 176051309 178323589 180721801 184025980 188122789 193329580
3063 193329580 199873768 207876816 216499124 223779881 227981574 226303890 218271178 205398362
3055 205398362 191265342 178298525 167081118 158333132 151030108 145517776 141097086 137710942
3047 137710942 134712235 132643447 131113372 130149197 129919849 130187001 130848127 131085927 131511230
3038 131511230 131207421 129735259 127808416 125373408 122753249 120681572 118744824 116490538
3030 116490538 114601785 111764973 108056289 103458912 98408830 93185541 87927242 82815512
3022 82815512 78029265 73767282 69990773 66606389 63390909 60402674 57595931 55152788
3014 55152788 52915905 50828735 48383414 46700561 45397104 44003557 42671872 41558023
3006D1558023j075009j137919j170884q39701o37433p19021q02909n75441p37669
2997C3862037p59084m45678p80841o91048j019099q02917p97345o51718o63859
2988B7250448o55700n78841l72466m97878q15854m39348j71286l80313j92524
2979B3146238k6011o16610l95467m34521p39935k37790n87865p67053k02808l47050
2969A8791128o49431m76901m84319m48366k69984K5341m57603m28948j68201n17292
2959A4915424l58216j51346k77559k61549j89342l26879m0375j54880L2449j83425
2949A3004302k47709j91869l4082j47142k26493j36685k67113m6894j60146j54472
2939A1391697k74325j6739k00931m13552r6022k78729l05577k3185j22189j19776
$$ plain form
3006 41558023 40483014 39345095 38174211 37334510 36697077 35978056 35175147 34599706 33862037
2997 33862037 33102953 32657275 31876434 31185386 30166287 29363370 28566025 27914307 27250448
2988 27250448 26594748 26015907 25643441 25145563 24329709 23890361 23719075 23338762 23146238
2979 23146238 23120227 22503617 22108150 21673629 20933694 20695904 20108039 19340986 19138178 18791128
2969 18791128 18141697 17664796 17180477 16732111 16462127 16487468 16029865 15600917 15432716 14915424
2959 14915424 14557208 14405862 14128303 13866754 13677412 13350533 13310158 13155278 13187727 13004302
2949 13004302 12756593 12564724 12530642 12383500 12157007 12020322 11753209 11706315 11546169 11391697
2939 11391697 11117372 11100633 10899702 10486150 10390128 10111399 9805822 9782637 9660448 9540672
2929I540672n2508J4286j70367l03535o5044o6351j79606l40362K42607J61493
2919H781285k51884O5658q3458P1644j7647j62044Q0409R0233J2833k66466k62388
2908H058175j95719j31189n06l6333j94615j00957q9557m4685l66987J72300j71770
2897F898157l6527j66611j75281O9246K31378k11876K2027K27090j01096N2465
2887F808972K20597j88205J14959l1001k9933Q4196M2980L60271R4593J43107
2877G620536P7045J65217K20391J84175J17707M8015j39091J35547j25617m2757
2867H261168o5398j72566L53956J16575j49978P2811K0591j13602L02031L47956
2857H973544K94856J24342J15486K17930J75535K69691L1478L06451L2670J39037
$$ plain form
2929 9540672 9488164 9502450 9332083 9028548 8963504 8897153 8717547 8377185 8619792 8781285
2919 8781285 8529401 8595059 8511601 8583245 8565598 8403554 8483963 8574196 8587029 8320563 8058175
2908 8058175 7862456 7731267 7730761 7694428 7499813 7398856 7309299 7264614 6897627 7069927 6898157
2897 6898157 6861630 6695019 6519738 6588984 6820362 6608486 6630513 6857603 6756507 6808972
2887 6808972 7029569 6841364 6956323 6925322 6895389 6979585 7022565 7382836 7477429 7620536
2877 7620536 7697581 7862798 8083189 8267364 8385071 8433086 8293995 8429542 8303925 8261168
2867 8261168 8195770 8023204 8377160 8493735 8343757 8416568 8437159 8323557 8625588 8973544
2857 8973544 9268400 9392742 9508228 9726158 9901693 10171384 10202862 10509313 10541983 10681020
2847A0681020J97143M28046P3266j73517K53800J39831K06424J42337r126J76942
2837A2116166N5935l52394j71965J57653K53035n077j37553P6344j09735K9311
2827A1911720j85937L7173K04721J20167J12503K72981J28969K00826J64939J29956
2817A3098018N78974L46286L58155L49985k42953J30626l24298l99625m61538
2808A3433630j60520m38774k51687k44072j27960l27316R0849M2752l22180l30176
2798A1364546j96215O9471K0442J30461k29718k46765q7858M4833j44835r6942
2788A0627420l9846R5973k63570j41697J40588K26644k17041p6239O29052L91888
2778A1373172L4301j06422j71052j88626n44933p35927m37415l23474n45493l18676
$$ plain form
2847 10681020 10878163 11306209 11379475 11205958 11459758 11599589 11806013 11948350 11939224 12116166
2837 12116166 12172101 11819707 11647742 11805395 12058430 12053353 11915800 11992144 11882409 11911720
2827 11911720 11725783 11762956 11967677 12087844 12200347 12473328 12602297 12803123 12968062 13098018
2817 13098018 13676992 14023278 14381433 14731418 14488465 14619091 14294793 13895168 13433630
2808 13433630 13273110 12834336 12582649 12338577 12210617 11883301 11974150 12016902 11694722 11364546
2798 11364546 11168331 11237802 11258244 11388705 11158987 10912222 10824364 10869197 10724362 10627420
2788 10627420 10587574 10683547 10419977 10278280 10418868 10645512 10428471 10352232 10981284 11373172
2778 11373172 11407473 11301051 11129999 10941373 10396440 9660513 9223098 8899624 8354131 8035455
2768H035455m89712l15538l49744l90818k08683j43817K2549M3937l30219J53817
2758F027227M501j73756j37075q5048k12286k46045k80958k60699k9122k89636
2748D317103k09032Q8323N292K99957j48221k00298j68146k37907K1117r2692
2738C675496k01274p3520l08707n89463m26157O4893J83592p5694l21553l23244
2728A604369J29825N9226r4404l0338J53898k23794n2550j76222M5150K02626
2718A617786l5900k95181l31341K42343L479J4013m7329j74813m3803j04510j26272
2707G18472o3501k5351M8226J85950k31378k51625o7554m5001l0731p6226j9633
2696A41648J53107k4339k28100N1040o3267j9469K02499p5832r2163L8156k74376
$$ plain form
2768 8035455 7545743 7230205 6880461 6489643 6280960 6137143 6159692 6203629 5873410 6027227
2758 6027227 6031728 5857972 5720897 5635849 5423563 5177518 4896560 4635861 4606739 4317103
2748 4317103 4108071 4196394 4201686 4501643 4353422 4153124 3984978 3747071 3768188 3675496
2738 3675496 3474222 3400702 3091995 2502532 2076375 2141268 2324860 2249166 1927613 1604369
2728 1604369 1734194 1793420 1699016 1668678 1822576 1598782 1546232 1370010 1415160 1617786
2718 1617786 1581886 1286705 955364 1197707 1201186 1215199 1167870 993057 949254 844744 718472
2707 718472 654971 629620 677846 863796 632418 380793 313239 268238 237507 161281 141648
2696 141648 294755 270416 42316 93356 30089 10620 213119 137287 45124 83280 -191096
2685a91096O5404L11383N3321N7670Q5766k55092o1979j1735R8217q8350j23464
2674e9955K1344P5600L626J4963n9389k46243J82514J95471l07390k31738K57490
2663a53707L23270k53223j58535Q8651J60232k05035j20822N1606l5943l743j56746
2652d63995J10270j04222P1038J9622O645J13325M3119N4431J23893J32435j04886
2641A675m45428r2398K29994M006Q28j10437J57973Q8500l6276J336o1871M2050
2629b20048n0396r6232l4196J58286o14725J05995Q5911L715K57697K2686n897
2618c87204j81059j3488k0701j02462K81522J76059k39199l2166J7765O0686K65389
2607a74858O3825l39500Q9966N6952k10982M5559Q66J93312J58283M870j24293
$$ plain form
2685 -191096 -125692 185691 239012 296682 382448 127356 65377 53642 151859 63509 -59955
2674 -59955 -38611 36989 40615 55578 -3811 -250054 -67540 127931 -179459 -411197 -153707
2663 -153707 169563 -83660 -242195 -153544 6688 -198347 -319169 -267563 -303506 -307249 -463995
2652 -463995 -353725 -457947 -386909 -367287 -360642 -247317 -204198 -149767 -25874 106561 1675
2641 1675 -443753 -536151 -306157 -302151 -301323 -411760 -253787 -165287 -201563 -200227 -262098 -220048
2629 -220048 -270444 -366676 -400872 -242586 -857311 -751316 -665405 -661690 -403993 -381307 -387204
2618 -387204 -568263 -581751 -602452 -704914 -423392 -247333 -486532 -518698 -500933 -440247 -174858
2607 -174858 -111033 -450533 -360567 -303615 -514597 -469038 -468172 -274860 -116577 -111707 -236000
2596b36000O619n094J71971J86889j55798j55749P5062j63838j40420m3528L101
2585d56785Q9554O0613J96395j35301j94786j14049J34939J28277j57088j43804
2575e92035l340J30711l7128j56516K17325o987k70696q6330J72139L8292j92010
2564g86575k2649M8105L13747O0049o7544p0148O7391k4230p0709Q0051k30912
2553g03424j06910M0537J65210n269K460o9072R3834M1916N4449q8877k16296
2542g91442J27321J71497O335J63536k39303P9137L9089J15451J75352p7920k63664
2531d94611p1878L98578k22077n5087j66462J8400K07004j08376J49858m1019
2521c85670l6781j9649j3959P1006p014k5624L906R8579j17400J03873k65008
$$ plain form
2596 -236000 -229381 -234475 -62504 124385 -31413 -187162 -112100 -275938 -416358 -459886 -456785
2585 -456785 -367231 -306618 -110223 -245524 -440310 -554359 -419420 -291143 -448231 -592035
2575 -592035 -595375 -464664 -501792 -658308 -440983 -447970 -718666 -804996 -632857 -594565 -786575
2564 -786575 -809224 -761119 -447372 -387323 -454867 -525015 -457624 -481854 -552563 -472512 -703424
2553 -703424 -810334 -769797 -604587 -609856 -607396 -676468 -582634 -540718 -486269 -575146 -791442
2542 -791442 -664121 -492624 -486289 -322753 -562056 -482919 -443830 -328379 -153027 -230947 -494611
2531 -494611 -566489 -167911 -389988 -445075 -611537 -593137 -386133 -494509 -344651 -385670
2521 -385670 -422451 -442100 -456059 -385053 -392067 -417691 -413785 -315206 -432606 -328733 -593741
2510e93741o0308M672j67390O0220L29064K39475j02743j63360K85280j26084
2500b94915K0476j69854o94J6651k07002R0083j87654R5912K47591p9908K9089
2489d40225M9153j53627L16111p6777j85900N5080j56515Q2809K67418l81623
2479f24096j70843J69439J34276p0697K99401k90450k13096m0074J8936J97010
2469e90194l04L5975K51658J90330m2510k44681O3011J12429j20461J41698M126
2458a98923j03983j23341J26634J86616m4433o4196J23605j98464j49372L58956
2448h6901R6100k34716j02160k26209J05333K41284J4829k8608j3027Q3758M1317
2437a09000R2670k22783j74364L38802j05415r4766K76492j45671J37032j44702
$$ plain form
2510 -593741 -654049 -649377 -816767 -756547 -427483 -188008 -290751 -454111 -168831 -294915
2500 -294915 -274439 -444293 -444987 -428336 -635338 -545255 -732909 -636997 -389406 -469314 -440225
2489 -440225 -391072 -544699 -228588 -305365 -491265 -436185 -592700 -509891 -242473 -624096
2479 -624096 -794939 -625500 -491224 -561921 -262520 -552970 -766066 -806140 -787204 -590194
2469 -590194 -590498 -554523 -302865 -112535 -155045 -399726 -336715 -224286 -344747 -203049 -198923
2458 -198923 -302906 -426247 -299613 -112997 -157430 -221626 -98021 -296485 -445857 -86901
2448 -86901 9199 -225517 -327677 -553886 -448553 -207269 -192440 -221048 -234075 -150317 -109000
2437 -109000 -16330 -239113 -413477 -74675 -180090 -274856 1636 -144035 -7003 -151705
2427a51705k17533k444n3661K97650J21640l45366K7896K72887k923K17878J30982
2416B95301k31515N2146Q6879P4182k4233l7717L1177j16645K21379J07033m0965
2405D17022M082L9734L0718J93845N8418J57132J25741P0061K82165K35105l38587
2394A275436l76509J77563K74311J029k45711K74140J6648k00531P8477J720n3033
2383A223540J67084K13448j31165m479J11620Q8266J69562K0388k1225J36364
2373A973403K7502J33768J17977J92195L81486J10163K23302L89440R0734K36388
2363C876358K96057L04121M47212J58895O44277M39563L17430N27642R31168Q79788
2353H822511N57804Q00157P58951O88421R46265J211976J345528J715732K065283
$$ plain form
2427 -151705 -369238 -371682 -425343 -127693 -6053 -351419 -323523 -50636 -53559 164319 295301
2416 295301 63786 115932 202811 276993 252760 215043 246220 129575 350954 457987 417022
2405 417022 421104 460838 491556 685401 743819 900951 1026692 1096753 1378918 1614023 1275436
2394 1275436 898927 1076490 1350801 1351830 1106119 1380259 1396907 1196376 1274853 1276573 1223540
2383 1223540 1390624 1604072 1472907 1468428 1580048 1668314 1837876 1858264 1837039 1973403
2373 1973403 2000905 2134673 2252650 2444845 2826331 2936494 3159796 3549236 3639970 3876358
2363 3876358 4172415 4476536 4923748 5082643 5726920 6166483 6483913 7011555 7942723 8822511
2353 8822511 9380315 10180472 10939423 11627844 12574109 13786085 15131613 16847345 18912628
2344A8912628K210460K291011J624003J842389K879883L588158M190844M583512
2336D2122888L870780L150167N400485P680677J0226000J3154427J6697132J5246182
2328A17548738k035598k4016797k2433302j3653984r099708o259268n157756l675520
2320C1216805l321166k576058k274665j827484j588183j351723j081770j347761
2312A5847995j700800j220534j345722j227225p88318j027867n50235l06177n53538
2303G127579o00477m09618j69718n69452m59027l41331J70192p2875l91835k3363
2293D260075m9122m73765k05872j79431J99527j74873m58376j52244j92285m29308
2283B144326J7033K08125j41746l87151K2753k85396j86915L4099r7440K35936
$$ plain form
2344 18912628 21123088 23414099 25038102 26880491 29760374 33348532 37539376 42122888
2336 42122888 45993668 49143835 54544320 62224997 72450997 85605424 102302556 117548738
2328 117548738 115513140 91496343 69063041 55409057 46309349 40050081 34892325 31216805
2320 31216805 27895639 25319581 23044916 21217432 19629249 18277526 17195756 15847995
2312 15847995 14147195 12926661 11580939 10353714 9565396 8537529 7987294 7681117 7127579
2303 7127579 6527102 6117484 5947766 5378314 4919287 4577956 4748148 4675273 4283438 4260075
2293 4260075 4210953 3737188 3531316 3351885 3551412 3376539 2918163 2765919 2573634 2144326
2283 2144326 2161359 2369484 2227738 1840587 1863340 1577944 1391029 1425128 1327688 1563624
2273A563624k2149k71713j28792l28845L2916L00101M3267k92289K90819k67967
2263I18972J30092k0249q6259r4828O6435m07n5968j74328k45084P2952l1975
2252D79353K07152P1201J64704k70321r2212n5369N231j22986p0924k40745J59015
2241B34099L59866J03494l38207n9909K1415Q3802L3949k66929J90801P2911Q8010
2230E23302k25015m2054j64986k15691J51787K24944j15996K26145J25959k91303
2220A97092l34345K28076K42141j67291M3551J3579k046Q2800q2840j06654J4610
2209A28673Q5876j97101j64468k10408p0039J90330j7172k9213j71520J83125
2199b71917O5423j94556j557J06471k37849K24607K20865O18r871k1524k57161
$$ plain form
2273 1563624 1541475 1269762 1140970 812125 845041 1145142 1188409 896120 1186939 918972
2263 918972 1049064 1028815 942556 847728 914163 913756 857788 683460 438376 511328 479353
2252 479353 686505 757706 922410 652089 559877 504508 509739 386753 315829 75084 234099
2241 234099 593965 697459 359252 299343 320758 404560 438509 171580 362381 435292 523302
2230 523302 298287 256233 91247 -124444 27343 252287 136291 362436 488395 197092
2220 197092 -137253 90823 332964 165673 209224 222803 220757 303557 220717 114063 128673
2209 128673 214549 17448 -147020 -357428 -427467 -237137 -254309 -283522 -455042 -271917
2199 -271917 -206494 -401050 -402607 -296136 -533985 -309378 -88513 -87895 -97766 -119290 -376451
2188c76451Q4182J17586q1833O5676o921k00272J15105j9960O5987n3286r5671
2177c85858J46256j16421q0518K6826j55253j32450K1348K42517m1478K04954
2167b70077N0229k24831j0637k34659M6749L05167r9045j9414J33186k84410r1388
2156f99130Q3057k5416P0807J72393J10585Q2916o0921o3017J15936j1707r3970
2145c18467R8209p7118j88703P0561P4502J61865j7335r3475R7323k7965q0173
2134c00776j46020k21975r6540k6886K48809O6779J61901k12239k9764Q0043O9497
2123d07171k8849k3333J13532n1201L3942j781j9169O8441q3670q2332j36087
2112f17678K47136K43480l66452r2873J16815K6481k25233J31560J75736k4274
$$ plain form
2188 -376451 -292269 -174683 -256516 -190840 -197761 -398033 -282928 -302888 -236901 -290187 -385858
2177 -385858 -239602 -356023 -436541 -409715 -564968 -697418 -676070 -433553 -475031 -270077
2167 -270077 -219848 -444679 -455316 -689975 -643226 -338059 -437104 -456518 -323332 -607742 -699130
2156 -699130 -616073 -641489 -570682 -398289 -287704 -204788 -265709 -328726 -212790 -224497 -318467
2145 -318467 -220258 -297376 -486079 -415518 -341016 -179151 -196486 -289961 -192638 -220603 -300776
2134 -300776 -446796 -668771 -765311 -792197 -543388 -476609 -314708 -526947 -556711 -476668 -407171
2123 -407171 -436020 -459353 -345821 -397022 -363080 -364861 -384030 -315589 -399259 -481591 -617678
2112 -617678 -370542 -127062 -493514 -586387 -469572 -443091 -668324 -536764 -361028 -385302
2102c85302j06308L864R007P2896J63238J44944l5047q4403p6691r5018q4392
2091d73212n0364n9234J34008m6332j07056j17217P1231L39028k3861m3261L6096
2080c40174R7467l54170o8756K34727j29380K21489L6594J04299j53677J58078
2070a93503J86832l21382k06444J54879j788K9505k33303K17955L86530O6708
2060H5989J44435K26429k99231l07523J79870K8264k11639m5087k81826k17756
2050f98075K4518J57482o7861N062k03446L47380J31102j66762J32623r4040N5865
2039c76152j05795r0879J31278N2574k24728M0032K0793j32790K8704J53901J8692
2028d84370n0433J5897M4952K65596M1068k17951R5246k0429j65730L0575K1932
$$ plain form
2102 -385302 -491610 -487746 -478739 -405843 -242605 -97661 -132708 -217111 -293802 -388820 -473212
2091 -473212 -523576 -582810 -448802 -495134 -602190 -719407 -648176 -309148 -333009 -376270 -340174
2080 -340174 -242707 -596877 -665633 -430906 -560286 -338797 -302203 -197904 -351581 -193503
2070 -193503 -6671 -328053 -534497 -379618 -381406 -351901 -585204 -367249 19281 85989
2060 85989 230424 456853 157622 -149901 29969 58233 -153406 -198493 -480319 -698075
2050 -698075 -673557 -516075 -583936 -578874 -782320 -434940 -303838 -470600 -337977 -432017 -376152
2039 -376152 -481947 -572826 -441548 -388974 -613702 -573670 -552877 -685667 -656963 -503062 -484370
2028 -484370 -534803 -518906 -473954 -208358 -167290 -385241 -289995 -310424 -476154 -445579 -423647
2017d23647l49053N12030J90791n1139j48048j65467l24105j63672J03446J51431
2007f67433j03684N2061Q2780l5133p2827K16797L0547M1175m5284j42345J55595
1996d87751J82479j49328J712L0153j72914O8201K11021m9543k09535J84887j13790
1985e04408K320K28505o7871n2154K13926j45277j28837J44693j01887K8050J98115
1974a84825r9239k29511p9024K88496m9425k81291K9290J91193O6100j6843k06776
1963e71855m5108q9587j28171K54767N6642P4838J08732J07870K4659k36897J68825
1952b75285N2135q5380P3580l77608J29707L48900p70k9750R4672m843N3425M0160
1940A8943k39621j73858p4773O9725L07343J53454j86849k89988P8352J49006
$$ plain form
2017 -423647 -772700 -260670 -69879 -121018 -269066 -434533 -758638 -922310 -818864 -667433
2007 -667433 -771117 -719056 -636276 -671409 -744236 -527439 -496892 -455717 -501001 -643346 -487751
1996 -487751 -305272 -454600 -452888 -422735 -595649 -527448 -316427 -365970 -575505 -390618 -504408
1985 -504408 -502088 -273583 -341454 -393608 -179682 -324959 -453796 -309103 -410990 -382940 -184825
1974 -184825 -284064 -513575 -592599 -304103 -353528 -634819 -605529 -414336 -348236 -365079 -571855
1963 -571855 -616963 -706550 -834721 -579954 -523312 -448474 -339742 -231872 -207213 -444110 -275285
1952 -275285 -223150 -308530 -234950 -612558 -482851 -133951 -134721 -164471 -69799 -74642 -21217 18943
1940 18943 -220678 -394536 -469309 -399584 -92241 61213 -125636 -415624 -337272 -188266
1930a88266P4467p7247p6829L91952k45785m65890K4214J75381n7002P2925q4602
1919d56682j42631K2812K21027j68838Q3274J33827J50207P4p2506J30635j66839
1908b65640k31022K93727k6873j70524J41092j05648j31163j42267K42962Q3195
1898c12161l08898J50963O5672L4218j65788k251J56516k24272J19875L441L8502
1887d44183n9474J72183K51787k08246m7596J35668J64576j53204j23154J87670
1877a23973p5588n9998j04316K03991m0738j39819j11878o2921Q4197P8916J24040
1866b28087K4298q0247J45707k8217k98556L0495j6553Q8641J92589K7116j02945
1855b45759Q6634j45181m6126J20578j88749J7983J81724P7438q8595K5392M1176
$$ plain form
1930 -188266 -113799 -191046 -267875 124077 -121708 -587598 -563384 -388003 -445005 -372080 -456682
1919 -456682 -599313 -576501 -355474 -524312 -441038 -307211 -157004 -156930 -229436 -98801 -265640
1908 -265640 -496662 -202935 -229808 -400332 -259240 -364888 -496051 -638318 -395356 -312161
1898 -312161 -621059 -470096 -404424 -370206 -535994 -538245 -381729 -606001 -486126 -482685 -444183
1887 -444183 -503657 -331474 -79687 -287933 -335529 -199861 -35285 -188489 -311643 -123973
1877 -123973 -199561 -259559 -363875 -159884 -200622 -340441 -452319 -515240 -431043 -352127 -228087
1866 -228087 -203789 -284036 -138329 -166546 -465102 -434607 -451160 -362519 -169930 -142814 -245759
1855 -245759 -159125 -304306 -350432 -229854 -418603 -400620 -218896 -141458 -230053 -204661 -163485
1844a63485p2897N1420o8003o8674J54562j1527N2820j84083k7531K3248j14r219
1832c23483p1660K78498p0494k43353L56158j48037q0877j14115o9673M9467J50236
1821b87333J4645J04773q8773j34054Q9738j22878N1588O3024M5231R492k13297
1810d67844Q9829J36440k36290K97772J45065k41951k598Q4759N9045J94239J35435
1799A93901l77993L221O7349J0767j43378k6625J26468j07061m3049m8356J64830
1788a79926L9019m4736j68991j91831L2429J44735j24037l6470r9273J44034J02195
1777c82852O2159L5060k24184N0790J26608J5011J36946k33067R2536M7735L33938
1766F0680n7197j16097J46766k63805l9242J99129m0750K050k80839M3394k0617
$$ plain form
1844 -163485 -236382 -184962 -252965 -321639 -167077 -178604 -125784 -309867 -337398 -314150 -314264 -323483
1832 -323483 -395143 -116645 -187139 -430492 -74334 -222371 -303248 -417363 -487036 -437569 -287333
1821 -287333 -272688 -167915 -256688 -390742 -301004 -423882 -372294 -309270 -264039 -254547 -467844
1810 -467844 -378015 -241575 -477865 -180093 -35028 -276979 -279577 -194818 -135773 58466 193901
1799 193901 -184092 -180871 -113522 -102755 -246133 -272758 -146290 -253351 -296400 -344756 -179926
1788 -179926 -140907 -185643 -354634 -546465 -514036 -369301 -493338 -529808 -629081 -485047 -382852
1777 -382852 -320693 -285633 -509817 -459027 -332419 -317408 -180462 -413529 -320993 -273258 60680
1766 60680 3483 -112614 34152 -229653 -268895 -69766 -110516 -108466 -389305 -345911 -366528
1755c66528M23659l662J47575j43854l97169l7727J8655J45936N3028m233j20735
1744b85055L5170J52830p2923o7044J15903j08123K5159k75299p5918K3181J88324
1733c43795n3434O403K54954J35833P5685J6901k54239o0923L08602J35257k61752
1722d0508k40634n4325J38750j650K51772p8877k08309j30834K0317R8258r1184
1711c37224j01428o4799M4592k2055L99575J09630l28317P2588J71282J55852
1701I9696j2462J0599J9174n20717l9462M00836J05k93888j14739K12209M7885
1690a90764o0727n8568L15911p9082N6413p428j79716j14967m9191j0772K89710
1679h9181r0605l4878J27923k077k58722o21M52928j57367N4189J9638j91103
$$ plain form
1755 -366528 57131 53469 201044 57190 -339979 -377706 -359051 -213115 -160087 -164320 -285055
1744 -285055 -249885 -97055 -169978 -237022 -121119 -229242 -204083 -479382 -555300 -532119 -343795
1733 -343795 -397229 -390826 -135872 -39 75646 92547 -161692 -222615 85987 221244 -40508
1722 -40508 -281142 -335467 -196717 -198367 53405 -25472 -233781 -364615 -344298 -246040 -337224
1711 -337224 -438652 -503451 -458859 -480914 -81339 28291 -300026 -227438 -56156 99696
1701 99696 87234 97833 117007 -403710 -443172 -42336 -42231 -336119 -450858 -238649 -190764
1690 -190764 -251491 -310059 5852 -73230 -16817 -24245 -203961 -318928 -368119 -378891 -89181
1679 -89181 -179786 -214664 -86741 -88818 -347540 -348161 104767 -52600 1589 21227 -169876
1668a69876J28488J34114k8748K0189j16190k7797M575j78520J36267R7176r3590
1657i3912O1487j8551k7822k80717J46778k851M6398L85008k87017j85323K52411
1646d111J26292j9584N979J5303J09868j96237o4974k3587l02211q0891K23006
1635b11147Q7186J12388o5827j73517J69510J45216j16k6722J01050L1287K684
1624A71992n7334N7292J9202j76282m6972J58336j55303j58405K03226J07220
1614A22972j86516r1093k0235j46165L57417q3879j32968K23761K03984j42538
1604A04740K20930O420P322q3267k73723P7924J49334J31682k48618j22853K593
1593b7516r1476j12357J10555M4122j25253r1761L4347J35684R6634j57099J24538
$$ plain form
1668 -169876 -41388 92726 63978 84167 -32023 -59820 -55245 -233765 -97498 -322 -93912
1657 -93912 -32425 -50976 -78798 -359515 -212737 -215588 -169190 215818 -71199 -256522 -4111
1646 -4111 122181 102597 108576 123879 233747 37510 -27464 -51051 -353262 -434153 -211147
1635 -211147 -123961 -11573 -77400 -250917 -81407 63809 63693 36971 138021 169308 171992
1624 171992 114658 171950 191152 14870 -32102 126234 -29069 -187474 15752 122972
1614 122972 -63544 -154637 -174872 -321037 36380 -47499 -180467 43294 247278 104740
1604 104740 325670 332090 339412 256145 -17578 60346 209680 341362 92744 -30109 -27516
1593 -27516 -118992 -231349 -120794 -76672 -201925 -293686 -259339 -123655 -27021 -184120 -59582
1582e9582J65194j05100j35405J78847J46850M6279n00832J09649L04192Q0812
1572B30904l1079n7641j67073J43240j56816j8541o561J04279j54157J24928J15542
1561A27025J30524j04359j80083o719n5511Q1875l66681Q1454j3592K82059j98413
1550b22421J19596M1940P6127O6232j28492j49530K02937k9525j89941J77946
1540c5131j43889r4090j94807J74648J20829P6246L06392j58322n3247k8261m3193
1529g2825J32306k16916j86675P2944K22391k4556k76442J39854J77974Q9777
1519E7832j37858o7917J03233J30258J59720l23967j55838J57732p6105L3796
1509a19114r0398J34975P4194j29359Q1506J21247J5726j57426K59123k9614J16581
$$ plain form
1582 -59582 105612 512 -134893 43954 190804 237083 -263749 -154100 150092 230904
1572 230904 199825 142184 -24889 118351 -38465 -57006 -63567 40712 -113445 11483 127025
1561 127025 257549 153190 -26893 -33612 -89123 -7248 -373929 -292475 -306067 -24008 -222421
1550 -222421 -102825 -60885 15242 81474 -47018 -196548 6389 -23136 -213077 -35131
1540 -35131 -179020 -273110 -467917 -293269 -172440 -96194 210198 51876 -1371 -29632 -72825
1529 -72825 59481 -157435 -344110 -271166 -48775 -73331 -349773 -209919 -31945 57832
1519 57832 -80026 -147943 -44710 85548 245268 -78699 -234537 -76805 -152910 -119114
1509 -119114 -209512 -74537 -343 -129702 -48196 73051 88777 -68649 190474 160860 277441
1498B77441k21139N9263R8612M8104J0805o8895k6229j19150j50599K13622J36352
1487B58187k13287p896P6367j54007k2497L36757K3435o5352j46838o4306q7896
1476f7333J22548k5907j08235j64247J6575K37158N0364P1454J03230j39684N8523
1465A54446m4544J42145k3650j30622j46934n4661q7782Q2571N2501p5113L9176
1454i2467J56201K88050n5000j42004k69388J15780K87795O1190L4897k84258
1444A00796r7610M1093K6325o7690Q111J81413m1389Q310K06467J04973j46820
1433C23979k10522R4533j14700j10090J65805J46867j90139q8705K8354j518j49706
1422a05842L574J08712K3939J52094O1871k63089M0157J15527J45566J56894m89116
$$ plain form
1498 277441 56302 115565 214177 262281 273086 204191 177962 58812 -91787 121835 258187
1487 258187 44900 37004 113371 -40636 -63133 273624 297059 231707 84869 20563 -67333
1476 -67333 55215 29308 -78927 -243174 -226599 10559 60923 132377 235607 95923 154446
1465 154446 109902 252047 228397 97775 -49159 -103820 -191602 -109031 -56530 -131643 -92467
1454 -92467 63734 351784 296784 154780 -114608 1172 288967 350157 385054 100796
1444 100796 3186 44279 70604 2914 11025 192438 151049 159359 365826 470799 323979
1433 323979 113457 207990 93290 -16800 149005 295872 105733 17028 45382 43864 -105842
1422 -105842 -102268 6444 30383 182477 244348 -18741 21416 136943 282509 439403 -49713
1411d9713l9864Q1750q4722Q416O6465j2224j21169L44127Q5183k45043K4871
1400E8077j57406J53464n6766k17145J86380L1143j08809j92887K82002J14369
1390I2422j17832J50279O8672j459R9446k26416Q9379n7229k93086J94408J58099
1379A56683p7503r7087j10033J27542J25336o4726J7668m5327J16714p9996m0442
1368B8829j06058m8126J96800J57830r8062L29634n3726l45217l0411J35203k17977
1357e1281l09175m0680J37399K15184R0049o3174Q6920j38966j03232J15694o0107
1346a21369m6084J40375k9259k9636K83541Q0110p9399m5989J63262J8447j33275
1335B00724J21758J01125k05832k19121j01935M69J07579J36338J61360j03335
$$ plain form
1411 -49713 -89577 -7827 -92549 -84133 -17668 -29892 -151061 193066 278249 33206 58077
1400 58077 -99329 54135 -2631 -219776 -33396 -2253 -111062 -303949 -21947 92422
1390 92422 -25410 124869 193541 192082 291528 65112 154491 97262 -195824 -1416 156683
1379 156683 79180 -17907 -127940 -398 124938 60212 77880 32553 149267 69271 28829
1368 28829 -77229 -125355 71445 229275 131213 460847 407121 61904 31493 166696 -51281
1357 -51281 -360456 -401136 -263737 -48553 41496 -21678 65242 -73724 -176956 -61262 -121369
1346 -121369 -167453 -27078 -56337 -85973 197568 277678 198279 152290 315552 333999 200724
1335 200724 322482 423607 217775 -1346 -103281 -102812 4767 141105 302465 199130
1325A99130M150N2753J02633k62179P7158J48793k3868k39267k68154K31325K6207
1314D8681j14768J44541j92457K0244j8475n8563J69461N6045k5361K47933j6691
1303B60590k19332o4472m2548J15327R6261K69845j27715k4033K0885j196N2923
1292C36535n5058j16313M3922J41810k44701j43403N4133p0173M0262J79285P4126
1281B40425L6514J21992j49829j74166n510K4736k79481K00570j3730o052K06989
1270B02458j39586k47757L6482L21545k0484J2312j0735J75526L3896m4517l3167
1259B85973q4816K24067r3061j91536n2549j17202J02285J15872R7236j45775
1249A40494j22806J7121J64867L39123l47765q9275P2380p4833K494J31488j07994
$$ plain form
1325 199130 203280 256033 358666 96487 173645 322438 298570 59303 -208851 22474 48681
1314 48681 -66087 78454 -114003 -93759 -112234 -170797 -1336 54709 29348 277281 260590
1303 260590 41258 -23214 -65762 49565 145826 415671 287956 263923 284808 283612 336535
1292 336535 281477 165164 209086 350896 106195 -37208 16925 -53248 -12986 166299 240425
1281 240425 276939 398931 249102 74936 69426 94162 -185319 15251 1521 -4531 202458
1270 202458 62872 -184885 -148403 173142 152658 164970 154235 329761 363657 319140 285973
1259 285973 201157 425224 332163 140627 88078 -29124 73161 189033 286269 140494
1249 140494 17688 34809 199676 538799 191034 101759 174139 99306 101800 233288 125294
1238A25294l793n6419o7476l7919J24604k10675J31170O2536j28043j9637j12375
1227a92733m7698K29920q9835O3855Q9115L0839M737k49266M1283R5780J89048
1216A65045l5983p0550J1863J59052J80322j04827k02083m7409r2830j28143R6586
1205f8957L17263j45595K74625P8635m10301j62134R3627J31348K30024O4739
1195D03274k59354j76795N5626n4445J139M3821l8104O9878K7803q9086J45396
1184A29153P4534K13840R2195k76031n5224p61p9150k55079O4323J42461M1671
1173I1932m8511J67309M7492J26905Q9333k88413Q5621Q2465j86136j7122P0210
1162B21085k89399k88658J25560L03666J38371j0196l0543L9318k59656L70446
$$ plain form
1238 125294 121501 65082 -2394 -40313 84291 -126384 4786 67322 -60721 -80358 -192733
1227 -192733 -240431 -10511 -100346 -36491 52624 83463 88200 -161066 -119783 -24003 165045
1216 165045 129062 58512 70375 229427 409749 304922 102839 55430 -37400 -165543 -68957
1205 -68957 248306 102711 377336 455971 45670 -116464 -22837 108511 338535 403274
1195 403274 143920 -32875 22751 -31694 -30555 13266 -24838 45040 72843 -16243 129153
1184 129153 203687 417527 509722 233691 178467 177706 98556 -156523 -92200 50261 91932
1173 91932 43421 210730 258222 385127 474460 186047 271668 354133 167997 150875 221085
1162 221085 -68314 -356972 -231412 72254 210625 200429 169886 209204 -50452 319994
1152C19994m3687j95178j45821q0626J18141J46001L87749l01931k1343J9918
1142B03217j79894l0246K83220P0151m6765L6386J47058Q215j96495j7672N7787
1131C34962N5745k28158n4143N4410K0245k4553q6064J09946j09211k7777L29510
1120C74912j50200j68668J95600N0305j17540K87471l8734O2082k48160Q8823
1110C35891k6764j65997K29073k4037q9650o1565J87370j06781m42395R0584J04711
1099C0440l12J79516o487j60196o6744n3360p144L25446n8609L0500j57943O1648
1087A16755P5634K4976j68523L0941j47647j20718N4238J61373P1806K85616J84775
1076E69226l56404j29206Q9265J49100m7968k6495k82351J02496j9694J01622
$$ plain form
1152 319994 276307 81129 -64692 -145318 -27177 118824 506573 204642 183299 203217
1142 203217 23323 -6923 276297 346448 299683 336069 483127 491342 294847 277175 334962
1131 334962 390707 162549 108406 162816 183061 158508 72444 182390 73179 45402 374912
1120 374912 224712 56044 251644 301949 184409 471880 433146 495228 247068 335891
1110 335891 309127 143130 372203 348166 258516 196951 384321 277540 -164855 -74271 30440
1099 30440 30128 209644 203157 42961 -23783 -77143 -84287 241159 182550 213050 55107 116755
1087 116755 192389 217365 48842 79783 -67864 -188582 -134344 27029 98835 384451 569226
1076 569226 212822 83616 172881 321981 274013 247518 -34833 67663 47969 149591
1066A49591N1962O2353J59287m3046j46830N4937n6944j83605j29460J1548N9426
1055a0781K15997N6227j8311j67568J8826L03727j33770J29813j34004O4902J00617
1044D25675j15501n1133L5848o1079k22312J34355k9850k40730L8397J97559Q9179
1033B00408m913j96319j14991J77585O3382K37960O3525j48011k32042J87929
1023B34513j1881J57106J04205r9497j12253o9606O6317N5307j88257k990J6674
1012A49638J57359j5041o2723K06669j39586R0738m5903j55908j42217J08508
1002A51534J3799K52768l16058M459M9028N6523J00954k25K38550p4741j2492
991D64099j08442j50789L1683L2466J6323j4793p532k5251l855l4595k1340J58464
$$ plain form
1066 149591 201553 263906 423193 380147 233317 288254 231310 47705 -81755 -70207 -10781
1055 -10781 205216 261443 243132 75564 94390 398117 264347 394160 260156 325058 425675
1044 425675 310174 259041 294889 233810 11498 145853 116003 -124727 -86330 111229 200408
1033 200408 195495 -824 -115815 61770 125152 363112 426637 278626 46584 234513
1023 234513 222632 379738 483943 384446 272193 202587 268904 324211 135954 132964 149638
1012 149638 306997 291956 229233 435902 296316 387054 341151 185243 43026 151534
1002 151534 165333 418101 102043 106502 155530 212053 313007 312782 551332 476591 464099
991 464099 355657 204868 236551 269017 285340 270547 263015 237764 233909 199314 177974 336438
979C36438o106j31437p5775j7948j02101J75215N2965j82644N0059K46835o7755
968B77746k03754J37587M423r1582j99498j83826J47490J30015L22188j64536
958A76253j08243K43190J81315j36390j68450q6439J68628J66990m9827q4481
948C02546R7510M7248j14704P0007p239j15005J12783m9567p8761k68886l5079
937c9147M3887k5712J94416J65611J07881p5774J63401j11483k92782j78582k9697
926g7981o5771O4744K11412K14588k01592j50924O5676j53877j40190K04561J90632
915A61278J39915J6762l93436K45471j36727J13920j70498J03699J87349K5335
905B93068j08248O080J26006L5132P9842o8018J04125l54332M3316n3018j72248
$$ plain form
979 336438 330332 198895 123120 105172 3071 178286 231251 48607 98666 345501 277746
968 277746 73992 211579 216002 124420 -75078 -258904 -111414 18601 340789 176253
958 176253 68010 311200 492515 356125 187675 101236 269864 436854 387027 302546
948 302546 400056 447304 332600 402607 395368 280363 393146 343579 264818 -4068 -39147
937 -39147 4740 -20972 173444 339055 446936 371162 534563 423080 130298 -48284 -77981
926 -77981 -143752 -79008 132404 346992 145400 -5524 60152 -93725 -233915 -29354 161278
915 161278 301193 317955 -75481 169990 33263 147183 -23315 80384 267733 293068
905 293068 184820 190900 316906 352038 431880 363862 467987 113655 156971 103953 -68295
894f8295j258J75822j10545K13787n6494K2026J31306k84746k03366K63914J96534
883B78685J02631j21007j10890k8981Q3600k15283J16221J46397J87619J17181
873E56173l4294m33960K6338j9769j08242j13677j77718J40553K03084K26689
863B65177r993J042k04436K46949R1420q7426m6857j41723Q5442J94253Q0291
852D74139j37838j32095r2000Q3789N33075J66169o03220n5624q345J09097K61817
841E98964k91327q4452K6780k4541o3827P9992r877p2784k25389K13230J7743
830A64512J1104K98028k54389m02372j25688K62179j1276N25015l6000l9095j68924
819B23094k47515O3701K7830R190Q8054p9454j68400K10553j1969L079K68K45359
$$ plain form
894 -68295 -69553 106269 -4276 209511 153017 175043 306349 21603 -181763 82151 278685
883 278685 381316 260309 149419 120438 204038 -11245 104976 251373 438992 556173
873 556173 521879 87919 114257 94488 -13754 -127431 -305149 -164596 38488 265177
863 265177 255184 256226 51790 298739 390159 302733 255876 114153 199595 393848 474139
852 474139 336301 204206 112206 195995 729070 895239 292019 236395 228050 337147 598964
841 598964 307637 223185 249965 225424 161597 241589 231712 158928 -66461 146769 164512
830 164512 175616 473644 219255 -183117 -308805 -46626 -57902 467113 431113 392018 223094
819 223094 -24421 39280 67110 76300 164354 84900 -83500 127053 115084 118163 118431 363790
807C63790p2799R0094K8138p2179R7647N8726l09068j04706k5382J78920o616
796B26565j4557j34254Q8780p844J63851M3629K2761j87696Q4487j90145P1478
785A67055K11721k37232N3005O1220N1465m5475n1277j63628K5225K28463N913
774C06455J92745k21728r2595k3157l9221l3758o76q2242J14996j09209J05769
763A17379J31810k80603J21613j51851j8552M6477J29451j39621m9821P6648n2549
752f9619K41970r1329j95865M52642M4054R2413j92593j32102J24949O915k07934
741G3501j02424k78852l7637M38038l2482k19337J52184N30q5486j97321p4311
730c63597K39783K29896M2386j92602k76023O5130n3532K38723J83070K0026J75007
$$ plain form
807 363790 290991 381085 409223 337044 434691 493417 184349 79643 54261 233181 226565
796 226565 212008 77754 166534 158690 322541 366170 388931 201235 285722 95577 167055
785 167055 378776 141544 194549 255769 307234 261759 210482 46854 72079 300542 306455
774 306455 499200 277472 184877 161720 122499 88741 88065 5823 120819 11610 117379
763 117379 249189 -31414 90199 -61652 -80204 -33727 95724 -43897 -93718 -17070 -69619
752 -69619 172351 81022 -114843 337799 381853 474266 281673 149571 274520 281435 73501
741 73501 -28923 -307775 -345412 92626 60144 -159193 -7009 -6479 -91965 -289286 -363597
730 -363597 -123814 106082 148468 -44134 -320157 -255027 -308559 -69836 113234 133260 308267
719C08267j51417R3051l8507P4240O4326j24017P7769p7486N7130m1378M0404
708B82382j75j32126J9723p5451j0657k4367K8691J5328j8451k3323J06799J37256
696C05629l179l6586j85684o0011J273j32709P3197J9099N9718j16105L6969Q2266
684D3877Q4068J22848q9341P5980k46647J76442n7212J8167J44411j46277K6094
673A52410J75294k88735m3895Q26J59524O2509l32462j35035j61322L42623K10373
662A42110p809l0192q9897M8725L1572j93959J10170j2589l3799k4969M452l7935
650i4120J28787N6846N7018j49818j56793K63925L01189k21210k49211L33065
640B69678r2854k92170J35778J3777n1812j68591r325K19992P2604j0406j07002
$$ plain form
719 308267 156850 249901 211394 285634 349960 225943 303712 226226 283356 241978 282382
708 282382 282207 150081 169804 94353 83696 59329 88020 103348 84897 61574 168373 305629
696 305629 302450 265864 80180 20169 21442 -111267 -38070 -18971 40747 -75358 -38389 43877
684 43877 127945 250793 161452 237432 -9215 167227 110015 128182 272593 126316 152410
673 152410 327704 38969 -4926 -4100 155424 217933 -114529 -249564 -410886 -68263 142110
662 142110 134301 104109 14212 62937 94509 -99450 10720 -1869 -35668 -60637 -56185 -94120
650 -94120 34667 91513 148531 -1287 -158080 105845 407034 185824 -63387 269678
640 269678 176824 -115346 20432 34209 -17603 -186194 -195519 24473 97077 86671 -20331
629b0331P3389j93361m8292K87532K17491p3078M6238j55736K1886j58349J77513
618A74902K44750j98746j00940o3714K8189j6551K08008k49920j28634J64826
608F2170K4611k08302j01053N5406R2084J77219Q7689m5734L4814j26256l1885
597B0763j28985j4655J36838k21509K06777M2044j6934P5115O6862J1408k79352
586a01628M958Q6044j01603J75006j8390J49943k16858j2035J45314L6057Q243
575A55051j8361j045R966j64704j99883J30820J11575r0800O9761J25556Q8601
$$ plain form
629 -20331 53058 -140303 -188595 98937 316428 243350 289588 133852 155738 -2611 174902
618 174902 419652 220906 119966 56252 84441 67890 275898 25978 -102656 62170
608 62170 86781 -121521 -222574 -167168 -75084 102135 189824 144090 178904 52648 20763
597 20763 -108222 -122877 13961 -207548 -771 41273 24339 99454 166316 177724 -101628
586 -101628 -96670 -10626 -112229 62777 44387 194330 -22528 -34563 110751 146808 155051
575 155051 136690 135645 145611 -19093 -218976 -88156 23419 -67381 2380 127936 216537
$$ [...]
##END NTUPLES=NMR SPECTRUM
##END=
