##TITLE=1H_CA-9359-2
 200.13MHz,CDCl3,
 8 sc
 
 2.7.2025
##JCAMPDX= 6.0         $$ Bruker NMR JCAMP-DX V2.0
##DATA TYPE= NMR SPECTRUM
##DATA CLASS= NTUPLES
##ORIGIN= UXNMR, Bruker Analytische Messtechnik GmbH
##OWNER= pz
$$ XWIN-NMR		Version 3.5
$$ Wed Jul  2 15:05:41 2025 Russian Standard Time (UT+4h)  she@DPX200
##.OBSERVE FREQUENCY= 200.1313
##.OBSERVE NUCLEUS= ^1H
##.ACQUISITION MODE= SIMULTANEOUS
##.ACQUISITION SCHEME= undefined
##.AVERAGES= 8
##.DIGITISER RES= 18
##SPECTROMETER/DATA SYSTEM= spect
##.PULSE SEQUENCE= zg30
##.SOLVENT NAME= CDCl3
##.SHIFT REFERENCE= (INTERNAL, CDCl3, 0, 15.5453)
##AUDIT TRAIL= $$ (NUMBER, WHEN, WHO, WHERE, WHAT)
$$ ##TITLE= Audit trail, XWIN-NMR		Version 3.5
$$ ##JCAMPDX= 5.01
$$ ##ORIGIN= Bruker BioSpin GmbH
$$ ##OWNER= she
$$ F:/spectra/data/she/nmr/H-C/1/pdata/1/auditp.txt
$$ ##AUDIT TRAIL=  $$ (NUMBER, WHEN, WHO, WHERE, WHAT)
(   1,<2025-07-02 15:04:33.43 +0400>,<she>,<DPX200>,
      <created by zg, POWCHK disabled, PULCHK disabled
       configuration hash MD5:
       00 E9 B6 7A A2 85 ED C7 34 08 36 98 17 FE 4E 26
       data hash MD5: 16K
       77 3F D6 E8 7C FB 48 DA 97 09 D6 33 C5 99 F6 FF>)
(   2,<2025-07-02 15:04:35.75 +0400>,<she>,<DPX200>,
      <Start of raw data processing
       efp BC_mod = 2 LB = 0.25 FT_mod = 6 PKNL = 1 PHC0 = -1201.791 PHC1 = 13.79219 SI = 16K 
       data hash MD5: 16K
       35 93 17 B3 10 8A E3 66 2B BA 44 C3 4C 8F 45 52>)
(   3,<2025-07-02 15:04:52.57 +0400>,<she>,<DPX200>,
      <pk PHC0 = -0.5592996 PHC1 = 0 
       data hash MD5: 16K
       8C BC 35 33 0A 3F F0 DD 2E 64 37 2B 6A 81 65 21>)
(   4,<2025-07-02 15:04:56.32 +0400>,<she>,<DPX200>,
      <abs ABSG = 5 
       data hash MD5: 16K
       AD 8B 6E E2 D8 EF 72 CF 39 4D F8 46 AD 04 0F 90>)
$$ ##END=
$$ 
$$ hash MD5
$$ 91 B8 07 A9 05 95 CF 43 BF FF F9 19 C5 7A DC 4F
##$RELAX= 
##$RELAX= 
##$RELAX= 
##$RELAX= 
##$RELAX= 
##$RELAX= 
$$ Bruker specific parameters
$$ --------------------------
##$DU= <F:/spectra>
##$EXPNO= 1
##$NAME= <H-C>
##$PROCNO= 1
##$TYPE= <nmr>
##$USER= <she>
##$AMP= (0..31)
100 100 100 100 100 100 100 100 100 100 100 100 100 100 100 100 100 100 
100 100 100 100 100 100 100 100 100 100 100 100 100 100 
##$AQSEQ= 0
##$AQ_mod= 1
##$AUNM= <au_zg>
##$AUTOPOS= <>
##$BF1= 200.13
##$BF2= 200.13
##$BF3= 200.13
##$BF4= 200.13
##$BF5= 200.13
##$BF6= 200.13
##$BF7= 200.13
##$BF8= 200.13
##$BYTORDA= 1
##$CFDGTYP= 0
##$CFRGTYP= 5
##$CHEMSTR= <none>
##$CNST= (0..31)
1 1 145 1 1 1 1 1 1 1 1 1 1 1 1 1 1 1 1 1 1 1 1 1 1 1 1 1 1 1 1 1 
##$CPDPRG= <>
##$CPDPRG1= <>
##$CPDPRG2= <>
##$CPDPRG3= <>
##$CPDPRG4= <mlev>
##$CPDPRG5= <mlev>
##$CPDPRG6= <mlev>
##$CPDPRG7= <mlev>
##$CPDPRG8= <mlev>
##$CPDPRGB= <>
##$CPDPRGT= <>
##$D= (0..31)
0 0.7 0 0 0 0 0 0 0 0 0 0.03 0 0 0 0 0 0 0 0 0 0 0 0 0 0 0 0 0 0 0 0 
##$DATE= 1751454272
##$DBL= (0..7)
120 120 120 120 120 120 120 120 
##$DBP= (0..7)
150 150 150 150 150 150 150 150 
##$DBP07= 0
##$DBPNAM0= <>
##$DBPNAM1= <>
##$DBPNAM2= <>
##$DBPNAM3= <>
##$DBPNAM4= <>
##$DBPNAM5= <>
$$ [...]
##$SUBNAM3= <"">
##$SUBNAM4= <"">
##$SUBNAM5= <"">
##$SUBNAM6= <"">
##$SUBNAM7= <"">
##$SUBNAM8= <"">
##$SUBNAM9= <"">
##$SW= 18.0517328524113
##$SWIBOX= (0..15)
0 0 2 0 0 0 0 0 0 0 0 0 0 0 0 0 
##$SW_h= 3612.71676300578
##$TD= 16384
##$TD0= 1
##$TE= 0
##$TE2= 300
##$TE3= 300
##$TEG= 300
##$TL= (0..7)
0 120 120 120 120 120 120 120 
##$TP= (0..7)
150 150 150 150 150 150 150 150 
##$TP07= 0
##$TPNAME0= <>
##$TPNAME1= <>
##$TPNAME2= <>
##$TPNAME3= <>
##$TPNAME4= <>
##$TPNAME5= <>
##$TPNAME6= <>
##$TPNAME7= <>
##$TPOAL= (0..7)
0.5 0.5 0.5 0.5 0.5 0.5 0.5 0.5 
##$TPOFFS= (0..7)
0 0 0 0 0 0 0 0 
##$TUNHIN= 0
##$TUNHOUT= 0
##$TUNXOUT= 0
##$USERA1= <user>
##$USERA2= <user>
##$USERA3= <user>
##$USERA4= <user>
##$USERA5= <user>
##$V9= 5
##$VALIST= <valist>
##$VCLIST= <CCCCCCCCCCCCCCC>
##$VD= 0
##$VDLIST= <DDDDDDDDDDDDDDD>
##$VPLIST= <PPPPPPPPPPPPPPP>
##$VTLIST= <TTTTTTTTTTTTTTT>
##$WBST= 1024
##$WBSW= 4
##$XGAIN= (0..3)
0 0 0 0 
##$XL= 0
##$YL= 0
##$YMAX_a= 473273
##$YMIN_a= -690835
##$ZGOPTNS= <>
##$ZL1= 120
##$ZL2= 120
##$ZL3= 120
##$ZL4= 120
##$ABSF1= 15.45491
##$ABSF2= -2.596939
##$ABSG= 5
##$ABSL= 3
##$ALPHA= 0
##$AQORDER= 0
##$ASSFAC= 0
##$ASSFACI= 0
##$ASSFACX= 0
##$ASSWID= 0
##$AUNMP= <proc_1d>
##$AZFE= 0.1
##$AZFW= 0.1
##$BCFW= 0
##$BC_mod= 2
##$BYTORDP= 0
##$COROFFS= 0
##$CY= -3
##$DATMOD= 1
##$DC= 0
##$DFILT= <>
##$DTYPP= 0
##$F1P= 0
##$F2P= 0
##$FCOR= 1
##$FTSIZE= 16384
##$FT_mod= 6
##$GAMMA= 0
##$GB= 0
##$INTBC= 1
##$INTSCL= 3.241238e-09
##$ISEN= 128
##$LB= 0.25
##$LEV0= 0
##$LPBIN= 0
##$MAXI= 10000
##$MC2= 0
##$MEAN= 0
##$ME_mod= 0
##$MI= 1.114404
##$NCOEF= 0
##$NC_proc= -5
##$NLEV= 6
##$NOISF1= 3.799351
##$NOISF2= 2.8
##$NSP= 0
##$NTH_PI= 0
##$NZP= 0
##$OFFSET= 15.54526
##$PC= 1
##$PHC0= -1202.35
##$PHC1= 13.79219
##$PH_mod= 1
##$PKNL= yes
##$PPARMOD= 0
##$PSCAL= 0
##$PSIGN= 0
##$REVERSE= no
##$SF= 200.129995285616
##$SI= 16384
##$SIGF1= 3
##$SIGF2= 2
##$SINO= 0.751879
##$SIOLD= 32768
##$SREGLST= <19F.Aceton>
##$SSB= 0
##$STSI= 16384
##$STSR= 0
##$SW_p= 3612.71676300578
##$SYMM= 0
##$S_DEV= 0
##$TDeff= 16384
##$TDoff= 0
##$TI= <>
##$TILT= no
##$TM1= 0
##$TM2= 0
##$TOPLEV= 0
##$USERP1= <user>
##$USERP2= <user>
##$USERP3= <user>
##$USERP4= <user>
##$USERP5= <user>
##$WDW= 1
##$XDIM= 16384
##$YMAX_p= 378262016
##$YMIN_p= -154550
$$ End of Bruker specific parameters
$$ ---------------------------------
##NTUPLES= NMR SPECTRUM
##VAR_NAME=  FREQUENCY,     SPECTRUM/REAL,   SPECTRUM/IMAG
##SYMBOL=    X,             R,               I
##VAR_TYPE=  INDEPENDENT,   DEPENDENT,       DEPENDENT
##VAR_FORM=  AFFN,          ASDF,            ASDF
##VAR_DIM=   16384,         16384,           16384
##UNITS=     HZ,            ARBITRARY UNITS, ARBITRARY UNITS
##FACTOR=    0.220516191357247, 1,           1
##FIRST=     3111.07289644596, 0,            0
##LAST=      -501.643866559823, 0,           0
##MIN=       -501.643866559823, -154550,     0
##MAX=       3111.07289644596, 378262016,    0
$$ Real data points
##PAGE= N=1
##DATA TABLE= (X++(R..R)), XYDATA
$$ [...]
8084D531901M261n8959k8190K112J9270J126p3539m0720n662j2248N8389q056
8072D389685J5427k7038l0256Q702k1963k7981n9860J7168n1947o273J6406l7140
8060D184930L2417k3926n3132O714J8672k6768o653R489m5227p0660l791k6845
8048C995220P978m198J8225k7124J628L503j2987P295k7721l0086o972j8131k5468
8035C881162k3234K5391k2296l7937J2573p8862l272P044J1222r7561n4919l4717
8023C584594p1178j16277j5776K4045q9958n3973l2719j0273p4768p191m1547
8012C094979p6947m3370l361n6252R544n446Q607R318o3175m307k241q2012M0814
7999B826151m102K144k1177k7242K7297k2122k8388k9538M1828L219M779l2860
$$ y = [4531901, 4536162, 4477203, 4449013, 4451125, 4470395, 4471521, 4397982, 4357262, 4351600, 4339352, 4397741, 4389685, 4405112, 4378074, 4347818, 4356520, 4334557, 4306576, 4246716, 4263884, 4211937, 4205664, 4222070, 4184930, 4217347, 4193421, 4140289, 4147003, 4165675, 4138907, 4132254, 4141743, 4096516, 4025856, 4022065, 3995220, 4003198, 3999000, 4017225, 3990101, 3991729, 3995232, 3982245, 3989540, 3961819, 3931733, 3924761, 3906630, 3881162, 3857928, 3883319, 3861023, 3823086, 3835659, 3756797, 3753525, 3760569, 3771791, 3674230, 3619311, 3584594, 3513416, 3397139, 3381363, 3405408, 3315450, 3261477, 3228758, 3218485, 3143717, 3136526, 3094979, 3018032, 2974662, 2971301, 2915049, 2924593, 2919147, 2927754, 2937072, 2873897, 2869590, 2867349, 2785337, 2826151, 2822049, 2824193, 2803016, 2775774, 2803071, 2780949, 2752561, 2723023, 2764851, 2768070, 2772849, 2739989]
7987B739989j1236n4325l7359k5268r23K160m8152L4643o518l8164k8064m2957
7975B483826j3659n7846o5798K7326m2354j8508K449l444K0956l9922n1991k0745
7963B220290j7789j0008M996j7634m3905R124j4037r647N1778n5656K8133l4532
7951B111113l59l3429P835k1735l9420n5106j0247m4711L9275q387j3113k4411
7939A907305q2801P106l5291L2309K6535J0529l3319m5645j1633l7936K3093q794
7927A751458K3793K5408N764m8173K6695J3655p8375N3244K2191o5606l7317l9080
7915A653657L361M427k0546K3863l772l7277o2920J8035o4089L8837j7134q5933
7903A450509l4226l971l7205M2002J3379L4128J2257M962l8683k1331K0152K3066
$$ y = [2739989, 2728753, 2674428, 2637069, 2611801, 2610878, 2613038, 2564886, 2599529, 2593011, 2554847, 2526783, 2483826, 2470167, 2412321, 2346523, 2373849, 2331495, 2312987, 2315436, 2311992, 2332948, 2293026, 2241035, 2220290, 2202501, 2192493, 2197489, 2179855, 2135950, 2145074, 2131037, 2121390, 2173168, 2117512, 2145645, 2111113, 2110754, 2077325, 2085160, 2063425, 2024005, 1968899, 1958652, 1913941, 1953216, 1944829, 1931716, 1907305, 1824504, 1831610, 1796319, 1828628, 1855163, 1865692, 1832373, 1786728, 1775095, 1737159, 1760252, 1751458, 1775251, 1800659, 1806423, 1758250, 1784945, 1798600, 1720225, 1773469, 1795660, 1730054, 1692737, 1653657, 1657018, 1661445, 1640899, 1664762, 1660990, 1623713, 1560793, 1578828, 1514739, 1553576, 1536442, 1450509, 1416283, 1412312, 1375107, 1417109, 1430488, 1464616, 1476873, 1481835, 1443152, 1421821, 1441973, 1465039]
7891A465039j0546p2950j1353r962j5316O3545k3459n372l8966k103k2447n192
7879A310918N2860l416j0070l2760J5524L3570K8934m6820n1808m5797j4460L6225
7867A272900l3j0378O6939l937M5791n3282j6399K853j5406k4556k3180K5944
7855A267256p4462l7978o862M1646l8711m2630k0905R594N7549P223Q938q2333
7843A088325M651J6488m214K0752j6225l7260k9449K5094k4332j0288J2025q980
7831A036587N3236j3006l4922j957J4060L3567K2641J9762k6248j2426j8760l2780
7819A039754r020K638L2791K6451m4592n294k7687j6430m3229n3720R995j5551
7807H96106O2164J2124n732m9668l3940J9696k0004m2910J3305K0209R437L4910
$$ y = [1465039, 1454493, 1381543, 1370190, 1360228, 1344912, 1408457, 1384998, 1379626, 1340660, 1338557, 1316110, 1310918, 1363778, 1360362, 1350292, 1317532, 1333056, 1366626, 1395560, 1348740, 1296932, 1251135, 1236675, 1272900, 1272867, 1262489, 1329428, 1325491, 1371282, 1318000, 1301601, 1304454, 1289048, 1264492, 1241312, 1267256, 1192794, 1154816, 1147954, 1189600, 1150889, 1108259, 1087354, 1096948, 1154497, 1161720, 1170658, 1088325, 1092976, 1109464, 1105250, 1126002, 1109777, 1072517, 1043068, 1068162, 1043830, 1033542, 1045567, 1036587, 1089823, 1076817, 1041895, 1039938, 1053998, 1087565, 1110206, 1129968, 1103720, 1091294, 1072534, 1039754, 1030734, 1033372, 1066163, 1092614, 1048022, 1042728, 1015041, 998611, 955382, 901662, 911657, 896106, 958270, 970394, 964662, 914994, 881054, 900750, 880746, 837836, 851141, 871350, 880787, 915697]
7795I15697j3789o6991K963M305n3457L4514R951L020k541k4980K6797K3369k5443
7782H33415k265J7285l7494n8726M2765J0064O904K6942J5253M3539m5334j0740
7770H41608j1186k1632j2067Q064L5693j9340J1790j237J0400R030k4414P718
7758H34427L056k5906J9917J2096J3108p748o0999l702j6409M8201o2666k1108
7746G32267L7465J2897J7746k3245q2971O274M661l889J1618J2299j1422n2697
7734F61003J728J409m3699p083o483L4328M6666O038K4994k4715j8500k0725o815
7721F48146m6904N940K4313L1944l5411O579N2885M975q965O5223m3383m7816
7709F57526l4796J3011K6868j6012K3169O493l923l3684J0130J3016k3360m0701
$$ y = [915697, 901908, 834917, 837880, 842185, 788728, 823242, 833193, 836213, 833672, 808692, 835489, 858858, 833415, 831150, 848435, 810941, 752215, 794980, 805044, 811948, 838890, 854143, 897682, 852348, 841608, 830422, 808790, 796723, 804787, 840480, 821140, 832930, 831693, 842093, 851123, 826709, 834427, 837483, 811577, 831494, 843590, 856698, 848950, 787951, 784249, 767840, 816041, 753375, 732267, 769732, 782629, 800375, 777130, 694159, 700433, 705094, 701205, 712823, 725122, 713700, 661003, 662731, 664140, 620441, 613358, 606875, 641203, 687869, 693907, 718901, 694186, 675686, 654961, 648146, 601242, 607182, 631495, 663439, 628028, 634607, 687492, 692467, 683502, 748725, 705342, 657526, 622730, 635741, 662609, 646597, 669766, 676259, 672336, 638652, 648782, 661798, 638438, 597737]
7697E97737J4614N5341k2818K668k8673J3631k4493q734J1706k0996j9661M2478
7685F12800M8774k8176o3215L9094J5565m0767j8413j2230N0839j538j4387P257
7673E95603J1943Q866r473o505N787L7045k0808m6541O1126J8529n3844L2461
7661F34189O2144l9849k9461l0571M6538j0447l1965k3123M035M6418l1220l687
7649E93001J4512j0378L4464q231j2015Q964o667j4498N587m6090N4227m284J8319
7636F26911l0590l5506J08076J3450Q698l1447k7556L2340L2670N905n701k4962
7624F72288m1871k648L938N5630K6315n25P895j0086p75M6637p254n4254r550
7611F85740L4043J4158q13l8720J7186M1546q50J0559L6764j7487j3019k6975
$$ y = [597737, 612351, 667692, 644874, 647542, 618869, 632500, 608007, 599273, 610979, 589983, 570322, 612800, 661574, 633398, 570183, 609277, 624842, 584075, 565662, 553432, 604271, 602733, 588346, 595603, 607546, 616412, 606939, 600434, 606221, 643266, 622458, 575917, 637043, 655572, 601728, 634189, 696333, 656484, 627023, 596452, 642990, 632543, 600578, 577455, 581490, 627908, 596688, 593001, 607513, 597135, 631599, 623368, 611353, 620317, 613650, 599152, 604739, 558649, 612876, 608592, 626911, 596321, 560815, 668891, 682341, 691039, 659592, 632036, 664376, 697046, 702951, 697250, 672288, 630417, 627769, 631707, 687337, 713652, 713127, 721022, 710936, 710161, 756798, 749544, 695290, 685740, 719783, 733941, 733128, 694408, 711594, 753140, 752290, 762849, 799613, 782126, 769107, 742132]
7599G42132k131j3202K9503p421m4445J5279N800J0790r234N2461j4997k3876
7587G40659j0376j4047o0510J0540M704N4866m8613o1610Q1469J336p2087K291
7575F28622Q461l3r322j1335q45K4293k4850j0095k448R6686M747n8062k4413
7562F21406l1902k5669L2131M5684P878N241r800l2874K816K4712m0371J7262
7550F16514n2878k8720o626L2305R3844k8629k3565J6982r844K742Q00k6327j6841
7537E69757l0340K7950R338P369N5158j4316L4398l3230o2703M1256K9446m3533
7525E90550M73j7012J6964k7590L238j5280K8469R084k6396K0300L6010n1033
7513E67777K4013N334l6828O752K6039k5883l1459l1749j2064Q6905j596N4032
$$ y = [742132, 740001, 726799, 756302, 748881, 704436, 719715, 725515, 736305, 727071, 779532, 764535, 740659, 730283, 716236, 655726, 666266, 670970, 725836, 677223, 615613, 697082, 698418, 626331, 628622, 637083, 637050, 627728, 616393, 615548, 639841, 614991, 604896, 602448, 699134, 703881, 645819, 621406, 589504, 563835, 595966, 641650, 649528, 654769, 644969, 612095, 614911, 639623, 599252, 616514, 563636, 534916, 528290, 560595, 654439, 625810, 602245, 619227, 609383, 612125, 612925, 586598, 569757, 539417, 567367, 576705, 584074, 639232, 624916, 659314, 626084, 563381, 604637, 634083, 590550, 591023, 574011, 590975, 563385, 566623, 551343, 579812, 588896, 562500, 582800, 618810, 567777, 591790, 597124, 560296, 567048, 593087, 567204, 535745, 503996, 491932, 578837, 577241, 631273]
7501F31273n1777P681L2465n155J1681L9407m3000o2001L4971J7172m8659K6407
7489E90465J9533j1683m5670j1672K1439l9670J7256L0373K8437J8066n2154k5108
7477E39612n177m1706j1914N3454K733J9436O6575j0090J8675k2755q2737L0927
7465E57033k2996M4453M2089Q128K0727k2380k6852L9810L8673o1206L98k4559
7453E93318L543N8754J3053o2510J9209O247J4624n6968m8103M8087L4999J6823
7441F41076m1722J9340M4989j7175l0564j1071k777l1013N1913l7391k7157O315
7429E64763j7774r052L5634J1540M548j3910m1310J2124L925o204l7913J1400
7417E17771j4823P745J2184j0830O0276K348Q264k5452L2678q681L130K0730l0498
$$ y = [631273, 579496, 587177, 619642, 614487, 626168, 665575, 622575, 560574, 595545, 612717, 564058, 590465, 609998, 598315, 552645, 540973, 562412, 522742, 539998, 570371, 598808, 616874, 564720, 539612, 534435, 492729, 480815, 534269, 537002, 556438, 623013, 612923, 631598, 608843, 526106, 557033, 534037, 578490, 620579, 628707, 649434, 627054, 600202, 640012, 678685, 617479, 617877, 593318, 596861, 655615, 668668, 606158, 625367, 631614, 646238, 589270, 541167, 589254, 624253, 641076, 599354, 618694, 663683, 646508, 615944, 604873, 602096, 571083, 622996, 585605, 558448, 564763, 546989, 537937, 573571, 585111, 589659, 575749, 534439, 546563, 550488, 544284, 506371, 517771, 502948, 510693, 522877, 512047, 572323, 574671, 582935, 557483, 590161, 581480, 584610, 605340, 574842]
7404E74842j9517r478p168j6579r631M0342J2215k2163Q189Q543J7227R128l3559
7391E52391N396L6653p7059J3616L7281L3167K6435o0168j4o643n4470L6832P26
7378E44143L0615j3699J0983j4914L9229j4308M895P364m0345n1092k4492L8553
7366E16932o220j4065k7278R705K0544K6481R930P268j1057l2973J9505N790j067
7353E23495m6399n7106L735M2750R4j4281q933P558M0421J7613n1211p3938L6116
7340D19914P1309R962m1603P988k6172l4172L6805K2488o867N354K53J4580j1271
7327D68568j9053p652q526k1746M1405L9874k4683l667J7497M422j6789j9371
7315D50279j9686J2837L4142N317l2451k4031Q642J1174k1446M0284K1870k3323
$$ y = [574842, 555325, 545847, 538679, 522100, 512469, 552811, 565026, 542863, 551052, 559595, 576822, 585950, 552391, 557787, 594440, 517381, 530997, 568278, 601445, 627880, 567712, 567698, 561055, 506585, 543417, 544143, 574758, 561059, 572042, 557128, 596357, 582049, 586944, 594308, 553963, 502871, 478379, 516932, 510712, 496647, 469369, 479074, 499618, 526099, 536029, 543297, 532240, 499267, 518772, 524562, 523495, 477096, 419990, 423725, 466475, 466569, 452288, 443355, 450913, 491334, 508947, 457736, 383798, 419914, 491223, 501185, 459582, 467570, 441398, 407226, 444031, 466519, 459652, 465006, 465259, 479839, 468568, 449515, 441863, 433337, 411591, 452996, 492870, 468187, 464520, 482017, 486439, 469650, 450279, 430593, 443430, 477572, 482889, 450438, 426407, 435049, 446223, 424777, 465061, 486931, 463608]
7303D63608L3057l8728j6426K0590J5311L32q215l1640J7281K1100k2406Q439
7291D62303L9823k7048j6576q757l7288L7357K7505K5450l1455k2507K9638J576
7279D80021J9685j3783k8534O4411m4882J796M2771k917l6248p913j5422o730
7267D52255K8159n6748k1561L1640K4502j158M9584l3617o150L8427n1555l1286
7255D22492J227N1014M7695J768o3028L2931K1944q4646K1149O7913p213m8963
7243D64283j5701K0114K5599J7014j8180j1255J705l1078J4094J0034N3858l5012
7231D95475l9177J2125k1683O043M7446N3451n8300J519O7032k5275l2274K4810
7219E31192n4305k0719J01313M0428m5224j4033k136j2802J0879J3884K5872n6200
$$ y = [463608, 496665, 457937, 441511, 462101, 477412, 477744, 469529, 437889, 455170, 476270, 453864, 462303, 502126, 475078, 458502, 449745, 412457, 449814, 477319, 502769, 471314, 448807, 478445, 480021, 499706, 485923, 457389, 521800, 476918, 478714, 521485, 518568, 482320, 474407, 458985, 452255, 480414, 423666, 402105, 433745, 458247, 457089, 506673, 473056, 466906, 505333, 453778, 422492, 423719, 474733, 522428, 524196, 461168, 494099, 516043, 431397, 452546, 520459, 513246, 464283, 448582, 468696, 494295, 511309, 493129, 481874, 483579, 452501, 466595, 476629, 530487, 495475, 456298, 468423, 446740, 452783, 500229, 553680, 495380, 496899, 563931, 538656, 506382, 531192, 476887, 456168, 557481, 597909, 552685, 538652, 536516, 523714, 534593, 548477, 574349, 518149]
7207E18149l5956j9530K9100M0737L0177L8330r934k4870r575n990L963j2702
7195E41899J6252L0550K0572J9537M0088k9987j3462k2690j7929K4957M6555r936
7183F46406L6300J4745k3126j712J3269R4767r544k213L2492M3379j9361k2132
7171H03270Q6001K6346J0672O6076L5503J00778J14668M9896L2428P7353J21666
7160A524657J19165p5208l0879J9917p7178q0335p0142n5572p3240j4492j5922
7149A170771p3700q7650K4883M4802J4937o4429j01954L2719J7038L724k6205
7138I54936L4439l1922M911k441N2504J1929r358L1037l5393m390N4029J5456
7126A075737J9792J9083L157N5036L9104j0670K1596N6526L8030j2316M1631R067
$$ y = [518149, 482193, 462663, 491763, 532500, 562677, 601007, 591073, 566203, 556628, 550638, 554601, 541899, 558151, 588701, 609273, 628810, 668898, 638911, 625449, 602759, 584830, 609787, 656342, 646406, 682706, 697451, 674325, 672613, 685882, 780649, 771105, 768892, 801384, 844763, 825402, 803270, 889271, 915617, 926289, 992365, 1027868, 1128646, 1243314, 1293210, 1325638, 1402991, 1524657, 1643822, 1568614, 1537735, 1557652, 1480474, 1400139, 1329997, 1274425, 1201185, 1186693, 1170771, 1097071, 1009421, 1034304, 1079106, 1094043, 1029614, 927660, 960379, 977417, 981141, 954936, 989375, 957453, 962364, 959923, 1012427, 1024356, 1014998, 1046035, 1010642, 1006252, 1060281, 1075737, 1095529, 1114612, 1117769, 1172805, 1211909, 1201239, 1222835, 1279361, 1317391, 1305075, 1346706, 1355773]
7114A355773N9583O8819R3902L6986O9122J41102P0520J60924J65478J62368K03801
7103B588378K35761K72875L30916M66746N81691O94138Q89963R86428J172721
7094H219617R28831o2646j436427j540540j053488p43959m95991m33683l55707
7085C026007k67491k15008j94125j36032l8715j05961p3122j12023j16903o7256
7075A699371o2592r0833p7671m6468l6554r065o2340k4048k1350n458J3307j9982
7063A256317p8828r913m9085j0278p577j6456j7713j8536m0868m591n7289K1182
7051I66365J8398m1531K8800j8502l0162M927j3657n7510J1993m3538L115l2103
7039G96595J6507K6418L8531k1976k7270k2125k1168L019n8392L2004K0788k5173
$$ y = [1355773, 1415356, 1484175, 1578077, 1615063, 1684185, 1825287, 1895807, 2056731, 2222209, 2384577, 2588378, 2824139, 3097014, 3427930, 3894676, 4476367, 5170505, 6060468, 7046896, 8219617, 9148448, 9085802, 7649375, 6108835, 5055347, 4311388, 3815397, 3381714, 3026007, 2758516, 2543508, 2349383, 2213351, 2174636, 2068675, 1995553, 1883530, 1766627, 1699371, 1636779, 1545946, 1468275, 1421807, 1385253, 1376188, 1313848, 1289800, 1268450, 1262992, 1276299, 1256317, 1177489, 1167576, 1118491, 1108213, 1100636, 1084180, 1066467, 1047931, 1007063, 1002472, 945183, 966365, 984763, 943232, 972032, 953530, 923368, 928295, 914638, 857128, 869121, 825583, 828698, 796595, 813102, 839520, 878051, 856075, 828805, 806680, 785512, 788531, 730139, 762143, 782931, 757758]
7027G57758R671K7410K0173l9947o4503k0329O9455K873k1908J8463l7091N5524
7015G77549J5235j0458l795m241m8840l396m3877L456m2645K2173M0482q6350
7003F15293j995L6288L5003J4509l3407M642K9904j2681N062k5634l7444q283
6991F21257j0578J339K1605K0953J1465K6091m327p965L4150k9936J0278l2111
6979F62221K1048M416K3602L50m2636l39K6537k5084K2010N2723j8996m6139j9499
6966F60214L1292l5222j8431K833k4023K7305k0774j57M7693k3100j7392l5920
6954E94318K9640j1786l3246L3797K2427J4831J8544Q996k5710nJ2789m6290N5414
6941F73719k8872l5891m6783J1676Q8585o7328O586k17K6010k8776L894K9522
$$ y = [757758, 767429, 794839, 815012, 775065, 710562, 690233, 759688, 762561, 740653, 759116, 722025, 777549, 792784, 782326, 778531, 774290, 725450, 722054, 678177, 681633, 638988, 661161, 701643, 615293, 613298, 649586, 684589, 699098, 665691, 670333, 700237, 687556, 692618, 666984, 629540, 621257, 610679, 612018, 633623, 654576, 666041, 692132, 687805, 679840, 713990, 684054, 694332, 662221, 683269, 687685, 711287, 711637, 669001, 668662, 695199, 670115, 692125, 744848, 725852, 679713, 660214, 691506, 656284, 637853, 640686, 616663, 643968, 623194, 623037, 670730, 647630, 630238, 594318, 623958, 612172, 578926, 612723, 635150, 649981, 668525, 677521, 651811, 651806, 664595, 618305, 673719, 644847, 608956, 562173, 573849, 662434, 595106, 601692, 601475, 627485, 598709, 602603, 632125]
6929F32125l2307j882J2139J1039k5112j5731k1408j2134k4602N9986M487j9505
6917E67095l3741J5124n4121J3489L2651Q670M9929l4504q47K1865m418J4061
6905E95253P371P36k5436J7817L3443l2595n8626O0753j913k3163O1513m565j9888
6892F10700J5894N9290j064K860J0623J1299j6970N0591O362J2463K5862M2444
6880H30354m3408K52L4727N6710Q2295L3631N1198L9865M5121j176R1303J42568
6868A363440J20305J01223J03829J62866J42664J47591P5445N8876j8913m2068
6858B215258j33465k04820j65973j40702j11784j15072n6820q9741m2345l5909
6848A118627p7689j2287J3372o6107m0884l0032m4994m6658k7564L1865L8108
$$ y = [632125, 599818, 597936, 610075, 621114, 596002, 580271, 558863, 546729, 522127, 582113, 586600, 567095, 533354, 548478, 494357, 507846, 540497, 549167, 599096, 564592, 563745, 585610, 581192, 595253, 602624, 603360, 577924, 595741, 629184, 596589, 537963, 598716, 596803, 573640, 635153, 630588, 610700, 626594, 685884, 684820, 687680, 698303, 709602, 692632, 743223, 749585, 762048, 787910, 830354, 786946, 787198, 821925, 878635, 960930, 994561, 1045759, 1085624, 1130745, 1129569, 1220872, 1363440, 1483745, 1584968, 1688797, 1851663, 1994327, 2141918, 2217363, 2276239, 2257326, 2215258, 2081793, 1876973, 1711000, 1570298, 1458514, 1343442, 1286622, 1196881, 1154536, 1118627, 1040938, 1028651, 1042023, 975916, 935032, 905000, 860006, 813348, 785784, 817649, 855757]
6837H55757j9724j1170K4505m8792k1461J7049j1521o271Q035l8578l5590k468
6825G09771j9013r149m5621Q434M2567L3301j0435q263n7395n6009k8294j6166
6813E43728O3278O2632j51j1637J7149K0001L791l956o3732l151O1592Q13K9454
6800G19811l3709L7074j0466l3812J2678J896O522L071J2269p453L875j1282K7210
6787G27684Q255K778L3974k3113R218n0911K4020M2352j7455l2169K9731L0531
6775G84895l3977J1115J17k1663J0067j3483j2815p405m9551K5934Q450j5769
6763F85915r853N4888j870k9584r54K2200L8838k3794n1088j7620K7683L2815
6751G27576j1798N511m3894m453K441J8784J6008M628j3700O696M9936m713j6995
$$ y = [855757, 836033, 824863, 849368, 800576, 779115, 796164, 784643, 778372, 786407, 747829, 712239, 709771, 690758, 681609, 635988, 644422, 686989, 720290, 709855, 701592, 644197, 588188, 559894, 543728, 607006, 669638, 669487, 657850, 674999, 695000, 698791, 694835, 631103, 627952, 689544, 690357, 719811, 686102, 723176, 712710, 678898, 691576, 693472, 699994, 703065, 715334, 707881, 711756, 700474, 727684, 735939, 738717, 772691, 749578, 758796, 707885, 731905, 774257, 756802, 724633, 754364, 784895, 750918, 762033, 762150, 740487, 750554, 737071, 724256, 716851, 667300, 693234, 701684, 685915, 676062, 730950, 729080, 699496, 698542, 720742, 759580, 735786, 684698, 667078, 694761, 727576, 715778, 721289, 677395, 672942, 675383, 694167, 710175, 714803, 701103, 707799, 757735, 753022, 736027]
6738G36027J2703K5318J2996p57k1894m601R93L7799K9784K3644j1677N6238J1493
6725I08066l2862L2129k562k956L4458j6019K607K2595R772j1602J4754j6593
6713I41787j5813K3970m4249K0018m2151j5031L7315n6805L1835o122m1447M837
6701H38144K0422K4632q2985p869J7304J3361j7364l1810R3929M8208J7788n9363
6689H74397l8502k1625J5989L7322n9436J465o373K2931Q228j9042j661k1814
6677G91879J2822j0569k3779M5969K4021M675k5K2988n9138L2371j4907K1215
6665H47522K8809l2918l955j070J5729M2897o823l2917L94M134J7403l0877O924
6652H55252k4793Q290L3806q522P502K5291k3758k4562l2305L3953K0483p811
$$ y = [736027, 748730, 774048, 787044, 786287, 764393, 759792, 760785, 798584, 828368, 852012, 840335, 896573, 908066, 875204, 907333, 904771, 901815, 936273, 920254, 922861, 945456, 955228, 943626, 958380, 941787, 925974, 949944, 905695, 925713, 883562, 868531, 905846, 849041, 880876, 874754, 833307, 838144, 858566, 883198, 800213, 792344, 809648, 823009, 805645, 773835, 867764, 915972, 933760, 874397, 835895, 814270, 830259, 867581, 808145, 809610, 803237, 826168, 834396, 815354, 813693, 791879, 804701, 794132, 770353, 816322, 840343, 845018, 844993, 867981, 808843, 841214, 826307, 847522, 876331, 843413, 839458, 838388, 854117, 897014, 890191, 857274, 857668, 861802, 879205, 848328, 855252, 830459, 838749, 872555, 864033, 871535, 896826, 873068, 848506, 816201, 850154, 870637, 862826]
6640H62826j9912K6896l8457m8320j8088L8202M3720N842k1197Q529L0711o5576
6628H05176j4959M3746J2417k6491l0135R195K7986j7859L9874N067p1026N206
6616G88197m7398q870P5462M0271l6050J5107l5815M9829L8736j6983K7282l4675
6604H55093k5706k3807K0719r012K2660J1454J9313l2509O3624m365k7295J1483
6592H81652J7731k6492q52K7491p9543M916p482N0317R497m102q297J4845J4424
6579H94105J5933k6841j5949L3841k0193n8922K3901N2443n4239K3951M8628J7932
6567I34590j6517J7640J7333l3420k4568l97M1058J3705K4011o4589o166Nl5126
6554H67559K9271K1024N2153m3668L7670O797j1997J6344L5492P545m078k0279
$$ y = [862826, 842914, 869810, 831353, 783033, 764945, 803147, 846867, 852709, 831512, 840041, 870752, 805176, 790217, 833963, 846380, 819889, 789754, 798949, 826935, 809076, 848950, 854017, 782991, 788197, 740799, 731929, 807391, 847662, 811612, 826719, 790904, 840733, 879469, 862486, 889768, 855093, 829387, 805580, 826299, 817287, 839947, 851401, 870714, 838205, 901829, 897464, 870169, 881652, 899383, 872891, 872039, 899530, 819987, 824903, 817421, 867738, 877235, 873133, 864836, 879681, 894105, 910038, 883197, 867248, 901089, 880896, 821974, 845875, 898318, 844079, 868030, 916658, 934590, 918073, 935713, 953046, 919626, 895058, 894661, 935719, 949424, 973435, 908846, 902680, 902685, 867559, 896830, 917854, 970007, 926339, 964009, 970806, 958809, 975153, 1010645, 1018190, 1014112, 993833]
6542I93833J9148K4096j3289k3005k9689L5759K830m3911M0605J0333J2765K0069
6530A049544K8814L7915k0604N29m9005J1388l3779R995J3169K205L2467l5131
6518A047507j4012O8975P845L453k5630o9748m307J3431K8028L6206O319l0367
6506A067700j2863k318l297R09J7673L3722k3675j5546M8132J4913o074N584L4509
6493A159369m535j8974r590J4995M2201K3580M373o097k8162k9628J752O3866
6481A213150K8351M5581L3905k4218l0848j7093j6191L9598k074m4697J7350k5007
6469A217807m9437p259M8234J1525M7239j8427l6627J0535l0545J6737O3839L0366
6457A303987K2066K6455l1665l2157P1215N2788o5196M3137K2728J1197M5648
$$ y = [993833, 1012981, 1037077, 1023788, 1000783, 971094, 1006853, 1009683, 965772, 1006377, 1016710, 1029475, 1049544, 1078358, 1116273, 1095669, 1096198, 1047193, 1058581, 1024802, 1034797, 1047966, 1050171, 1082638, 1047507, 1033495, 1102470, 1110315, 1113768, 1088138, 1018390, 1014083, 1027514, 1055542, 1091748, 1098067, 1067700, 1054837, 1052519, 1049222, 1050131, 1067804, 1101526, 1077851, 1062305, 1110437, 1125350, 1119276, 1124860, 1159369, 1154834, 1135860, 1126270, 1141265, 1183466, 1207046, 1211419, 1205322, 1177160, 1147532, 1149284, 1213150, 1241501, 1287082, 1320987, 1296769, 1265921, 1248828, 1232637, 1272235, 1270161, 1225464, 1242814, 1217807, 1168370, 1161111, 1209345, 1220870, 1268109, 1249682, 1213055, 1223590, 1193045, 1209782, 1273621, 1303987, 1326053, 1352508, 1320843, 1288686, 1359901, 1412689, 1347493, 1390630, 1413358, 1424555, 1470203]
6446A470203j6986R976L4253Q2402K4164L3418Q524j1769j0463L1478K0359n288
6434A670271L3199K2549K6038N936k3516J1485L7769L3761n829L1507M8471L7378
6422A929019P2419m8986l1759L5118N4363K7479j125K0002o444K0303M769J8444
6410B093602rK4812r309k2041j4741o980K6568l6597N2458M5888l7814l2958p598
6397B075281K1560Q1726M453p538m710m5069j6673N9754K3678L6993L2021j5728
6385B245748l000m92q079n5650k8956O8240m6729l6691O0673m5110J5141l4694
6373B130401j1585N7506M5525l6263P24o0319J7414J6404q333j3980o9430P513
6361B075577k4635l7096m1054L9653p242L493k9725K962M2912r999m957l3482
$$ y = [1470203, 1453217, 1463193, 1497446, 1579848, 1604012, 1637430, 1645954, 1634185, 1623722, 1655200, 1675559, 1670271, 1703470, 1726019, 1752057, 1757993, 1734477, 1745962, 1783731, 1817492, 1811663, 1843170, 1891641, 1929019, 2001438, 1952452, 1920693, 1955811, 2010174, 2037653, 2036528, 2056530, 2050086, 2070389, 2075158, 2093602, 2093593, 2118405, 2109096, 2087055, 2072314, 2065334, 2091902, 2055305, 2107763, 2153651, 2115837, 2082879, 2075281, 2096841, 2178567, 2183020, 2175482, 2170772, 2125703, 2109030, 2168784, 2192462, 2229455, 2261476, 2245748, 2242748, 2242256, 2234177, 2178527, 2149571, 2217811, 2171082, 2134391, 2195064, 2149954, 2165095, 2130401, 2118816, 2176322, 2221847, 2185584, 2186308, 2125989, 2143403, 2159807, 2151474, 2137494, 2068064, 2075577, 2050942, 2013846, 1972792, 2012445, 2005203, 2008696, 1978971, 1981933, 2024845, 2014846, 2009889, 1976407]
6349A976407J6124o477L5318o637m4686j4005o106J8222l9674N078p184o2877
6337A863503j3697P460k9849k8567k0816k9652K8729R120m3389J4632K713J1352
6325A771539K5745J1469m8717K6286q007L6508r27J4620J5636Q158O2127J1017
6313A925454N4796O6442l9096l76Q300m7259J2609p8865k6890m6566p3861o990
6301A747698L1642N309J9711n5869q2839L46p868K7906R3765l2629j1205J384
6289A737351p184K035j0279l4431k4997M276m3272O3830J6188n4911j0124K7174
6277A665656J0153K1830Q509j1712j7784K2544L4999m7952k4125K7401K4605l9836
6265A674288k9699M8067J9413j1583l4726J1999Q509J2261k0150O19M5656L7169
$$ y = [1976407, 1992531, 1986054, 2021372, 2014735, 1970049, 1956044, 1949938, 1968160, 1928486, 1933564, 1926380, 1863503, 1849806, 1857266, 1827417, 1798850, 1778034, 1748382, 1777111, 1786231, 1742842, 1757474, 1760187, 1771539, 1797284, 1808753, 1760036, 1786322, 1778315, 1814823, 1813896, 1828516, 1844152, 1852310, 1914437, 1925454, 1980250, 2046692, 2007596, 2007220, 2015520, 1968261, 1980870, 1902005, 1875115, 1828549, 1754688, 1747698, 1779340, 1784649, 1804360, 1748491, 1665652, 1665998, 1658130, 1686036, 1779801, 1747172, 1735967, 1737351, 1730167, 1732202, 1721923, 1687492, 1662495, 1666771, 1623499, 1687329, 1703517, 1648606, 1638482, 1665656, 1675809, 1697639, 1706148, 1694436, 1676652, 1699196, 1734195, 1686243, 1662118, 1689519, 1714124, 1674288, 1644589, 1692656, 1712069, 1700486, 1665760, 1677759, 1686268, 1698529, 1678379, 1678998, 1724654, 1761823]
6253A761823o920K6741M0317p390J1057J8407j1134J744K2546M1151L0783J2148
6241A941273j3872m0781O2982R976K5740j9682K8093l039l7401R2Q941J7716k0976
6228A959062n0353m7935L7623j2847J9426k007m6363N6169M8294j0212P564M5974
6216B004395l1278M157P24J8650K6994R154n198N2366K8002l3787p7912K594N889
6203B004750J5395r820r853M8346Q134K4987m915k3915m214m425J7135L2208o231
6190B087582k4519j6327R0025L4060J1698K0515k1905k2784J0058J9102O2928
6179B250433l9643J2223p719K0508r156l5504O7585O6646N1627K0394L0388Q067
6167B435849m1946o932m1588k6643K4030k915k3240k5010J7327L0944K1572K8766
$$ y = [1761823, 1754903, 1781644, 1821961, 1814571, 1825628, 1844035, 1832901, 1834645, 1857191, 1898342, 1929125, 1941273, 1927401, 1886620, 1949602, 1959578, 1985318, 1965636, 1993729, 1990690, 1953289, 1953381, 1962322, 1980038, 1959062, 1908709, 1860774, 1898397, 1885550, 1904976, 1902969, 1856606, 1912775, 1961069, 1950857, 1958421, 2004395, 1973117, 1977274, 1977998, 1996648, 2023642, 2032796, 2027598, 2079964, 2107966, 2074179, 1996267, 1998861, 2004750, 2020145, 2010325, 2000472, 2048818, 2056952, 2081939, 2077024, 2053109, 2048895, 2044470, 2061605, 2093813, 2087582, 2063063, 2046736, 2136761, 2170821, 2182519, 2203034, 2181129, 2158345, 2168403, 2187505, 2250433, 2210790, 2223013, 2215294, 2235802, 2226646, 2191142, 2258727, 2325373, 2377000, 2397394, 2427782, 2435849, 2393903, 2386971, 2345383, 2318740, 2342770, 2339855, 2316615, 2291605, 2308932, 2339876, 2361448, 2390214]
6155B390214l6540l8114j6157K9241N0613P439o977J0118M718n1435j8037J0656
6143B335739N7080K9013q563O2650K4589J682k1120N8761q948l0514P7969M9615
6131B627953k5867r898N1447j8273N6054P221N3790J5552l4066M9958L465K8585
6119B805921r3010l6350L2331r198Q3015O4731M1518K568J0669L8755L1647J9519
6107B992116N0370k0420l4196P5714j9674j2668N8738P1285j4338m2915M5116
6096C149128O017l8476n221K7427n3781K7001J3703l6995M717P874P672l6638
6084C072428j7187n236R4603J7941n7424O0097M9099n336n995J1363L8573m169
6072C248757J4265K210j6156N3966L0253J15011J842j6009M406k563k998M3304
$$ y = [2390214, 2353674, 2315560, 2299403, 2328644, 2379257, 2386696, 2379719, 2389837, 2394555, 2343120, 2325083, 2335739, 2392819, 2421832, 2413269, 2475919, 2500508, 2502190, 2481070, 2539831, 2530883, 2500369, 2578338, 2627953, 2602086, 2592188, 2643635, 2625362, 2681416, 2688637, 2742427, 2757979, 2723913, 2773871, 2777336, 2805921, 2712911, 2676561, 2708892, 2699694, 2782709, 2847440, 2888958, 2891526, 2902195, 2940950, 2972597, 2992116, 3042486, 3022066, 2987870, 3063584, 3043910, 3031242, 3089980, 3161265, 3146927, 3104012, 3149128, 3155145, 3116669, 3111448, 3138875, 3085094, 3112095, 3125798, 3088803, 3093520, 3101394, 3109066, 3072428, 3055241, 3050005, 3144608, 3162549, 3105125, 3165222, 3214321, 3208985, 3202990, 3214353, 3252926, 3248757, 3263022, 3265232, 3249076, 3303042, 3333295, 3448306, 3450148, 3434139, 3438545, 3435982, 3432984, 3476288]
6060C476288r463L7959L1099J6829K3459m863n805k8521M7278o813L955K3932
6048C605334k9964L596J5187O4178O935p201J7772q310K5873K2382j3425k6818
6036C675539K4264M4205r141M8055J4310J5249o005J0400J8250M7347N055J1138
6024C898666j0394k3193Q7296k740Q9173m739k063j9911M0906J9929L7509K7235
6012D137674J1372N6605M7515N1642O4171N6048L8918M7502N7283J7062k259P8378
6000D661911J558n2166Q9151P0259M716N1700j0861M1559L5007L7611R321k2271
5988D917495J5018k33l5096o7816l9447K7906J2318n3969K9996n279J017O9195
5976D871105O2381K1614j903l0992O293M2133M1757j9869L023l4284k6967J3930
$$ y = [3476288, 3466825, 3504784, 3535883, 3552712, 3576171, 3571308, 3565503, 3536982, 3584260, 3577447, 3581402, 3605334, 3575370, 3578966, 3594153, 3658331, 3665266, 3658065, 3675837, 3667527, 3693400, 3715782, 3702357, 3675539, 3699803, 3744008, 3734867, 3782922, 3797232, 3812481, 3806476, 3816876, 3835126, 3882473, 3887528, 3898666, 3888272, 3865079, 3952375, 3949635, 4038808, 4034069, 4032006, 4012095, 4053001, 4072930, 4110439, 4137674, 4149046, 4205651, 4253166, 4304808, 4368979, 4425027, 4463945, 4511447, 4568730, 4585792, 4583533, 4661911, 4663469, 4611303, 4700454, 4770713, 4775429, 4827129, 4816268, 4857827, 4892834, 4930445, 4939766, 4917495, 4932513, 4932280, 4897184, 4829368, 4789921, 4817827, 4830145, 4776176, 4806172, 4800893, 4801910, 4871105, 4933486, 4955100, 4953197, 4922205, 4928498, 4970631, 5012388, 4992519, 4995542, 4961258, 4934291, 4948221]
5964D948221k8649o2045J5412p56m9128n1590K755q2821n4654j1385Q6807M5635
5952D757802k5939J1914j9968j5472J7305O512N0837K4125r686r669l6842j5432
5940D735487k6046L9504l7485r756J9868L3127L604K2507J72J9213K8234J9093
5928D847522o5044L2169J8029l244K6134j1967J4223L1599J7307O5730L7840k1857
5916D988441J7520M041K493J9396l6266k1956J8392K7266n6638k0847p199P6454
5904E011097k2868j5914M4070L5024M8460j5040R108P133J1040R5585N8037q5605
5892E180127J9815k7004p8124J661k3795k4984m870j3746n2133M898m71L2342
5880E013716L5329L8106O2710j7610J29357P3893J01359M5869J6194N5353P1451
$$ y = [4948221, 4919572, 4857527, 4872939, 4872183, 4823055, 4771465, 4774220, 4691399, 4636745, 4625360, 4712167, 4757802, 4731863, 4743777, 4723809, 4708337, 4725642, 4732154, 4782991, 4807116, 4797430, 4787761, 4750919, 4735487, 4709441, 4748945, 4711460, 4701704, 4721572, 4754699, 4758303, 4780810, 4780982, 4800195, 4828429, 4847522, 4782478, 4814647, 4832676, 4829432, 4855566, 4843599, 4857822, 4889421, 4906728, 4972458, 5010298, 4988441, 5005961, 5010002, 5012495, 5031891, 4995625, 4973669, 4992061, 5019327, 4962689, 4941842, 4934643, 5011097, 4988229, 4972315, 5016385, 5051409, 5099869, 5084829, 5093937, 5101070, 5112110, 5207695, 5265732, 5180127, 5199942, 5172938, 5094814, 5096475, 5072680, 5047696, 5042826, 5029080, 4976947, 4981845, 4981374, 5013716, 5049045, 5087151, 5149861, 5132251, 5261608, 5335501, 5436860, 5482729, 5498923, 5554276, 5625727]
5869E625727L4718J05038N6003l4714K8482m7160P181L9146N8713j0858p5649
5858E786627k7389O850l0640M1434P0189k6448m1395j4885n308j389J619N152
5846E764417R759M9019N5049J4944K6501k7573r761J5761q0969n7121J8883j310
5834E777599k2562M068O969O0642K1468j2905N7113K886M3372J6812o01J0053
5822E964914N3665N1078l4107Q885Q1509K1472j7774o754M5916P5901K7371Q4437
5810F356513K4308M8391P0067Q7651M9234J00046P5265R3749P9208O9770R7162
5799G151364J36289R4708P5744R7268p676J875N951M4861P1076Q3617m62j5512
5787G739103j2135k5158q7656J1858p2763q5389R441j1761K7165j8759n813K3566
$$ y = [5625727, 5660445, 5765483, 5821486, 5786772, 5815254, 5768094, 5775275, 5814421, 5873134, 5862276, 5786627, 5759238, 5766088, 5735448, 5776882, 5847071, 5820623, 5779228, 5764343, 5759035, 5757646, 5759265, 5764417, 5774176, 5823195, 5878244, 5893188, 5919689, 5892116, 5882355, 5898116, 5817147, 5760026, 5778909, 5777599, 5755037, 5759105, 5766074, 5826716, 5848184, 5835279, 5892392, 5895278, 5938650, 5955462, 5954861, 5964914, 6018579, 6069657, 6035550, 6044435, 6125944, 6147416, 6129642, 6122888, 6168804, 6244705, 6272076, 6356513, 6380821, 6429212, 6499279, 6586930, 6636164, 6736210, 6811475, 6905224, 6984432, 7054202, 7151364, 7287653, 7382361, 7458105, 7555373, 7547697, 7549572, 7555523, 7600384, 7671460, 7755077, 7754615, 7739103, 7726968, 7701810, 7614154, 7626012, 7553249, 7467860, 7477301, 7465540, 7492705, 7473946, 7468133, 7491699]
5775G491699l2770p6707K1175L0176k4642o381L389N605L1633M5271l3553O3756
5763G518651P5958k422N9142O2203M3506M5645L1512L0457J859J5107J9323J3591
5751G914532M1416P2536J2146K3711N2481k869l8551J9592K7598p866j4782J04753
5739H204697N1500K6058J15658K0824o2247m0119m7050j3413k8217o5716l8224
5728H123751K5384j4511p8018M5336j9470l1236r2843j18891n0868r5000q3197
5717G610437k2313J6436l5388m8984r2336j15040k4711o1554n0023kj07257l1499
5705G037766N1942l0751J2242k6943K157L7215L0825l6314K5461M1763j0063j6434
5693G118866J7654K0816j6562j8849K3510M2887k0556J6409M0994J8170L1533
$$ y = [7491699, 7458929, 7382222, 7403397, 7433573, 7408931, 7402550, 7405939, 7411544, 7443177, 7488448, 7454895, 7518651, 7594609, 7592187, 7651329, 7713532, 7757038, 7802683, 7834195, 7864652, 7866511, 7881618, 7900941, 7914532, 7955948, 8028484, 8040630, 8064341, 8116822, 8113953, 8075402, 8094994, 8122592, 8114726, 8099944, 8204697, 8256197, 8282255, 8397913, 8418737, 8356490, 8316371, 8269321, 8255908, 8227691, 8161975, 8123751, 8149135, 8134624, 8056606, 8101942, 8082472, 8051236, 7958393, 7839502, 7788634, 7693634, 7610437, 7588124, 7604560, 7569172, 7520188, 7427852, 7312812, 7288101, 7226547, 7176524, 7176522, 7069265, 7037766, 7089708, 7058957, 7071199, 7044256, 7046413, 7083628, 7114453, 7078139, 7103600, 7145363, 7135300, 7118866, 7136520, 7157336, 7140774, 7121925, 7145435, 7188322, 7167766, 7184175, 7225169, 7243339, 7274872]
5682G274872L563K2315r658M9456M6914P6520Q541J586K1359j1175L3347J5212
5670G532852N5734J9122O3327j4098k5301m3752m7745j7298l4740o3304j37268
5659G287529l7500o7113k9013l5991J287j1698m4303K8082n356L0673M3939K2447
5647G182983N2768J02558K7591K6422O3618P5328J94969J50455K0490Q5276L3698
5636H016156j40117j12081p5256q4219l6321n2570J4399k3290K7620P4842O8703
5625G677866k8625P0293J02974J47167J58941R9950R4341P0173M4255M3923J1152
5614H492410K444M6204O6954P8003R155J20732J60107Q4511J28222Q9392m3887
5603I234247m9164j02619J7776M8136K8710J2135Q9785p896j9676k6783m1347
$$ y = [7274872, 7278435, 7300750, 7291092, 7340548, 7387462, 7463982, 7472523, 7474109, 7495468, 7484293, 7517640, 7532852, 7588586, 7607708, 7671035, 7656937, 7631636, 7587884, 7540139, 7522841, 7488101, 7424797, 7287529, 7250029, 7182916, 7153903, 7117912, 7119199, 7107501, 7063198, 7091280, 7085924, 7116597, 7160536, 7182983, 7235751, 7338309, 7365900, 7392322, 7455940, 7531268, 7726237, 7876692, 7897182, 7982458, 8016156, 7876039, 7763958, 7688702, 7604483, 7568162, 7515592, 7529991, 7506701, 7534321, 7609163, 7677866, 7649241, 7719534, 7822508, 7969675, 8128616, 8228566, 8322907, 8393080, 8437335, 8481258, 8492410, 8494854, 8541058, 8608012, 8686015, 8695170, 8815902, 8976009, 9060520, 9188742, 9278134, 9234247, 9185083, 9082464, 9100240, 9148376, 9177086, 9189221, 9279006, 9271110, 9251434, 9224651, 9183304]
5592I183304l5920q5920o8415l6341k8814K9902j5755m4109j1353n6625o3691
5581H766263n9808n1192m0117n9667j5301K6868j3320m1813r4572n7566q5931
5570H273844r2894p4221n3167q7805m149j5283P967K742L6099j0986j3517o8722
5558G899908R439p1561p5360m3536j27380r4111j21186k2838k6599p0704k0692
5547G235380p7232k3695j058l9293j1938L3569M2774k3291k6324N032J1225k2679
5535G102470q898o1732N626M6292N201K3716P1575K3742L6519K9087J3701j3876
5523G273423l6686j1498o8130o0181r958K2482l7089k6870o2066j08099r180p1656
5511F794492r8485k6800l0078l3343r640q849M9130K9847m529o3271r946q6329
$$ y = [9183304, 9147384, 9061464, 8993049, 8956708, 8927894, 8957796, 8942041, 8897932, 8886579, 8829954, 8766263, 8706455, 8655263, 8615146, 8555479, 8540178, 8567046, 8553726, 8511913, 8417341, 8359775, 8273844, 8180950, 8106729, 8053562, 7965757, 7961608, 7946325, 7954292, 7957034, 7993133, 7982147, 7968630, 7899908, 7909347, 7837786, 7762426, 7718890, 7591510, 7497399, 7376213, 7353375, 7326776, 7256072, 7235380, 7158148, 7134453, 7133395, 7094102, 7082164, 7115733, 7158507, 7135216, 7108892, 7113924, 7125149, 7102470, 7093572, 7031840, 7037466, 7083758, 7088959, 7112675, 7184250, 7207992, 7244511, 7273598, 7287299, 7273423, 7236737, 7225239, 7157109, 7096928, 7086970, 7109452, 7072363, 7045493, 6983427, 6875328, 6866148, 6794492, 6696007, 6669207, 6639129, 6605786, 6596146, 6587297, 6636427, 6666274, 6661745, 6598474, 6588528, 6502199]
5499F502199k8593K0042m5438r345M994m9945l6519P7801m2003l4059K451j523
5487F360062J1118k4779L4641O011J2405n5910o8459o538J3423m6528L7644J7705
5475F290795K2854n1679o0095M2989j4188J8558L6631O0782Q241K8263k4929k6588
5463F331634J2148m4283k2266l1296l6944j4493m752m0933n0431M3742k8006L6104
5451F150224j6447P3099J6895l9236M3126n6315k1538P7932m500j5199K6848P97
5439F235686P11J1812k8889o389j5352O3761o196K1368N7908J4614M2341n237
5427F386138J644K7804K9127k3162O5007P3629Q8040O4520K7570J4924J34908
5416F890149J23593M734L6418K3425p780P632j3041P2581L9842K946m011K3269
$$ y = [6502199, 6473606, 6493648, 6448210, 6438865, 6443859, 6393914, 6357395, 6435196, 6393193, 6359134, 6361585, 6360062, 6371180, 6346401, 6381042, 6387053, 6399458, 6343548, 6275089, 6268551, 6281974, 6235446, 6273090, 6290795, 6313649, 6261970, 6201875, 6244864, 6230676, 6249234, 6285865, 6346647, 6354888, 6383151, 6358222, 6331634, 6343782, 6299499, 6277233, 6245937, 6208993, 6194500, 6189748, 6148815, 6098384, 6142126, 6114120, 6150224, 6133777, 6206876, 6223771, 6184535, 6227661, 6171346, 6149808, 6227740, 6223240, 6208041, 6234889, 6235686, 6236397, 6248209, 6219320, 6212931, 6197579, 6261340, 6255144, 6276512, 6334420, 6349034, 6391375, 6386138, 6387782, 6415586, 6444713, 6421551, 6486558, 6560187, 6648227, 6712747, 6740317, 6755241, 6890149, 7013742, 7018476, 7054894, 7078319, 7070539, 7078171, 7065130, 7137711, 7177553, 7180499, 7176488, 7199757]
5404G199757M7675Q3361p592J1595J9885J1074J49079J35753J20353L7595j26277
5393G682258j32453n8815l0481k2142K878n780J2695j8594j20513j4072K3990
5382G318971J2698j6425m0156O936r947L6874l7747l3736K4770L4370J1344M473
5370G312425Q9745L6333M593O0471L4197J9221J8852M9176O1024P5522R7994J1663
5358G871216k9073L778k601j6861o5943j1128J210m3110O5814J8623k0443K0114
5346G791596J0055J3857p624J2991m9447m8230K7465p4666J5243O506k8129L1424
5334G701041L3576J6423j0850l5257N3114Q844k7088m8922n8092n0776o3042l0757
5322G488214k7361N5760K3819k8792P7566N5325K9153M241M2513K6136N80K7596
$$ y = [7199757, 7247432, 7330793, 7323201, 7334796, 7354681, 7365755, 7514834, 7650587, 7770940, 7808535, 7682258, 7549805, 7490990, 7460509, 7438367, 7441245, 7435465, 7448160, 7429566, 7309053, 7294981, 7318971, 7331669, 7315244, 7275088, 7282024, 7272077, 7308951, 7271204, 7237468, 7262238, 7296608, 7307952, 7312425, 7402170, 7438503, 7443096, 7503567, 7537764, 7556985, 7575837, 7625013, 7686037, 7761559, 7859553, 7871216, 7842143, 7845921, 7843320, 7826459, 7760516, 7749388, 7750598, 7707488, 7773302, 7791925, 7771482, 7791596, 7801651, 7815508, 7807884, 7820875, 7771428, 7723198, 7750663, 7675997, 7691240, 7697746, 7669617, 7701041, 7734617, 7751040, 7740190, 7704933, 7758047, 7766891, 7739803, 7690881, 7632789, 7582013, 7518971, 7488214, 7460853, 7516613, 7540432, 7511640, 7589206, 7644531, 7673684, 7677925, 7720438, 7746574, 7747154, 7774750]
5310G774750J8852K4170M5605M2415N5483K9066O1748N9615M2742Q4075j0684
5299H227837N1451K2581l5307r3909N6586m1156p6935m6177K413L8327l673P8668
5287H180706J2984N8405J69046J10024l2095N0253J13771Q6647N9795O8580J07983
5276H986099m8879m5932P0720M2543J06821J38473J65550K22896K52995J82243
5266A0073529J92024J46533K560p4669j85216k36528j14101j33786j06084m1685
5256I522577K7950M2374M7258J12081P0195Q553J01927J21544P6005J18149J19283
5245A0367896J11340O4256M0689M97K7165k5446l0006n2323p120O3649J04430
5234A0665027O0400N3269J21687L8626J8309q813p414n41o7437L1131j8039k4486
$$ y = [7774750, 7793602, 7817772, 7863377, 7905792, 7961275, 7990341, 8052089, 8111704, 8154446, 8238521, 8227837, 8279288, 8301869, 8266562, 8172653, 8229239, 8188083, 8111148, 8064971, 8067384, 8105711, 8102038, 8180706, 8193690, 8252095, 8421141, 8531165, 8499070, 8549323, 8663094, 8749741, 8809536, 8878116, 8986099, 8937220, 8891288, 8962008, 9004551, 9111372, 9249845, 9415395, 9638291, 9891286, 10073529, 10265553, 10412086, 10414646, 10339977, 10154761, 9918233, 9804132, 9670346, 9564262, 9522577, 9550527, 9592901, 9640159, 9752240, 9822435, 9830988, 9932915, 10054459, 10130464, 10248613, 10367896, 10479236, 10543492, 10584181, 10584678, 10611843, 10586397, 10556391, 10504068, 10496948, 10560597, 10665027, 10725427, 10778696, 10900383, 10939009, 10957318, 10948505, 10941091, 10940550, 10873113, 10904244, 10886205, 10861719]
5222A0861719k8863m7346l4960K4988N276l4034Q4989N7881J08940L2202L449
5211A1034241k4588j0165L2675j1546J8549N9143J41233J19041J22096K67375
5201A1748054K36975K57709K31571K45403K68530J16928j3304p7675j30116k44611
5191A2639464k26387j81622j51727q6086p2673l7224J2903J2171J8778L9867Q9817
5180A2057281O2963M3050M4306P4627K4037j4934j4397P4841M8006M5700Q9883
5169A2535363Q6671O3382L8503k8998N1780Q0565N3815J26733J05370Q9385J87992
5158A3390561K26830K65194K77861K46287L01096K34132K21515J97157R5553m2729
5148A5413457n9637k637j3882k2284J07953j1258j5021j184j28446j86454j78487
$$ y = [10861719, 10832856, 10785510, 10750550, 10775538, 10780814, 10746780, 10831769, 10889650, 10998590, 11030792, 11034241, 11009653, 10999488, 11032163, 11020617, 11039166, 11098309, 11239542, 11358583, 11480679, 11748054, 11985029, 12242738, 12474309, 12719712, 12988242, 13105170, 13091866, 13014191, 12884075, 12639464, 12413077, 12231455, 12079728, 11993642, 11920969, 11883745, 11896648, 11908819, 11927597, 11967464, 12057281, 12120244, 12163294, 12207600, 12282227, 12306264, 12291330, 12276933, 12351774, 12399780, 12445480, 12535363, 12622034, 12685416, 12723919, 12694921, 12746701, 12827266, 12881081, 13007814, 13113184, 13202569, 13390561, 13617391, 13882585, 14160446, 14406733, 14707829, 14941961, 15163476, 15360633, 15456186, 15413457, 15353820, 15351183, 15337301, 15315017, 15422970, 15411712, 15396691, 15395507, 15267061, 15080607, 14902120]
5137A4902120j83554j69952j80209j43554j68253j74587n9808o7795p7242j06709
5127A3570457j43558j43421m4021q5479j19444j11348j79118j13633j26269j08747
5117A2395419n6559l3983m4255j2178L016j1341M9142P819n4978n6921n7415m2732
5105A2085034l3857p8958n3807o4878m8545k4264o419Q745k77r511r5534m9759
5093A1627970J0436l6019K9299M195N1205l619J9424M1316Q1042P129R4593P6170
5081A2003141O0835O5213Q8958P4128R745N9566J3995K330L0286J16045O8126
5070A2592368J08861J88313J03009Q2651J08761R2031J64070J88910K13914J75952
5060A4018840J71134J53491K35886K15325J66059J20285P7715j701q684j01958
$$ y = [14902120, 14718566, 14548614, 14368405, 14224851, 14056598, 13882011, 13822203, 13754408, 13677166, 13570457, 13426899, 13283478, 13239457, 13153978, 13034534, 12923186, 12744068, 12630435, 12504166, 12395419, 12338860, 12304877, 12260622, 12248444, 12251460, 12240119, 12289261, 12297080, 12242102, 12185181, 12127766, 12085034, 12051177, 11972219, 11918412, 11853534, 11804989, 11780725, 11774306, 11783051, 11782774, 11773263, 11677729, 11627970, 11638406, 11602387, 11631686, 11635881, 11687086, 11683467, 11702891, 11744207, 11825249, 11832378, 11926971, 12003141, 12063976, 12129189, 12218147, 12292275, 12302020, 12361586, 12375581, 12377911, 12408197, 12524242, 12592368, 12701229, 12889542, 12992551, 13075202, 13183963, 13275994, 13440064, 13628974, 13842888, 14018840, 14189974, 14343465, 14579351, 14794676, 14960735, 15081020, 15158735, 15157034, 15148350, 15046392]
5050A5046392j21349p5534n1033m3848n9163K1445P4137J24296J37746R9699J35694
5039A5288482J18914J45157J46759R1334J14318J86288J54624Q7304K37583J72503
5029A6743266J50557J67532J61563J62083J50578J95384J50867K21894K22949
5020A8326673K32975K43640K88543L59658L72071L34284L80355L13246L32086
5011B1183531K75182J17367M0452J33050J86310K32336K28119K65800K69911K41110
5001B3173168J96658K75882L13374M17512N12480O00315O99250P08759N78831
4992B7476229N67376N84968P81156Q89957R51446J018669J032783J084287J218702
4983C5605573J284775J405052J563925J661943J763810J895759K077571K356612
$$ y = [15046392, 14925043, 14849509, 14798476, 14754628, 14695465, 14716910, 14791047, 14915343, 15053089, 15152788, 15288482, 15407396, 15552553, 15699312, 15790646, 15904964, 16091252, 16245876, 16333180, 16570763, 16743266, 16893823, 17061355, 17222918, 17385001, 17535579, 17730963, 17881830, 18103724, 18326673, 18559648, 18803288, 19091831, 19451489, 19823560, 20157844, 20538199, 20851445, 21183531, 21458713, 21576080, 21616532, 21749582, 21935892, 22168228, 22396347, 22662147, 22932058, 23173168, 23369826, 23645708, 23959082, 24376594, 24889074, 25489389, 26188639, 26897398, 27476229, 28043605, 28628573, 29409729, 30299686, 31251132, 32269801, 33302584, 34386871, 35605573, 36890348, 38295400, 39859325, 41521268, 43285078, 45180837, 47258408, 49615020]
4975D9615020K702227L128984L427572L844688M449810N076928N759983O613647
4967H4618859P644683Q687489R851332J1213390J3068900J6075900K0244338K5364777
4959A96769668L0898552L6649844M0846604L6346947J9576135o551149k7900384
4952C26636217m3329205m5019779l4568482k5383942j8633164j4017283j0659269
4945A35025093q450551o849148n753870n066761m650354m223845l872869l479491
4937I2678204l107892k584851k115902j497869j178215q20895o40982m85039k99847
4928G9946712j11952N671J86468L02493N99202O80628O85998N15915N37157N67060
4918H3915352P25180Q43462R66088R19140P42801N45505L44955J36277M4284L73360
$$ y = [49615020, 52317247, 55446231, 58873803, 62718491, 67168301, 72245229, 78005212, 84618859, 92263542, 100951031, 110802363, 122015753, 135084653, 151160553, 171404891, 196769668, 227668220, 264318064, 305164668, 341511615, 361087750, 354536601, 326636217, 283307012, 238287233, 203718751, 178334809, 159701645, 145684362, 135025093, 126574542, 119725394, 113971524, 108904763, 104254409, 100030564, 96157695, 92678204, 89570312, 86985461, 84869559, 83371690, 82193475, 81372580, 80731598, 80246559, 79946712, 79834760, 79840431, 80026899, 80329392, 80928594, 81609222, 82295220, 82811135, 83348292, 83915352, 84640532, 85483994, 86450082, 87369222, 88112023, 88657528, 89002483, 89138760, 89183044, 89556404]
4908H9556404Q29681J257001J721126J920191J784342J609613J973342K534598
4900A03186298L242639L984382M731177N584103O656651P675683Q831724J0467764
4892A54360421J2897757J6428823K0744945K5427696L0355874L6406119L9334741
4885C35956376L0797235J1508405p012017j6772676l0767635m1754507l5920352
4878B46034829k5911383j8853902j3924466j0289026p724978n757853m165511
4871A59407710l105545k487875k292967k391893k175920j713013j579522j652908
4863A42008067j946686k527133l155366l767827m184476m384321m603233m548728
4855A12890297m293225m168709l833493l520260l290691l044961k806882k644115
$$ y = [89556404, 90386085, 91643086, 93364212, 95284403, 97068745, 98678358, 100651700, 103186298, 106428937, 110413319, 115144496, 120728599, 127385250, 135060933, 143892657, 154360421, 167258178, 183687001, 204431946, 229859642, 260215516, 296621635, 335956376, 366753611, 378262016, 371249999, 354477323, 323709688, 281955181, 246034829, 220123446, 201269544, 187345078, 177056052, 169331074, 163573221, 159407710, 156302165, 153814290, 151521323, 149129430, 146953510, 145240497, 143660975, 142008067, 140061381, 137534248, 134378882, 130611055, 126426579, 122042258, 117439025, 112890297, 108597072, 104428363, 100594870, 97074610, 93783919, 90738958, 87932076, 85287961]
4847H5287961k497508k331785k229233k160147k098973k008387j916461j821943
4839F8223524j813314j643869j426763j369201j265811j295720j100272r43355
4831E7365219q66874p99251p27439p88974p20679p07340o33092o13221o37831
4822E0870518o70622o74246p29289p43343o84860p23915q62491r20744q82356
4813D3978652p66610o87801n50355n25572n24358m54427m40801l90953k84860
4804C9352915l45884l57907m25923n57168n80104n49196o37315o60939o01771
4795C4636708n80069n64992n80209o03452n03049m84406o14011o10354o26003
4786B9470163o49178n93477n12015m52398m03178n08626m93564m61029m88053
$$ y = [85287961, 82790453, 80458668, 78229435, 76069288, 73970315, 71961928, 70045467, 68223524, 66410210, 64766341, 63339578, 61970377, 60704566, 59408846, 58308574, 57365219, 56498345, 55699094, 54971655, 54182681, 53462002, 52754662, 52121570, 51508349, 50870518, 50199896, 49525650, 48796361, 48053018, 47368158, 46644243, 45781752, 44861008, 43978652, 43212042, 42524241, 41973886, 41448314, 40923956, 40469529, 40028728, 39637775, 39352915, 39007031, 38649124, 38223201, 37666033, 37085929, 36536733, 35899418, 35238479, 34636708, 34056639, 33491647, 32911438, 32307986, 31804937, 31320531, 30706520, 30096166, 29470163, 28820985, 28227508, 27715493, 27263095, 26859917, 26351291, 25857727, 25396698, 24908645]
4777B4908645m35163l75588l15179k71959j58333j89674k23470k30561j85428
4768B2523290k09403j80722j53188j45368j07792j34684m3500p911K6988Q7125
4758B1654835J43579J58143K39969K56255M7405k36571m89685n23340l39192k45773
4748B0665625k15584j60049j85978k08133j35818j68484k12819k88165m23389
4739A8667206m40133l72536m27708m01235l36227k79833k76558j87108k35916
4730A5709952k03374k00430j54248j86190j42695q6023j42756p0874j29019j55545
4720A4238798j13858q6190j12238j03352j29260k21022j66378j55290n6914j07092
4710A2987204j63408q6676j53680j06890p6862n8639k8514k4730l6000O7754J3679
$$ y = [24908645, 24473482, 24097894, 23782715, 23510756, 23352423, 23162749, 22939279, 22708718, 22523290, 22313887, 22133165, 21979977, 21834609, 21726817, 21592133, 21548633, 21540722, 21567710, 21654835, 21798414, 21956557, 22196526, 22452781, 22500186, 22263615, 21773930, 21250590, 20911398, 20665625, 20450041, 20289992, 20104014, 19895881, 19760063, 19591579, 19378760, 19090595, 18667206, 18227073, 17854537, 17426829, 17025594, 16689367, 16409534, 16132976, 15945868, 15709952, 15506578, 15306148, 15151900, 14965710, 14823015, 14736992, 14594236, 14523362, 14394343, 14238798, 14124940, 14038750, 13926512, 13823160, 13693900, 13472878, 13306500, 13151210, 13094296, 12987204, 12823796, 12737120, 12583440, 12476550, 12399688, 12341049, 12312535, 12287805, 12251805, 12319559, 12333238]
4699A2333238P912O3221k793k8240K2610J292L7536j9958O6577R2538m1759N3254
4687A2585428L1768j744k8258m0848q260J4532O8121O5324O6964N9547Q9149J03113
4675A3004836J55247J38178J79417K09224J81700K40499K43783K67873J45638
4666A4766395R4227r908m4733n2667p6442m8417M6514P1082J00099J08473J22605
4655A5077228m930J8899M3072J0098j8430k040P2909J07033R9891J22656Q9096
4644A5615482K8326k2663p0582j47708k50060k88383k91905l44311k82796j14461
4634A3830939j46849j15736j53920j52869j43325k26784k38566j76134k69342
4625A2207414k58217j78789j24597j00865n0635j21717j07360L237N8604J00644
$$ y = [12333238, 12341150, 12404371, 12401578, 12373338, 12395948, 12397240, 12434776, 12414818, 12481395, 12573933, 12532174, 12585428, 12617196, 12615452, 12587194, 12546346, 12538086, 12552618, 12620739, 12686063, 12753027, 12812574, 12901723, 13004836, 13160083, 13298261, 13477678, 13686902, 13868602, 14109101, 14352884, 14620757, 14766395, 14860622, 14850714, 14805981, 14753314, 14676872, 14628455, 14674969, 14746051, 14846150, 14954623, 15077228, 15072298, 15091197, 15134269, 15144367, 15125937, 15123897, 15196806, 15303839, 15403730, 15526386, 15615482, 15643808, 15621145, 15550563, 15402855, 15152795, 14864412, 14572507, 14228196, 13945400, 13830939, 13684090, 13568354, 13414434, 13261565, 13118240, 12891456, 12652890, 12476756, 12207414, 11949197, 11770408, 11645811, 11544946, 11494311, 11372594, 11265234, 11268471, 11327075, 11427719]
4615A1427719L5464J6765n0162q1103j07968j13977n3954j2953M6680N8710O5667
4604A1230888k9648K546n4500j05683q8563j42430j05192p120m0964o5731l9555
4593A0554048p7868o0816j29957q4862q7548o7853j06906r679K1261o7808J3129
4582I895141r760J4614o443o2061q7081n7570j24122r9841k645M6362j4949J15364
4570I607009Q6522N82j4222r8536k42404k88567k61095k49342k31250j34578j09675
4559H064444o8662q3533p2936l1768q1981m7640k8527j2413n3251k1349J2484
4548G574868k2665n8880n9941k2114k0211k0083J2664j5767Q492K2958J5141O2670
4536G477132J00866p3430r1352k8164o6712k4887l5898m7471m6309k8995j0996
$$ y = [11427719, 11463183, 11479948, 11429786, 11348683, 11240715, 11126738, 11072784, 11059831, 11106511, 11165221, 11230888, 11201240, 11203786, 11149286, 11043603, 10955040, 10812610, 10707418, 10700298, 10659334, 10593603, 10554048, 10476180, 10415364, 10285407, 10200545, 10112997, 10045144, 9938238, 9928559, 9949820, 9882012, 9895141, 9885381, 9899995, 9893552, 9831491, 9744410, 9686840, 9562718, 9462877, 9460232, 9506594, 9491645, 9607009, 9693531, 9694113, 9679891, 9581355, 9338951, 9050384, 8789289, 8539947, 8308697, 8174119, 8064444, 7995782, 7912249, 7839313, 7807545, 7725564, 7677924, 7649397, 7636984, 7583733, 7562384, 7574868, 7552203, 7493323, 7433382, 7411268, 7391057, 7370974, 7383638, 7367871, 7376363, 7399321, 7414462, 7477132, 7577998, 7504568, 7413216, 7385052, 7318340, 7293453, 7257555, 7210084, 7163775, 7134780, 7123784]
4525G123784j9331M255m1289j7602j1354n848m7230J085L4117Q6249N9289m2936
4513G123189o4620r2312o1420l1814o7190n717n0102o7206J8663j6467j8042o7080
4501F599882j12230r8014j23691p3357o7382j41797j70984o8972o8938j07911
4491E566606o2652o1827n9586n2943m8541k7636l4867n0055m2177l3054j4171
4480E079097L5508j5354o880L2659k0158O2341N542K6343N5507P4057L6123M0948
4468E405733k4086m1216N4843j1029M0430n8924n7962J1644o6725l722l2416k1429
4456E195141O080L920N0607L8731M0928R332n47J550k7936l4074m2927p5736l0969
4443E134100L8540p484k9190j9003m5707l9539k785n0143k2919o7959l5453p694
$$ y = [7123784, 7104453, 7108708, 7067419, 7049817, 7038463, 7032615, 6985385, 6986470, 7020587, 7106836, 7166125, 7123189, 7058569, 6966257, 6904837, 6873023, 6805833, 6800116, 6750014, 6682808, 6701471, 6685004, 6666962, 6599882, 6487652, 6389638, 6265947, 6192590, 6125208, 5983411, 5812427, 5743455, 5674517, 5566606, 5503954, 5442127, 5382541, 5329598, 5281057, 5253421, 5218554, 5168499, 5126322, 5093268, 5079097, 5114605, 5099251, 5092371, 5125030, 5104872, 5167213, 5172755, 5199098, 5254605, 5328662, 5364785, 5405733, 5381647, 5340431, 5395274, 5384245, 5424675, 5365751, 5307789, 5319433, 5252708, 5248986, 5216570, 5195141, 5201221, 5205141, 5255748, 5294479, 5335407, 5344739, 5344192, 5345742, 5317806, 5283732, 5240805, 5165069, 5134100, 5172640, 5165156, 5135966, 5116963, 5071256, 5031717, 5028932, 4978789, 4955870, 4887911, 4852458, 4844764]
4431D844764j7628m9791n2337K039l6683L3046j3290j3185j5459l4114J2737M0745
4419D700844L3999N1421Q2967J25702K4699O9475P0865L8687P5903R5991K3442
4408E393995R5102L5671j8835O2707j0743k2292J297J6912K9965J1798O5126O7805
4396E728508O0716R5073J43528J44479J35405K02891J92625K29619K45812L27243
4386G505899K91393L43862L13479L00611J31591o8905k36593l14541k88681j64979
4376G813136j53383j89249r6337n3733k8478k6426N66n7931q3181j6841M6365
4365G154508N9717L9467P6329P6340M6658Q319p151J335o0943o004J2398m3827
4353G357146m726M5540M962m443K7946O7420Q9261M7592N563N7214J8758l1403
$$ y = [4844764, 4827136, 4777345, 4725008, 4727047, 4690364, 4723410, 4710120, 4696935, 4681476, 4647362, 4660099, 4700844, 4734843, 4786264, 4869231, 4994933, 5019632, 5089107, 5159972, 5198659, 5274562, 5370553, 5393995, 5489097, 5524768, 5505933, 5568640, 5557897, 5535605, 5536902, 5553814, 5583779, 5595577, 5660703, 5728508, 5789224, 5884297, 6027825, 6172304, 6307709, 6510600, 6703225, 6932844, 7178656, 7505899, 7797292, 8141154, 8454633, 8755244, 8886835, 8817930, 8581337, 8266796, 7978115, 7813136, 7659753, 7470504, 7374167, 7320434, 7291956, 7265530, 7266096, 7208165, 7124984, 7108143, 7154508, 7214225, 7253692, 7330021, 7406361, 7453019, 7461338, 7454187, 7455522, 7394579, 7388575, 7400973, 7357146, 7352420, 7397960, 7402922, 7398479, 7426425, 7493845, 7583106, 7630698, 7636261, 7693475, 7712233, 7680830]
4341G680830R35O3063Q9421Q0027J13374J42752J61823J34045J72676K25974J94003
4330I058923J90518K72285K64049K75026K91310K27812J19455J8418P4016J22830
4320A0914642J75652J95578L43091L90190L47351M53499N52475O08695O96195
4311A4677368Q35533R13134R57709J086178J272383J258549J173706J042649P09213
4302B3926422L56853q7850n14359q63728j154968j251152j207184j110586j004584
4293A7088864q83668q56352p54558p48660o93000n35791n12326n02539m45033
4284A1156937m16778l72148l31858k82036k47886k17687j90206k04111j69114
4275H725113j02517n8344j37750q0953k0064o060m386N2065J1715p9529m4626
$$ y = [7680830, 7681765, 7744828, 7834249, 7914276, 8027650, 8170402, 8332225, 8466270, 8638946, 8864920, 9058923, 9249441, 9521726, 9785775, 10060801, 10352111, 10579923, 10699378, 10717796, 10791812, 10914642, 11090294, 11285872, 11628963, 12019153, 12366504, 12820003, 13372478, 13981173, 14677368, 15512901, 16426035, 17383744, 18469922, 19742305, 21000854, 22174560, 23217209, 23926422, 24283275, 24195425, 23681066, 22817338, 21662370, 20411218, 19204034, 18093448, 17088864, 16205196, 15348844, 14594286, 13845626, 13152626, 12616835, 12104509, 11601970, 11156937, 10740159, 10368011, 10036153, 9754117, 9506231, 9288544, 9098338, 8894227, 8725113, 8622596, 8564252, 8426502, 8345549, 8325485, 8319425, 8315039, 8367104, 8378819, 8299290, 8254664]
4264H254664j53242j69507j76520k26429k31892k18689k14870j95085j74097j43686
4254F350647j20535j30972j53468m7486k6536o8322p0351j8742k3769l0724o5436
4243E594306p284n3911q2870l8812J6156K742K0013J39711R6220J18274Q2510
4232E887055J6219n2202j09958j66798j91659k71271k43235k27143m4583p1598
4222D524827q5867o4790n6455r2134n1398J053J4143o3115q2388p703R490l1291
4210D014372k0803k1560J4064l9062q9058j5225L5393K3624J1423k9821L8510
4199C921857K9835M4698Q993m7380q7957j31606n0869m7944j6670p5041l6796
4188C511120o0012k8219m8615j9733l2901j4768q269K628l8596L5420l5749n3009
$$ y = [8254664, 8101422, 7931915, 7755395, 7528966, 7297074, 7078385, 6863515, 6668430, 6494333, 6350647, 6230112, 6099140, 5945672, 5898186, 5871650, 5803328, 5732977, 5714235, 5690466, 5659742, 5594306, 5587022, 5533111, 5450241, 5411429, 5427585, 5430327, 5450340, 5590051, 5686271, 5804545, 5887055, 5903274, 5851072, 5741114, 5574316, 5382657, 5111386, 4868151, 4641008, 4596425, 4524827, 4438960, 4374170, 4317715, 4225581, 4174183, 4175236, 4189379, 4126264, 4043876, 4036173, 4045663, 4014372, 3993569, 3972009, 3986073, 3947011, 3857953, 3842728, 3878121, 3901745, 3913168, 3883347, 3921857, 3951692, 3996390, 4005383, 3958003, 3870046, 3738440, 3687571, 3639627, 3622957, 3547916, 3511120, 3451108, 3422889, 3374274, 3354541, 3321640, 3306872, 3298603, 3301231, 3262635, 3298055, 3262306, 3209297]
4176C209297p234r237O707n9011N801k0372q5841K9448j0646n9546k4234k0593
4164B954539O81k9417p2976j8585k8990J6094n02l9605L0178k3337j0755K7343
4152B804668l3454L0649m8953q7876j2788O839n368M4141n1288m5964K2020M0054
4140B662680P0998R012n0143p0482K7422L2985L7599J2462l926n934K1527L3864
4128B778064J2150m3741J0571n4638n2969K1748m510k6732j1452J0553j4242k1373
4116B603429l4895q546M9879p1170q2239n6737j9602L7366J398K3143j1279O551
4104B437298L0983l5627r1057J2198P3279o0311o7383k4352j5230j8015J9377
4093B261160J7660J4313R749J7399j4144n403k450O229l3020n2198j68J6432L8015
$$ y = [3209297, 3202063, 3192826, 3199533, 3140522, 3146323, 3125951, 3040110, 3069558, 3058912, 2999366, 2975132, 2954539, 2955220, 2925803, 2852827, 2834242, 2805252, 2821346, 2820844, 2781239, 2811417, 2788080, 2777325, 2804668, 2771214, 2801863, 2752910, 2665034, 2652246, 2659085, 2653717, 2697858, 2646570, 2600606, 2622626, 2662680, 2733678, 2742690, 2692547, 2622065, 2649487, 2682472, 2720071, 2732533, 2728607, 2722673, 2744200, 2778064, 2790214, 2746473, 2757044, 2702406, 2649437, 2671185, 2666675, 2639943, 2628491, 2639044, 2624802, 2603429, 2568534, 2559988, 2609867, 2538697, 2456458, 2399721, 2380119, 2417485, 2418883, 2442026, 2430747, 2437298, 2468281, 2432654, 2341597, 2353795, 2427074, 2366763, 2299380, 2275028, 2259798, 2241783, 2261160, 2278820, 2293133, 2302882, 2320281, 2306137, 2300734, 2298284, 2304513, 2271493, 2219295, 2219127, 2235559, 2273574]
4080B273574l4690L1225K5023n1420K7976O0248l1568o4753j7984L3111l1271
4069B219471o8655K4044k3726k6398J0195k0172j17J8069n6100K70K8559J3184
4057B118624k0691l7008L5086M6867j5812l9623K8661n759k4009J3702k3187K4658
4045B101509l1716Q147j3173K0261P1240q524l4479J3235q511o204M9126k6402
4033B134509Q0717M390l2699L6283O8400J2062J6580l2769k2815O1443J0948O2970
4021B400019L9948K5356P0228N8808L3930Q948J5696N0479R3592Q7385J21592
4010C005981K6268R4699J10586J50555J74109K36465K64520K89064L30169L61210
4000E043626K63315J84835O8189J8974m9257k13443l94262m14691l18229k57445
$$ y = [2273574, 2238884, 2270109, 2295132, 2243712, 2271688, 2331936, 2300368, 2235615, 2217631, 2250742, 2219471, 2150816, 2174860, 2151134, 2124736, 2134931, 2114759, 2114642, 2132711, 2076611, 2076881, 2105440, 2118624, 2097933, 2060925, 2096011, 2142878, 2127066, 2087443, 2116104, 2110345, 2086336, 2100038, 2076851, 2101509, 2069793, 2077940, 2064767, 2085028, 2156268, 2147744, 2113265, 2126500, 2117989, 2111785, 2160911, 2134509, 2215226, 2219616, 2186917, 2223200, 2291600, 2303662, 2320242, 2287473, 2264658, 2326101, 2337049, 2400019, 2439967, 2465323, 2535551, 2594359, 2628289, 2637237, 2652933, 2703412, 2797004, 2884389, 3005981, 3032249, 3126948, 3237534, 3388089, 3562198, 3798663, 4063183, 4352247, 4682416, 5043626, 5306941, 5491776, 5559965, 5578939, 5529682, 5316239, 4921977, 4507286, 4189057, 3931612]
3990C931612j50863q4374p5003j22011o3239o5001m6775n4280n0260n2919k7600
3979C139287m4106q1545j9676k4222n1783m7674L5826J9248o2421j4730K1683
3968B869887N2990j0826K3912p0410l2229L4856J8779m9656j760m2403m297N4100
3956B842943l0870k8712q097m41J531l0191l965n441k8427J8828k9503j3844n6133
3943B627678J1629J7371k6139m0931m9445Q043p9975p1073l7449j9378K0129k0624
3931B339836k5576k7285p615M780n7354j9663K908k9134k6373K4077K237q097
3919B172741J070k0183J632k9904l9885k6411K3879j8821r4697l909K0701Q520
3907A994733m0563k9153k4462M8847K4200m3966o7064N577j3860K0939k3119m5644
$$ y = [3931612, 3780749, 3696375, 3621372, 3499361, 3436122, 3371121, 3324346, 3270066, 3219806, 3166887, 3139287, 3095181, 3013636, 2993960, 2969738, 2917955, 2870281, 2906107, 2925355, 2862934, 2848204, 2869887, 2922877, 2912051, 2935963, 2865553, 2833324, 2868180, 2886959, 2837303, 2835543, 2793140, 2788843, 2842943, 2812073, 2783361, 2775264, 2774823, 2776354, 2746163, 2742198, 2736757, 2708330, 2727158, 2697655, 2683811, 2627678, 2639307, 2656678, 2630539, 2589608, 2540163, 2548206, 2468231, 2397158, 2359709, 2340331, 2360460, 2339836, 2314260, 2286975, 2279360, 2284140, 2226786, 2207123, 2210031, 2180897, 2154524, 2178601, 2180838, 2172741, 2173811, 2153628, 2155260, 2125356, 2085471, 2059060, 2082939, 2064118, 1969421, 1965512, 1986213, 1994733, 1954170, 1925017, 1900555, 1949402, 1973602, 1929636, 1862572, 1868149, 1854289, 1875228, 1852109, 1806465]
3895A806465O1621m5530k1122P8422k1607m8185L5423m2002p189l1673k5731N7396
3883A796288L9144M8817K1144o2637n3618L1782j1458M3568j2537r746j0803M632
3871A824576l1665j7543J5566l4422N128m00J0588o122l0479j3793j7121j0128
3859A694185L3853N278k5616r7938K5353j6684K7808K0368L148m5149K678L0701
3847A657985o37p0397j8072P6162k1705m1981L2832K5660L3325J56J1871j7433
3835A667766n6330J4060J6174J3085k4744j9913M3761m6562j0630K7390L3716
3824A657773r233K3271n464p7925K9516K0464p6183J7156l0739P0418L9204m5854
3812A612404k6042J8470j2024l3561J7509J2647M5149n78l1967P037L6912m5683
$$ y = [1806465, 1868086, 1822556, 1801434, 1879856, 1858249, 1810064, 1845487, 1803485, 1796296, 1764623, 1738892, 1796288, 1835432, 1884249, 1905393, 1842756, 1789138, 1820920, 1809462, 1853030, 1840493, 1830747, 1819944, 1824576, 1792911, 1775368, 1790934, 1756512, 1761640, 1761240, 1771828, 1765706, 1735227, 1721434, 1704313, 1694185, 1728038, 1733316, 1707700, 1609762, 1635115, 1618431, 1646239, 1666607, 1669755, 1624606, 1627284, 1657985, 1657348, 1586951, 1568879, 1645041, 1623336, 1581355, 1614187, 1639847, 1673172, 1673328, 1685199, 1667766, 1611436, 1625496, 1641670, 1654755, 1630011, 1610098, 1653859, 1607297, 1596667, 1624057, 1657773, 1648540, 1671811, 1666347, 1588422, 1617938, 1638402, 1562219, 1579375, 1548636, 1619054, 1658258, 1612404, 1586362, 1604832, 1592808, 1559247, 1576756, 1589403, 1634552, 1633974, 1602007, 1609044, 1645956, 1600273]
3800A600273J263K3742j7595m2794K9397j8728K4479J6128K8244k4026J9927J0021
3788A650331j8962R70j378l985J8010O575J2360r748k5846r98J3637Q854L9147
3775A688967k9893K677M204o9490J653j2692K3553K530l364m113k4823K7843j0585
3762A596467l0354q555m1914o004J2370j6851M7100l0892j6607M1963l4007m0086
3750A472630j0200K3939O456K0852m4456j268M2845m5153P108P1517m479k3402
3738A516389j9905m6270j4322J175J7158j7702K1610M244j5937o768K1796j5963
3726A445505J7947o84N5985N984m7806k0012K3136L5969m1004p663k1009L593
3714A449941L424J2495J2266O194Q872N0292l7661p0235K5868j7596j8641N7511
$$ y = [1600273, 1601536, 1625278, 1607683, 1564889, 1594286, 1575558, 1600037, 1616165, 1644409, 1620383, 1640310, 1650331, 1631369, 1632339, 1630961, 1626976, 1644986, 1651561, 1663921, 1654173, 1628327, 1627329, 1640966, 1649820, 1688967, 1659074, 1661751, 1665955, 1596465, 1598118, 1585426, 1608979, 1611509, 1608145, 1604032, 1579209, 1607052, 1596467, 1566113, 1557558, 1515644, 1509640, 1522010, 1505159, 1552259, 1521367, 1504760, 1546723, 1512716, 1472630, 1462430, 1486369, 1492825, 1513677, 1469221, 1467953, 1510798, 1465645, 1472753, 1544270, 1539791, 1516389, 1496484, 1450214, 1435892, 1437067, 1454225, 1436523, 1458133, 1462377, 1446440, 1439672, 1461468, 1445505, 1463452, 1462768, 1518753, 1524737, 1476931, 1456919, 1480055, 1516024, 1475020, 1467357, 1446348, 1449941, 1453365, 1465860, 1478126, 1484320, 1493192, 1543484, 1505823, 1435588, 1461456, 1443860, 1425219, 1482730]
3702A482730k1813r3647M997J8560k6739M930m750j472K3637n958j2778k2013
3690A345684o57N4698l7989O2371K6315j7624O741n5365O0402o555o4640K5120
3678A398501Q2369r072P816k8326n1419K0512L7306j053k2400k4081K1244m5418
3666A385979O923L0596N5881j7017k057K8238L135k5930R632R9760q630n863j0338
3653A550309k8168l6877K5770K3848K3405N829J0601m1081L3959M6883k2570k0762
3641A571146o559K2268O5422K5663K6622n28L1475o840q364R417M145J5420P6275
3628A825562o522J7890j8857L7056J0847J6889M7118L0450k1086l562r035J2634
3616A939384K0883J5748N9640O013K8605M4314N419j259L4566p284J6970k9253
$$ y = [1482730, 1460917, 1367270, 1372267, 1390827, 1364088, 1369018, 1364268, 1362796, 1386433, 1380475, 1367697, 1345684, 1345027, 1399725, 1361736, 1424107, 1450422, 1432798, 1439539, 1384174, 1444576, 1438021, 1373381, 1398501, 1480870, 1471798, 1479614, 1451288, 1399869, 1420381, 1457687, 1456634, 1434234, 1410153, 1431397, 1385979, 1392902, 1423498, 1479379, 1462362, 1460305, 1488543, 1491678, 1465748, 1475380, 1575140, 1566510, 1560647, 1550309, 1522141, 1485264, 1511034, 1534882, 1558287, 1564116, 1574717, 1533636, 1567595, 1614478, 1591908, 1571146, 1564587, 1586855, 1652277, 1677940, 1704562, 1704034, 1735509, 1728669, 1720305, 1729722, 1733867, 1749287, 1825562, 1819040, 1836930, 1818073, 1855129, 1865976, 1882865, 1929983, 1960433, 1939347, 1935785, 1926750, 1939384, 1960267, 1976015, 2035655, 2041668, 2070273, 2114587, 2120006, 2118747, 2153313, 2146029, 2162999, 2133746]
3604B133746k9319P277M3747N0194o3509n8135J6733K2428L4199n1357o3069n3897
3592A989038L2389P6037L5601m1622o2780m7678j4071K6655m0980k716k6940K6151
3580A949084j637j3460M5097J5520J1422l520J963P394L3708p431L3091K8082
3568B099313L6392m4951o6120K0959J3225K4818O3360j8870m2308J0695K0507
3557B117020K3959r031j674J4764J1182K4374j2064M330p809k1781P2580L831
3545B219681P03P6623j7983p934O3996L508l1055P1498k0344o0840L275L2791
3533B333919K646N7408o883J0408K440M5670j0439K7729M4981L360l548N9582
3521B567273K0916J6624J0680O0624M0587J5178J6858m501J8722J8497L6914K1644
$$ y = [2133746, 2104427, 2111704, 2155451, 2205645, 2142136, 2084001, 2100734, 2123162, 2157361, 2106004, 2042935, 1989038, 2021427, 2097464, 2133065, 2091443, 2028663, 1980985, 1966914, 1993569, 1952589, 1949873, 1922933, 1949084, 1947447, 1933987, 1979084, 1994604, 2006026, 2002506, 2004469, 2011863, 2045571, 2038140, 2071231, 2099313, 2135705, 2090754, 2024634, 2045593, 2058818, 2083636, 2146996, 2128126, 2085818, 2096513, 2117020, 2140979, 2131948, 2130274, 2145038, 2156220, 2180594, 2168530, 2172860, 2165051, 2143270, 2215850, 2219681, 2220384, 2297007, 2279024, 2271090, 2335086, 2338594, 2307539, 2379037, 2358693, 2297853, 2301128, 2333919, 2336565, 2393973, 2387090, 2397498, 2399938, 2445608, 2435169, 2462898, 2507879, 2511239, 2507691, 2567273, 2588189, 2604813, 2615493, 2676117, 2716704, 2731882, 2748740, 2744239, 2762961, 2781458, 2818372, 2840016]
3509B840016N6387K8020K2908k658M1596L1485L0617K0882M1671L7526L7037N3078
3497C238565M6839j685N4308P4277P4244M6097P2633L9660N7157n0932j0962L9514
3485C679715K245L7261k3800N1787P82j1787O3899M4316K1718K4320Q9574P0636
3473D050666p610L9865J17537Q6042P8282Q2117M0194O8834J16346J18921Q3809
3462D875003J33908J03622P9206Q3186R9505J23779J48210J77602J29781R4052
3452F047854R6392J89062J29551J90935K54327K02044J83419K25262K29793K58889
3442H007528K06700J59560J24199J40335K05008K64022J94571K35779K65278K39976
3432A0042956L02275L44845M39827M15207L53658M37712M56475N23563O23940
$$ y = [2840016, 2896403, 2924423, 2947331, 2944673, 2986269, 3017754, 3048371, 3069253, 3110924, 3148450, 3185487, 3238565, 3285404, 3283719, 3338027, 3412304, 3486548, 3532645, 3605278, 3644938, 3702095, 3651163, 3640201, 3679715, 3681960, 3719221, 3695421, 3747208, 3747990, 3736203, 3800102, 3844418, 3866136, 3890456, 3980030, 4050666, 4043056, 4082921, 4200458, 4286500, 4364782, 4446899, 4487093, 4555927, 4672273, 4791194, 4875003, 5008911, 5112533, 5191739, 5274925, 5374430, 5498209, 5646419, 5824021, 5953802, 6047854, 6144246, 6333308, 6462859, 6653794, 6908121, 7110165, 7293584, 7518846, 7748639, 8007528, 8214228, 8373788, 8497987, 8638322, 8843330, 9107352, 9301923, 9537702, 9802980, 10042956, 10345231, 10690076, 11129903, 11545110, 11898768, 12336480, 12792955, 13316518, 13940458]
3423A3940458O57195O28860O32678P04208P39273O75427M85511L38561J87344
3414A8989515o5266m39885o62141q83323r49852q56307p82399o51564n82974n70974
3404A2544830n13874l78218l58858l79032l32025k93351k60206k47376k39527
3395I542363k09044j81693j68214r7708j43758j24121o3944k7525p7208j9814
3385H429334K6203O1241L2724N8191P167j94384l17829l56665k95104k91632j55420
3374G003826k22125j42777j03554o6060j20151j47304l3524m4838o0676k6063
3364F036754k5897m1207k302n1912p6185K4478J6358k0627M2507M1441l9935O1580
3352E965053j8156M3214J01014n9383j58134j75903j68768j21751q7440j25132
$$ y = [13940458, 14597653, 15226513, 15859191, 16563399, 17302672, 17978099, 18463610, 18802171, 18989515, 18924249, 18484364, 17822223, 16938900, 15989048, 15132741, 14350342, 13698778, 13115804, 12544830, 12030956, 11652738, 11293880, 10914848, 10582823, 10289472, 10029266, 9781890, 9542363, 9333319, 9151626, 8983412, 8885704, 8741946, 8617825, 8553881, 8526356, 8449148, 8429334, 8455537, 8516778, 8549502, 8607693, 8614860, 8420476, 8102647, 7745982, 7450878, 7159246, 7003826, 6781701, 6638924, 6535370, 6469310, 6349159, 6201855, 6168331, 6123493, 6062817, 6036754, 6010857, 5969650, 5967348, 5915436, 5839251, 5863729, 5880087, 5859460, 5901967, 5943408, 5903473, 5965053, 5946897, 5990111, 6091125, 6031742, 5873608, 5697705, 5528937, 5407186, 5319746, 5194614]
3342E194614l3991j9998L8213p5532j3657l8235m6377m7849j00195j19056l1650
3331D706287m95k2133n1331l7757J2147m0722j4571K5032N077L898N5049N5022
3319D695503p0746p1630n5438p15P1842k9093N902Q1966J12505J25692J34874
3308E000662K11530K34811K04810J35514Q1907j31995k63956l00721k25610j65995
3298D780957k05577j38053k7290q5772n6463m2935m9591q561p213j8819J9227
3287D159910M212m239L1857K3470J11598R3202N1504J03839R0190J24681J80133
3276D970357K38331K12427L07258L91452L76207K72563j2831j86693m29880n14164
3266E625027l94772l73852k96153k05969j69424j45780j44331j14608j15907j37208
$$ y = [5194614, 5160623, 5140625, 5178838, 5103306, 5089649, 5051414, 5005037, 4957188, 4856993, 4737937, 4706287, 4705792, 4683659, 4632328, 4594571, 4606718, 4565996, 4551425, 4576457, 4581534, 4585432, 4640481, 4695503, 4624757, 4553127, 4497689, 4496974, 4568816, 4539723, 4545625, 4627591, 4740096, 4865788, 5000662, 5212192, 5447003, 5651813, 5787327, 5869234, 5737239, 5473283, 5172562, 4946952, 4780957, 4575380, 4437327, 4410037, 4324265, 4267802, 4224867, 4175276, 4166715, 4159502, 4140683, 4159910, 4164122, 4159883, 4191740, 4215210, 4326808, 4420010, 4471514, 4575353, 4665543, 4790224, 4970357, 5208688, 5421115, 5728373, 6119825, 6496032, 6768595, 6755764, 6569071, 6139191, 5625027, 5230255, 4856403, 4560250, 4354281, 4184857, 4039077, 3894746, 3780138, 3664231, 3527023]
3256C527023o8351n0442p8768n3630n0396k9063o0140L5681j840Q345j5503J051
3244C163967K2705N8596R5541P7284K6837P9769J60916L8266o3456r5018j58505
3233C406902j89391j90989j70659j08560j21439r9849r77j23610j24752o0430
3223B216246k7292k8475m4755p6475k0128l7488p1474o1419Q75J9417k2919n7676
3211A788437k1068j0423l1448k4138J0640k64k1451m9987l5348J6831j2653l2532
3199A576596M8618l670q7443j5715J3469K2254j1173n9265k1154K9183j8645l3249
3187A439806l2579P3266N595j2099l2340L3796N5288O634o667n6903l4228n9036
3175A380533P1555p828j8185M3061o2465l1995k2259M1448J1953k1308k3472m504
$$ y = [3527023, 3458672, 3408230, 3329462, 3275832, 3225436, 3196373, 3136233, 3171914, 3170074, 3178419, 3162916, 3163967, 3186672, 3245268, 3340809, 3418093, 3444930, 3524699, 3685615, 3723881, 3660425, 3565407, 3406902, 3217511, 3026522, 2855863, 2747303, 2625864, 2526015, 2525038, 2401428, 2276676, 2216246, 2188954, 2160479, 2115724, 2039249, 2019121, 1981633, 1910159, 1848740, 1849615, 1869032, 1846113, 1788437, 1767369, 1756946, 1725498, 1701360, 1712000, 1711736, 1690285, 1640298, 1604950, 1621781, 1609128, 1576596, 1625214, 1621544, 1534101, 1518386, 1531855, 1554109, 1542936, 1483671, 1462517, 1491700, 1473055, 1439806, 1407227, 1480493, 1486088, 1473989, 1441649, 1475445, 1530733, 1537367, 1530700, 1473797, 1439569, 1380533, 1452088, 1444260, 1426075, 1469136, 1406671, 1374676, 1352417, 1393865, 1405818, 1384510, 1361038, 1356534]
3163A356534N9698n519k0496K7487k0127J6142m6906N5628J2229m4471O9908J5670
3151A475777J5645K9847l5032k248M4296L6000L8677J7699m6716q253j0723l7649
3139A517320M2271l922l893J3752j0811j0538k0343K9048J1403l2420j2476L3726
3127A553117M0273J4408J0132K6348L7540K1674l3916L0252P5139O7010M0402
3116A882379N6313O1562O4672P5302L0819O6197Q9855K8860K4210J6864j2094
3105B384939N5845m7541J172O424M0790P6333J0546j8214N0540Q924j2792N7598
3093B614564O8514P8422l9226O8781M6532N1741J00402Q0436Q9662J42035J50909
3082C452772J00900J36531R8874J17430M7488L1712J09199O3268N8310Q5778n5586
$$ y = [1356534, 1416232, 1410713, 1390217, 1417704, 1397577, 1413719, 1366813, 1422441, 1434670, 1390199, 1460107, 1475777, 1491422, 1521269, 1486237, 1483989, 1528285, 1564285, 1602962, 1620661, 1573945, 1565692, 1554969, 1517320, 1559591, 1555669, 1551776, 1565528, 1554717, 1544179, 1523836, 1552884, 1564287, 1531867, 1519391, 1553117, 1593390, 1607798, 1617930, 1644278, 1681818, 1703492, 1669576, 1699828, 1774967, 1841977, 1882379, 1938692, 2000254, 2064926, 2140228, 2171047, 2237244, 2327099, 2355959, 2380169, 2397033, 2384939, 2440784, 2393243, 2394415, 2400839, 2441629, 2517962, 2528508, 2510294, 2560834, 2569758, 2556966, 2614564, 2683078, 2761500, 2722274, 2791055, 2837587, 2889328, 2989730, 3070166, 3159828, 3301863, 3452772, 3553672, 3690203, 3789077, 3906507, 3953995, 3985707, 4094906, 4158174, 4216484, 4302262, 4246676]
3071D246676l7938K9234o2329l4011O3758J21092N9634J19504J21231J60579J31661
3060D919091j5394p7498m3151r507j6294k3065K481L5634J9164K1905K8555L1196
3048D873117K8792K941m2112j7485j5365K6159n5985N4560k0034K580N3942j0288
3036D880822P7179Q5638Q9832Q5855K12664J58832J40240R7293Q2742K8026q4405
3025E854718j20027k49318j83418j33549j85418j51140j38095j71008k32089k84308
3015D006348k24908j54673k50720k01436j50818j29455j32425n8679m0466j08458
3005B554310j51353j03640k6476q7589o2465r9400J9901o9107r4900l83o8478
2994A810420p9991p6801p8915J4528N971o2496l2867q5682k4209m6150j2938M2239
$$ y = [4246676, 4208738, 4237972, 4175643, 4141632, 4205390, 4326482, 4386116, 4505620, 4626851, 4787430, 4919091, 4903697, 4826199, 4783048, 4773541, 4757247, 4734182, 4736663, 4772297, 4791461, 4813366, 4841921, 4873117, 4901909, 4904850, 4862738, 4845253, 4829888, 4856047, 4800062, 4854622, 4834588, 4837168, 4891110, 4880822, 4958001, 5043639, 5133471, 5219326, 5431990, 5590822, 5731062, 5828355, 5911097, 5939123, 5854718, 5734691, 5485373, 5301955, 5168406, 4982988, 4831848, 4693753, 4522745, 4290656, 4006348, 3781440, 3626767, 3376047, 3174611, 3023793, 2894338, 2761913, 2703234, 2662768, 2554310, 2402957, 2299317, 2272841, 2185252, 2122787, 2023387, 2043288, 1974181, 1879281, 1878898, 1810420, 1730429, 1653628, 1574713, 1589241, 1595212, 1532716, 1499849, 1414167, 1389958, 1343808, 1330870, 1373109]
2982A373109k0228m4690m9276k1503j7777p3324o1045Q293Q153m970m8626l5278
2970A012838m6952r320K190j9276k408K8510j7770J4395l7740l4740p95r243k9870
2957H49819n0967L3612K7622j8003l2642J0746K264M5287J0411r9202j9585J5824
2945G75186r687l2297k755k3395J4915k9168p097J5433m7544L2913j5784k7880
2933F42840l4426N633K0765l3985k3987k6927J5510O718j750K0611j8622m138
2921E68242o263m9833r120L779k9604J157J1669J5038l6761K3604Q415M912m7884
2908D57351j4818J5062M2090K494o0030P335L3615M552L5145k6175j188j04970
2896C90463j0502J06217r160m6576k4588O772P889J1787L704j2968K5559j32n0151
$$ y = [1373109, 1352881, 1308191, 1258915, 1237412, 1219635, 1146311, 1085266, 1093559, 1101712, 1096742, 1048116, 1012838, 965886, 956566, 958756, 939480, 937072, 965582, 947812, 962207, 924467, 889727, 888932, 879689, 849819, 798852, 832464, 860086, 842083, 809441, 820187, 822451, 867738, 878149, 778947, 759362, 775186, 765499, 733202, 730447, 707052, 721967, 692799, 685702, 701135, 653591, 686504, 670720, 642840, 608414, 614047, 634812, 600827, 576840, 549913, 565423, 572141, 570391, 591002, 572380, 568242, 561979, 512146, 503026, 506805, 477201, 478358, 490027, 505065, 468304, 491908, 500323, 505235, 457351, 442533, 457595, 499685, 502179, 442149, 449484, 483099, 487651, 522796, 496621, 495433, 390463, 379961, 486178, 477018, 430442, 405854, 412626, 420515, 432302, 436006, 423038, 448597, 448465, 398314]
2883C98314K3683K8948j9002k4804n7382k9645R4229l818m7740L3189j702j2315
2871C81955l0480k8256o402J0940j5663l7756j6212p856L0835n864K1857j1293
2859B85805K1547L8396m0501J3256M3866l9807l857l2261P4936q233k0779l1974
2847C00394L714k117M1609q498n8651j459K3863k5458K9303J9721n9396Q688N344
2834B77057n7520J4488J5571l2298N5692M1936j9081m0273k0716j0184l4989L4048
2822B23731K2958j006L2931J0337L0533k8461L9410k5198j095p685o359l0028
2810B60068k3383p068K9134K2145k266J3154o0280p5271N4518K9204M764N085
2798B49804J1094l9398P941j405k3223j4759Q759J2843P5391o4332p1684j3355
$$ y = [398314, 421997, 450945, 431943, 407139, 349757, 320112, 414341, 410523, 362783, 395972, 394270, 381955, 351475, 323219, 316817, 327757, 312094, 274338, 258126, 250270, 281105, 275241, 297098, 285805, 307352, 345748, 305247, 318503, 362369, 322562, 318705, 286444, 361380, 353147, 332368, 300394, 304108, 301991, 343600, 335102, 276451, 274992, 298855, 273397, 302700, 322421, 263025, 271713, 277057, 219537, 234025, 249596, 217298, 272990, 314926, 295845, 255572, 234856, 224672, 189683, 223731, 246689, 245683, 278614, 288951, 319484, 291023, 330433, 305235, 304140, 296455, 290096, 260068, 236685, 229617, 258751, 280896, 278630, 291784, 231504, 156233, 210751, 239955, 244719, 249804, 260898, 221500, 229441, 228036, 204813, 190054, 198813, 211656, 287047, 222715, 151031, 137676]
2786A37676N3200l6913m1252Q9409m777J7324l4783k5938M3524L8779k7413j6029
2774A92807Q586q779k4965J0329n836m801m643J9968q214K1210N681j9853K1383
2761B02873L2641m9690l3133K4493K5421l2194M0073K9989l539R6m3651J0470
2749B03849n96k3869m6502Q339L1085j7263k5528M5628K9243o2356j021p520p833
2736A25656M9288j2587l3582m3715j550N6970J4988J9197j0358L6211j2235J1881
2724B00164k717j0950j9786l6577l2767J9642q149Q51M2901m7186j5931R003J2533
2711A11031L9339m063o409k033j7437J9813k3445K5722o8737j6273P0809K4656
2699A52973O998j733N9442n3568k6195o2744K1417L4518K868k2627k8600N1415
$$ y = [137676, 190876, 153963, 112711, 202120, 197343, 214667, 179884, 153946, 197470, 236249, 208836, 192807, 201393, 192614, 167649, 177978, 172142, 167341, 162698, 182666, 174452, 195662, 201343, 181490, 202873, 235514, 185824, 152691, 177184, 202605, 170411, 210484, 240473, 236934, 237030, 193379, 203849, 203253, 179384, 132882, 141221, 172306, 155043, 129515, 175143, 204386, 142030, 141009, 133489, 125656, 174944, 162357, 128775, 85060, 83510, 140480, 155468, 174665, 164307, 200518, 188283, 200164, 197447, 186497, 166711, 130134, 97367, 117009, 108860, 109711, 152612, 105426, 89495, 98498, 111031, 150370, 146307, 139898, 137865, 120428, 140241, 116796, 142518, 73781, 57508, 128317, 152973, 159971, 158238, 217680, 164112, 137917, 75173, 96590, 131108, 133976, 111349, 82749, 134164]
2687A34164j270n4733m2858N9034K7858k8909r523P011l0249n43L4003J4969k2121
2674H6833p801K3768K5054j016K5332l3915J944L3352k0800m0966O167N436L6195
2661A39583j6141m1445J1081l2325M2126M0679o934j2762l923k2341l0914O986
2649G3670j9381j2547K2060L6774N200m9314j5774J1215k2381L7193M483m708
2637F6490l7501K5446K3625M6578j1384j5734O33n3886K957J0036j411k9080L3004
2624E9773l464j1674J9767J270L0823m2464n0742O063J5501J4045p473N0473P087
2611H8985J131l9273K0250J9462p726k2728k1643k2999k838J6754J1505J6458
2599E7338M14N5768l4535n6105J6744M8230k6680L9187O825k1878J8579n0598
$$ y = [134164, 132894, 78161, 35303, 94337, 122195, 93286, 83763, 90774, 60525, 59982, 93985, 108954, 86833, 79032, 102800, 127854, 126838, 152170, 118255, 120199, 153551, 132751, 91785, 97952, 103388, 139583, 123442, 81997, 93078, 60753, 102879, 143558, 136624, 123862, 119939, 97598, 66684, 73670, 54289, 41742, 63802, 100576, 105776, 56462, 40688, 51903, 29522, 66715, 71198, 66490, 28989, 54435, 78060, 124638, 113254, 97520, 98153, 44267, 47224, 57260, 55849, 26769, 59773, 56309, 44635, 64402, 65672, 96495, 54031, 3289, 9352, 24853, 38898, 31425, 81898, 88985, 90116, 50843, 71093, 90555, 82829, 60101, 38458, 15459, 12621, 29375, 40880, 57338, 57752, 113520, 78985, 22880, 39624, 87854, 61174, 100361, 107186, 85308, 103887, 53289]
2587E3289j848K0850K091k3305J4633k8169j6482j4140J8197N259K0813j323p560
2574D2305L967K7191m9547J1527K6177n155r457K6037j856k5227K6638j6052M1691
2561I8239j6446j5038J0810Q488k9414L8110k6618K141l6303L4284Q871n166M5028
2548A16986k1686j3429o333M5916j1292L9859m9076l5712J06333n0622o4316k6620
2536C0008J898l3383L0890J0600m1855M2611K5073J1040o4528k2016O1776n882
2524D6232r591R088J2851n513j1846j8466r219O206K588m4120K8985O1767k754
2511F6208j5792Q454J5125k1112J0928K7018m7968m3290R068L7790L4964j5581
2499F5812j4132M7283K799M0128m7829k6744M327l1119O75P3286J1604o2023K7199
$$ y = [53289, 51441, 72291, 74382, 51077, 65710, 37541, 21059, 6919, 25116, 30375, 51188, 49865, 42305, 46272, 73463, 23916, 35443, 61620, 56465, 47008, 73045, 71189, 45962, 72600, 56548, 98239, 81793, 66755, 77565, 86053, 56639, 94749, 68131, 70272, 33969, 68253, 77124, 71958, 116986, 95300, 81871, 75538, 121454, 110162, 150021, 100945, 65233, 171566, 120944, 56628, 30008, 31906, -1477, 29413, 40013, -1842, 40769, 65842, 76882, 12354, -9662, 52114, 46232, 36641, 45729, 58580, 53067, 41221, 22755, 13536, 19742, 22330, -21790, 7195, 68962, 66208, 50416, 58870, 73995, 52883, 63811, 90829, 42861, -429, 8639, 46429, 81393, 65812, 51680, 98963, 101762, 141890, 94061, 67317, 71644, 40525, 41200, 114486, 126090, 64067, 91266]
2486I1266o3260j2572j6760L5896r107O9252o5158o228k8476L829o440L1573K8833
2473E2648K7167N2629k2167j7430l4909l7930m5821J2274O3543K8120n0885R330
2461C6569k0527j6839K5493J837J5935J853N987k1489J7452j8408P44n125Q0063
2448A03545j5339p9395L1018k7945K2437K9492L446R406n943K062m2244l4160
2436c620L1798J9468j353k157P6211m5951k2415M0169N1910k1575k5483k4610
2424G2392M279l4712m3843L0419K5729K3546M0489k7396l6256o210l5635Q417
2412B1219J8755l508L6563K2410j153l3408l1575J2794k2709J1789N9250q246
2400H2181P59p1901L861R1776L3771o3814m0528J5038R237k175K7256L8085j7686
$$ y = [91266, 28006, 15434, -1326, 34570, 25463, 94715, 29557, 23329, -5147, -1318, -7758, 23815, 52648, 79815, 132444, 110277, 92847, 57938, 20008, -25813, -13539, 50004, 78124, 27239, 36569, 16042, -797, 24696, 26533, 42468, 44321, 50308, 28819, 46271, 27863, 28607, 23482, 103545, 88206, 8811, 39829, 11884, 34321, 63813, 67259, 76665, 70722, 72784, 30540, -3620, 28178, 47646, 46293, 44136, 120347, 74396, 51981, 92150, 144060, 122485, 97002, 72392, 76671, 41959, -1884, 28535, 54264, 77810, 118299, 90903, 54647, 48437, 12802, 21219, 39974, 36466, 73029, 95439, 94286, 60878, 29303, 42097, 19388, 31177, 90427, 82181, 82940, 11039, 14900, 106676, 140447, 76633, 36105, 51143, 60380, 58205, 85461, 123546, 105860]
2387A05860k491L8245n8738o7832Q1494R522k0323K0334k3231r427l8968j594
2375C2851P5422K8279l3841k1489J3465j6705J9680O6087l2523Q664k6919l988
2363A08983k3713K1483j4906J7519J2956O957M4037p303n8251K7201O2183l0621
2351A66525J9552m245J2192k7188j9894l1577L1795K8579k390m6961N1261r020
2339A68629o592R124L6085J3171j4716N963L960K2547K8161p117k6345L5833M1324
2326C10027J3789k5854N7846Q757j1058L0579N1376k6742J1108j5436K2355L8916
2314D65663J1972L1091O8446L0938L9343N0002L4495J8718N4246O5224L6959Q3117
2302I90214J33854P8273N0355P9927M2936J25797J96427K29732K19489K15143
$$ y = [105860, 103369, 141614, 82876, 15044, 96538, 106060, 85737, 106071, 82840, 73413, 34445, 32851, 108273, 136552, 102711, 81222, 94687, 77982, 97662, 163749, 131226, 139890, 112971, 108983, 85270, 106753, 91847, 109366, 122322, 129279, 173316, 166013, 107762, 134963, 197146, 166525, 186077, 181832, 194024, 166836, 146942, 115365, 147160, 175739, 173349, 126388, 177649, 168629, 162037, 171161, 207246, 220417, 205701, 211664, 215624, 238171, 266332, 259215, 232870, 268703, 310027, 323816, 297962, 355808, 364565, 353507, 384086, 435462, 408720, 419828, 404392, 426747, 465663, 477635, 508726, 577172, 608110, 647453, 697455, 731950, 750668, 804914, 870138, 907097, 990214, 1124068, 1202341, 1252696, 1332623, 1375559, 1501356, 1697783, 1927515, 2147004, 2362147]
2292B362147K91372K50416K72405K86559K03411L82858L85306M96876N99333P56223
2282F286906R67851J373448J687458K012395K192381K771164K423950O24069k740888
2273A7598734l773313k563291j958030j357042j024440p60218o66530m73521l49481
2264D672868k67527k23980j95724k31146j84162k57454k90153k88062j84929j81069
2254B368662k20758j70780o8205r7209p9372j17419j05410n5706j17986j00660
2244A235157k5960l8498n6901J5792l9566r0005l3433m4453l2219p0780m6299
2233G72835j6890L426m5564n3140l0670M487J6454L984m8820m6308k7615n6756
2221D75423J2858k311n1744r144l106M4035j1498k1378J7370R4r0814J5408M1738
$$ y = [2362147, 2653519, 2903935, 3176340, 3462899, 3666310, 4049168, 4434474, 4931350, 5530683, 6286906, 7254757, 8628205, 10315663, 12328058, 14520439, 17291603, 19715553, 20339622, 17598734, 13825421, 11262130, 9304100, 7947058, 6922618, 6162400, 5495870, 5022349, 4672868, 4405341, 4181361, 3985637, 3754491, 3570329, 3312875, 3022722, 2734660, 2549731, 2368662, 2147904, 1977124, 1908919, 1811710, 1732338, 1614919, 1509509, 1453803, 1335817, 1235157, 1209197, 1170699, 1113798, 1129590, 1090024, 1000019, 966586, 922133, 889914, 819134, 772835, 755945, 759371, 713807, 660667, 629997, 634484, 650938, 654922, 606102, 559794, 532179, 475423, 488281, 485970, 434226, 425082, 421976, 466011, 454513, 433135, 450505, 450599, 359785, 375193, 416931]
2208D16931j4111m5742K5122n303m1178j9283l6039J6850J2368n4782q559m5677
2196B00597K5333N4049j3840j8809J2305P720l2812J8392K1851j0730j6502n3312
2184A94242K6566k1949J5529J7558j6573j6473L866o902P488L8066o551m6943
2172A87924l4764K8122l7881K4078J8008l1189k3257N3157l0220K0159q700k9364
2160A36073k0706N416L5518j1875l5754L0971l4896K3019K0442k0763J6782j3456
2148A30771P297l1204K464K2921R048k6631l4154p263J8285k9220l2335O1206
2136I1185L3657l7504j3570L8008m9265J3984J1783o147J9296q102k3010M4660
2124A14975j5599k2520O094P335k004l2373M2015k4450r197M1352Q520j210l5933
$$ y = [416931, 402820, 357078, 382200, 376897, 335719, 316436, 280397, 297247, 309615, 254833, 246274, 200597, 225930, 279979, 266139, 247330, 259635, 267355, 234543, 252935, 274786, 264056, 247554, 194242, 220808, 198859, 214388, 231946, 215373, 198900, 202766, 195864, 203352, 241418, 234867, 187924, 153160, 181282, 143401, 167479, 185487, 154298, 131041, 184198, 153978, 174137, 165437, 136073, 115367, 120783, 156301, 144426, 108672, 139643, 104747, 127766, 148208, 127445, 144227, 130771, 138068, 106864, 109328, 132249, 141297, 114666, 80512, 73249, 91534, 62314, 29979, 91185, 124842, 87338, 73768, 111776, 62511, 76495, 88278, 82131, 101427, 93325, 70315, 114975, 99376, 76856, 82950, 90285, 88281, 55908, 97923, 73473, 64276, 105628, 114148, 112938, 77005]
2111G7005J6863k978L0221j366m3945P77J6266k4458l86k7333L6790k8936m4161
2098D359J2504L8761K3917n1021O8075R444n4401j2731Q5767m8271q071R936j619
2085G6649l1263M0856n12l1655k6662K2790M427j682j7943k6259N6325r078r530
2072D6463j1152k9947N104L4904l5835k0379J4241K7128J9298j553l4858Q262
2060B1676L7351m3351J7096K5467j4097J7153p804p099N955M1163l1094p527L8350
2047I3239K8478k257J0140k9792J6858J3557q4745l1347K5140l2365k2447m3377
2035e8918M9637R9339o3698J515K4163k4489K1678J3602q78j4251q206k1980j492
2022A6022j9681M157M3528k2908J6602J8894j6328M3528K2054m9815j5134K6395
$$ y = [77005, 93868, 90890, 121111, 119745, 75800, 76577, 92843, 68385, 67999, 40666, 77456, 48520, 4359, 16863, 55624, 79541, 28520, 96595, 106039, 51638, 38907, 124674, 76403, 68332, 78268, 76649, 45386, 86242, 85730, 54075, 27413, 50203, 54630, 52948, 35005, 8746, 65071, 55993, 46463, 35311, 5364, 10468, 45372, 9537, -10842, 3399, 30527, 49825, 48272, 13414, 21676, 59027, 15676, 32772, 58239, 44142, 61295, 53491, 46392, 52347, 93510, 62416, 54889, 93239, 121717, 119460, 129600, 99808, 116666, 130223, 45478, 14131, 39271, 6906, -15541, -58918, -9281, 90058, 26360, 27875, 52038, 27549, 49227, 62829, 61951, 47700, 39494, 17514, 16022, -3659, 498, 44026, 21118, 37720, 56614, 40286, 83814, 105868, 56053, 40919, 67314]
2010F7314j2644M398L4738J6685K5896n7373K1187j3247l1674K5872k097k419
1998G6636q062k5543k234j5492L6515l850l3687M3820k962k6007m1472J8663M0775
1985E7100k9029m2868K1756L6518K4073J082n0955K9613n101j148K2728J5005
1973G8774k4072L041K6819j3534k1944m9139K2749j9530k1954M5129J699k3147
1961D891L531L0741j4805k6141M2872n291J5l1283O855m712l7244N3720k5620
1948b471K0353J6203l4970j0382L7046l555k94K6023m1476M1679J7657m2852l8273
1935a5312M4329n2022l5304L6047J1652K1987j3945k2607m7215O5006O4858j2342
1923D5132k8553J7626n966j7381n485l2097K2150K7069k0084l4373M5160J5141
$$ y = [67314, 54670, 59068, 93806, 110491, 136387, 79014, 100201, 86954, 55280, 81152, 79055, 76636, 68574, 43031, 40797, 25305, 61820, 57970, 24283, 68103, 65141, 39134, -2338, 16325, 57100, 28071, -14797, 6959, 43477, 67550, 68632, 17677, 47290, 42189, 41041, 63769, 78774, 54702, 57743, 84562, 71028, 49084, -55, 22694, 3164, -18790, 26339, 28038, 4891, 8422, 39163, 24358, -1783, 41089, 35798, 35813, 4530, 11385, 6673, -30571, 23149, -2471, 17882, 34085, -885, -11267, 25779, 22224, 21930, 47953, 6477, 48156, 65813, 22961, -15312, 29017, -23005, -58309, -22262, -10610, 11377, -2568, -25175, -72390, -7384, 57474, 45132, 16579, 34205, 28239, 10858, 5373, -26724, -4574, 22495, 2411, -31962, 13198, 28339]
1911B8339p0187J294K917K3373O489J4221J6629O891n535j6883L0095O275p327
1898C6591k3161J3745R349l5563j2716K4288j6281j9884j9527L5037J2830Q267
1886A2975j7432J1377j3698j2381j3977j9795J8223J2939J8806M6947j4536n4533
1874b5085M0435K1864m0678k1661L2268n058L1J4060J7228j8184k2928M4175j0560
1861B5907m4617J429j4602O611K0573M5008j779k8380l7K417J9999Q982k7412
1848A4099k7386K1269L6330P859J6503j1852k970k2428k0236J1417m1902k5897
1836d5194O5161M4629l0319K4058J0020L393l4207J5302l6437o3003M0078j153
1824g672J8743j8086o772L580k4606q955L910Q12j2235L3041P3581m2139n9678
$$ y = [28339, -41848, -40554, -37637, -14264, -7775, 6446, 23075, 29966, 24431, 7548, 37643, 43918, 36591, 13430, 27175, 36524, 961, -11755, 12533, -3748, -23632, -43159, -8122, 4708, 12975, -4457, 6920, -6778, -19159, -33136, -52931, -34708, -21769, -2963, 43984, 29448, -25085, 15350, 37214, -3464, -25125, 7143, 2085, 2116, 16176, 33404, 15220, -7708, 36467, 25907, -18710, -17281, -31883, -25272, -4699, 40309, 38530, 10150, 10113, 12530, 32529, 41511, 14099, -13287, 7982, 44312, 52171, 68674, 56822, 53852, 31424, 11188, 22605, -19297, -45194, 19967, 64596, 34277, 58335, 68355, 71748, 37541, 52843, 16406, -46597, -6519, -7672, 11071, -7015, -13787, -10207, -34813, -43768, -39858, -39046, -51281, -18240, 55341, 13202, -46476]
1811d6476J5839K8633N993m455k777K1260l3320k5851K4227R350J22j2560l6738
1798e6753J4749n212k274J8963J7010K4370J2108R3085M890p4456j4457j4916
1786A7107J1639j6658Rm8334J0585J6693p605L361l0860O838o028L240j6284L7971
1772a8326j2112J1003l3421J4487O3044j9960O166k513p1506K1086J9607j6661
1760c9106k2944L5879O4119L7541l6779k2710j8808n47l5591M9066K7552j0845
1748B6827J5553n4582J9175l4913K6033P815k0103m0826K9154N2024k6770M8416
1736D7803j0353k2275n23J7273J6533p379m4707k3115K2469m278k6910K0010k3571
1723c9023k390j2131J6350l6807K6305N5616m7354k1175O8231L6104n4758Q067
$$ y = [-46476, -30637, -2004, 3989, -466, -3243, 18017, -15303, -41154, -16927, -7577, -7455, -20015, -56753, -42004, -47216, -49490, -30527, -13517, 10853, 22961, 116046, 120936, 46480, 32023, 17107, 28746, 12088, 12097, -36237, -25652, -8959, -16564, -13203, -44063, -37225, -43253, -40013, -56297, -18326, -30438, -19435, -52856, -38369, 24675, 4715, 10881, 8368, -63138, -42052, -22445, -39106, -62050, -26171, 37948, 75489, 38710, 16000, -2808, -3355, -38946, 10120, 37672, 26827, 42380, -12202, 6973, -27940, -1907, 5908, -14195, -55021, -25867, 26157, -613, 47803, 37450, 15175, 14652, 31925, 48458, 41079, -3628, -26743, -4274, -8552, -35462, -15452, -39023, -41413, -53544, -37194, -74001, -47696, 7920, -39434, -60609, 7622, 43726, -11032, -2965]
$$ [...]
##END NTUPLES=NMR SPECTRUM
##END=
