##TITLE=1H_CA-9359-1
 200.13MHz,CDCl3,
 8 sc
 
 2.7.2025
##JCAMPDX= 6.0         $$ Bruker NMR JCAMP-DX V2.0
##DATA TYPE= NMR SPECTRUM
##DATA CLASS= NTUPLES
##ORIGIN= UXNMR, Bruker Analytische Messtechnik GmbH
##OWNER= pz
$$ XWIN-NMR		Version 3.5
$$ Wed Jul  2 14:59:39 2025 Russian Standard Time (UT+4h)  she@DPX200
##.OBSERVE FREQUENCY= 200.1313
##.OBSERVE NUCLEUS= ^1H
##.ACQUISITION MODE= SIMULTANEOUS
##.ACQUISITION SCHEME= undefined
##.AVERAGES= 8
##.DIGITISER RES= 18
##SPECTROMETER/DATA SYSTEM= spect
##.PULSE SEQUENCE= zg30
##.SOLVENT NAME= CDCl3
##.SHIFT REFERENCE= (INTERNAL, CDCl3, 0, 15.4549)
##AUDIT TRAIL= $$ (NUMBER, WHEN, WHO, WHERE, WHAT)
$$ ##TITLE= Audit trail, XWIN-NMR		Version 3.5
$$ ##JCAMPDX= 5.01
$$ ##ORIGIN= Bruker BioSpin GmbH
$$ ##OWNER= she
$$ F:/spectra/data/she/nmr/H-C/1/pdata/1/auditp.txt
$$ ##AUDIT TRAIL=  $$ (NUMBER, WHEN, WHO, WHERE, WHAT)
(   1,<2025-07-02 14:58:28.89 +0400>,<she>,<DPX200>,
      <created by zg, POWCHK disabled, PULCHK disabled
       configuration hash MD5:
       00 E9 B6 7A A2 85 ED C7 34 08 36 98 17 FE 4E 26
       data hash MD5: 16K
       A9 50 B0 5F A0 AE CF E1 EE AE 31 DE 39 BC 67 32>)
(   2,<2025-07-02 14:58:31.10 +0400>,<she>,<DPX200>,
      <Start of raw data processing
       efp BC_mod = 2 LB = 0.25 FT_mod = 6 PKNL = 1 PHC0 = -1193.902 PHC1 = -3.007805 SI = 16K 
       data hash MD5: 16K
       80 05 75 ED 02 EF 13 B7 CE 30 38 55 81 3B 5A DE>)
(   3,<2025-07-02 14:58:48.57 +0400>,<she>,<DPX200>,
      <pk PHC0 = -7.88902 PHC1 = 16.8 
       data hash MD5: 16K
       E3 7A EC BE 63 40 65 18 DC A8 40 97 73 C8 E0 DD>)
(   4,<2025-07-02 14:58:52.46 +0400>,<she>,<DPX200>,
      <abs ABSG = 5 
       data hash MD5: 16K
       DA 8F 48 15 E2 74 93 82 23 26 F8 B9 7D D5 83 F3>)
$$ ##END=
$$ 
$$ hash MD5
$$ A5 8C E2 58 1A 67 A0 F3 29 3D 06 43 48 B3 B2 C3
##$RELAX= 
##$RELAX= 
##$RELAX= 
##$RELAX= 
##$RELAX= 
##$RELAX= 
$$ Bruker specific parameters
$$ --------------------------
##$DU= <F:/spectra>
##$EXPNO= 1
##$NAME= <H-C>
##$PROCNO= 1
##$TYPE= <nmr>
##$USER= <she>
##$AMP= (0..31)
100 100 100 100 100 100 100 100 100 100 100 100 100 100 100 100 100 100 
100 100 100 100 100 100 100 100 100 100 100 100 100 100 
##$AQSEQ= 0
##$AQ_mod= 1
##$AUNM= <au_zg>
##$AUTOPOS= <>
##$BF1= 200.13
##$BF2= 200.13
##$BF3= 200.13
##$BF4= 200.13
##$BF5= 200.13
##$BF6= 200.13
##$BF7= 200.13
##$BF8= 200.13
##$BYTORDA= 1
##$CFDGTYP= 0
##$CFRGTYP= 5
##$CHEMSTR= <none>
##$CNST= (0..31)
1 1 145 1 1 1 1 1 1 1 1 1 1 1 1 1 1 1 1 1 1 1 1 1 1 1 1 1 1 1 1 1 
##$CPDPRG= <>
##$CPDPRG1= <>
##$CPDPRG2= <>
##$CPDPRG3= <>
##$CPDPRG4= <mlev>
##$CPDPRG5= <mlev>
##$CPDPRG6= <mlev>
##$CPDPRG7= <mlev>
##$CPDPRG8= <mlev>
##$CPDPRGB= <>
##$CPDPRGT= <>
##$D= (0..31)
0 0.7 0 0 0 0 0 0 0 0 0 0.03 0 0 0 0 0 0 0 0 0 0 0 0 0 0 0 0 0 0 0 0 
##$DATE= 1751453908
##$DBL= (0..7)
120 120 120 120 120 120 120 120 
##$DBP= (0..7)
150 150 150 150 150 150 150 150 
##$DBP07= 0
##$DBPNAM0= <>
##$DBPNAM1= <>
##$DBPNAM2= <>
##$DBPNAM3= <>
##$DBPNAM4= <>
$$ [...]
##$SUBNAM3= <"">
##$SUBNAM4= <"">
##$SUBNAM5= <"">
##$SUBNAM6= <"">
##$SUBNAM7= <"">
##$SUBNAM8= <"">
##$SUBNAM9= <"">
##$SW= 18.0517328524113
##$SWIBOX= (0..15)
0 0 2 0 0 0 0 0 0 0 0 0 0 0 0 0 
##$SW_h= 3612.71676300578
##$TD= 16384
##$TD0= 1
##$TE= 0
##$TE2= 300
##$TE3= 300
##$TEG= 300
##$TL= (0..7)
0 120 120 120 120 120 120 120 
##$TP= (0..7)
150 150 150 150 150 150 150 150 
##$TP07= 0
##$TPNAME0= <>
##$TPNAME1= <>
##$TPNAME2= <>
##$TPNAME3= <>
##$TPNAME4= <>
##$TPNAME5= <>
##$TPNAME6= <>
##$TPNAME7= <>
##$TPOAL= (0..7)
0.5 0.5 0.5 0.5 0.5 0.5 0.5 0.5 
##$TPOFFS= (0..7)
0 0 0 0 0 0 0 0 
##$TUNHIN= 0
##$TUNHOUT= 0
##$TUNXOUT= 0
##$USERA1= <user>
##$USERA2= <user>
##$USERA3= <user>
##$USERA4= <user>
##$USERA5= <user>
##$V9= 5
##$VALIST= <valist>
##$VCLIST= <CCCCCCCCCCCCCCC>
##$VD= 0
##$VDLIST= <DDDDDDDDDDDDDDD>
##$VPLIST= <PPPPPPPPPPPPPPP>
##$VTLIST= <TTTTTTTTTTTTTTT>
##$WBST= 1024
##$WBSW= 4
##$XGAIN= (0..3)
0 0 0 0 
##$XL= 0
##$YL= 0
##$YMAX_a= 660686
##$YMIN_a= -1148134
##$ZGOPTNS= <>
##$ZL1= 120
##$ZL2= 120
##$ZL3= 120
##$ZL4= 120
##$ABSF1= 15.48907
##$ABSF2= -2.562779
##$ABSG= 5
##$ABSL= 3
##$ALPHA= 0
##$AQORDER= 0
##$ASSFAC= 0
##$ASSFACI= 0
##$ASSFACX= 0
##$ASSWID= 0
##$AUNMP= <proc_1d>
##$AZFE= 0.1
##$AZFW= 0.1
##$BCFW= 0
##$BC_mod= 2
##$BYTORDP= 0
##$COROFFS= 0
##$CY= -3
##$DATMOD= 1
##$DC= 0
##$DFILT= <>
##$DTYPP= 0
##$F1P= 0
##$F2P= 0
##$FCOR= 1
##$FTSIZE= 16384
##$FT_mod= 6
##$GAMMA= 0
##$GB= 0
##$INTBC= 1
##$INTSCL= 3.241238e-09
##$ISEN= 128
##$LB= 0.25
##$LEV0= 0
##$LPBIN= 0
##$MAXI= 10000
##$MC2= 0
##$MEAN= 0
##$ME_mod= 0
##$MI= 1.114404
##$NCOEF= 0
##$NC_proc= -4
##$NLEV= 6
##$NOISF1= 3.799351
##$NOISF2= 2.8
##$NSP= 0
##$NTH_PI= 0
##$NZP= 0
##$OFFSET= 15.45491
##$PC= 1
##$PHC0= -1201.791
##$PHC1= 13.79219
##$PH_mod= 1
##$PKNL= yes
##$PPARMOD= 0
##$PSCAL= 0
##$PSIGN= 0
##$REVERSE= no
##$SF= 200.130013367263
##$SI= 16384
##$SIGF1= 3
##$SIGF2= 2
##$SINO= 0.751879
##$SIOLD= 32768
##$SREGLST= <19F.Aceton>
##$SSB= 0
##$STSI= 16384
##$STSR= 0
##$SW_p= 3612.71676300578
##$SYMM= 0
##$S_DEV= 0
##$TDeff= 16384
##$TDoff= 0
##$TI= <>
##$TILT= no
##$TM1= 0
##$TM2= 0
##$TOPLEV= 0
##$USERP1= <user>
##$USERP2= <user>
##$USERP3= <user>
##$USERP4= <user>
##$USERP5= <user>
##$WDW= 1
##$XDIM= 16384
##$YMAX_p= 471357573
##$YMIN_p= -86397
$$ End of Bruker specific parameters
$$ ---------------------------------
##NTUPLES= NMR SPECTRUM
##VAR_NAME=  FREQUENCY,     SPECTRUM/REAL,   SPECTRUM/IMAG
##SYMBOL=    X,             R,               I
##VAR_TYPE=  INDEPENDENT,   DEPENDENT,       DEPENDENT
##VAR_FORM=  AFFN,          ASDF,            ASDF
##VAR_DIM=   16384,         16384,           16384
##UNITS=     HZ,            ARBITRARY UNITS, ARBITRARY UNITS
##FACTOR=    0.220516191357247, 1,           1
##FIRST=     3092.99140059009, 0,            0
##LAST=      -519.725362415686, 0,           0
##MIN=       -519.725362415686, -86397,      0
##MAX=       3092.99140059009, 471357573,    0
$$ Real data points
##PAGE= N=1
##DATA TABLE= (X++(R..R)), XYDATA
$$ [...]
8145F773889j80417j99532k01285k20493k10874k05704k27581k28644j73671j64431
8135D761257j19055j49089j43106j06947r3304p2200q3478o4111p3277o8351o3432
8124C724907o9474m1298l8011l8042k8025k9282l8577j00154l9526k9096m693
8113C268729k9704m0120k7028k884k6962l6626O607l156n866J2327L771M894J6135
8100C140117R768Q226L8665N5123N4159N2868M8757R6950J00832P3292P6863J12215
8088C867835J13745P7563R3230O4404L9261N2880L2821k1058n7666n9381r7466
8077D106168j19924j37150j14549r9880j14400j13896r2501j17442q1917q1989
8067C032520p8802n2678m3652o1486q9416n6718n5412l2902o2936p2153n5758
$$ y = [6773889, 6593472, 6393940, 6192655, 5972162, 5761288, 5555584, 5328003, 5099359, 4925688, 4761257, 4642202, 4493113, 4350007, 4243060, 4149756, 4077556, 3994078, 3929967, 3856690, 3788339, 3724907, 3655433, 3614135, 3576124, 3538082, 3510057, 3480775, 3442198, 3342044, 3302518, 3273422, 3268729, 3239025, 3198905, 3171877, 3168993, 3142031, 3105405, 3112012, 3108856, 3102990, 3115317, 3119088, 3123982, 3140117, 3149885, 3158111, 3196776, 3251899, 3306058, 3358926, 3407683, 3504633, 3605465, 3678757, 3755620, 3867835, 3981580, 4059143, 4152373, 4216777, 4256038, 4308918, 4341739, 4320681, 4263015, 4203634, 4106168, 3986244, 3849094, 3734545, 3634665, 3520265, 3406369, 3313868, 3196426, 3114509, 3032520, 2953718, 2901040, 2857388, 2795902, 2706486, 2649768, 2594356, 2561454, 2498518, 2426365, 2370607]
8056B370607l2717m0400l0290k9682k2477m1583l6398n6206k2397k6569m9160
8045A982728R309j9220l117j4885k3426l1365l5788j5998p549k7286m705O20j6404
8032A792914M057j2367l4215J5161K3907j7037j7268j6119J0566J5407k7242j7092
8020A720672J1961j4627k845j1149k6689j9050j0945j2956j8509m290j4799q48
8008A595926j8109k9863j7841j7848K1469k947j7370k4932j6806k152k2205K1404
7996A468726j4513j1322M684J224L303j8748l611k139J2534j947k1073J1761M848
7983A433727o375J098K0235K0034k017K5218j599o231J055k1429k3001r327N520
7970A436908o386K0601J6536r599k0508n373j8677j8157r215q597j2351k3885
$$ y = [2370607, 2337890, 2297490, 2267200, 2237518, 2215041, 2173458, 2137060, 2080854, 2058457, 2031888, 1982728, 1992037, 1972817, 1969700, 1954815, 1931389, 1900024, 1864236, 1848238, 1840689, 1813403, 1808698, 1809318, 1792914, 1796971, 1784604, 1750389, 1765550, 1789457, 1772420, 1755152, 1739033, 1749599, 1765006, 1737764, 1720672, 1732633, 1718006, 1715161, 1704012, 1677323, 1658273, 1647328, 1634372, 1615863, 1611573, 1596774, 1595926, 1577817, 1547954, 1530113, 1512265, 1533734, 1530787, 1513417, 1488485, 1471679, 1469527, 1447322, 1468726, 1454213, 1442891, 1447575, 1448799, 1452102, 1433354, 1429743, 1427604, 1440138, 1438191, 1417118, 1428879, 1433727, 1427352, 1428450, 1448685, 1468719, 1466702, 1491920, 1490321, 1484090, 1485145, 1463716, 1440715, 1431388, 1436908, 1430522, 1451123, 1467659, 1458060, 1437552, 1432179, 1413502, 1395345, 1386130, 1377533, 1365182, 1341297]
7958A341297m1406j791j2535J4887p51l5587j1810j7958K1449n964k8193n627
7946A216011K5374p884j0515j1637k2074j6257r135j0286j9747l729J705k5238
7934A106588P946J2529m1744J0792M967l6923l328q692m347j9928o745M964K470
7921A028549m891J4262N808J078k074j5034L5264J7917l232k9183l6927k3049
7909I88488k0450j9010j485J9409L888k6983M78Q22l920J3616j022j9395l8514
7896H95922m4563P867K2272k5773j099K9673q821j3874j5854j1568q51l577k0037
7883H09717K3954J0603j8598J4610k6511p600r505p588J2537J3417K064k5417
7871G91683M804J010O880J19J6872k8135r806l062j0163J7286J152j1412n972
$$ y = [1341297, 1299891, 1298100, 1285565, 1300452, 1299701, 1264114, 1252304, 1234346, 1255795, 1249831, 1221638, 1216011, 1241385, 1233501, 1222986, 1211349, 1189275, 1173018, 1163883, 1153597, 1133850, 1130121, 1131826, 1106588, 1114534, 1127063, 1085319, 1096111, 1101078, 1064155, 1060827, 1052135, 1047788, 1027860, 1021115, 1026079, 1028549, 1023658, 1037920, 1043728, 1044806, 1042732, 1027698, 1062962, 1080879, 1077647, 1048464, 1011537, 988488, 968038, 949028, 947543, 966952, 970840, 943857, 944335, 945157, 941237, 954853, 953831, 934436, 895922, 851359, 859226, 881498, 855725, 854626, 884299, 875478, 861604, 845750, 834182, 833331, 829754, 809717, 833671, 844274, 825676, 840286, 813775, 806175, 796670, 789082, 801619, 815036, 817100, 791683, 796487, 797497, 804377, 804496, 821368, 793233, 783427, 780365, 770202, 787488, 788640, 777228, 771256]
7858G71256j9726p547J0796o776r235m422P617J793N604k8112j6953L1312J4403
7845G50010j5513J626J2721p624k4794M707N478J1100j6140j0808N164P004J9276
7832G42207j789k3471m67Q265Q391l023L6560k5674j6386J6801j1311R494j463
7819G38134j0953N787p319M377j6894o12j1729M163J7773p490K1978J1638j1642
7806G37211j1628q418j0330M035J9261M6356J5445k953O283r886Q495q340J1628
7793G97159K580N946l797j0256l008J4616J4552J193j9091O890P289j6972N400
7780H02501L878J5658j3931J745J9071R563k815k0382L6178J235m971O511l845
7767H50396Q873j1870K023J0854n036m4839l244r699n322j4278Q18K0204j1216
$$ y = [771256, 751530, 743983, 754779, 748003, 738768, 734346, 741963, 743756, 749360, 721248, 704295, 735607, 750010, 734497, 736123, 748844, 741220, 716426, 721133, 726611, 737711, 721571, 710763, 715927, 722931, 742207, 740418, 716947, 716480, 724745, 733136, 730113, 766673, 740999, 724613, 741414, 730103, 739597, 738134, 727181, 732968, 725649, 730026, 713132, 712520, 700791, 704954, 722727, 715237, 737215, 748853, 737211, 725583, 717165, 706835, 710870, 730131, 776487, 791932, 788979, 795262, 785376, 793871, 785531, 797159, 799739, 805685, 801888, 791632, 788624, 803240, 817792, 818985, 799894, 806784, 814073, 797101, 802501, 806379, 822037, 808106, 809851, 828922, 838485, 835670, 815288, 851466, 852701, 847730, 854241, 850396, 859269, 847399, 849422, 860276, 855240, 810401, 807157, 797458, 792136, 777858, 778676, 798880, 787664]
7754G87664k4647K243J8596M3785K7300N358j9339L1561k10l5022R700j2586k7672
7741H06731K1764j1039k8560j385r611k3286J6225L571J755L396K6315k3372j6574
7728G65930L9523K7082J5836L3620k2035K6715K0913N879K0297r627j2373j2888
7716H98872j7744R224j6457l0211L628j1869p685j2953J0249r704j9767j722O845
7703H00706P490J2644K404L42R023k562K9189L3318K2986J768k298R616o874o047
7689I11705j5028O140j3726m5380o350k0420j4096j0163k1652j2965J9231K0226
7677G97522j3078J1114p147k104m0162K0274K4230K1208K0388J6533r864j389
7665H37525J89j8017k9698L1046n426K241j2781k1439l0340j9229J7213k5172
$$ y = [787664, 763017, 765260, 783856, 827641, 854941, 860299, 840960, 872521, 872311, 837289, 846989, 834403, 806731, 828495, 817456, 788896, 787511, 777900, 754614, 770839, 774410, 776165, 779561, 805876, 782504, 765930, 805453, 832535, 848371, 881991, 859956, 886671, 907584, 913463, 933760, 924133, 911760, 898872, 881128, 890352, 873895, 843684, 847312, 835443, 827758, 814805, 825054, 815350, 795583, 793861, 800706, 808196, 820840, 823244, 823586, 832609, 830047, 859236, 892554, 915540, 917308, 915010, 924626, 917752, 911705, 896677, 902817, 889091, 843711, 837361, 816941, 802845, 792682, 771030, 758065, 777296, 797522, 784444, 795558, 788411, 786307, 746145, 766419, 790649, 811857, 832245, 848778, 838914, 837525, 837714, 819697, 789999, 821045, 815619, 817860, 805079, 783640, 753300, 734071, 751284, 726112]
7653G26112k800J3894m436K861Q140O660K5420K1599j808L855L3698o526k6941
7640G99728n165o511m6641m5546q77m739n771k9622M485j2919k5747J3728j6235
7627F18168K2761K5823k9618J0757L917Q420P65j615J5317L4229k5108k4226l2169
7614F27421l9191R79O906J8389m6871q210p32k9601K267J073n78K784j8677m994
7600E10965L682p17m916k7573N799k783J2556p452K917J1219P438j391j236j967
7586E06541K00p706r988J3910k3723K2948K3092M528k1298j5067l759o61j4196
7573D74821l839J6990o54j3370p14Q728J3425p132L882L867p748l1943J4128m73
7559D69968K974l905k0486p893J6443j4891j679kJ592M837J6798j3900j9982J1410
$$ y = [726112, 723312, 737206, 732770, 735631, 743771, 750431, 775851, 797450, 795642, 799497, 833195, 826669, 799728, 794563, 788052, 741411, 695865, 694988, 690249, 684478, 654856, 659341, 646422, 620675, 634403, 618168, 640929, 666752, 637134, 647891, 651808, 660228, 660993, 659378, 674695, 708924, 683816, 659590, 627421, 588230, 589209, 596115, 614504, 567633, 559423, 558691, 529090, 531357, 532430, 531852, 534636, 515959, 510965, 514647, 513930, 509014, 481441, 487240, 484457, 497013, 489561, 492478, 503697, 511135, 509744, 508508, 506541, 506741, 499035, 489047, 502957, 479234, 502182, 525274, 529802, 508504, 493437, 489678, 489017, 474821, 470982, 487972, 487318, 473948, 473234, 481962, 495387, 488255, 492137, 496004, 488256, 456313, 470441, 469968, 472942, 469037, 448551, 440658, 457101, 442210, 440531, 440529, 442121, 446958, 463756, 449856, 429874, 441284]
7545D41284P79K119K200J0831J5671l7384m693J4904K3175l1638j9057k9094J5980
7532D05077M5273k3696l1346J7055k657n528L6791M736j2018q311J1110j0383
7520D26103J1819K1443M637j186J9970J5046K336m689j192L400L5232N755l238
7507E35436j1411l6717k0924R383R571J7684j2590J1492k2302k6513p712j9355
7495D26042L578L799N758J0539J4843n910j8803k8367O450R916k0029j2059J0744
7482D06501m777n881J2301j3278j2746j2319K5025M967o082n763K5341K5434p794
7469D30929r588k2794J6890K4622l3434j4426J0222J201q561r0J7311j294J0724
7456D21712k0486j7076j4588L346K6650O716J3267n1739J2635K5026k1457K8819
$$ y = [441284, 442063, 444182, 446382, 457213, 472884, 435500, 430807, 445711, 468886, 437248, 418191, 389097, 405077, 450350, 426654, 395308, 412363, 409706, 404178, 440969, 445705, 433687, 425376, 436486, 426103, 437922, 459365, 464002, 462816, 482786, 497832, 500168, 495479, 494287, 497687, 532919, 538674, 535436, 524025, 487308, 466384, 475767, 485338, 503022, 490432, 501924, 479622, 453109, 445397, 426042, 429620, 433419, 439177, 449716, 464559, 458649, 439846, 411479, 417929, 427845, 407816, 395757, 406501, 401724, 395843, 408144, 394866, 382120, 369801, 394826, 399793, 393711, 387948, 413289, 438723, 430929, 421341, 398547, 415437, 440059, 406625, 392199, 402421, 403622, 395061, 394971, 412282, 410988, 421712, 401226, 384150, 369562, 372908, 399558, 406274, 419541, 367802, 380437, 405463, 384006, 412825]
7444D12825q62k4059J891J5334J07l3633K955P393j7849K0091L653k1093J3497
7431C80250n51R906j497O639j6529J1971k529k3532q574K757j0674J887P793o987
7417C50330K372M938J1153k440l690q245j7308J3972J1515M046r295K187k8033
7404C31502n426K0045j5358j1784K1456J7270J4731N290k3232m714P430j6889
7392C40321K972J766j9418K3496j3837O781J0460J6077j692K4083j1331q414l796
7379C67468Q460J8563j0830P57K754j3098j7747l104L2788m166k4018p058K0611
7366C71380k852r643J1389J6130k5659J8974J9789K622j2954R171k41j2608k774
7353C82724p098J9081O450m981J7905j6960Q080j001k3836R254q402m365M391
$$ y = [412825, 411963, 387904, 389795, 405129, 405236, 371603, 374558, 381951, 364102, 384193, 387846, 366753, 380250, 379699, 389605, 388108, 394747, 378218, 390189, 387660, 364128, 355554, 358311, 347637, 349524, 357317, 350330, 352702, 357640, 368793, 366353, 362663, 354418, 337110, 351082, 362597, 366643, 357348, 359535, 331502, 326076, 346121, 330763, 318979, 340435, 357705, 372436, 377726, 354494, 349780, 357210, 340321, 343293, 345059, 325641, 349137, 335300, 342081, 352541, 368618, 366926, 391009, 379678, 371264, 367468, 375928, 394491, 383661, 384418, 387172, 374074, 356327, 353223, 386011, 381845, 357827, 350769, 371380, 368528, 358885, 370274, 386404, 360745, 379719, 399508, 402130, 389176, 398347, 398106, 385498, 382724, 375626, 394707, 401157, 396176, 414081, 397121, 405201, 404200, 380364, 389618, 381216, 376851, 381242]
7340C81242M1827k0680j6381p855k1204m348J7746Q104j566J0838Q188J3530J1620
7327D21061M75J107j2873q478J5064q670N939J443j1973j349j8112M865M096J6384
7313D08979M23j6640J283k530l295J9475k3826J6399q315P529N693O724J2627
7300D24526l2915l020j316M522O106K1553k3165k7321J524L5607K2459n7245k4659
7287C46656L5298n998j6018q200J6086J9795q602o8474J2392J8432O41J7404k5237
7274C34175L42J8906O85k3782K6767n741j7528J5111P157O032m347J237o936L0632
7260C82710K40j2722j4833L5204Q914k0169L2222j3904l488K5955J6891j0896
7248D26124R09l2060j063j602o556L2356m30r069J2023Q349J8994J2283K935P476
$$ y = [381242, 423069, 402389, 386008, 378153, 356949, 352601, 370347, 378451, 376885, 387723, 395911, 409441, 421061, 421536, 422643, 409770, 401292, 416356, 407686, 413625, 415068, 403095, 401746, 383634, 388499, 392595, 408979, 409402, 392762, 394045, 391515, 388220, 407695, 383869, 400268, 391953, 399482, 405175, 411899, 424526, 391611, 388591, 387275, 391797, 397903, 419456, 396291, 368970, 370494, 406101, 428560, 371315, 346656, 381954, 375956, 359938, 351738, 367824, 387619, 379017, 310543, 322935, 341367, 342008, 359412, 334175, 334517, 353423, 354108, 330326, 357093, 351352, 333824, 348935, 356092, 362124, 357777, 359014, 352078, 382710, 382950, 370228, 355395, 390599, 399513, 379344, 411566, 397662, 394174, 420129, 437020, 426124, 427033, 394973, 393910, 392308, 385752, 418108, 417678, 408609, 420632, 428981, 447975, 460258, 463193, 470669]
7234D70669J5539K594l3232K7275L8399q032K29m016L3962J2856O263J2419l0006
7221E44919K4005K8666o449J5392J1545Q509K7894K0975J9942j257K005K5998
7209G22144K2189K6885J2506N4291K6766J7400J1949K1662q54K7782N0745J4016
7197A007481n238o166L4663M9841M190j39J5498M3989L6754N6627N0014J5162
7185A302676L9860K7868K7848J3977J6835j55K571j5909J0811J2730n4195o1526
7173A323391m2128j3910o849l3242p6725k8031j5228o628j2289j7286N575j9223
7161A057427j4871K52k489R160k5564J0037J7936q948L2135O128J8355L0898J8584
7148A149040M2258L5289M4083M2062K0698N6854N4611P3577N7219O0649O1850
$$ y = [470669, 486208, 488802, 455570, 482845, 521244, 513212, 513441, 509425, 543387, 556243, 562506, 574925, 544919, 568924, 597590, 591141, 606533, 618078, 626587, 654481, 675456, 695398, 694141, 696146, 722144, 744333, 771218, 783724, 838015, 864781, 882181, 894130, 915792, 914938, 942720, 993465, 1007481, 1002243, 996077, 1030740, 1080581, 1084771, 1084632, 1100130, 1144119, 1180873, 1237500, 1287514, 1302676, 1342536, 1370404, 1398252, 1412229, 1429064, 1428909, 1431480, 1415571, 1426382, 1439112, 1384917, 1323391, 1281263, 1267353, 1260504, 1227262, 1150537, 1122506, 1107278, 1100650, 1088361, 1071075, 1076650, 1057427, 1042556, 1042808, 1040319, 1049479, 1023915, 1033952, 1051888, 1042940, 1075075, 1081203, 1099558, 1130456, 1149040, 1191298, 1226587, 1270670, 1312732, 1333430, 1390284, 1444895, 1518472, 1575691, 1636340, 1698190]
7137A698190P6867Q5263J29439J15326J12832J04578J37133K02841J94560K02159
7127C059188K34580K64141L04408L36835L76652M47338M99864N44431O74952P25251
7117G467640Q55186J070658J236581J396394J504170J578570J534826Q87784m72355
7108A7059454j687425j989739j803724j466960j177180r73294q03973o51772n06001
7099E999386m50766l91496l56323k87076k44800k19441k04081j81916j83619j20884
7089C358984j42653j41830q1546p3648j04508q3594n9797l7589o2775n0224m7663
7078B473157o4037o2272r2813q8131q1009r7722q3933q0524p6397o2519p4205
7067A609595q0684p9526o0816l5862k7473n0456k6018l3754k3309m0922k6396
$$ y = [1698190, 1775057, 1860320, 1989759, 2105085, 2217917, 2322495, 2459628, 2662469, 2857029, 3059188, 3293768, 3557909, 3862317, 4199152, 4575804, 5023142, 5523006, 6067437, 6742389, 7467640, 8322826, 9393484, 10630065, 12026459, 13530629, 15109199, 16644025, 17531809, 17059454, 15372029, 13382290, 11578566, 10111606, 8934426, 7961132, 7157159, 6505387, 5999386, 5548620, 5157124, 4800801, 4513725, 4268925, 4049484, 3845403, 3663487, 3479868, 3358984, 3216331, 3074501, 2992955, 2919307, 2814799, 2731205, 2671408, 2633819, 2571044, 2520820, 2473157, 2409120, 2346848, 2254035, 2165904, 2084895, 1987173, 1903240, 1822716, 1746319, 1683800, 1609595, 1528911, 1449385, 1388569, 1352707, 1325234, 1274778, 1248760, 1215006, 1191697, 1150775, 1124379]
7056A124379j9886k3938k5976k1503j2807q752P581P376R780o316m4J1753L1008
7043A072655L2881J9292J9135m769K6441K8771N9354J8750J0210J462k2794k716
7031A258672l560j1874l2946p521m2162l4774l7135l7719o6075o0998m0130k4291
7019H59487l0758m6703l321k6364m2980k3915j5262j0068k6105m3798K869l2965
7007E60117q754J8917j2041l1121o483p761p115K0188j9799m980l5714k7878k0899
6994D16677O272q46N957n649Q173O41J3468M062J0998j8127k4689J8726J5321
6981D50984k4071r842r039k185J2567M486j9413k3292J1633q771K4378r744L63
6968C98054p926j8295K547R984J1711j5742k2603k1027K0881j0385n060k934j816
$$ y = [1124379, 1104493, 1080555, 1054579, 1033076, 1020269, 1011517, 1019098, 1026474, 1036254, 1029938, 1029894, 1041647, 1072655, 1105536, 1124828, 1143963, 1139194, 1165635, 1194406, 1253760, 1272510, 1282720, 1284182, 1261388, 1258672, 1255112, 1243238, 1210292, 1202771, 1160609, 1125835, 1088700, 1050981, 984906, 923908, 883778, 859487, 828729, 782026, 778705, 752341, 709361, 685446, 670184, 660116, 634011, 590213, 593082, 560117, 551363, 570280, 558239, 527118, 520635, 512874, 505759, 525947, 506148, 501168, 465454, 437576, 416677, 422949, 422103, 428060, 422411, 430584, 431225, 444693, 448755, 459753, 441626, 416937, 435663, 450984, 426913, 417071, 408032, 405847, 418414, 422900, 403487, 380195, 391828, 383057, 407435, 397691, 398054, 390128, 371833, 374380, 384364, 396075, 380333, 357730, 336703, 357584, 347199, 342139, 339205, 337389]
6955C37389j0269J0741K685r417j6949J1973l0677m111Q901J3042m041l680J8653
6942C24240m297k5982K3135K371l7163O641N811P869K0605j1968l2872j1730j8257
6929B48403k126o365K7005L210Q634j964Q628r561O226n237p174q669j3043o23
6915B47344J9732K6959k5859k6911M1424r120J6122J177n80l382O084J7570q198
6902C02362l0845J9111M093K0086j3394L007J0213K2824j9017j7467K2291P239
6890C30503K5778J3606K856j0837n057J2847K0625L073n974R806J4434K7102Q262
6877D47024j6414j3125J7107J463j946K9430k0707j4925K5229K5233p190J8570
6865D89749Q485j0746Q186O939K869J0454J9348r205K7526L4532q514J9299j933
$$ y = [337389, 327120, 337861, 340546, 331129, 314180, 326153, 295476, 291365, 300266, 313308, 309267, 305587, 324240, 319943, 293961, 317096, 319467, 282304, 288945, 294756, 302625, 323230, 311262, 278390, 266660, 248403, 246277, 239912, 266917, 270127, 278761, 276797, 285425, 275864, 282090, 276853, 269679, 261010, 247967, 247344, 267076, 294035, 268176, 241265, 282689, 273569, 289691, 290868, 290288, 286906, 292990, 310560, 302362, 271517, 290628, 294721, 314807, 301413, 304420, 314633, 337457, 318440, 300973, 323264, 330503, 356281, 369887, 372743, 361906, 356849, 369696, 390321, 393394, 387420, 397226, 411660, 438762, 447024, 430610, 417485, 434592, 436055, 434109, 463539, 442832, 427907, 453136, 478369, 471179, 489749, 498234, 487488, 495674, 502613, 505482, 515936, 535284, 526079, 553605, 588137, 579623, 598922, 596989]
6852E96989k6398q679j5072j3466J5314J3140r730k8047j8610p585J7057l8843
6840D76070j4779l4481j7634j3868k974O205o202o576k7568J768K889l186m770
6827C54894k6811J8522k0766l4228m542M185J3490k9871k313J3265J6904j2049
6815B90680j7334J0329J6495Q91k4437m551j5322l426j4900J3838r448R227J0048
6802B62090k002k6412r144r398K0705P027o714k030J1941j8308j6742J7008k11
6789B27810M970k0005L053l410j203P325L4947j4469j6518J0807l30o835p248
6776B18894j9799J3280N655k8805J6011Q79n103k400K2740M2888l1269j300l495
6763B28176r868j016k687K2799N462k8445j0093k4343n933K4718P88o247R116
$$ y = [596989, 570591, 561912, 546840, 533374, 548688, 561828, 552098, 524051, 505441, 497856, 514913, 476070, 461291, 426810, 409176, 395308, 392334, 398539, 392337, 385761, 358193, 359961, 362850, 359664, 354894, 328083, 346605, 325839, 291611, 287069, 291254, 304744, 274873, 272560, 285825, 302729, 290680, 273346, 283675, 300170, 301061, 276624, 272073, 256751, 253325, 238425, 252263, 242815, 252042, 262090, 260088, 233676, 224532, 215134, 235839, 242866, 236152, 234122, 246063, 227755, 211013, 228021, 227810, 232780, 212775, 215828, 212418, 211215, 218540, 253487, 239018, 222500, 233307, 232977, 226142, 218894, 199095, 212375, 218030, 189225, 205236, 206115, 201012, 198612, 221352, 264240, 232971, 231671, 228176, 218308, 217292, 214605, 237404, 242866, 214421, 204328, 179985, 174052, 198770, 199558, 193311, 202427]
6750B02427K4475M591J6845k0777j4594j262R32j1155N666n256l8104K8141k566
6737A89363q74J9450j9058j847r504K896k599Q427K8091P802m777k086j1498J311
6723B05097l180O751J7492j3531M505j9846J6887R845J5249k3538K427J6211j9219
6710B15150R563L100K0121L0527j1089j9287n697J0241j102j3042J1998p295L718
6697B46906K69l23j968j4498k063k1628J0845k4857K6085Q16L597J559q288l218
6683B13234j624j1520j5307k4610J7764L2153J0342P303k4726K410l408J0368
6671B12379K3737K4758n4150l138Q393Q80j2165j2163J2036j3475K722m914O019
6658A90919K01j7401l00J3403L1829j0960j4777r804M640Q816k6163J0859p165
$$ y = [202427, 226902, 231493, 248338, 227561, 212967, 211705, 212637, 201482, 207148, 201892, 163788, 191929, 189363, 188489, 207939, 188881, 187034, 177530, 180426, 177827, 186254, 214345, 222147, 217370, 215284, 203786, 205097, 201917, 208668, 226160, 212629, 217134, 197288, 214175, 224020, 239269, 215731, 218158, 234369, 215150, 224713, 227813, 247934, 278461, 267372, 248085, 242388, 252629, 251527, 238485, 250483, 243188, 246906, 247175, 246852, 244884, 230386, 228323, 206695, 217540, 192683, 218768, 219584, 223181, 224740, 216452, 213234, 211610, 200090, 184783, 160173, 177937, 210090, 220432, 227735, 203009, 205419, 202011, 212379, 236116, 260874, 206724, 203586, 211979, 212859, 200694, 188531, 200567, 187092, 189814, 184900, 190919, 191120, 173719, 173419, 186822, 218651, 207691, 192914, 183110, 187750, 196566, 170403, 181262, 174097]
6645A74097k855M735R790K7768k1464J9531k269J059N407K985k280J541j4415
6632B03630k8808J6226r849k8337J4178J5480K6484O024k9513j034K015J826J850
6619A90172K0921K5242J6925p098m9073o448L1793m1388j2050J0168J3073K0219
6607B12456L461P684J8968l1755j3395K214K8981k575j1698J2666j4684J4692
6595B27015Q830k637N965J4954R48L698l1013J0192L7093r458j5955L715K728
6582B56075K5236j7770q495M3643j472R027J4074j0394j8681j2222P006j5856
6570B70171L4222k3614O022M2255M657j0638l693k1743l019O428K7691P645j411
6557C34973O881J3508P525L1310L7008j3911j6124m338p571l9621o669J8982j7200
$$ y = [174097, 171242, 175977, 185767, 213535, 192071, 211602, 209333, 210392, 215799, 218784, 216504, 218045, 203630, 174822, 191048, 181199, 152862, 167040, 182520, 209004, 215028, 185515, 184481, 186496, 188322, 190172, 211093, 236335, 253260, 246162, 197089, 190641, 222434, 181046, 168996, 179164, 192237, 212456, 215917, 223601, 242569, 210814, 197419, 199633, 228614, 226039, 214341, 227007, 212323, 227015, 235845, 233208, 239173, 254127, 255075, 258773, 227760, 237952, 275045, 265587, 249632, 253347, 256075, 281311, 263541, 255046, 298689, 297217, 306244, 320318, 309924, 291243, 279021, 286027, 270171, 304393, 280779, 286801, 329056, 333713, 323075, 319382, 297639, 294620, 301048, 328739, 336384, 334973, 341854, 355362, 362887, 394197, 431205, 417294, 401170, 396832, 389261, 349640, 342971, 361953, 344753]
6544C44753m1547l768l518j2378o77n877K1288J6560O805o902j6246j535q131
6531B88827j652K4970J3540l138o866j907k1074j5116J181l3696K0421J968N928
6518B73386k8850K301O386p135J2811J9841j1305K991k610J8414o021l0430M135
6505B53914Q711K585Q247Q045k3098k749J7272j1250j7182P620J6677P603J0783
6492B87178p057n914J511J756O786q735j0058K0546L514j5689j0208L677M781
6479B72088j0001q778j3502j36k1424J9630L1864j6749n156L362j8265m185J1245
6466B39993n463J4863R301R828J9864j8996j9287J7930j674M861L798m118j5530
6453B55370P955p403r685J9752r440j1982k5988J0913J6210m881L12O969j899
$$ y = [344753, 303206, 299438, 295920, 283542, 282865, 276988, 298276, 314836, 321641, 314739, 298493, 296958, 288827, 287175, 312145, 325685, 322547, 315681, 313774, 292700, 277584, 278765, 245069, 265490, 267458, 273386, 244536, 246837, 253223, 246088, 258899, 278740, 267435, 270426, 267816, 286230, 280209, 249779, 253914, 262625, 265210, 273457, 281502, 258404, 255655, 272927, 261677, 244495, 252115, 268792, 276395, 287178, 280121, 274207, 275718, 277474, 284260, 275525, 265467, 286013, 289527, 273838, 263630, 267307, 272088, 262087, 253309, 239807, 239671, 218247, 237877, 269741, 252992, 247836, 251198, 232933, 228748, 239993, 234530, 249393, 258694, 268522, 288386, 269390, 250103, 268033, 266359, 271220, 275018, 270900, 255370, 263325, 255922, 246237, 265989, 256549, 244567, 218579, 229492, 245702, 240821, 241133, 248102, 246203]
6440B46203q457J7878j5553K6732R011q335M717n472J387J3995j3364q194O673
6427B67221l158J3271L675K2390k7760O202o18N964J4414J6501j1640J1445J0636
6414C28543m756m123J2648M905O144J852j5058n808n784K5425J3331J1419K38
6401C68976K7188j0344l8117j2011L749K8930k3989O518j0484P817K1141j0342
6389C59032j2632j1329Q174K0934J8496O765n0704o520J9443l927n698M289k0036
6376C26287J0737K6005j1422R480j6596j4832R077j6182P766J3693M690K2232
6364C70935J979k2766K1839J5494k5141L3753J2371l919j3391j1672j4572L3340
6352C98250j6089L93K5548P744j3718k9343J9595k652J063Q682L4779m986J0658
$$ y = [246203, 237746, 255624, 240071, 266803, 275814, 267479, 272196, 266724, 268111, 282106, 268742, 260548, 267221, 264063, 277334, 281009, 303399, 275639, 281841, 281223, 287187, 301601, 318102, 306462, 317907, 328543, 323787, 319664, 332312, 337217, 343361, 345213, 330155, 324347, 318563, 343988, 357319, 368738, 368976, 396164, 385820, 347703, 335692, 339441, 368371, 344382, 350900, 340416, 348233, 369374, 359032, 346400, 335071, 343245, 364179, 382675, 389440, 338736, 332216, 351659, 347732, 342034, 346323, 326287, 337024, 363029, 351607, 361087, 344491, 329659, 338736, 322554, 330320, 344013, 348703, 370935, 372914, 350148, 371987, 387481, 362340, 396093, 408464, 404545, 391154, 379482, 364910, 398250, 382161, 382554, 408102, 415846, 402128, 372785, 392380, 389728, 390791, 399473, 434252, 429266, 439924]
6339D39924n159l1893M4260l27M95M800l189J0620R916r366J6772j2215l5496
6326D29142j7322J2660K4131j6141Q853Q799J4405Q124j6301P69l0796J8510R397
6313D54230Q991J8220k441J5257p01J5539J2274J2932m740p237J2725M3164M1802
6300F20015K198o172m811K216M0260J8405M2993J5386k8864Q022P165M5843J7857
6287G80513j1624Q629K3212j7543K4673r215q976J4523J9232o524k6988j0339
6275G79573j3964Q118j622q074L458o654j0696O211k323J6254j3619R626J6476
6262G82764q07P970J8289J3784J4842o383n923J6038J1586J6020p104l9692k658
6249H18726L254l969J4023l1690j3686o099q836L9165j2367k2575M51l143n190
$$ y = [439924, 434765, 402872, 447132, 446805, 447300, 452100, 448911, 459531, 469447, 460081, 476853, 464638, 429142, 411820, 424480, 448611, 432470, 441323, 450122, 464527, 472651, 456350, 457119, 426323, 444833, 454230, 463221, 481441, 479000, 494257, 493556, 509095, 521369, 534301, 529561, 522324, 535049, 578213, 620015, 622213, 616041, 611230, 613446, 653706, 672111, 715104, 730490, 701626, 709648, 716813, 762656, 780513, 768889, 777518, 800730, 783187, 807860, 798645, 789669, 804192, 823424, 816900, 789912, 779573, 765609, 773727, 772105, 764031, 767489, 760835, 750139, 756350, 754027, 770281, 756662, 766288, 782764, 781957, 789927, 808216, 822000, 836842, 830459, 824536, 840574, 852160, 868180, 861076, 821384, 818726, 821980, 818011, 832034, 800344, 786658, 780559, 771723, 810888, 798521, 775946, 776397, 773254, 768064]
6236G68064J560J3703K4209j0446K3719K2580N354Q627o823m772k5088j4120J1261
6223H17828L6195j720Q003M160J3647j507j0686j5818r350R025l9187R114R794
6210H29498P023O882k0039K1694r267l0267J0397j013K94o275L0469J4649j306
6197H52739K0582r820O229R732j05M601l741o406J1090P552j3215J4758L500J2914
6183I10410N572n1J9972J1590n421j0477J9752J0262J2418j9914k405L5240J2370
6170I99318P504K245J9655K5083r796k812L6321R604K935J3165R339L3848M0421
6157A186830J4995K8165L9582L0231K4491K5538O367L588K7488J71n597p999r506
6144A364344K6615K0237R306O902j0956k9308K8157N678k7666j9906l5653J2195
$$ y = [768064, 769624, 783327, 807536, 797090, 820809, 843389, 848743, 857370, 850547, 845775, 820687, 806567, 817828, 854023, 852303, 860306, 864466, 878113, 876606, 865920, 850102, 840752, 849777, 810590, 819704, 829498, 836521, 843403, 823364, 845058, 835791, 805524, 815921, 814908, 815202, 808927, 839396, 854045, 852739, 873321, 863501, 869730, 879462, 879357, 883958, 880217, 873811, 884901, 892453, 879238, 893996, 897496, 910410, 915982, 915931, 935903, 947493, 942072, 931595, 951347, 961609, 974027, 954113, 951708, 986948, 999318, 1006822, 1009067, 1028722, 1053805, 1044009, 1041197, 1077518, 1087122, 1090057, 1103222, 1112561, 1146409, 1186830, 1201825, 1229990, 1269572, 1299803, 1324294, 1349832, 1356199, 1359787, 1387275, 1387446, 1381849, 1373850, 1364344, 1390959, 1411196, 1420502, 1427404, 1416448, 1387140, 1415297, 1420975, 1393309, 1373403, 1337750, 1349945]
6132A349945n724j6931m38J6383o560m096o827j6160J7898j2422L4911L5382O031
6119A391392j5700n25K7380K1980M8050J4173j4068L4413J4944J2307P7147L6153
6107A647646K4705K728K3322M4641K0571m718K2821L8950K6382K231L0402N1897
6095A931578J6547o496N4825L2841M6803L7244J9485J5561K8097M0740M5168M7813
6083B310206L0693M4060K4536M2040P0450M5428Q0360N4352N8291O0626P9816
6072B900858O9920N7735Q5317P1477R3016R0770J02879J37702J52027J34650J79290
6061D075641J52780J78332J89207K31106K30536K52770K93816L00137L28814L33688
6051F566827L34879L75168L54949L45130L19798K75291K29894K14702J49732J09744
$$ y = [1349945, 1344221, 1327290, 1326852, 1343235, 1336675, 1332579, 1325752, 1309592, 1327490, 1315068, 1349979, 1385361, 1391392, 1375692, 1375167, 1402547, 1424527, 1472577, 1486750, 1472682, 1507095, 1522039, 1534346, 1611493, 1647646, 1672351, 1675079, 1698401, 1743042, 1763613, 1758895, 1781716, 1820666, 1847048, 1849279, 1879681, 1931578, 1948125, 1941629, 1996454, 2029295, 2076098, 2113342, 2132827, 2148388, 2176485, 2217225, 2262393, 2310206, 2340899, 2384959, 2409495, 2451535, 2521985, 2567413, 2647773, 2702125, 2760416, 2821042, 2900858, 2970778, 3028513, 3113830, 3185307, 3278323, 3369093, 3471972, 3609674, 3761701, 3896351, 4075641, 4228421, 4406753, 4595960, 4827066, 5057602, 5310372, 5604188, 5904325, 6233139, 6566827, 6901706, 7276874, 7631823, 7976953, 8296751, 8572042, 8801936, 9016638, 9166370, 9276114]
6041I276114Q8438N5588N8306M4172M9629O7332M2964J376j2365l7980l6219j24579
6029I472776j96364k09418k23677k59300k44938k33383k24807k04541j64456j48708
6019G363184j18866j09701j16059p4122l7963k7649o6913j7886l2601j2592l4657
6008F714175k2999n108J0064m572L3998j6327J0830Q5270N3031R8135J00467J29169
5996G186133J35622K00533K20482K30184K56774K82464L13128L39213L41155M02124
5986I907812M15945M27915M35742M59706M91075M87916M69174L88406L78763L30602
5976A4193056K68956K06511J39022O8885J9355o114l0299l6462m3169p4664r2413
5965A4612664j14440j70987k09013k94003l31222m24560m64072n01628n15273
$$ y = [9276114, 9364552, 9420140, 9478446, 9522618, 9572247, 9639579, 9682543, 9683919, 9671554, 9633574, 9597355, 9472776, 9276412, 9066994, 8843317, 8584017, 8339079, 8105696, 7880889, 7676348, 7511892, 7363184, 7244318, 7134617, 7018558, 6944436, 6906473, 6878824, 6811911, 6794025, 6761424, 6748832, 6714175, 6691176, 6686068, 6696132, 6691560, 6725558, 6709231, 6720061, 6805331, 6858362, 6956497, 7056964, 7186133, 7321755, 7522288, 7742770, 7972954, 8229728, 8512192, 8825320, 9164533, 9505688, 9907812, 10323757, 10751672, 11187414, 11647120, 12138195, 12626111, 13095285, 13483691, 13862454, 14193056, 14462012, 14668523, 14807545, 14876430, 14895785, 14889671, 14859372, 14822910, 14779741, 14705077, 14612664, 14498224, 14327237, 14118224, 13824221, 13492999, 13068439, 12604367, 12102739, 11587466]
5956A1587466n24249n13308m88745m88221m14902m14364l80732l41134l55322
5947G666489l01219k46920k52446k28415k18768j87385j82977j74074j38749j61005
5937E574531j39588j12872j14248q4585p9625p1865q8564l6943m5875j2030N249
5926D793585j269K3205R645N9672M6052P0213P9103J23204J41128J51787J64614
5915E660939K06947K50112K33149K40638K82542L10951K89716K69059K85645K37638
5905H267336J84902J55596P4416L6077k8342j15114j44554j63591j83131j98640
5895G884955k22626j98076j29387j02333m8948k7780J8754O8405Q7577P7658R2467
5884G500666J19750J17575P4504N0152M2210M282n1646j30019j61938k05733k18722
$$ y = [11587466, 11063217, 10549909, 10061164, 9572943, 9158041, 8743677, 8362945, 8021811, 7666489, 7365270, 7118350, 6865904, 6637489, 6418721, 6231336, 6048359, 5874285, 5735536, 5574531, 5434943, 5322071, 5207823, 5123238, 5043613, 4971748, 4883184, 4846241, 4800366, 4788336, 4793585, 4792316, 4815521, 4825166, 4884838, 4930890, 5001103, 5080206, 5203410, 5344538, 5496325, 5660939, 5867886, 6117998, 6351147, 6591785, 6874327, 7185278, 7474994, 7744053, 8029698, 8267336, 8452238, 8607834, 8682250, 8718327, 8689985, 8574871, 8430317, 8266726, 8083595, 7884955, 7662329, 7464253, 7334866, 7232533, 7183585, 7155805, 7174559, 7242964, 7330541, 7408199, 7500666, 7620416, 7737991, 7812495, 7862647, 7904857, 7909139, 7857493, 7727474, 7565536, 7359803, 7141081]
5873G141081k26450k36845k85974k80672k46155k76301k16915j91028j60389j30201
5863D890151j24516p9752p1596n6510m2387j411M151M7975N1827J4247N0554Q1320
5851D764053N1218J6939l5527l0985k1522j0496R294K9596P3105M6736N7316O3434
5839E013161J9999k338k9982m7510l4948l9768k8682k0818J6301K9006K7231N0509
5827D952161P0864R1295J25304J23113J08374J49900J44484J77571J90550K24250
5817F357866K13993K50156K84364K79979L13596L35228L76886M25411M13812M55470
5807I706761M55481M62569M69604M64556N35303N55298N70319N56980N21877M84528
5797A4783276M41495L33524K40143J32515L6814k6378n2286o4191p0631r3471
$$ y = [7141081, 6914631, 6677786, 6391812, 6111140, 5864985, 5588684, 5371769, 5180741, 5020352, 4890151, 4765635, 4685883, 4614287, 4557777, 4515390, 4513979, 4518130, 4566105, 4617932, 4632179, 4682733, 4764053, 4815271, 4832210, 4796683, 4765698, 4744176, 4733680, 4742974, 4772570, 4845675, 4892411, 4949727, 5013161, 5033160, 5030822, 5000840, 4953330, 4918382, 4878614, 4849932, 4829114, 4845415, 4874421, 4901652, 4952161, 5023025, 5114320, 5239624, 5362737, 5471111, 5621011, 5765495, 5943066, 6133616, 6357866, 6571859, 6822015, 7106379, 7386358, 7699954, 8035182, 8412068, 8837479, 9251291, 9706761, 10162242, 10624811, 11094415, 11558971, 12094274, 12649572, 13219891, 13776871, 14298748, 14783276, 15224771, 15558295, 15798438, 15930953, 15967767, 15941389, 15889103, 15824912, 15754281, 15660810]
5787A5660810r2749j00349j14200p8828o5894m3154k1416L0967J4768k9854o6919
5776A5093182o2341j18120k14679k82138l69793l63351m07636m27448m13416m18492
5766A2015768l74607l24235l08240k66834k46825j77551j01104r6401o6793l9961
5756A0013217J662P571j6434j8339k7308l4570n0709k8873N8441P6409J30124
5745A0111191J84804J56421K01105K27892K10929J74986J72564J56861J34584
5736A1731337Q6684N3169M7276N3737P2058J58005J88371J82032J85771J42324
5726A2900764R9305p375p1123j65533k08949k74224k55435k04458k08263k05634
5716A1399075j53368q3224m7131k9680J035K2190L1911L8959J8558m153m2035
$$ y = [15660810, 15568061, 15467712, 15353512, 15274684, 15208790, 15165636, 15144220, 15175187, 15189955, 15160101, 15093182, 15030841, 14912721, 14698042, 14415904, 14046111, 13682760, 13275124, 12847676, 12434260, 12015768, 11641161, 11316926, 11008686, 10741852, 10495027, 10317476, 10216372, 10119971, 10053178, 10013217, 10014879, 10022450, 10006016, 9987677, 9960369, 9925799, 9875090, 9846217, 9904658, 9981067, 10111191, 10295995, 10452416, 10653521, 10881413, 11092342, 11267328, 11439892, 11596753, 11731337, 11818021, 11871190, 11918466, 11972203, 12044261, 12202266, 12390637, 12572669, 12758440, 12900764, 13000069, 12992694, 12921571, 12756038, 12547089, 12272865, 12017430, 11812972, 11604709, 11399075, 11245707, 11162483, 11115352, 11085672, 11086707, 11108897, 11140808, 11179767, 11198325, 11194172, 11152137]
5705A1152137j23796j95682k05786k27350k11328k45532k66652k60666k30442
5696I184903j92205j40928q5503o3630k8328J9416K9637O9163Q4038L5679j7962
5685H894280n9318j50551j73141k08239j96718j61680j30151r0085j13375j01299
5675G509723r6373j29696j55337k24292k76177k97587k99726l16014k87489k63591
5665E163441k10473j98004j95253j68624j53021j24645j19619p8292q9529j01377
5655C724604n8821o7623j04062o1481m9668n8080q8290m7067l8260m5605m3148
5644C062499m4431m3363l2373j7296j5678l4419k816j9499n2646l1993Q254J9698
5632B795937r161k4260J0928j6811j0452K641k3926J581k5827J9492K7248q995
$$ y = [11152137, 11028341, 10832659, 10626873, 10399523, 10188195, 9942663, 9676011, 9415345, 9184903, 8992698, 8851770, 8766267, 8702637, 8674309, 8693725, 8723362, 8792525, 8876563, 8912242, 8894280, 8834962, 8684411, 8511270, 8303031, 8106313, 7944633, 7814482, 7724397, 7611022, 7509723, 7413350, 7283654, 7128317, 6904025, 6627848, 6330261, 6030535, 5714521, 5427032, 5163441, 4952968, 4754964, 4559711, 4391087, 4238066, 4113421, 3993802, 3915510, 3825981, 3724604, 3665783, 3598160, 3494098, 3432617, 3382949, 3324869, 3236579, 3189512, 3151252, 3105647, 3062499, 3018068, 2974705, 2942332, 2925036, 2909358, 2874939, 2872123, 2852624, 2799978, 2767985, 2776239, 2795937, 2786776, 2762516, 2773444, 2756633, 2746181, 2748822, 2724896, 2726477, 2700650, 2720142, 2747390, 2738395]
5620B738395P451K3691J5784Q00M6708J3156N377J7640N178L4787L5049L0354
5608B974370L9485J7549L7544j3198j8046l3273k477J6039K0201K781J3115M1014
5596C095104L8406N8868L0546P503K4927L3685M992K9845K6537N924M3801O5700
5584C465838O3894N7756M9122Q5797Q4746J02168Q6639J16551J02499Q4013L9500
5573D338523L265n9040l7211l6397o7122k9595P892J0991J3265L4305M3625L3844
5561D256345m069j9353m6623j6281n8941l0633k3210j9289m0486n6907o416N154
5549C939291K0354J8324L0476N2447J09036P0761O0020P0218K3687m6140p0892
5538D277582q0558n4222o3609l9475l6780l0483p259p898l9975n8860r9054j25071
$$ y = [2738395, 2745846, 2769537, 2785321, 2786121, 2832829, 2845985, 2851362, 2869002, 2874180, 2908967, 2944016, 2974370, 3013855, 3031404, 3068948, 3055750, 3037704, 3004431, 3001954, 3017993, 3038194, 3040975, 3054090, 3095104, 3133510, 3192378, 3222924, 3230427, 3255354, 3289039, 3294031, 3323876, 3350413, 3356337, 3400138, 3465838, 3529732, 3587488, 3636610, 3722407, 3807153, 3909321, 3995960, 4112511, 4215010, 4299023, 4338523, 4341788, 4282748, 4245537, 4209140, 4142018, 4112423, 4120315, 4131306, 4144571, 4178876, 4222501, 4256345, 4252276, 4232923, 4186300, 4170019, 4111078, 4080445, 4057235, 4037946, 3997460, 3940553, 3934137, 3939291, 3959645, 3977969, 4008445, 4060892, 4169928, 4240689, 4300709, 4370927, 4394614, 4348474, 4277582, 4197024, 4142802, 4079193, 4039718, 4002938, 3972455, 3965196, 3957298, 3917323, 3858463, 3759409, 3634338]
5526C634338q8945j04785q2882n7452l221K808q167o771l0716K0061K7627K4765
5514C326660j364j7636l006k0999k4835j6340m5750n6789m9019k8720K096j1288
5502C053010j5148J4298M0795K7403L489j9587K3901K4606J4379J8754L8598O4157
5490C288655R3077P4613Q2328N2556l211k3257k8409j05196j13714o3854q3803
5479C169785q1251k6597k6488l1547k6541j3202L13J4182N4287J2901J4628L8993
5467C099463N6483N9145Q1472M7003O3839Q0029J25358J09150Q677j6847n0251
5456C663521q7648r3904j02093q5208n7568o1285o3803l9908L071k2619J344Q40
5444C054740J7132J4565O2361O3012O2019R9792Q8552J00304J29220J28029J48702
$$ y = [3634338, 3545393, 3440608, 3357726, 3300274, 3297053, 3299861, 3291694, 3284923, 3254207, 3274268, 3301895, 3326660, 3325296, 3307660, 3304654, 3283655, 3258820, 3242480, 3196730, 3139941, 3090922, 3062202, 3064298, 3053010, 3037862, 3052160, 3092955, 3120358, 3123847, 3104260, 3128161, 3152767, 3167146, 3185900, 3224498, 3288655, 3381732, 3456345, 3538673, 3591229, 3588018, 3564761, 3536352, 3431156, 3317442, 3253588, 3169785, 3088534, 3061937, 3035449, 3003902, 2977361, 2964159, 2964472, 2978654, 3032941, 3045842, 3060470, 3099463, 3155946, 3215091, 3296563, 3343566, 3407405, 3487434, 3612792, 3721942, 3730619, 3713772, 3663521, 3575873, 3481969, 3379876, 3294668, 3237100, 3175815, 3112012, 3072104, 3075175, 3052556, 3053900, 3054740, 3071872, 3086437, 3148798, 3211810, 3273829, 3373621, 3462173, 3562477, 3691697, 3819726, 3968428]
5433C968428R7650J20293R8000O7879P8787L1746M9359K6236L045l5034n2098
5422D454291k0936l982k8764K4309L7715M7693J03468Q1490J26096J35250J04383
5411E061013J10725Q0286O7585J6701J9801L7054K5356J0229l4546k4706J9680
5400E389178n905l7826m8269m1311q9635j23529j10016p7469o3349j0932p687
5389D773250R722L5199K8999M8366J02183P7565J6707k8808k0190K7234M5918
5378E116145O1007O3941Q5912J23800Q2741M7006M8688L0103J1909M37p3244o9604
5366E528841l2563m8976n5608k4608J5746K7858N333J6415J8261K0741N8728O0032
5354E590200O0715J19327J42553J39700J95288J67952J44620J55913J51919R4060
$$ y = [3968428, 4066078, 4186371, 4284371, 4352250, 4431037, 4462783, 4512142, 4538378, 4541423, 4506389, 4454291, 4433355, 4429373, 4400609, 4424918, 4462633, 4510326, 4613794, 4695284, 4821380, 4956630, 5061013, 5171738, 5252024, 5319609, 5336310, 5356111, 5393165, 5418521, 5428750, 5394204, 5369498, 5389178, 5383273, 5345447, 5297178, 5255867, 5166232, 5042703, 4932687, 4855218, 4791869, 4780937, 4773250, 4782972, 4818171, 4847170, 4895536, 4997719, 5075284, 5091991, 5063183, 5042993, 5070227, 5116145, 5177152, 5241093, 5327005, 5450805, 5533546, 5580552, 5629240, 5659343, 5671252, 5671689, 5598445, 5528841, 5496278, 5447302, 5391694, 5367086, 5382832, 5410690, 5416023, 5432438, 5450699, 5471440, 5530168, 5590200, 5650915, 5770242, 5912795, 6052495, 6247783, 6415735, 6560355, 6716268, 6868187, 6962247]
5344F962247M6203K1059j8593o2451q5504q6883n2633o3107k450k0183J1887K7629
5332F677221J8014K7588M1255L2743L6988Q9991J00189J47459K31105K10210K56712
5321G869475K87829K84320L17048K75373K87471K66489K55930K71001K92957L10648
5311A0718541L18929L65922L74825M01666M19125M53016M53158M59811M67441
5302A4432434M93006N13262M85976M82235M73364M52092M45094M50061M10868
5293A8638392L62735L50871L04452K53386J96544J09617P2872O9094J2506r985
5283B0360484l5949q9016j36944j78025k10016k30349k45380k81231k92626l03925
5273A8357023l16926l41791l34709l51384l31938l96216m20156l86525l90526
$$ y = [6962247, 7008450, 7029509, 7010916, 6948465, 6862961, 6776078, 6723445, 6660338, 6657888, 6637705, 6649592, 6677221, 6695235, 6722823, 6764078, 6796821, 6833809, 6923800, 7023989, 7171448, 7402553, 7612763, 7869475, 8157304, 8441624, 8758672, 9034045, 9321516, 9588005, 9843935, 10114936, 10407893, 10718541, 11037470, 11403392, 11778217, 12179883, 12599008, 13052024, 13505182, 13964993, 14432434, 14925440, 15438702, 15924678, 16406913, 16880277, 17332369, 17777463, 18227524, 18638392, 19001127, 19351998, 19656450, 19909836, 20106380, 20215997, 20288869, 20357963, 20370469, 20360484, 20324535, 20235519, 20098575, 19920550, 19710534, 19480185, 19234805, 18953574, 18660948, 18357023, 18040097, 17698306, 17363597, 17012213, 16680275, 16284059, 15863903, 15477378, 15086852]
5264A5086852m03911m26705m34982m30470m10781m09653l86090m01225l97516
5255A1385519l44545l30738l23171l18448k70511l03951l05969k67825k41067
5246H679294k33973k09530j75006j59460j29790q6445o0512o4119o4233m3116
5236G453110j1212J1945K1749P7955P8683R1447J07464J07263J65856K14961J83413
5225H502634J91804J84298J92666J76052K02784K02061K30595K07203J99727J50951
5215A0440775Q7893L5720j1213k7783p1704n0051l8796l7120r728k0077j7181
5204A0280735O311l4475K3452M3751L6762N6897P2250N3085M3015L1798L5642
5193A0649223m8561o7882k5109j137k3360r49l528k7543m908k806n1628m6467
$$ y = [15086852, 14682941, 14256236, 13821254, 13390784, 12980003, 12570350, 12184260, 11783035, 11385519, 11040974, 10710236, 10387065, 10068617, 9798106, 9494155, 9188186, 8920361, 8679294, 8445321, 8235791, 8060785, 7901325, 7771535, 7685090, 7624578, 7560459, 7496226, 7453110, 7441898, 7453843, 7475592, 7553547, 7632230, 7723677, 7831141, 7938404, 8104260, 8319221, 8502634, 8694438, 8878736, 9071402, 9247454, 9450238, 9652299, 9882894, 10090097, 10289824, 10440775, 10528668, 10564388, 10553175, 10525392, 10453688, 10403637, 10364841, 10327721, 10317993, 10297916, 10280735, 10287046, 10252571, 10276023, 10319774, 10356536, 10413433, 10485683, 10538768, 10581783, 10613581, 10649223, 10600662, 10532780, 10507671, 10506534, 10483174, 10482225, 10478697, 10451154, 10446246, 10443440, 10391812, 10345345]
5181A0345345o7209q2307n9145r6617j12451j42341j23417j09238j24381o5550
5171I362689q3248q0315r7091p7172r5645j07352j79231j80843j91426j99817
5161H070549j32235j31969j25181j16982r6742j01068j24218j36741j33086j27060
5151F845267j48340j42446j25799j45243j20673j10978r7873q7978p1004p1235
5141E723698q9537n5846m7284p3074q0765r6431r0339r4616q6005l6376o8130
5130D905295q5240o6780q5830o7730p0560q1356n4184n6631p3874m5093m5005
5119D173012l7247j6112j1318m7233j1179j7111O928J8127k3643L764J7916K1733
5107D077637J1101p575n574P2285R021K1087K5890J2684L0906J5263L5961K3061
$$ y = [10345345, 10278136, 10195829, 10136684, 10040067, 9927616, 9785275, 9661858, 9552620, 9428239, 9362689, 9279441, 9199126, 9102035, 9024863, 8929218, 8821866, 8642635, 8461792, 8270366, 8070549, 7938314, 7806345, 7681164, 7564182, 7467440, 7366372, 7242154, 7105413, 6972327, 6845267, 6696927, 6554481, 6428682, 6283439, 6162766, 6051788, 5953915, 5865937, 5794933, 5723698, 5634161, 5578315, 5531031, 5457957, 5377192, 5280761, 5190422, 5095806, 5009801, 4973425, 4905295, 4820055, 4753275, 4667445, 4599715, 4529155, 4447799, 4393615, 4336984, 4263110, 4218017, 4173012, 4135765, 4119653, 4108335, 4061102, 4049923, 4032812, 4039740, 4057867, 4034224, 4037988, 4055904, 4077637, 4088738, 4081163, 4075589, 4147874, 4156895, 4177982, 4203872, 4216556, 4247462, 4262725, 4298686, 4321747]
5095D321747L0179L0818L6099L9740L8541K8510O7374N1835N1288M9733O6957
5084D812821P0217J2999K5192N7293N3887K0418L2333J1366J0976J9131O422n850
5072E127205O921L3196Q754O368L4888M1579L1309M9273O2360Q7422P7131N7737
5060E624143P7599Q2390N0222R3199P9817L3706N9796O9815M9525O9494M5088
5049F334794L3331K2977M4916N9726P4397Q9735P3771Q1595J00307Q3157Q0735
5038G079441N4457O3091N5676M3775L3694K7906O4819P7588P1397O9243N1561
5027G692648N6935K3352M4089L9762N1864O5365R4799J40099J21830J54773J86020
5016H671536J55336J80558K04197K13890K37109K40950K58132K60263K87066K76877
$$ y = [4321747, 4351926, 4382744, 4418843, 4458583, 4497124, 4525634, 4593008, 4644843, 4696131, 4745864, 4812821, 4883038, 4896037, 4921229, 4978522, 5032409, 5052827, 5085160, 5096526, 5107502, 5126633, 5133055, 5127205, 5134126, 5167322, 5176076, 5182444, 5217332, 5258911, 5290220, 5339493, 5401853, 5489275, 5566406, 5624143, 5701742, 5784132, 5834354, 5927553, 6007370, 6041076, 6100872, 6170687, 6220212, 6289706, 6334794, 6368125, 6391102, 6436018, 6495744, 6570141, 6659876, 6733647, 6815242, 6915549, 6998706, 7079441, 7133898, 7196989, 7252665, 7296440, 7330134, 7358040, 7422859, 7500447, 7571844, 7641087, 7692648, 7749583, 7772935, 7817024, 7856786, 7908650, 7974015, 8068814, 8208913, 8330743, 8485516, 8671536, 8826872, 9007430, 9211627, 9425517, 9662626, 9903576, 10161708, 10421971, 10709037, 10985914]
5006A0985914K99715L18792L22239K92062L35598L13935L21618L87818M30114
4997A4007805M69017M80593M73681N66351O14991O33330O32123P22195P65386
4988A9365472Q02612R02497R34078R80288J028391J126739J174910J200617J273340
4979B8788944J334075J363893J366140J386411J433242J442410J456752J512365
4971D0084232J580877J688832J815359J908369K038496K145261K176784K183592
4963E5621802K200768K249006K296058K386021K619095K905097L211946L657661
4955G7147454M104844M614517N080183N465371N546312N277436M361525K695753
4947A14293395P52247q58357j724186j814379j425254r07471l70184J50986O57720
$$ y = [10985914, 11285629, 11604421, 11926660, 12218722, 12554320, 12868255, 13189873, 13577691, 14007805, 14476822, 14957415, 15431096, 15997447, 16612438, 17245768, 17877891, 18600086, 19365472, 20168084, 21070581, 22004659, 22984947, 24013338, 25140077, 26314987, 27515604, 28788944, 30123019, 31486912, 32853052, 34239463, 35672705, 37115115, 38571867, 40084232, 41665109, 43353941, 45169300, 47077669, 49116165, 51261426, 53438210, 55621802, 57822570, 60071576, 62367634, 64753655, 67372750, 70277847, 73489793, 77147454, 81252298, 85866815, 90946998, 96412369, 101958681, 107236117, 111597642, 114293395, 115045642, 114187285, 112463099, 110648720, 109223466, 108315995, 107945811, 108096797, 108754517]
4938A08754517J152467J696494K266424K926677L667374M447633N251508O144917
4930A36308011P195172Q204252R278433J0383943J1543083J2767837J4110217
4923B09790948J5681940J7358643J9279514K1305071K3489926K5709734K7643843
4916C60259619K8681430K8174063K5494029J9578939R169493n170640j9684808
4909D46502125k9753594l3979625l3791266l1309975k8028500k4722920k1626857
4902B43289388j8909624j6566195j4513918j2840763j1379210j0156973r098260
4895A49824445q237281p491891o778382o180991n698270n282252m924473m610755
4887A00620150m330638m023137l680508l376678l111316k922036k768831k639021
$$ y = [108754517, 109906984, 111603478, 113869902, 116796579, 120463953, 124911586, 130163094, 136308011, 143503183, 151707435, 160985868, 171369811, 182912894, 195680731, 209790948, 225472888, 242831531, 262111045, 283416116, 306906042, 332615776, 360259619, 388941049, 417115112, 442609141, 462188080, 471357573, 466186933, 446502125, 416748531, 382768906, 348977640, 317667665, 289639165, 264916245, 243289388, 224379764, 207813569, 193299651, 180458888, 169079678, 158922705, 149824445, 141587164, 134095273, 127316891, 121135900, 115437630, 110155378, 105230905, 100620150, 96289512, 92266375, 88585867, 85209189, 82097873, 79175837, 76407006, 73767985]
4879G3767985k539059k429245k336405k193093k058088j867412j679992j524291
4871E7140400j344774j217488j097605r77387r15508q32609p78152p25437o75937
4862D8575503o55013o80578p24551p52534q26595q53304q63827q19355q06989
4853D1592757p30290o17361n31705n12343m55168m40697m10706l90504l55072
4844C7148911l37249l08753k57411k48894k51629k76131k87642k31852j54798
4835C4794552j17177m3548O0577K10191M03706N34167O42760P60647Q77279R85940
4825C9109094J102900J245558J261288J189813R13965M05955k00431o89541r34408
4816D3404193r13004q29576o73093n88198n46240n23528n19295n52939n32249
$$ y = [73767985, 71228926, 68799681, 66463276, 64270183, 62212095, 60344683, 58664691, 57140400, 55795626, 54578138, 53480533, 52503146, 51587638, 50755029, 49976877, 49251440, 48575503, 47920490, 47239912, 46515361, 45762827, 44936232, 44082928, 43219101, 42399746, 41592757, 40862467, 40245106, 39713401, 39201058, 38745890, 38305193, 37894487, 37503983, 37148911, 36811662, 36502909, 36245498, 35996604, 35744975, 35468844, 35181202, 34949350, 34794552, 34677375, 34633827, 34694404, 34904595, 35308301, 35842468, 36485228, 37245875, 38123154, 39109094, 40211994, 41457552, 42718840, 43908653, 44822618, 45228573, 45028142, 44338601, 43404193, 42491189, 41661613, 40988520, 40400322, 39854082, 39330554, 38811259, 38258320, 37726071]
4807C7726071m84913m43410m16301l74496l02758l47616l65899m39109m97265
4798C4054304n49301n46580n56775n04497m79288m54501l76801l94804m13399
4789B9778358m60561n06952n85052n76782n56642n40595n22801n13072n18198
4780B4997703n26218n80905o13328o69339p77493p88894q05365q10431p79270
4771A8646460p29374o84913o11842n74712n13869m93989m70145m00185l44970
4762A3822461l46454l33214k88297k59180k72609j99715k15992k07711j86078
4753A1513211j91466j64245j58887j72019j84693j67494j54835j26006j32826
4744A0060740j15892j04831o4443r4988p6290j9727k4152n4340K53J4823M1850
$$ y = [37726071, 37241158, 36797748, 36381447, 36006951, 35704193, 35356577, 34990678, 34551569, 34054304, 33505003, 32958423, 32401648, 31897151, 31417863, 30963362, 30586561, 30191757, 29778358, 29317797, 28810845, 28225793, 27649011, 27092369, 26551774, 26028973, 25515901, 24997703, 24471485, 23890580, 23277252, 22607913, 21830420, 21041526, 20236161, 19425730, 18646460, 17917086, 17232173, 16620331, 16045619, 15531750, 15037761, 14567616, 14167431, 13822461, 13476007, 13142793, 12854496, 12595316, 12322707, 12122992, 11907000, 11699289, 11513211, 11321745, 11157500, 10998613, 10826594, 10641901, 10474407, 10319572, 10193566, 10060740, 9944848, 9840017, 9775574, 9680586, 9604296, 9584569, 9560417, 9506077, 9506330, 9521153, 9563003]
4733I563003K9370M7655N5265O5904J16184J23692J14304J40066J26856J31742
4723A0514041J07661R0099J11270J17310J38407J30032J61209J93510J98931J89902
4713A1952372K21333K21003K01061J82482J30421J24703J06922J30953Q4752Q3490
4703A3439492O7650L9625N6727P3741Q6771R7309P1936P4013J23256J18431Q9356
4692A4338307M6636m1864q9677j55221j86001j78036j96300j58723j54326j38821
4682A3085974j43228j67851j79933k12071k66693k34613k67053k20454k32315
4673A1161763k11637j80079j89539k18217k38895k85009l16684l18316k83751
4664H919636k58541j99143k18593j78451j27703j70880j35866j75550j84740k13939
$$ y = [9563003, 9592373, 9640028, 9695293, 9761197, 9877381, 10001073, 10115377, 10255443, 10382299, 10514041, 10621702, 10711801, 10823071, 10940381, 11078788, 11208820, 11370029, 11563539, 11762470, 11952372, 12173705, 12394708, 12595769, 12778251, 12908672, 13033375, 13140297, 13271250, 13356002, 13439492, 13507142, 13546767, 13603494, 13677235, 13764006, 13861315, 13933251, 14007264, 14130520, 14248951, 14338307, 14384943, 14343079, 14253402, 14098181, 13912180, 13734144, 13537844, 13379121, 13224795, 13085974, 12942746, 12774895, 12594962, 12382891, 12116198, 11881585, 11614532, 11394078, 11161763, 10950126, 10770047, 10580508, 10362291, 10123396, 9838387, 9521703, 9203387, 8919636, 8661095, 8461952, 8243359, 8064908, 7937205, 7766325, 7630459, 7454909, 7270169, 7056230]
4654G056230k25202k24215k60337j92027j82284j82681j29577j51906j26264r0835
4644E290902j06706p1300m2691o1631p6808m6351o1853p4856n9482o4471n9405
4633D565348k7029m6193q6153o3803m2585n7117j3565j0450l5249N134m1337l967
4621D143034K9354l548K0189K7401L2949M4896P5949P8905N6991Q4789J06967
4610D697876R7257J15921J42015J40623J25086R4734P3670j7238p4164j17999
4600E277781j65568j86788j83341j72790j46981j01205j06911j01088r8648m1635
4590C972826p6089n4876m4828p0021m7083m4635p4728n0345k7652q0004r0418
4579C312147p6572n9135n9730l9822o3466n1459l8124n9037n7065j8306k7173
$$ y = [7056230, 6831028, 6606813, 6346476, 6154449, 5972165, 5789484, 5659907, 5508001, 5381737, 5290902, 5184196, 5112896, 5070205, 5008574, 4931766, 4885415, 4823562, 4748706, 4689224, 4624753, 4565348, 4538319, 4492126, 4405973, 4342170, 4299585, 4242468, 4228903, 4218453, 4183204, 4188338, 4147001, 4143034, 4172388, 4168840, 4189029, 4216430, 4249379, 4294275, 4370224, 4449129, 4506120, 4590909, 4697876, 4795133, 4911054, 5053069, 5193692, 5318778, 5413512, 5487182, 5469944, 5395780, 5277781, 5112213, 4925425, 4742084, 4569294, 4422313, 4321108, 4214197, 4113109, 4014461, 3972826, 3896737, 3841861, 3797033, 3727012, 3679929, 3635294, 3560566, 3510221, 3482569, 3402565, 3312147, 3235575, 3176440, 3116710, 3076888, 3013422, 2961963, 2923839, 2864802, 2807737, 2789431, 2762258]
4568B762258j4852l1136k9034m7721l3765n154k9366m7703N34m2873q487K230
4556B474931K192m740k1296l123k9983j8146r362k1336j2718m080j4081l7386
4544B300872j8386j6350l0544r595l117J9894m3507O821O828j8833Q365k3396
4532B179052J5908k0384J075M8810J2j1560j415K2612J9052K0471O382K638j4670
4519B267983j0016m2092n4600j7953n9100m3082k8973l3953k9063k6753r527j4878
4507A897993l206j7408l9825m8530j2577N386j0290k7158m5709K22j0468k0208
4495A668222m0742k480r113j5843o20Q789l2246m9889j7472l3776k0195l5206
4483A419429N312J6820M01m1385k0135m235l688R024j3305k3553j7089M348J9187
$$ y = [2762258, 2747406, 2716270, 2687236, 2639515, 2605750, 2600596, 2571230, 2523527, 2524061, 2481188, 2472701, 2474931, 2477123, 2472383, 2451087, 2447964, 2417981, 2399835, 2390473, 2369137, 2356419, 2352339, 2338258, 2300872, 2282486, 2266136, 2235592, 2225997, 2222880, 2242774, 2199267, 2206088, 2212916, 2194083, 2202448, 2179052, 2194960, 2174576, 2175651, 2224461, 2224473, 2212913, 2211498, 2234110, 2253162, 2273633, 2280015, 2282653, 2267983, 2257967, 2215875, 2161275, 2143322, 2084222, 2041140, 2012167, 1978214, 1949151, 1922398, 1912871, 1897993, 1894787, 1877379, 1837554, 1789024, 1776447, 1781833, 1771543, 1744385, 1698676, 1698898, 1688430, 1668222, 1627480, 1625000, 1615887, 1600044, 1599424, 1608213, 1575967, 1526078, 1508606, 1474830, 1454635, 1419429, 1424741, 1441561, 1441962, 1400577, 1380442, 1376207, 1372519, 1381543, 1368238, 1344685, 1327596, 1331944, 1351131]
4470A351131j325k528Q29k955k4528N872j3935r236j0638K327J6275J990K5813
4457A339092J3905J685j0874k783j0185o280Q191j4422j358K6077J3250l456L487
4444A356329l264p614O796L558q263P989q110m984q983L7431n920j9600K3889
4431A369254l999j1785L910j2215k1739n713k4270K693j3534k3153J9065K0806
4419A299320j2771k5223j6911j9286M320j3333P577K3608k4274j5469o716N706
4407A206548l501q146J755k3052k427j2160j4860J0374K5304k100M003L3461k0297
4394A194902k1575K132J2603J2552J3674K5897L0857J7290L3840N698J577j6667
4382A312780k9810m1428j6195q541k0817q874j0047k6523K0872J7558j675k6420
$$ y = [1351131, 1349806, 1347278, 1348107, 1345152, 1320624, 1326496, 1312561, 1303325, 1292687, 1295014, 1311289, 1313279, 1339092, 1352997, 1354682, 1343808, 1341025, 1330840, 1324560, 1332751, 1318329, 1316971, 1343048, 1356298, 1352842, 1356329, 1353065, 1345451, 1352247, 1355805, 1347542, 1355531, 1347421, 1342437, 1333454, 1370885, 1364965, 1345365, 1369254, 1365255, 1353470, 1357380, 1345165, 1323426, 1317713, 1293443, 1296136, 1282602, 1259449, 1278514, 1299320, 1286549, 1261326, 1244415, 1225129, 1229449, 1216116, 1223693, 1247301, 1223027, 1207558, 1200842, 1206548, 1203047, 1194901, 1196656, 1173604, 1171177, 1159017, 1144157, 1154531, 1179835, 1177735, 1181738, 1215199, 1194902, 1173327, 1175459, 1188062, 1200614, 1214288, 1240185, 1271042, 1288332, 1322172, 1327870, 1329447, 1312780, 1282970, 1241542, 1225347, 1216806, 1195989, 1187115, 1177068, 1150545, 1171417, 1188975, 1187300, 1160880]
4370A160880j4069j1294K2025J439n641p255j804J6603J5042J0732Q459J9698
4358A214815J5545K7281K3354K3800P184P906J5837N723j676R018J2399k1450
4346A339736k4604l5018j8437j2056l543J1944l6610j8141k9041j3126j8415k2043
4334A120646n885M612P082M318m027k9230o323J2027N799o167L0L0411J5638J9510
4320A168441K4883M2801J9263K8399K5297J8990j5541r530j4968l7432l0355p941
4308A212307K6703M218j7588M448k4269q508N310J8923r980k8758J7338Q994K1839
4295A230977K3076M7626P55K3963M3030L6680J7339N9870O1623R1834Q1720Q1344
4283A799837R2966N337p3487j06185r5208p2997l7434m9443l3472l3030m3341
$$ y = [1160880, 1146811, 1135517, 1157542, 1158981, 1153340, 1146085, 1144281, 1160884, 1175926, 1186658, 1195117, 1214815, 1230360, 1257641, 1280995, 1304795, 1311979, 1319885, 1335722, 1341445, 1339769, 1348787, 1361186, 1339736, 1315132, 1280114, 1261677, 1249621, 1246078, 1258022, 1221412, 1203271, 1174230, 1161104, 1142689, 1120646, 1114761, 1119373, 1126455, 1130773, 1126746, 1097516, 1091193, 1103220, 1109019, 1102852, 1102882, 1133293, 1148931, 1168441, 1193324, 1236125, 1255388, 1283787, 1309084, 1328074, 1312533, 1303003, 1288035, 1250603, 1220248, 1212307, 1239010, 1243228, 1225640, 1230088, 1205819, 1197311, 1202621, 1221544, 1211564, 1182806, 1200144, 1209138, 1230977, 1254053, 1301679, 1302434, 1326397, 1369427, 1406107, 1423446, 1483316, 1544939, 1636773, 1718493, 1799837, 1892803, 1898140, 1824653, 1718468, 1623260, 1550263, 1512829, 1463386, 1429914, 1396884, 1353543]
4272A353543p163m109j2266p986l2401J4072J3251r554M04P041J005J8073r248
4259A324662o596p964n1573n0643n198l8384j6139l7759k7572j7089p251m372
4247A054122J6544K3515Q145k817L5037J4508p412M1559J4026L9961K057M0566
4235A279811M9244J0769M1577O2620K6777k3617o0856m2556m8047n3920n8194
4224A183608p4942o0838J95n5902j5504j7713j9509q813j0295k1974l2596q747
4212H56970m272j4681k3072q320j51k5420m285N564m195J7995k9543j8133j6176
4199G32281N36K031n174j1615K0995J7687O203j6293o619l8089q848N663j2704
4186F86054p334Q345j8978j3237Q870N13m187M433r977L224O507m520j4451M745
$$ y = [1353543, 1346380, 1342271, 1330005, 1322019, 1289618, 1303690, 1316941, 1307387, 1307791, 1314832, 1315837, 1333910, 1324662, 1318066, 1310102, 1258529, 1207886, 1202688, 1164304, 1148165, 1110406, 1082834, 1065745, 1058494, 1054122, 1070666, 1094181, 1102326, 1099509, 1134546, 1149054, 1141642, 1183201, 1197227, 1237188, 1239245, 1279811, 1329055, 1339824, 1381401, 1444021, 1470798, 1447181, 1386325, 1343769, 1295722, 1241802, 1183608, 1108666, 1047828, 1048023, 992121, 976617, 958904, 939395, 930582, 920287, 898313, 865717, 856970, 852698, 838017, 814945, 806625, 806474, 781054, 776769, 782333, 778138, 796133, 766590, 748457, 732281, 732817, 734848, 729674, 718059, 739054, 756741, 762944, 746651, 740032, 701943, 693095, 698758, 686054, 678720, 687065, 668087, 654850, 663720, 664233, 660046, 664479, 654502, 657726, 664233, 659713, 645262, 650007]
4172F50007J8403k0346M097j3910J8173k6031j7308L1652K2366p683n912k0750
4160F32758k982L133R634j0018m1398M128j0513N591m510J4901j2632p569J6417
4147E96940o614J6496l3604R179k578l27K534Q673q989J8694J9154k2674o609
4134E90275L2524j663k9087P265l2362K6383J7659j0811R755M130j065L796L7439
4121F54238N329j5928N13N357j7910j1661J5404l976J320J793J3850J3591j7290
4108F44630p759L038N730j5355O162j1403j3773K6712j779j9342j6431J638J5066
4095F17134j3693k2423L415J4822q728j2565J6693J7796m673j5610L7113P738
4083F37019j8657l723j9435K0151J1461k5412j3539r503L7401K4725K9355k0057
$$ y = [650007, 668410, 648064, 652161, 638251, 656424, 630393, 613085, 644737, 667103, 659420, 653508, 632758, 629776, 632909, 642543, 632525, 591127, 595255, 584742, 590333, 585823, 600724, 588092, 580523, 596940, 590326, 606822, 573218, 582397, 579819, 579492, 582026, 590699, 581710, 600404, 619558, 596884, 590275, 622799, 621136, 592049, 599314, 566952, 593335, 610994, 600183, 609938, 614068, 613003, 616799, 654238, 659567, 643639, 644152, 649509, 631599, 619938, 635342, 631366, 632686, 634479, 648329, 661920, 644630, 636871, 639909, 645639, 630284, 636446, 625043, 611270, 637982, 636203, 616861, 600430, 602068, 617134, 603441, 581018, 584433, 599255, 590527, 577962, 594655, 612451, 607778, 592168, 629281, 637019, 618362, 614639, 595204, 615355, 626816, 601404, 587865, 578362, 615763, 640488, 669843, 649786]
4071F49786k0492J0875J7182J0902K1552k473J7651K5361J4039Q030M366K6793
4059G83572J7864K5785k1535K3317j3620j6077J4094J5102l6201j9347J2121J3856
4047G98931P303j4967J3416K1523K0283l751m022N259J4438J1489J1259o89P966
4034H88438l130J1592J3392N397K3720L4354J6106K8105L2391M0744K3364L7621
4022A152094L5583K2323L5693L4908J2245M246j6382P113j876P403k067j8268
4010A273015k4154O417R689Q43k6351l0770o724q216j38O330J9460k3691j8933
3997A176777m0153l4517k5175k4260j6289r857l7877l917l8033k4329j0399j3028
3985H98943Q587k1266j6778j1505l3245j076n729L832O407r443k2269k8122K949
$$ y = [649786, 629294, 640169, 657351, 668253, 689805, 687332, 704983, 730344, 744383, 752413, 756779, 783572, 801436, 827221, 805686, 829003, 815383, 799306, 813400, 828502, 792301, 772954, 785075, 798931, 806234, 791267, 804683, 826206, 846489, 842738, 838716, 843975, 858413, 869902, 881161, 880472, 888438, 885308, 896900, 910292, 915689, 939409, 973763, 989869, 1017974, 1050365, 1091109, 1114473, 1152094, 1187677, 1210000, 1245693, 1280601, 1292846, 1297092, 1280710, 1287823, 1285947, 1293350, 1291283, 1273015, 1248861, 1255278, 1264967, 1265810, 1239459, 1208689, 1201965, 1193749, 1193611, 1199941, 1219401, 1195710, 1176777, 1136624, 1102107, 1076932, 1052672, 1036383, 1026526, 988649, 984732, 946699, 922370, 911971, 898943, 907530, 886264, 869486, 857981, 824736, 823660, 817931, 821763, 828170, 818727, 796458, 768336, 771285]
3972G71285j1596K0575R323r880N89p320m3135r238K3325k4075R529M273p268
3959G26387o054O219j4682Q899J3424K955Q190p843K3655J532l969Q85K577l226
3945G58949p146J3426k1821n571M256q469j5513J3095m5209r452k941J3809j875
3932F85538j7935l0061Q523r958l120K3113l329J408k3451M662J8995M0325J556
3919F96266j9468l5041k6839L27J7400j7697K1064j5243J727J1603J316Q04J3793
3906F50012J254K9678k2822j4317n840R889R44L9227K5476j5702K5765P075n281
3893G25358k6606o606m890J9535o071J927p192j0555J9010K1387R06r41k4580
3880G00682j7186K2976Q164J6062J9803j5797k289J739R923k285N22L068p623
$$ y = [771285, 759689, 780264, 789587, 779707, 780296, 772976, 729841, 720603, 743928, 719853, 729382, 733655, 726387, 720333, 726552, 711870, 720769, 734193, 737148, 745338, 737495, 761150, 762682, 758713, 759598, 762175, 758949, 751803, 765229, 743408, 737837, 742093, 733624, 718111, 731206, 685997, 676545, 673604, 687413, 685538, 667603, 637542, 646065, 636107, 632987, 656100, 652771, 654179, 630728, 635390, 654385, 694710, 696266, 676798, 641757, 614918, 615245, 632645, 614948, 636012, 620769, 622496, 634099, 635415, 636219, 650012, 651266, 680944, 658122, 643805, 637965, 647854, 648798, 688025, 713501, 697799, 723564, 730639, 725358, 698752, 692146, 687256, 706791, 700720, 702647, 695455, 684900, 703910, 725297, 726203, 725262, 700682, 683496, 706472, 714636, 730698, 750501, 734704, 732415, 734154, 744077, 741792, 742314, 745382, 737759]
3867G37759J0248o371K2823L4303O686j976M819n168J7239J6795J8079M545M493
3854H64274K3410J701J8898K8361K0548K2073K1637L0233L3874L3972O0448M1471
3842A200900L794L4852L9860J2179M8229M0012J3311M0291J7720J9183L3575j1920
3830A491986k1334r536P862j3311j391l0855l9410j3255l6374k2719k9445k8717
3818A253501m7882m1674k6673n3735k7442l6254l1806k0264m1186j4153N591k5758
3806H92265l7402k0856M700J9459m3707m2711j7966K1164j5828p316M459Q82l1962
3793G25181n976j2977j8529J1259j1999p80N225m068L154P355j2544O352Q101
3780F99754J0081k9292p933J0979J7153M821J5588J722j7309j5691o458K3487
$$ y = [737759, 748007, 741636, 764459, 798762, 805448, 803472, 808291, 803123, 820362, 837157, 855236, 859781, 864274, 887684, 889385, 908283, 936644, 957192, 979265, 1000902, 1031135, 1065009, 1098981, 1159429, 1200900, 1204694, 1239546, 1279406, 1291585, 1339814, 1379826, 1393137, 1433428, 1451148, 1470331, 1503906, 1491986, 1470652, 1461116, 1468978, 1455667, 1454276, 1423421, 1384011, 1370756, 1334382, 1311663, 1282218, 1253501, 1205619, 1163945, 1137272, 1083537, 1056095, 1019841, 988035, 967771, 926585, 912432, 918023, 892265, 854863, 834007, 838707, 858166, 814459, 771748, 753782, 774946, 759118, 751802, 756261, 757143, 725181, 719205, 706228, 687699, 698958, 686959, 686179, 691404, 687336, 690490, 697845, 685301, 691653, 699754, 709835, 680543, 672610, 683589, 700742, 705563, 721151, 722873, 705564, 689873, 683415, 706902]
3768G06902K4055P531j4649k5264k085R969O277o514J999M118k2464O25J5455
3755G05955j6024J1602Q580k1554k4829J7306J2257j9588Q30O152N64K0197P156
3742G08604J3072J9932j6440K0096K649q440j4102j714J4448J9763K8992l152
3730G83708J5417q826j8222N414j428n391q343j3310k2845K471O572L5397r623
3717G60991j5760M143k0099j3385P664J0924l7223N429K657O095k7880J0827K8500
3704G22883r855p00K160j4118k3960J907j7375P732J0796k3963l768p797m102
3691F39840j7918k3699J4004J3433k4941J8975k248L2165r837k5410N265L734
3679F23363J263J3721M888L98L572j4977J1212m143L6757k47K0894L1357k7940
$$ y = [706902, 730957, 738488, 723839, 698575, 696490, 706459, 712736, 706222, 708221, 712339, 689875, 690500, 705955, 689931, 701533, 710113, 688559, 663730, 681036, 693293, 673705, 674535, 680687, 681251, 701448, 708604, 721676, 741608, 725168, 745264, 747913, 739473, 725371, 723657, 738105, 757868, 786860, 783708, 799125, 790299, 772077, 777491, 776063, 770672, 762329, 749019, 726174, 728645, 735217, 770614, 760991, 745231, 749374, 729275, 715890, 723554, 734478, 697255, 702684, 705341, 711436, 683556, 694383, 722883, 713028, 712328, 714488, 700370, 676410, 678317, 660942, 668674, 679470, 655507, 651739, 643942, 639840, 621922, 598223, 612227, 625660, 600719, 619694, 617446, 649611, 639774, 614364, 619629, 623363, 624626, 638347, 643235, 643633, 647205, 632228, 643440, 639297, 676054, 675807, 696701, 728058, 700118]
3666G00118l46k387r447j9018J8623L0500j3845J4243J8527o740j9116j6726J08
3653F94494L8465J4383j1635j4055R607K5859j3332j9551M9003k571j244J8199
3641G87622K1324M490k085p299J734j4231K3622n440K1978j0307J4811J5115Q410
3628H59744N0084r88j9476J2952J9118J6627q784K6789K7096K753J0759L0023
3616A026697K0479n529j258J1170M088J4699L7828n345K0055J607K7731K53J1264
3603A163739J3227j078n074J1053j1814M967p831K7475L9589K8707j6686n955
3591A240319K5809j2926K7320Q605J2361R711P037J0820L3114J8435L932J7298
3579A401835L6598K232J6257L6767J9217L1380N0448N3198K3054L5746N3634M1613
$$ y = [700118, 699772, 697385, 687938, 668920, 687543, 718043, 704198, 718441, 736968, 730228, 711112, 694386, 694494, 732959, 747342, 735707, 721652, 731259, 757118, 743786, 724235, 773238, 770667, 769423, 787622, 808946, 813436, 811351, 804052, 805786, 791555, 815177, 809737, 831715, 821408, 836219, 851334, 859744, 909828, 908840, 889364, 902316, 921434, 938061, 929277, 956066, 983162, 985915, 996674, 1026697, 1047176, 1041647, 1040389, 1051559, 1055647, 1070346, 1108174, 1102829, 1122884, 1124491, 1152222, 1152475, 1163739, 1176966, 1175888, 1170814, 1181867, 1170053, 1175020, 1167189, 1194664, 1234253, 1262960, 1246274, 1240319, 1266128, 1253202, 1280522, 1289127, 1301488, 1311199, 1318236, 1329056, 1362170, 1380605, 1384537, 1401835, 1438433, 1440665, 1456922, 1493689, 1512906, 1544286, 1594734, 1647932, 1670986, 1706732, 1760366, 1801979]
3567A801979M2117M8168M2983O415K6146N1530P388M0500N2234K2668M8186Q6478
3555B276792K8077J4311K1479L5043M2176L9384J0611K4073M4790L4031L6415
3544B607182M8363M4491M5120L8614K6446M0614K9473P9656M7671K6597N7080
3533C091307L8581N3324M1216M5486M7027N1859N0668P8287O8083M9630L9595
3522C655063P1227Q1591P4715O9071J17477J26212J14094J14790J01762J23490
3512D649492J48321J71705J74584J72738K03277J94370K08126K21704K47319K74680
3502F666316K51376K44720K15203J85215J82311J62700J17769L4423L0891J3755
3492H104679l9614j1854Q528j6179K722N785L038N8063P4640N6380J21679J37996
$$ y = [1801979, 1844096, 1892264, 1935247, 1941662, 1967808, 2019338, 2026726, 2067226, 2119460, 2142128, 2190314, 2276792, 2304869, 2319180, 2340659, 2375702, 2417878, 2457262, 2467873, 2491946, 2536736, 2570767, 2607182, 2655545, 2700036, 2745156, 2783770, 2810216, 2850830, 2880303, 2959959, 3007630, 3034227, 3091307, 3129888, 3183212, 3224428, 3269914, 3316941, 3368800, 3419468, 3497755, 3565838, 3615468, 3655063, 3726290, 3807881, 3882596, 3951667, 4069144, 4195356, 4309450, 4424240, 4526002, 4649492, 4797813, 4969518, 5144102, 5316840, 5520117, 5714487, 5922613, 6144317, 6391636, 6666316, 6917692, 7162412, 7377615, 7562830, 7745141, 7907841, 8025610, 8060033, 8090924, 8104679, 8065065, 8053211, 8061739, 8045560, 8048282, 8054067, 8057105, 8115168, 8189808, 8246188, 8367867, 8505863]
3480H505863J49592J54455R0236m5194j76156k65856l28280l06224k71557k00382
3470G306497j83944j26378j39570r1021n4455m9702j4878J3362L8524O8423L5113
3459F801971P8948P6553P6415R1996O1001J00475J20587J66850K26720K98546
3449H100062L75997L98660L42989J56548j80638m82912o24147o26058n27484m70088
3439F462929l75334l06634k68291k37833j53600j17986j05978p0058p1130l5153
3429D720932l0037m1212m091k4222J9330J9901J4923L7109L8793O2379J11423
3418D925228J26041J47011J12063R0583J9969j26629k44097l38710l29224k46096
3408D136139k10999j95612j91291j71019j20946j15154j17084q1252o3498n1249
$$ y = [8505863, 8655455, 8809910, 8900146, 8854952, 8678796, 8412940, 8084660, 7778436, 7506879, 7306497, 7122553, 6996175, 6856605, 6765584, 6711129, 6661427, 6646549, 6659911, 6698435, 6766858, 6801971, 6880919, 6957472, 7033887, 7125883, 7186884, 7287359, 7407946, 7574796, 7801516, 8100062, 8476059, 8874719, 9217708, 9374256, 9193618, 8710706, 8086559, 7460501, 6933017, 6462929, 6087595, 5780961, 5512670, 5274837, 5121237, 5003251, 4897273, 4827215, 4756085, 4720932, 4690895, 4649683, 4645592, 4621370, 4640700, 4660601, 4675524, 4712633, 4751426, 4813805, 4925228, 5051269, 5198280, 5310343, 5400926, 5420895, 5294266, 5050169, 4711459, 4382235, 4136139, 3925140, 3729528, 3538237, 3367218, 3246272, 3131118, 3014034, 2932782, 2869284, 2818035]
3398B818035m1395p5765k7962p3636n5130j0097j4067j5089j2981j4959j9333
3387B457621L347j22j0068n818l8829J0024R822k6979O34k3564k7464l1060l3513
3374B284031l1402m8601k9962m2024k2285m7397l3795o2833o6971k5718l9323
3363A833720n7735l6214m7023m9538j9714l0957l2691l7378p032j3998k8734J4092
3351A486798j6420m8577j1907r386l1140O243o813l9549O258j5051m7568r847
3339A263041k702j7235j5154j9930j1122p693l0641k6660N655j1888O320o442
3327A125549l4237j0768k9310O040J9654L387m569r184j7476J8310J1172l1167
3315A047401j0551N538j2713q127R32m0399j9671J435J9207L547k6172j5409j3491
$$ y = [2818035, 2776640, 2700875, 2672913, 2599277, 2544147, 2534050, 2519983, 2504894, 2491913, 2476954, 2457621, 2460968, 2460846, 2450778, 2444960, 2406131, 2416155, 2425977, 2398998, 2399632, 2376068, 2348604, 2317544, 2284031, 2252629, 2204028, 2174066, 2132042, 2109757, 2062360, 2028565, 1965732, 1898761, 1873043, 1833720, 1775985, 1739771, 1692748, 1643210, 1623496, 1592539, 1559848, 1522470, 1515438, 1501440, 1472706, 1486798, 1470378, 1421801, 1409894, 1400508, 1369368, 1375611, 1368798, 1329249, 1335507, 1320456, 1272888, 1263041, 1260339, 1243104, 1227950, 1208020, 1196898, 1189205, 1158564, 1131904, 1137559, 1125671, 1131991, 1125549, 1091312, 1080544, 1051234, 1057274, 1076928, 1080315, 1075746, 1066562, 1049086, 1067396, 1078568, 1047401, 1036850, 1042388, 1029675, 1021548, 1022480, 982081, 962410, 963845, 983052, 986599, 960427, 945018, 931527]
3302I31527l7502j1178r104J1849K3140k2601k8355j6723k1722j6722J0825k3787
3290G89647k4189N319l527k4037k865L3068J1220l1170o65j3061J4412K4676J3461
3277G92289l2774J095j387J515Q651K6470l1827o084K0442k261j7855k7653L4084
3264G64705J6436k2884M946J5198j0340P692k707J3680m5418O688J1247K426J5076
3251G76745Q392n880K1450n536n495J1616n746j4820j1579L1563M2117M1871l091
3238H81607j86J0384l526L7794K2303J3846n46o302P526j4144j9561L890N713
3225I38798j5261p496K1879R819j5970k038L2788j5783J1333k947j5219r671o314
3212I23918J3541o596j8956J6818N130L0585m969J5242J3756J6108K6641L76J9192
$$ y = [931527, 894025, 882847, 873743, 885592, 908732, 886131, 857776, 841053, 819331, 802609, 813434, 789647, 765458, 770777, 767250, 743213, 740348, 773416, 784636, 753466, 752801, 739740, 754152, 778828, 792289, 759515, 760610, 759223, 760738, 769389, 795859, 764032, 757948, 778390, 776129, 758274, 730621, 764705, 781141, 758257, 763203, 778401, 768061, 775753, 773046, 786726, 741308, 747996, 759243, 761669, 776745, 785137, 779257, 800707, 795171, 789676, 801292, 795546, 780726, 769147, 800710, 842827, 884698, 881607, 881421, 891805, 888279, 926073, 948376, 962222, 961676, 955374, 962900, 948756, 929195, 933085, 938798, 923537, 916041, 937920, 947739, 931769, 929731, 962519, 946736, 958069, 955122, 939903, 930232, 923918, 937459, 930863, 911907, 928725, 933855, 964440, 959471, 974713, 988469, 1004577, 1031218, 1031594, 1050786]
3199A050786K5035j251K6862K5330K0866P936K488L524K0760M1239M9632K6659
3187A299866J5019L8064j2853K2403K5301K1114J9282L624K3985j82k722K7270
3175A480171K4132K5477K0586L1502L730K7451L5145K7217J5599L9794M3835L1155
3163A805794K4652N0191N7757L2387M7501M4174L5797O4085O383K9209M2802R856
3151B250588J0115k327j2698J3033k4372J8335J5017R475L0103K7570L5719P793
3139B378351J0590L8215M5088Q3070O0624M7311N9426O7504O0400O2856L1685
3128B945120K6806R340k2901j4455j5639j1393l135j5202K0165M8533N2015M3714
3116C062968O2657Q0482R6426J28566J54362J65877J26611J42654J25847O3313
$$ y = [1050786, 1075821, 1074570, 1101432, 1126762, 1147628, 1155564, 1158052, 1161576, 1182336, 1223575, 1273207, 1299866, 1314885, 1352949, 1340096, 1362499, 1387800, 1408914, 1428196, 1431820, 1455805, 1455623, 1452901, 1480171, 1504303, 1529780, 1550366, 1581868, 1585598, 1613049, 1648194, 1675411, 1691010, 1730804, 1774639, 1805794, 1830446, 1880637, 1938394, 1970781, 2018282, 2062456, 2098253, 2162338, 2168721, 2197930, 2240732, 2250588, 2260703, 2258376, 2245678, 2258711, 2234339, 2252674, 2267691, 2277166, 2307269, 2334839, 2370558, 2378351, 2388941, 2427156, 2472244, 2555314, 2615938, 2663249, 2722675, 2790179, 2850579, 2913435, 2945120, 2971926, 2981266, 2958365, 2943910, 2928271, 2916878, 2913743, 2898541, 2918706, 2967239, 3019254, 3062968, 3125625, 3206107, 3302533, 3431099, 3585461, 3751338, 3877949, 4020603, 4146450, 4209763]
3106D209763k6896r4081j76039k36575k44659k28016j73892j55972j64241j43714
3096B565678j42670r3443p3427q2077q5480n0114p4517m2381k4905m1919j6093
3085A838652k0972o4116m1685r0121q0273n7711p5652m8508o0187m4184m0239
3074A215004m5140m7811m6355k2254p930n8833k4697l8421l4669l8193l6640P41
3062H14802j284l6279j0520n365k8872r475n2663q774Q673j4126j5150k5104k7977
3049E87886N037J5426k3218j0801j1193J7289p614k6321N046m523j1767m0884
3037D94363o571O726O174j9664K154o257j1142j9560j0964j6923J540O817j6799
3024D09894j9251J1761K118N238M123k7984j162o781j7128n897N220J1362m587
$$ y = [4209763, 4182867, 4088786, 3912747, 3676172, 3431513, 3203497, 3029605, 2873633, 2709392, 2565678, 2423008, 2329565, 2256138, 2174061, 2088581, 2038467, 1963950, 1921569, 1896664, 1854745, 1838652, 1817680, 1753564, 1711879, 1621758, 1541485, 1483774, 1408122, 1359614, 1299427, 1255243, 1215004, 1169864, 1122053, 1075698, 1053444, 1045514, 986681, 961984, 923563, 888894, 850701, 814061, 814802, 813518, 777239, 766719, 761354, 732482, 723007, 670344, 661570, 670243, 656117, 640967, 615863, 587886, 592923, 608349, 585131, 574330, 563137, 580426, 572812, 546491, 551537, 547014, 535247, 494363, 487792, 494518, 500692, 481028, 483182, 476925, 465783, 446223, 435259, 418336, 419876, 426693, 409894, 390643, 402404, 404522, 409760, 413883, 385899, 384737, 377956, 360828, 354931, 360151, 371513, 366926]
3011C66926j9681j9341J1383j01p549N555j3666j7041M242p948J3330K2584j6264
2998C22429l2160k9875J6073j6563j901J2950J947j8010p085p489q677Q59R841
2985B42339l719J062q010O96J3054m246j3099n362K055J8444r882k2821k8981
2972A81530N689J6107j2976j0253J153j189K7715j550j1514k2476J2112O354j4990
2959A75712O040k268K8084j2711j1226K5695j0487k299K8326l1065o331j2640
2947A74830N328k7270Q246J829n559Q081P462k0494k1410J4785J1058P542J0088
2934A74516j3956k5440P471J1316l152p133L1510R302o856n988o665N74J3317
2921A78816J2234j9717j558P709P700j0823n619Q477O514j3195J4044p205k2221
$$ y = [366926, 347245, 327904, 339287, 339186, 331637, 337192, 323526, 306485, 310727, 302779, 316109, 338693, 322429, 290269, 260394, 276467, 259904, 258003, 270953, 272900, 254890, 247805, 240316, 231639, 232498, 242339, 238620, 239682, 231672, 232368, 245422, 241176, 228077, 222715, 224770, 243214, 233332, 210511, 181530, 187219, 203326, 190350, 180097, 181250, 180061, 207776, 206226, 194712, 172236, 184348, 190702, 175712, 181752, 179484, 207568, 194857, 183631, 209326, 198839, 196540, 224866, 193801, 187470, 174830, 180158, 152888, 161134, 162963, 157404, 165485, 172947, 152453, 131043, 145828, 156886, 164428, 174516, 160560, 135120, 142591, 153907, 150755, 143622, 175132, 184434, 177578, 171590, 164925, 165499, 178816, 191050, 171333, 169775, 177484, 185184, 174361, 168742, 177219, 183733, 170538, 184582, 177377, 155156]
2908A55156J1560P990J4414J9196l2533k0219L3192J0599N310M719N085k7604
2896A86865J3169j8941J1468j0767m506j5662p764L1490P465m302k0603l93J7329
2883A84848K5354n661o240J7648L31J7961k2145k6103O851P728K1803J0602L321
2870B36298n297j0186j3709q941K2922n295j4619N686J2658L552J095K6385J8868
2857B69417j3871k3711o449J5059j5882j6588P573k4119P926j6763q20Q042o020
2844A83794J4626J5547j0398K7110N007q700k923j6279j8601k204J5142K389J0785
2831B15295Q452j9304j3810K0426l155j661o181k4678J2935m004j3559J3013k853
2818A80916Q538N830M072j2256o558l9q378L120j9431j6345k4546j3175J4862
$$ y = [155156, 166716, 174706, 189120, 208316, 175783, 155564, 188756, 199355, 204665, 209384, 214469, 186865, 200034, 181093, 192561, 181794, 177288, 161626, 153862, 185352, 192817, 188515, 167912, 167519, 184848, 210202, 204541, 198301, 215949, 216280, 234241, 212096, 185993, 192844, 200572, 222375, 232977, 236298, 231001, 220815, 207106, 198165, 221087, 215792, 201173, 206859, 219517, 223069, 224164, 250549, 269417, 255546, 231835, 225386, 240445, 224563, 207975, 215548, 191429, 199355, 182592, 181772, 189814, 183794, 198420, 213967, 203569, 230679, 235686, 226986, 224063, 207784, 189183, 186979, 202121, 204510, 215295, 223747, 204443, 190633, 211059, 207904, 206243, 200062, 175384, 188319, 184315, 170756, 183769, 180916, 189454, 195284, 199356, 187100, 180542, 180503, 172125, 175245, 155814, 139469, 114923, 101748, 116610]
2805A16610R996Q184P310p988l116J516o600R549l2763k0089K5240J9995k2161
2792A05683k9235K890L743J7367p07J9377j0533j5723j322n162j5355j2149K6636
2779H5510N782j0948J0502R507k6343O628J0496K2975q255j2757j0448M486l1531
2766E5604J3426J4009P278M469q139j7281p242K0806n555J206k746k0713j4804
2753D0318m695o138L1566M877j0746k3645J1551j8520K1934Q615J1392j110k1543
2740D3856j9278K6888O435R66r060L005K21j7524K693P013j1072j6463N530o34
2726B2576K4755o58k7057l2609Q992K6063K0909K162k911J0360P944K0973m1116
2713D0383o539n611k066J7739k3923L56j5467j0743J798P58j2409J675K1340K0347
$$ y = [116610, 126606, 134790, 142100, 134112, 130996, 132512, 125912, 135461, 102698, 82609, 107849, 127844, 105683, 76448, 79338, 83081, 100448, 99741, 119118, 108585, 92862, 91540, 86378, 71023, 58874, 85510, 91292, 80344, 90846, 100353, 74010, 80638, 91134, 114109, 105854, 93097, 82649, 87135, 55604, 69030, 83039, 90317, 94786, 86647, 69366, 62124, 82930, 77375, 78581, 75835, 55122, 40318, 35623, 29485, 61051, 65928, 55182, 31537, 43088, 24568, 46502, 55117, 66509, 65399, 43856, 24578, 51466, 57901, 58867, 49807, 52812, 53033, 35509, 38202, 45215, 34143, 17680, 23210, 22576, 47331, 46673, 19616, -12993, -4001, 22062, 42971, 45133, 42222, 52582, 60526, 81499, 40383, 33844, 28233, 26167, 43906, 19983, 20339, 4872, -5871, -4073, -3315, -15724, -14049, 7291, 27638]
2699B7638J2947m492j852j5217lp712r097J5238j8929L925n214J2292K0766J2058
2685D2348j5127m207j5623j4618j0093O386K6324R711j7496o204J1699L005m90
2672A5615Nj576o725J2280q511J5633M00n730J1464j1822J6396k2592J0238K3957
2658D9032L690j0405k4749J158j6882P666L6534k5148J2759M854O273K097k6219
2645B0660j9234j010J9481K3191j9602L556n2j4856M116J7491J284m595k134l3449
2631e153J5785k660K5142L947K779p885J2553L544k1653p93j7850j583L3351l777
2617C5747J8381k9184j8671R085M233J0936j5738L843p458K7438J4260k0407k5251
2604G214n835q043J6122j9448J5396M46O926M246p39J6042K7966k2810l5600M78
$$ y = [27638, 40585, 36093, 34241, 19024, 19021, 11309, 2212, 17450, -1479, 2446, -2768, 9524, 30290, 42348, 27221, 23014, 7391, -7227, -17320, -10934, 15390, 25101, 7605, 1401, 13100, 16105, 15615, 15620, 14044, 7319, 19599, 11088, 26721, 27121, 21391, 32855, 21033, 37429, 14837, 25075, 49032, 52722, 42317, 17568, 18726, 1844, 9510, 46044, 20896, 33655, 38509, 44782, 46879, 20660, 1426, 416, 19897, 43088, 23486, 27042, 26990, 12134, 16250, 33741, 35025, 30430, 28296, -5153, 10632, 7972, 33114, 37061, 39840, 31955, 44508, 48052, 26399, 25606, 7756, 6173, 39524, 35747, 54128, 24944, 6273, 15358, 19591, 30527, 14789, 18632, 11174, 38612, 52872, 32465, 7214, 1379, -6664, 9458, -9990, 5406, 5852, 12778, 17024, 16285, 32327, 60293, 37483, 1883, 2361]
2590B361j0448J2454J8771m351k9554j9146r62K716O702N119K0167K4187N250
2577C3266j9543j198J2057q025k69k1157M1136r565k3119p165K7199J518L877
2564B9012L724j9561k2493o98j2786K0487R736j2618M541L5717k8068j2773J4344
2551H564P425M862L785J3525l0895l6106j30J8202k0435k000Q172J2325J1234
2538a472J0454o567m944J5120J0636j3723l414K949K2774j4105j6798J5514m738
2525A1686K280r041q665M985J8352j6613j369R095J289j5110K171J9374l458n024
2511I952j3253J0320l914k5173K559J3998J0334K0473j2474k5849P603P585j2818
2498a0657N64J0840K6474N392j5206K598J4207k5930o446j4613J9876o26j6618
$$ y = [2361, -8087, 4367, 23138, 18787, -10767, -29913, -30875, -28159, -21457, -16338, 3829, 28016, 33266, 13723, 12525, 24582, 16557, 16288, -4869, 36267, 26702, 3583, -3582, 23617, 25135, 29012, 32736, 13175, -9318, -10016, -22802, -2315, 7421, -5197, -656, 35061, 6993, -5780, 8564, 15989, 20851, 24636, 38161, 7266, -28840, -28970, -10768, -31203, -33203, -25031, -12706, -1472, 8982, 2415, -2529, 12591, 23227, 9504, 6090, 9039, 31813, 17708, 910, 16424, 11686, 13966, 4925, -3740, 1245, 19597, 2984, 1615, 10710, 11999, -3111, -940, 18434, 14976, 9952, -3301, 7019, 3105, -22068, -19509, -5511, 4823, 25296, 12822, -13027, -5424, 2161, -10657, -10093, 747, 27221, 32613, 17407, 20005, 34212, 8282, 1836, -12777, 7099, 6473, -10145]
2485a0145L405J6314J962J478q710J1909J03P458j4043k1327q36m89J3925m80
2471E24p004j1908K6957K1787l25k55l1245L144p054j1285M218K4614J3192j5806
2457I554j0578j8729L328K1016K2938k3416J7971J4882l1649p3J4327p404R309
2444B1476n0L1939j6263K1862J088k9388J1491L720J2350j0682j4907J8968j4417
2431C7187O280J4240m1866j1260M2825J3932k2712N79R1K0151o174J5431N400
2418G4104k5519L3975L2661k5301K394K9477l020j6775K986J4613N528J1004J5680
2405A51807K6218m66j3234K5008q305J955K4320J6753K0619M134P442K4890J0102
2392B91243J972N3829L7783R822K0535J3205J6198N2401M4023M2914M1276L9574
$$ y = [-10145, -6740, 9574, 11536, 13014, 4304, 16213, 16316, 23774, 9731, -11596, -12432, -12921, 1004, 524, -6480, -18388, 8569, 30356, 30031, 29776, -1469, 1675, -5379, -16664, -12446, 12168, 25360, 9554, -1024, -19753, -16425, 4591, 27529, 4113, 22084, 36966, 5317, 5244, 19571, 12167, 21476, 21426, 53365, 37102, 58964, 60052, 30664, 42155, 45875, 58225, 47543, 32636, 51604, 37187, 43467, 57707, 15841, 4581, 47406, 61338, 38626, 39205, 39296, 59447, 53273, 68704, 74104, 48585, 82560, 115221, 89920, 92314, 121791, 118771, 101996, 104982, 119595, 125123, 136127, 151807, 178025, 177559, 164325, 189333, 181028, 182983, 207303, 224056, 244675, 248809, 256251, 281141, 291243, 293215, 347044, 384827, 394649, 415184, 428389, 444587, 496988, 541011, 583925, 625201, 664775]
2380F64775O8160O9336R6257P8229R8824J19516J34620J29719J32461J24183J50847
2369A866927K07349K04035J96666L07071L48061M08564N37603O12349O63631P19954
2359F072210Q30517Q17303K72138o56237j094139j012500p73513n98205m86098
2350C371476l98424l27442k61566k03333j62776j35766j32051q6653q6672j18184
2340A458609q7011j07000j27332r5685m9300o9798m9776m4435n4455m6181k8701
2329F98935j4461l8728m3419o0100q938j7568k3188k1859j6559k4069m3220j1249
2317C75577N927m6201j6381R270O681k141l6530k6431r423p980k825O216k4226
2304B31533K993k1075j9766J2464k4807j7866J5670K0149k9513r210J0632j6008
$$ y = [664775, 732935, 802271, 898528, 976757, 1075581, 1195097, 1329717, 1459436, 1591897, 1716080, 1866927, 2074276, 2278311, 2474977, 2782048, 3130109, 3538673, 4076276, 4688625, 5352256, 6072210, 6902727, 7720030, 7992168, 7335931, 6241792, 5229292, 4455779, 3857574, 3371476, 2973052, 2645610, 2384044, 2180711, 2017935, 1882169, 1750118, 1663465, 1576793, 1458609, 1371598, 1264598, 1137266, 1041581, 992281, 922483, 872707, 828272, 773817, 727636, 698935, 684474, 645746, 602327, 542227, 533289, 515721, 492533, 470674, 454115, 430046, 386826, 375577, 381504, 335303, 318922, 328192, 334873, 332732, 296202, 269771, 260348, 252368, 249543, 255759, 231533, 234526, 213451, 193685, 206149, 181342, 163476, 179146, 199295, 169782, 160572, 171204, 155196]
2292A55196m063k408N552k3470J2037K1901N494o638k2318N424l0356p732k771
2279A05848L69j0490m490K4139Q682r722P173J1771k0317o060n056J3135k6731
2266H8251j9291n727N395L6407j7861r829Q627M263J2740j9076r748p164J0066
2253G7053j14j7029J4593l306J6940j9077j3207k651j8995L752J3342J2883J433
2240F5617j3895j6407j4793K906M319k2518L043K7540P739k546K3286j904l3015
2227B9372N346m701J1320J6935l3310O561j8778K0083K018k680R985J9197k5727
2214C5621j906J1314r694p966O927J7057k9550L093j4281R402j8263j0268K0779
2201A2265P508r899n620r498j6246K4004K1793o812j3283P663N015P25L464J2108
$$ y = [155196, 151133, 148725, 154277, 130807, 142844, 164745, 170239, 163601, 141283, 146707, 116351, 108619, 105848, 106217, 95727, 91237, 115376, 124058, 114336, 121509, 133280, 112963, 106903, 101847, 114982, 88251, 68960, 63233, 68628, 105035, 87174, 77345, 85972, 90235, 102975, 83899, 74151, 66987, 77053, 76939, 59910, 74503, 71197, 88137, 69060, 55853, 53202, 34207, 37959, 51301, 64184, 65617, 51722, 35315, 20522, 23428, 27747, 5229, 8272, 35812, 43551, 41005, 64291, 62387, 29372, 34718, 30017, 41337, 58272, 24962, 31523, 12745, 32828, 34846, 32166, 42151, 61348, 35621, 33715, 45029, 35335, 27369, 34296, 51353, 21803, 24896, 10615, 20017, 1754, -8514, 12265, 19773, 9874, 4254, -5244, -21490, 2514, 24307, 17495, 4212, 11875, 16890, 17615, 21079, 33187]
2187C3187p928o38p877j5720J2750j2921M236j5651K8647k777j5134j9325N704
2174a3447J4791K036P515j1289j797J6887J3123p60o27k0098j2271N836L2141
2161C2040k9010j1976j9477j7334J5078J2731K5170N707l8065R681L78K853K577
2148i647J4388j8647m548M157N659J9806P848j6236j8672o004K0007o760k390
2135a1039P532j1165j4247p592K5538J3662l1409j8297J6875N102N3113q914m4282
2122b5123K785L37K6959Q855j5793r822j4363k876J4306L3122k3162J153J0887
2109G265q386n668J5197M320K2839k490k9425M549J3925j8764m889J9122J5909
2096C3504q925N589k7837k6348J9130L0240L3224o896k7227n841r865n986J0392
$$ y = [33187, 25259, 24621, 16744, 1024, 13774, 853, 5089, -10562, 18085, 15308, 174, -19151, -13447, 1344, 3380, 10895, -394, -2191, 14696, 27819, 27059, 26432, 6334, -5937, -101, 32040, 3030, -8946, -28423, -45757, -30679, -17948, 7222, 12929, -25136, -15455, -15077, -12224, -9647, 4741, -13906, -18454, -14297, -8638, 11168, 19016, 2780, -15892, -21896, -1889, -8649, -11039, -3507, -14672, -28919, -36511, -10973, 2689, -28720, -47017, -30142, -25040, 28073, 19159, -25123, -22338, -22001, 4958, 13813, -1980, -11802, -26165, -29041, -14735, 18387, -4775, -3622, 7265, -1121, -6789, 8408, 12728, 35567, 33077, 3652, 8201, 22126, 3362, -1527, 17595, 33504, 24579, 30168, 2331, -24017, -4887, 25353, 58577, 51681, 24454, 18613, 8748, 2762, 13154]
2083A3154Q80j4944K778j1715j0721J5620J7573k2266O64J2430q456K54J8120
2070A3371k2696k3899l553Q173M537J4205j0275Q642N746Q28m266o716Q763j1596
2056a8736N931L1383k7702j1741r675J4189L0654j6604P259j720k1494j1003K0871
2043h388J0663o656j1477L1329q245J990M864j2189m1194q83J5644L985j5000
2030c5557j7832O418K5826L279l9971N53K080J103K5074k931K7814P070o4j6688
2016a3826p314J244j1731J6251N471J0545k9255j8025J5664N761K3768k4763j1782
2003c7992N7P539l777L2786M82l434o908K733k1423J4322k1126Q845R836k3829
1989d1889J9418J789q880j861J815R256J8259l185l067k4979j8769l720N0811
$$ y = [13154, 14034, -910, 1868, -9847, -20568, -4948, 12625, -9641, -8977, 3453, -5003, -4749, 13371, -9325, -33224, -36777, -28604, -24067, -9862, -20137, -11495, -5749, -4921, -9187, -15903, -7140, -18736, -12805, 18578, -9124, -20865, -30540, -16351, 14303, -2301, 4958, 3238, -18256, -29259, -8388, 2275, -4381, -15858, 15471, 7226, 9216, 14080, 1891, -39303, -40186, -24542, -20557, -35557, -53389, -46971, -21145, -17866, -57837, -57284, -55204, -54101, -29027, -31958, -4144, 2926, 2862, -13826, -21140, -19896, -31627, -15376, -9905, 640, -28615, -46640, -30976, -25215, -1447, -26210, -37992, -37935, -30396, -34173, -1387, -905, -4339, -11247, -8514, -29937, -15615, -36741, -27896, -18060, -41889, -22471, -20682, -29562, -31423, -29608, -20352, -2093, -5278, -8345, -33324, -52093, -55813, -5002]
1976e002J291K243q226l9382p656J8653j3969J9808k160K2252K912P901J7762
1963A6427j1908k6907k1279L8825j6976k6225q955P302J6552J1452j314M058l3216
1950e2164O595R801k1053P564L3723Q910k7331o138J1337K8260j498P063k2137
1937a7068N376O319K1673j6378j7141O124j3741o924K214m380k8995R713m907
1924e8115J8738O077L978N712l695J1872J4974j0870j6553J0880J0527j1504j4494
1911c2473M295p938J6267L147o550L706k7987j0351L3090p791l978r019P492J1369
1897b6721p226j2856o207J4948Q193O178J2594J1588o230r547j7614O086k424
1884b9238j287j605r405q236M277M731J091k538P443L921m413L2040n345L780
$$ y = [-5002, -3711, -1468, -9694, -49076, -56732, -38079, -52048, -32240, -34400, -12148, -9236, -1335, 16427, 4519, -22388, -43667, -4842, -21818, -48043, -56998, -49696, -33144, -21692, -23006, -18948, -52164, -45569, -35768, -56821, -49257, -15534, -6624, -33955, -40093, -28756, -496, -1994, 5069, -17068, -11692, -5373, 16300, -78, -17219, -11095, -24836, -31760, -29546, -33926, -62921, -53208, -58115, -39377, -33300, -29322, -23610, -27305, -15433, -459, -11329, -27882, -17002, -6475, -17979, -32473, -28178, -36116, -19849, -16702, -23252, -19546, -47533, -57884, -24794, -32585, -36563, -45582, -38090, -26721, -33947, -46803, -53010, -38062, -29869, -23691, -11097, 491, -5739, -15286, -32900, -26814, -29238, -30525, -32130, -41535, -49771, -45494, -40763, -39672, -42210, -34767, -30846, -35259, -3219, -8564, -4784]
1870d784K1550k4142k6887K8609j5018j0909p93L290k0200O082J3892k9125J4512
1857d3923J0246k3162J5801J6160P805j6262n796K2667J6264k0420p289l887J916
1844b9880J9637J1546k4051j7860K2945j20l081K5003n729k3024J2122j3578j2765
1831c8835K5642P14j8579M597Q767J6433Q973j0305k8911n333K687J9516p366
1818b2000J91j5318J7400m566J808O345P76k6241p545K4284k0219L527m276k838
1804d8672K4640O923M4984l2257k5688m131K812n031M164J1557n313J4426L31
1791a1255j5705o28K5753j7072K9190p365k5083m085k1454L4057j8332j6329J8150
1778c0158Q223J3998j4468o670J1119J4019j4610l2070k2470K8203K915J3184
$$ y = [-4784, 16766, -7376, -34263, -5654, -20672, -31581, -32374, -29084, -49284, -43202, -29310, -58435, -43923, -33677, -56839, -41038, -24878, -17073, -33335, -39131, -16464, -200, -20620, -27909, -31796, -29880, -10243, 1303, -22748, -40608, -17663, -17783, -20864, 4139, -1590, -24614, -12492, -26070, -38835, -13193, -12479, -31058, -26461, -17694, -1261, 7712, -2593, -31504, -36837, -34150, -14634, -22000, -21809, -37127, -19727, -24293, -22485, -16140, -15364, -41605, -49150, -24866, -45085, -41558, -45834, -48672, -24032, -17109, 27875, -4382, -30070, -34201, -31389, -36420, -32256, -20699, -26012, -11586, -11255, -26960, -27588, -1835, -18907, 10283, 2918, -22165, -26250, -47704, -13647, -31979, -48308, -30158, -21935, -7937, -22405, -29075, -17956, -3937, -18547, -50617, -73087, -44884, -41969, -28785]
1766b8785j3547n110K6963m295J588j3413M929k2241K1022K0166l509m584J5179
1753e637m788k1134J8839l401J3336j0917O172j3928J6836n264j6649J4398M446
1740g691k8058r140J7528P196P776k3904Q143J1286J0200j7312J7069K1868n963
1727H998l2125l848j9664J3989l860M715J8633k3746j5968j014K1516K2773j3934
1714b3535K955M203J3592m799j0675j1554P305J990q473M373Q151J5589K1152
1701B0274J7945l0219r822l1589Q629J7140o00r565L229j2746P914j2639L0170
1688a879O006l837k8488J0717j3328j0452K8501Q227l2533j0701N757K3130j2569
1675c1449l5159J528L0461n411K2360P638j3577P463q492r173k2012L7633K6491
$$ y = [-28785, -42332, -47442, -20479, -24774, -23186, -36599, -31670, -53911, -32889, -12723, -16232, -20816, -5637, -10425, -31559, -12720, -16121, -2785, -13702, -7530, -21458, -4622, -9886, -26535, -12137, -7691, -35749, -44889, -27361, -20165, -12389, -36293, -28150, -16864, -6664, -23976, -6907, 14961, 8998, -23127, -26975, -46639, -32650, -36510, -31795, -13162, -36908, -52876, -53890, -32374, -9601, -23535, -20580, -16377, -2785, -7584, -18259, -29813, -22508, -20518, -28991, -24618, -16467, -878, 20274, 38219, 8000, -1822, -33411, -24782, -7642, -8242, -17807, -14578, -27324, -19410, -32049, -1879, 4127, 290, -28198, -17481, -30809, -41261, -12760, -4533, -37066, -47767, -42010, -18880, -31449, -66608, -65080, -34619, -40030, -17670, -10032, -23609, -16146, -24638, -33811, -55823, -18190, 8301]
1662H301k803K153k3793j4819K0310P591j3238m699K5989Q916L779n303m5243
1649c2859j0093P61M911j8369J1782J8576j4392J5468o75N431j2836m944m661
1636d1900J0815R28k3457L482l241J5818N5184j6728j4800j2754N240P125K257
1623a2031k7509j898J2604K2586P632J827k6853m469J9144j8041M551O163o527
1610b2821R702J5354j5769j2444j4238Q177q217N574J2958q754j1617m230M859
1597d1466p277J271J2159J1672L270k2780j6398K3723j1541K3564k2417j6939
1585f3159j805R011M4968K6205k2429j6330P578K6921j4695j4417l882r086j8416
1572d9536m071L0895J3756j4135Q865r683j5658j5290L2480K592k1414j1582m499
$$ y = [8301, 5498, 7651, -16142, -30961, -10651, -3060, -16298, -20997, 4992, 13908, 17687, 12384, -32859, -42952, -42191, -37280, -55649, -43867, -25291, -39683, -24215, -24890, -19459, -32295, -37239, -41900, -31085, -30157, -53614, -50132, -53373, -37555, 17629, 901, -13899, -26653, -21413, -14288, -12031, -39540, -41438, -28834, -6248, 1384, 3211, -23642, -28111, -8967, -27008, -22457, -16294, -22821, -13119, 2235, -13534, -25978, -40216, -32039, -40256, -34682, -21724, -30478, -42095, -46325, -41466, -48743, -47472, -35313, -23641, -20371, -43151, -59549, -35826, -47367, -23803, -46220, -63159, -64964, -55953, -10985, 15220, -7209, -23539, -15961, 10960, -3735, -18152, -22034, -31120, -49536, -53607, -22712, -8956, -23091, -14226, -23909, -39567, -54857, -22377, -19785, -41199, -52781, -57280]
1559e7280K6553N13Q480j564O68m007J643Q485j2273J9128m930o592P464j1190
$$ y = [-57280, -30727, -30214, -21734, -23298, -22630, -26637, -24994, -16509, -28782, -9654, -14584, -21176, -13712, -24902]
$$ [...]
##END NTUPLES=NMR SPECTRUM
##END=
