##TITLE=1H_CA-9358
 200.13MHz,CDCl3,
 8 sc
 
 30.6.2025
##JCAMPDX= 6.0         $$ Bruker NMR JCAMP-DX V2.0
##DATA TYPE= NMR SPECTRUM
##DATA CLASS= NTUPLES
##ORIGIN= UXNMR, Bruker Analytische Messtechnik GmbH
##OWNER= pz
$$ XWIN-NMR		Version 3.5
$$ Mon Jun 30 15:27:07 2025 Russian Standard Time (UT+4h)  she@DPX200
##.OBSERVE FREQUENCY= 200.1313
##.OBSERVE NUCLEUS= ^1H
##.ACQUISITION MODE= SIMULTANEOUS
##.ACQUISITION SCHEME= undefined
##.AVERAGES= 8
##.DIGITISER RES= 18
##SPECTROMETER/DATA SYSTEM= spect
##.PULSE SEQUENCE= zg30
##.SOLVENT NAME= CDCl3
##.SHIFT REFERENCE= (INTERNAL, CDCl3, 0, 15.5056)
##AUDIT TRAIL= $$ (NUMBER, WHEN, WHO, WHERE, WHAT)
$$ ##TITLE= Audit trail, XWIN-NMR		Version 3.5
$$ ##JCAMPDX= 5.01
$$ ##ORIGIN= Bruker BioSpin GmbH
$$ ##OWNER= she
$$ F:/spectra/data/she/nmr/H-C/1/pdata/1/auditp.txt
$$ ##AUDIT TRAIL=  $$ (NUMBER, WHEN, WHO, WHERE, WHAT)
(   1,<2025-06-30 15:25:12.00 +0400>,<she>,<DPX200>,
      <created by zg, POWCHK disabled, PULCHK disabled
       configuration hash MD5:
       00 E9 B6 7A A2 85 ED C7 34 08 36 98 17 FE 4E 26
       data hash MD5: 16K
       97 82 1A C1 DE F0 F4 0D 82 0B 20 FA A5 60 41 AF>)
(   2,<2025-06-30 15:25:14.26 +0400>,<she>,<DPX200>,
      <Start of raw data processing
       efp BC_mod = 2 LB = 0.25 FT_mod = 6 PKNL = 1 PHC0 = -1207.985 PHC1 = 22.19222 SI = 16K 
       data hash MD5: 16K
       B4 7E 70 E4 66 61 11 B6 77 C9 32 6F F6 70 E5 AC>)
(   3,<2025-06-30 15:25:31.78 +0400>,<she>,<DPX200>,
      <pk PHC0 = 4.677315 PHC1 = -6.8 
       data hash MD5: 16K
       5B EF EB 04 CA 19 06 76 96 3E 91 46 DF 66 CA 87>)
(   4,<2025-06-30 15:25:36.31 +0400>,<she>,<DPX200>,
      <abs ABSG = 5 
       data hash MD5: 16K
       11 3E F8 E7 DA 3B 99 0B BA D1 B6 A6 BD FB BD 34>)
$$ ##END=
$$ 
$$ hash MD5
$$ FF 87 2C F7 F8 AC E9 70 B7 44 98 BB 05 F4 E1 9F
##$RELAX= 
##$RELAX= 
##$RELAX= 
##$RELAX= 
##$RELAX= 
##$RELAX= 
$$ Bruker specific parameters
$$ --------------------------
##$DU= <F:/spectra>
##$EXPNO= 1
##$NAME= <H-C>
##$PROCNO= 1
##$TYPE= <nmr>
##$USER= <she>
##$AMP= (0..31)
100 100 100 100 100 100 100 100 100 100 100 100 100 100 100 100 100 100 
100 100 100 100 100 100 100 100 100 100 100 100 100 100 
##$AQSEQ= 0
##$AQ_mod= 1
##$AUNM= <au_zg>
##$AUTOPOS= <>
##$BF1= 200.13
##$BF2= 200.13
##$BF3= 200.13
##$BF4= 200.13
##$BF5= 200.13
##$BF6= 200.13
##$BF7= 200.13
##$BF8= 200.13
##$BYTORDA= 1
##$CFDGTYP= 0
##$CFRGTYP= 5
##$CHEMSTR= <none>
##$CNST= (0..31)
1 1 145 1 1 1 1 1 1 1 1 1 1 1 1 1 1 1 1 1 1 1 1 1 1 1 1 1 1 1 1 1 
##$CPDPRG= <>
##$CPDPRG1= <>
##$CPDPRG2= <>
##$CPDPRG3= <>
##$CPDPRG4= <mlev>
##$CPDPRG5= <mlev>
##$CPDPRG6= <mlev>
##$CPDPRG7= <mlev>
##$CPDPRG8= <mlev>
##$CPDPRGB= <>
##$CPDPRGT= <>
##$D= (0..31)
0 0.7 0 0 0 0 0 0 0 0 0 0.03 0 0 0 0 0 0 0 0 0 0 0 0 0 0 0 0 0 0 0 0 
##$DATE= 1751282711
##$DBL= (0..7)
120 120 120 120 120 120 120 120 
##$DBP= (0..7)
150 150 150 150 150 150 150 150 
##$DBP07= 0
##$DBPNAM0= <>
##$DBPNAM1= <>
##$DBPNAM2= <>
##$DBPNAM3= <>
##$DBPNAM4= <>
##$DBPNAM5= <>
$$ [...]
##$SUBNAM3= <"">
##$SUBNAM4= <"">
##$SUBNAM5= <"">
##$SUBNAM6= <"">
##$SUBNAM7= <"">
##$SUBNAM8= <"">
##$SUBNAM9= <"">
##$SW= 18.0517328524113
##$SWIBOX= (0..15)
0 0 2 0 0 0 0 0 0 0 0 0 0 0 0 0 
##$SW_h= 3612.71676300578
##$TD= 16384
##$TD0= 1
##$TE= 0
##$TE2= 300
##$TE3= 300
##$TEG= 300
##$TL= (0..7)
0 120 120 120 120 120 120 120 
##$TP= (0..7)
150 150 150 150 150 150 150 150 
##$TP07= 0
##$TPNAME0= <>
##$TPNAME1= <>
##$TPNAME2= <>
##$TPNAME3= <>
##$TPNAME4= <>
##$TPNAME5= <>
##$TPNAME6= <>
##$TPNAME7= <>
##$TPOAL= (0..7)
0.5 0.5 0.5 0.5 0.5 0.5 0.5 0.5 
##$TPOFFS= (0..7)
0 0 0 0 0 0 0 0 
##$TUNHIN= 0
##$TUNHOUT= 0
##$TUNXOUT= 0
##$USERA1= <user>
##$USERA2= <user>
##$USERA3= <user>
##$USERA4= <user>
##$USERA5= <user>
##$V9= 5
##$VALIST= <valist>
##$VCLIST= <CCCCCCCCCCCCCCC>
##$VD= 0
##$VDLIST= <DDDDDDDDDDDDDDD>
##$VPLIST= <PPPPPPPPPPPPPPP>
##$VTLIST= <TTTTTTTTTTTTTTT>
##$WBST= 1024
##$WBSW= 4
##$XGAIN= (0..3)
0 0 0 0 
##$XL= 0
##$YL= 0
##$YMAX_a= 513490
##$YMIN_a= -649938
##$ZGOPTNS= <>
##$ZL1= 120
##$ZL2= 120
##$ZL3= 120
##$ZL4= 120
##$ABSF1= 15.48907
##$ABSF2= -2.562779
##$ABSG= 5
##$ABSL= 3
##$ALPHA= 0
##$AQORDER= 0
##$ASSFAC= 0
##$ASSFACI= 0
##$ASSFACX= 0
##$ASSWID= 0
##$AUNMP= <proc_1d>
##$AZFE= 0.1
##$AZFW= 0.1
##$BCFW= 0
##$BC_mod= 2
##$BYTORDP= 0
##$COROFFS= 0
##$CY= -3
##$DATMOD= 1
##$DC= 0
##$DFILT= <>
##$DTYPP= 0
##$F1P= 0
##$F2P= 0
##$FCOR= 1
##$FTSIZE= 16384
##$FT_mod= 6
##$GAMMA= 0
##$GB= 0
##$INTBC= 1
##$INTSCL= 3.241238e-09
##$ISEN= 128
##$LB= 0.25
##$LEV0= 0
##$LPBIN= 0
##$MAXI= 10000
##$MC2= 0
##$MEAN= 0
##$ME_mod= 0
##$MI= 1.114404
##$NCOEF= 0
##$NC_proc= -5
##$NLEV= 6
##$NOISF1= 3.799351
##$NOISF2= 2.8
##$NSP= 0
##$NTH_PI= 0
##$NZP= 0
##$OFFSET= 15.5056
##$PC= 1
##$PHC0= -1203.308
##$PHC1= 15.39222
##$PH_mod= 1
##$PKNL= yes
##$PPARMOD= 0
##$PSCAL= 0
##$PSIGN= 0
##$REVERSE= no
##$SF= 200.130003224325
##$SI= 16384
##$SIGF1= 3
##$SIGF2= 2
##$SINO= 0.751879
##$SIOLD= 32768
##$SREGLST= <19F.Aceton>
##$SSB= 0
##$STSI= 16384
##$STSR= 0
##$SW_p= 3612.71676300578
##$SYMM= 0
##$S_DEV= 0
##$TDeff= 16384
##$TDoff= 0
##$TI= <>
##$TILT= no
##$TM1= 0
##$TM2= 0
##$TOPLEV= 0
##$USERP1= <user>
##$USERP2= <user>
##$USERP3= <user>
##$USERP4= <user>
##$USERP5= <user>
##$WDW= 1
##$XDIM= 16384
##$YMAX_p= 447311990
##$YMIN_p= -193467
$$ End of Bruker specific parameters
$$ ---------------------------------
##NTUPLES= NMR SPECTRUM
##VAR_NAME=  FREQUENCY,     SPECTRUM/REAL,   SPECTRUM/IMAG
##SYMBOL=    X,             R,               I
##VAR_TYPE=  INDEPENDENT,   DEPENDENT,       DEPENDENT
##VAR_FORM=  AFFN,          ASDF,            ASDF
##VAR_DIM=   16384,         16384,           16384
##UNITS=     HZ,            ARBITRARY UNITS, ARBITRARY UNITS
##FACTOR=    0.220516191357247, 1,           1
##FIRST=     3103.13577310911, 0,            0
##LAST=      -509.580989896673, 0,           0
##MIN=       -509.580989896673, -193467,     0
##MAX=       3103.13577310911, 447311990,    0
$$ Real data points
##PAGE= N=1
##DATA TABLE= (X++(R..R)), XYDATA
$$ [...]
$$ plain form
6234 280097 362212 378498 453118 505585 525455 553320 618090 684670 740429 884199 1001861
6223 1001861 1035055 1012357 918570 780944 674459 638632 594271 527819 496431 445929 400413
6212 400413 356483 327280 304574 311285 247087 245615 256626 299074 230003 200729 237157 275047
6200 275047 253744 229279 198957 199859 237816 237727 207598 223384 248085 175162 212173 173452 83932
6187 83932 107205 132136 135993 168351 159150 147129 151577 202992 158730 159822 206018 230278 254396
6174 254396 252176 213491 164493 165924 172242 114581 91919 124588 140149 180422 256099 228954
6162 228954 181270 157221 190318 250467 212819 188931 202955 245056 283455 184517 144271 178206
6150 178206 175988 197050 209467 173677 197743 216138 177065 172185 165238 107609 159576 136241
$$ packed form
6234B80097Q2115J6286P4620N2467J9870K7865O4770O6580N5759J43770J17662
6223A001861L3194k2698r3787j37626j06485l5827m4361o6452l1388n0502m5516
6212D00413m3930k9203k2706O711o4198j472J1011M2448o9071k9274L6428L7890
6200B75047k1303k4465l0322R02L7957q9l0129J5786K4701p2923L7011l8721q9520
6187H3932K3273K4931L857L2358r201j2021M448N1415m4262J092M6196K4260K4118
6174B54396k220l8685m8998J431O318n7661k2662L2669J5561M0273P5677k7145
6162B28954m7684k4049L3097O0149l7648k3888J4024M2101L8399r8938m0246L3935
6150A78206k218K1062J2417l5790K4066J8395l9073m880o947n7629N1967k3335
$$ plain form
6138 136241 145000 225187 216189 191769 171301 232333 222479 155171 144520 213310 264168 229607
6126 229607 192552 205436 279095 248861 222528 213694 162570 200755 159703 200208 278175 295797
6114 295797 351313 346553 268861 322196 302079 348297 302307 264593 318128 337200 379921 430444
6102 430444 434525 420212 442337 387102 310412 361318 379759 373970 306873 306865 379760 343762 335882
6089 335882 310172 288994 283526 287512 290475 323141 318504 315891 311986 259452 326157 320244 265226
6076 265226 299764 316084 376356 412519 388367 335926 318635 313679 353640 345915 338349 373109
6064 373109 394491 366797 357746 392076 404988 376216 346152 378244 425246 456566 405837 423613
6052 423613 393971 410790 462105 533516 480650 473129 515702 511521 560486 575537 616735 662556
$$ packed form
6138A36241Q759Q0187q998k4420k0468O1032r854o7308j0651O8790N0858l4561
6126B29607l7055J2884P3659l0234k6333q834n1124L8185m1052M0505P7967J7622
6114B95797N5516m760p7692N3335k0117M6218m5990l7714N3535J9072M2721N0523
6102D30444M081j4313K2125n5235p6690N0906J8441n789o7097qP2895l5998p880
6089C35882k5710k1178n468L986K963L2666m637k613l905n2534O6705n913n5018
6076B65226L4538J6320O0272L6163k4152n2441j7291m956L9961p725p566L4760
6064C73109K1382k7694r051L4330J2912k8772l0064L2092M7002L1320n0729J7776
6052D23613k9642J6819N1315P1411n2866p521M2573m181M8965J5051M1198M5821
$$ plain form
6040 662556 688623 682332 657761 722583 772040 713239 692602 785347 721883 710647 720613 769932
6028 769932 793159 743603 768506 757364 814790 851967 911810 850033 839589 892243 842322 844574
6016 844574 919099 882224 886997 863516 895007 908542 902086 891139 961126 1028304 1004769 990000
6004 990000 1010644 1038457 1023321 1049643 1039906 996996 1009857 1037811 1029738 976743 1020333 1021037
5992 1021037 1053044 1055573 1045171 1055784 1148668 1172697 1171607 1196521 1163150 1190201 1255144 1269219
5980 1269219 1273381 1287412 1284437 1323152 1381805 1433098 1385330 1406504 1483774 1465911 1477151 1558397
5968 1558397 1621455 1623385 1692394 1736262 1761943 1798566 1818503 1836738 1900443 1958278 2000447 1993530
5956 1993530 2051639 2150527 2173813 2170897 2232980 2361937 2421335 2483393 2597994 2662734 2657992
$$ packed form
6040F62556K6067o291k4571O4822M9457n8801k0637R2745o3464j1236R966M9319
6028G69932K3227m9556K4903j1142N7426L7177N9843o1777j0444N2654m9921K252
6016H44574P4525l6875M773k3481L1491J3535o456j0947O9987O7178k3535j4769
6004I90000K0644K7813j5136K6322r737m2910J2861K7954q073n2995M3590P04
5992A021037L2007K529j0402J0613R2884K4029j090K4914l3371K7051O4943J4075
5980A269219M162J4031k975L8715N8653N1293m7768K1174P7270j7863J1240Q1246
5968A558397O3058J930O9009M3868K5681L6623J9937J8235O3705N7835M2169o917
5956A993530N8109R8888K3286k916O2083J28957N9398O2058J14601O4740m742
$$ plain form
5945 2657992 2697645 2778557 2834312 2881837 2988970 3094024 3190769 3270143 3410041 3524065 3603417
5934 3603417 3674703 3806887 4035370 4109577 4259536 4436267 4627586 4831741 5063124 5309451
5924 5309451 5512402 5867557 6128966 6373823 6668379 7027745 7352939 7688190 8032958 8516403
5914 8516403 9011421 9515475 10126829 10709368 11288387 11968500 12656973 13335690 14030826 14773753
5904 14773753 15615643 16438659 17473230 18685606 19987414 21483084 23106077 24969783
5896 24969783 27025460 29303090 31884355 34853213 38229669 42233596 46879557 52336458
5888 52336458 58561044 65287669 72357407 80216616 88747060 97836057 108130638 121356541
5880 121356541 138051109 154641047 162524826 158748368 147212553 131914373 116367649
$$ packed form
5945B657992L9653Q0912N5755M7525J07133J05054R6745P9374J39898J14024P9352
5934C603417P1286J32184K28483P4207J49959J76731J91319K04155K31383K46327
5924E309451K02951L55155K61409K44857K94556L59366L25194L35251L44768M83445
5914H516403M95018N04054O11354N82539N79019O80113O88473O78717O95136P42927
5904A4773753Q41890Q23016J034571J212376J301808J495670J622993J863706
5896B4969783K055677K277630K581265K968858L376456M003927M645961N456901
5888E2336458O224586O726625P069738P859209Q530444R088997J0294581J3225903
5880A21356541J6694568J6589938P883779l776458j1535815j5298180j5546724
$$ plain form
5873 116367649 102307438 89626724 78184346 68666774 61036555 54959584 49960480 45766949
5865 45766949 42010205 38664666 35483531 32576647 29994484 27599465 25524447 23725777
5857 23725777 22148263 20736727 19492980 18373461 17354826 16343952 15447352 14643458
5849 14643458 13826708 13119086 12364769 11743574 11145781 10582152 10133511 9735459 9279146
5840 9279146 8966322 8540497 8175149 7851815 7559690 7266587 7048122 6823990 6561926 6333270
5830 6333270 6170622 5943674 5732880 5517515 5326494 5173657 5024673 4899321 4718012 4559254
5820 4559254 4402769 4276944 4119025 4016680 3924095 3819087 3671163 3617813 3502452 3327931
5810 3327931 3269158 3238146 3181033 3053768 2981499 2886959 2800057 2677859 2598758 2624629 2599043
$$ packed form
5873A16367649j4060211j2680714j1442378r517572p630219o076971m999104m193531
5865D5766949l756744l345539l181135k906884k582163k395019k075018j798670
5857B3725777j577514j411536j243747j119519j018635j010874q96600q03894
5849A4643458q16750p07622p54317o21195n97793n63629m48641l98052m56313
5840I279146l12824m25825l65348l23334k92125k93103k18465k24132k62064k28656
5830F333270j62648k26948k10794k15365j91021j52837j48984j25352j81309j58758
5820D559254j56485j25825j57919j02345r2585j05008j47924n3350j15361j74521
5810C327931n8773l1012n7113j27265p2269r4540q6902j22198p9101K5871k5586
$$ plain form
5799 2599043 2545659 2443308 2367856 2329034 2256270 2263368 2193329 2133029 2077732 2058450 2009892
5788 2009892 1945874 1889537 1905105 1866051 1800858 1773616 1699296 1721781 1747726 1751552 1741826 1660762
5776 1660762 1633766 1630469 1586813 1584177 1542658 1517490 1535319 1459800 1450950 1453532 1396733 1353360
5764 1353360 1305982 1310685 1331941 1280437 1284714 1208842 1203588 1177371 1173910 1202248 1098955 1011658
5752 1011658 955115 1030158 996885 939123 932106 979834 913426 922271 952686 953811 827429 766572
5740 766572 755237 752723 738015 729471 702624 737683 713390 700467 637230 772226 799333 726814
5728 726814 696112 649205 663143 645426 611674 643011 600149 574791 577445 575074 559598 559087
5716 559087 549974 499234 510978 579745 556610 543859 586865 547336 570896 514970 532755 562686
$$ packed form
5799B599043n3384j02351p5452l8822p2764P098p0039o0300n5297j9282m8558
5788B009892o4018n6337J5568l9054o5193k7242p4320K2485K5945L826r726q1064
5776A660762k6996l297m3656k636m1519k5168J7829p5519q850K582n6799m3373
5764A353360m7378M703K1256n1504M277p5872n254k6217l461K8338j03293q7297
5752A011658n6543P5043l3273n7762p017M7728o6408Q845L0415J125j26382o0857
5740G66572j1335k514j4708q544k6847L5059k4293j2923o3237J34996K7107p2519
5728G26814l0702m6907J3938j7717l3752L1337m2862k5358K654k371j5476n11
5716E59087r113n0740J1744O8767k3135j2751M3006l9529K3560n5926J7785K9931
$$ plain form
5704 562686 593134 586686 540438 599090 613395 517042 534766 542185 525586 529102 549150 548506 526802
5691 526802 497671 455041 395992 449270 500942 467465 428343 509852 510103 496907 476605 402711
5679 402711 408207 416521 400879 391042 432968 395092 416255 400111 362879 318105 305595 346150
5667 346150 354657 316267 328027 357421 375942 345009 293718 333360 329843 271290 245610 257286
5655 257286 245278 247550 259596 297602 248906 240753 239432 233645 242522 300742 256159 252486 260937
5642 260937 355493 319848 269093 250673 244845 289517 254167 206140 268845 280064 189249 230263
5630 230263 218897 189967 217452 179204 167175 162164 172534 153374 199673 241670 203916 208184
5618 208184 180855 160426 113157 109161 123636 126555 137413 163999 164902 164830 118897 92678 166948
$$ packed form
5704E62686L0448o448m6248N8652J4305r6353J7724P419j6599L516K0048o44k1704
5691E26802k9131m2630n9049N3278N1672l3477l9122Q1509K51j3196k0302p3894
5679D02711N496Q314j5642r837M1926l7876K1163j6144l7232m4774j2510M0555
5667C46150Q507l8390J1760K9394J8521l0933n1291L9642l517n8553k5680J1676
5655B57286j2008K272J2046L8006m8696q153j321n787Q877N8220m4583l673Q451
5642B60937R4556l5645n0755j8420n828M4672l5350m8027O2705J1219r0815M1014
5630B30263j1366k8930K7485l8248j2029n011J0370j9160M6299M1997l7754M268
5618B08184k7329k0429m7269l996J4475K919J0858K6586R03p2m5933k6219P4270
$$ plain form
5605 166948 190405 198852 169203 84598 109593 137456 150524 118878 130694 151531 177814 172661
5593 172661 187216 130899 109587 82512 32036 84345 166701 163580 132971 116571 149995 165149
5581 165149 145903 164803 193192 224654 154270 165034 154465 100544 106408 86123 112645 152533
5569 152533 169274 160768 190006 143257 85032 82626 92772 122397 148476 167492 76901 72321
5557 72321 136258 206814 205773 170146 203609 182087 153604 188369 178093 237044 254584 314255
5545 314255 348933 344873 345036 293816 366793 345276 400460 495846 536567 536436 540161 588539 586707
5532 586707 615793 681308 801437 891312 832869 800352 778928 716892 609362 562439 498752
5521 498752 444470 487828 418761 353890 269960 296464 270307 219619 231621 205781 184653 145748
$$ packed form
5605A66948K3457Q447k9649q4605K4995K7863J3068l1646J1816K0837K6283n153
5593A72661J4555n6317k1312k7075n0476N2309Q2356l121l0609j6400L3424J5154
5581A65149j9246J8900K8389L1462p0384J0764j0569n3921N864k0285K6522L9888
5569A52533J6741q506K9238m6749n8225k406J0146K9625K6079J9016r0591m580
5557G2321O3937P0556j041l5627L3463k1522k8483L4765j0276N8951J7540N9671
5545C14255L4678m060J63n1220P2977k1517N5184R5386M0721j31L725M8378j832
5532E86707K9086O5515J20129Q9875n8443l2517k1424o2036j07530m6923o3687
5521D98752n4282M3358o9067o4871q3930K6504k6157n0688J2002k5840k1128l8905
$$ plain form
5509 145748 147009 84410 44339 138123 154569 81315 29621 34698 94124 147350 200338 109173
5497 109173 108231 69381 72656 35558 18242 79496 61301 126681 167054 91231 84812 70558
5485 70558 64084 58177 27851 77202 60835 102795 73913 67137 80548 91277 45466 57862
5473 57862 54481 23235 34149 34750 52545 78779 40895 82916 64485 17782 63568 29087
5461 29087 20961 46492 34673 -62385 -6230 74320 41553 51313 26687 -4173 -40302 -46332
5449 -46332 -13252 -24778 -25436 -5472 3777 6295 48389 76988 28183 24672 17881 52542 46369
5436 46369 -21634 30902 -6631 -23198 54154 84734 71669 131906 138394 92608 4095 2067
5424 2067 40627 50528 24815 39796 -1522 41467 41776 -15737 -8891 -30570 5923 34098 27021
$$ packed form
5509A45748J261o2599m0071R3784J6446p3254n1694N077N9426N3226N2988r1165
5497A09173r42l8850L275l7098j7316O1254j8195O5380M0373p5823o419j4254
5485G0558o474n907l0326M9351j6367M1960k8882o776J3411J0729m5811J2396
5473E7862l381l1246J0914O01J7795K6234l7884M2021j8431m6703M5786l4481
5461B9087q126K5531j1819r7058N6155Q0550l2767R760k4626l0860l6129o030
5449d6332L3080j1526o58J9964R249K518M2094K8599m8805l511o791L4661o173
5436D6369o8003N2536l7533j6567P7352L0580j3065O0237O488m5786q8513k028
5424B067L8560R901k5713J4981m1318M2989L09n7513O846k1679L6493K8175p077
$$ plain form
5411 27021 23316 44014 30376 13519 9195 18710 37171 -6865 -60822 -1109 34717 17247
5399 17247 17150 42775 -2564 -13088 30112 49766 20759 31152 21493 37788 55843 102341 99539
5386 99539 67308 5891 -47051 -36656 44453 18118 4683 76586 24160 24304 27557 43549
5374 43549 32860 43834 6038 -10479 28338 31898 64204 67539 103433 72030 13075 -14715
5362 -14715 -60861 -60252 -50852 -65554 -25655 -32746 -7365 25587 43166 -14780 -20092 -34448 18005
5349 18005 36067 23654 -19036 -52769 -44189 -30260 -33533 -23531 22543 -97 -42423 -70545
5337 -70545 -62163 -29875 -162 -24558 -80781 -103131 -19614 -13981 -12729 42422 10295 4094 48933
5324 48933 61135 -467 -37073 61628 -10045 -11648 -26809 32145 45562 33334 -16780 -21684
$$ packed form
5411B7021l705K0698j3638j6857m324R515J8461m4036n3957N9713L5826j7470
5399A7247r7K5625m5339j0524M3200J9654k9007J0393r659J6295J8055M6498k802
5386I9539l2231o1417n2942J0395Q1109k6335j3435P1903n2426J44L253J5992
5374D3549j0689J0974l7796j6517L8817L560L2306L335L5894l1403n8955k7790
5362a4715m6146O09R400j4702L9899p091K5381L2952J7579n7946n312j4356N2453
5349A8005J8062j2413m2690l3733Q580J3929l273J0002M6074k2640m2326k8122
5337g0545Q382L2288K9713k4396n6223k2350Q3517N633J252N5151l2127o201M4839
5324D8933J2202o1602l6606R8701p1673j603j5161N8954J3417j2228n0114m904
$$ plain form
5312 -21684 -41137 -24374 -25003 -34168 -40250 -39534 -16774 -34152 -26394 -26289 -39229 -49601 -59922 -9096
5298 -9096 30131 28463 -14036 -26164 42016 -7398 -26324 -5406 -12651 -26658 -46992 -110224
5286 -110224 -185521 -147976 -67895 -78418 -57582 -104019 -41647 -68617 -65002 -4113 -9728 -34906
5274 -34906 -36208 -103160 -103918 -98629 -90066 2237 -13841 6338 3678 86208 28670 -828 7643
5261 7643 -22785 -16714 42399 -30086 -44144 13929 8 -9149 -69431 -129431 -124427 -101391 -119626
5248 -119626 -83652 -74576 -49314 -52670 -18586 -84518 -95819 -61813 -7733 -5760 -72170 -45383
5236 -45383 -80 -18309 -47686 -34641 -19248 -38197 15997 12779 8758 -18728 -10143 16795
5224 16795 -21262 20892 29701 -2641 -16273 33295 -14904 -20787 -699 -42524 -55364 12687
$$ packed form
5312b1684j9453J6763o29r165o082P16K2760j7378P758J05j2940j0372j0321N0826
5298i096L9227j668m2499j2128O8180m9414j8926K0918p245j4007k0334o3232
5286a10224p5297L7545Q0081j0523K0836m6437O2372k6970L615O0889n615k5178
5274c4906j302o6952p58N289Q563R2303j6078K0179k660Q2530n7538k9498Q471
5261G643l0428O071N9113p2485j4058N8073j3921r157o0282o0000N004K3036j8235
5248a19626L5974R076K5262l356L4084o5932j1301L4006N4080J973o6410K6787
5236d5383M5303j8229k9377J3045J5393j8949N4194l218m021k7486Q585K6938
5224A6795l8057M2154Q809l2342j3632M9568m8199n883K0088m1825j2840O8051
$$ plain form
5212 12687 85781 86935 35389 25514 12058 -14164 10116 4046 21466 28106 -7966 -50850 -86873
5199 -86873 -105702 -75265 5872 39918 10538 17805 -29623 -76316 -31495 -10735 -45811 -30479
5187 -30479 -36702 16489 36344 2271 17388 -62619 -94382 -53750 -13413 -28608 -34801 -33923 -56227
5174 -56227 -11123 55804 71456 89304 65243 -10379 33632 22011 14584 10230 22561 -14628
5162 -14628 29098 24360 -2785 75282 90704 110815 52754 88780 144586 142424 77648 25172
5150 25172 -26690 -27891 -13011 3913 -15699 14892 17480 677 42400 46974 -16269 9344
5138 9344 52351 62672 59041 70995 130076 140984 136487 60227 113261 167967 111936 219835
5126 219835 220851 178934 169474 132917 180875 200245 316660 367796 351462 313170 255239 224456
$$ packed form
5212A2687P3094J154n1546r875j3456k6222K4280o070J7420O640l6072m2884l6023
5199h6873j8829L0437Q1137L4046k9380P267m7428m6693M4821K0760l5076J5332
5187c0479o223N3191J9855l4073J5117q0007l1763M0632M0337j5195o193Q78k2304
5174e6227M5104O6927J5652J7848k4061p5622M4011j1621p427m354J2331l7189
5162a4628M3726m738k7145P8067J5422K0111n8061L6026N5806k162o4776n2476
5150B5172n1862j201J4880J6924j9612L0591K588j6803M1723M574o3243K5613
5138I344M3007J0321l631J1954N9081J0908m497p6260N3034N4706n6031J07899
5126B19835J016m1917r460l6557M7958J9370J16415N1136j6334l8292n7931l0783
$$ plain form
5114 224456 193001 178041 186689 201420 272916 256530 179854 174988 135799 156349 175916 181441
5102 181441 169155 127581 129502 156405 179422 110142 52427 54309 29008 80624 27719 -14466
5090 -14466 28996 -21522 27404 53014 23856 20406 -5531 8010 48994 53232 58396 62738 10484
5077 10484 5823 -7595 39492 22088 14938 42019 53513 57258 10576 10263 18090 16714 2497
5064 2497 48066 123297 141695 62474 -33045 -75579 -48193 -1131 74821 53254 42241 25160
5052 25160 -5528 -28702 13568 72092 41127 37957 -3125 19448 28935 -18661 23692 -13024
5040 -13024 -27494 -27206 37088 12743 7137 -10484 -76505 -38078 16061 36958 -7795 75243
5028 75243 24969 -35999 -37910 -51776 -19028 -3019 7770 15677 38208 -10804 -20481 -27914 -39592
$$ packed form
5114B24456l1455j4960Q648J4731P1496j6386p6676m866l9189K0550J9567N525
5102A81441j2286m1574J921K6903K3017o9280n7715J882k5301N1616n2905m2185
5090a4466M3462n0518M8926K5610k9158l450k5937J3541M0984M238N164M342n2254
5077A0484m661j3418M7087j7404p150K7081J1494L745m6682l13P827j376j4217
5064B497M5569P5231J8398p9221r5519m2534K7386M7062P5952k1567j1013j7081
5052B5160l0688k3174M2270N8524l0965l170m1082K2573R487m7596M2353l6716
5040a3024j4470K88O4294k4345n606j7621o6021L8427N4139K0897m4753Q3038
5028G5243n0274o0968j911j3866L2748J6009J0789P907K2531m9012r677p433j1678
$$ plain form
5015 -39592 -9653 -58862 -15977 -16672 -9324 -32762 1836 -41889 -20406 12905 26812 57419
5003 57419 96569 83928 -13881 -50199 -54319 -23442 -2205 -21755 10159 -186 -20054 37830
4991 37830 6067 -49501 -22262 4987 -36124 -27266 -401 22047 -19255 -10847 -91285 -25879
4979 -25879 19868 7084 24178 -1303 -4448 -48189 -10876 -12649 -84908 -56151 -17103 4407
4967 4407 -17615 -24927 -24752 -37027 -8699 -15827 -25096 -8515 25309 46916 -20871 30555 84035
4954 84035 50956 -6686 -15008 2778 44585 -4740 -36327 -2328 -9621 -14239 -22187 -5973 -61323
4941 -61323 -51358 -25159 20293 46564 90245 86167 63024 60872 76294 109396 61286 50537
4929 50537 58656 79071 48381 -1347 -710 2699 -5456 -65716 -41687 -19194 -51020 -44109 -40456
$$ packed form
5015c9592K9939m9209M2885o95P348k3438L4598m3725K1483L3311J3907L0607
5003E7419L9150j2641r7809l6318m120L0877K1237j9550L1914j0345j9868N7884
4991C7830l1763n5568K7239K7249m1111Q858K6865K2448m1302Q408q0438O5406
4979b5879M5747j2784J7094k5481l145m3741L7313j773p2259K8757L9048K1510
4967D407k2022p312J75j2275K8328p128r269J6581L3824K1607o7787N1426N3480
4954H4035l3079n7642q322J7786M1807m9325l1587L3999p293m618p948J6214n5350
4941f1323R965K6199M5452K6271M3681m078k3143k152J5422L3102m8110j0749
4929E0537Q119K0415l0690m9728O37L409q155o0260K4029K2493l1826O911L653
$$ plain form
4916 -40456 29881 59699 7505 2547 9674 42685 71740 60589 94901 88623 5634 -25184
4904 -25184 59921 87485 149358 116874 35970 48719 41894 58713 54058 -3653 42924 126770
4892 126770 99258 96875 120317 121023 70024 18338 -9318 27133 16535 35497 57553 25113
4880 25113 28382 57171 51691 78592 94723 95606 100002 76293 72207 63253 28875 93768 127471
4867 127471 56047 50117 70764 16566 32686 47891 7489 47987 137887 123764 94952 104013
4855 104013 97275 64400 76362 72590 61553 56933 93162 95052 100995 71322 27435 30889 61551
4842 61551 60098 56235 64111 132 -13791 -19961 -19016 -55244 19352 73715 48137 42402 62346
4829 62346 74638 70039 52250 70230 52221 79716 37152 23588 90177 108393 109854 89742
$$ packed form
4916d0456P0337K9818n2194m958P127L3011K9055j1151L4312o278q2989l0818
4904b5184Q5105K7564O1873l2484q0904J2749o825J6819m655n7711M6577Q3846
4892A26770k7512k383K3442P06n0999n1686k7656L6451j0598J8962K2056l2440
4880B5113L269K8789n480K6901J6131Q83M396k3709m086q954l4378O4893L3703
4867A27471p1424n930K0647n4198J6120J5205m0402M0498Q9900j4123k8812R061
4855A04013o738l2875J1962l772j1037m620L6229J890N943k9673m3887L454L0662
4842F1551j453l863P876o3979j3923o170R45l6228P4596N4363k5578n735J9944
4829F2346J2292m599j7789J7980j8009K7495m2564j3564O6589J8216J461k0112
$$ plain form
4817 89742 187397 125163 74131 67661 60010 46102 104965 38028 38641 92365 57000 94256 110030
4804 110030 103748 53715 37745 -6030 9142 24259 998 30166 46342 42315 21448 55478
4792 55478 50499 28832 41873 20680 70524 22057 58551 50184 2286 76959 116014 76087
4780 76087 130056 103157 115820 105091 87831 32776 17559 54622 69832 83173 98697 108595
4768 108595 78334 95965 79757 38618 89259 128369 66747 116148 153342 143185 139854 86883
4756 86883 110948 105285 108616 164267 170456 135657 128350 92808 121040 122645 86353 94860 100392
4743 100392 108898 86593 52098 86791 94126 77494 144821 105133 31907 46573 73315 95131
4731 95131 102882 108239 90075 159026 156902 149507 143110 112641 90649 50613 60039 67856 147768
$$ packed form
4817H9742R7655o2234n1032o470p651j3908N8863o6937O13N3724l5365L7256J5774
4804A10030o282n0033j5970m3775J5172J5117k3261K9168J6176m027k0867L4030
4792E5478m979k1667J3041k1193M9844m8467L6494q367m7898P4673L9055l9927
4780G6087N3969k6899J2663j0729j7260n5055j5217L7063J5210J3341J5524R898
4768A08595l0261J7631j6208m1139N0641L9110o1622M9401L7194j0157l331n2971
4756H6883K4065n663L331N5651O189l4799p307l5542K8232J605l6292Q507N532
4743A00392Q506k2305l4495L4693P335j6632O7327l9688p3226J4666K6742K1816
4731I5131P751N357j8164O8951k124p395o397l0469k1992m0036R426P817P9912
$$ plain form
4718 147768 133313 94974 69815 119866 70323 56474 84558 77952 108934 97312 112387 160177
4706 160177 182887 171661 210197 157078 144741 153389 95543 133968 163379 237388 213843 190325
4694 190325 173636 196169 235831 267813 192585 145779 133912 196484 229965 301663 380003 287640
4682 287640 242281 230861 224455 249398 271917 268920 264143 276253 240496 246110 241105 342547
4670 342547 373132 356311 368240 406164 394293 387540 384230 437375 423497 400457 405885 420422
4658 420422 408550 335425 285659 335190 379512 367632 342202 319664 326319 345698 358061 332750
4646 332750 339669 298956 282588 217313 265071 297878 293062 223374 188782 229073 286710 310131
4634 310131 290980 231460 311998 294724 269269 298950 332029 283005 319459 264783 230036 264030
$$ packed form
4718A47768j4455l8339k5159N0051m9543j3849K8084o606L0982j1622J5075M7790
4706A60177K2710j1226L8536n3119j2337Q648n7846L8425K9411P4009k3545k3518
4694A90325j6689K2533L9662L1982p5228m6806j1867O2572L3481P1698P8340r2363
4682B87640m5359j1420o406K4943K2519k997m777J2110l5757N614n005J01442
4670C42547L0585j6821J1929L7924j1871o753l310N3145j3878k3040N428J4537
4658D20422j1872p3125m9766M9531M4322j1880k5430k2538O655J9379J2363k5311
4646C32750O919m0713j6368o5275M7758L2807m816o9688l4592M0291N7637K3421
4634C10131j9151n9520Q0538j7274k5455K9681L3079m9024L6454n4676l4747L3994
$$ plain form
4622 264030 280362 253005 252964 245159 227204 178603 271226 280340 277731 330271 302997 289466 297806
4609 297806 334843 284098 289595 324089 293217 279486 277674 247066 297371 353197 354311 300278
4597 300278 278109 344120 389406 391403 402348 406808 363721 364623 366171 364072 389929 391092 419656
4584 419656 362530 381499 390061 386720 388927 403802 409286 416872 409904 415698 392747 406456 455960
4571 455960 432127 404815 440713 443545 448910 382095 307893 361720 424786 431072 395711 403967
4559 403967 351951 359466 415519 400187 358114 340812 352568 404403 389007 330039 349724 370156
4547 370156 354760 374416 412884 349494 381605 378022 432612 469795 438978 416993 390911 360079
4535 360079 393814 431302 502957 430543 418343 422036 452786 456214 447698 450036 457840 421844 374468
$$ packed form
4622B64030J6332k7357m1p805j7955m8601R2623R114k609N2540k7274j3531Q340
4609B97806L7037n0745N497L4494l0872j3731j812l0608N0305N5826J114n4033
4597C00278k2169O6011M5286J997J0945M460m3087R02J548k099K5857J163K8564
4584D19656n7126J8969Q562l341K207J4875N484P586o968N794k2951J3709M9504
4571D55960k3833k7312L5898K832N365o6815p4202N3827O3066O286l5361Q256
4559D03967n2016P515N6053j5332m2073j7302J1756N1835j5396n8968J9685K0432
4547C70156j5396J9656L8468o3390L2111l583N4590L7183l0817k1985k6082l0832
4535C60079L3735L7488P1655p2414j2200L693L0750L428q516K338P804l5996m7376
$$ plain form
4522 374468 502186 544070 530120 506047 491563 533749 542677 477399 536719 511133 462948 488115
4510 488115 543378 540605 539262 555712 568018 551586 482818 532204 541878 497133 461658 442330
4498 442330 430576 437044 458876 435675 448583 445488 429018 391878 416540 467713 478791 499321
4486 499321 540840 509981 534106 514000 433966 392768 398664 412903 495556 539192 580150 572822
4474 572822 547397 563730 578867 558285 578343 583304 566880 604734 586045 601713 600633 606977
4462 606977 643246 673768 641525 631462 657367 630571 676204 662813 624836 632222 640088 650269
4450 650269 706850 748021 739433 709523 756577 688140 689230 719811 747157 785563 796524 808337
4438 808337 743519 777167 835867 854054 827818 840648 790691 767801 837934 848065 863440 885364
$$ packed form
4522C74468J27718M1884j3950k4073j4484M2186Q928o5278N9320k5586m8185K5167
4510D88115N5263k773j343J6450J2306j6432o8768M9386R674m4745l5475j9328
4498D42330j1754O468K1832k3201J2908l095j6470l7140K4662N1173J1078K0530
4486D99321M1519l0859K4125k0106q0034m1198N896J4239Q2653M3636M0958p328
4474E72822k5425J6333J5137k0582K0058M961j6424L7854j8689J5668j080O344
4462F06977L6269L0522l2243j0063K5905k6796M5633j3391l7977P386P866J0181
4450F50269N6581M1171q588k9910M7054o8437J090L0581K7346L8406J0961J1813
4438H08337o4818L3648N8700J8187k6236J2830m9957k2890P0133J0131J5375K1924
$$ plain form
4426 885364 859844 892905 907538 965989 1074290 1081816 979890 942619 943447 1035457 1045368 994529
4414 994529 960841 969535 1048353 1016816 1005991 1021866 1126898 1176995 1086589 1082226 1119734 1148772
4402 1148772 1147247 1106907 1140604 1176643 1160653 1177493 1220418 1276356 1294630 1347018 1308395 1345168
4390 1345168 1333299 1334807 1319050 1300221 1374858 1380436 1363813 1379769 1433741 1557956 1525235 1531271
4378 1531271 1552481 1575414 1581966 1589772 1571226 1611333 1645043 1718353 1787826 1784201 1749060 1743674
4366 1743674 1850662 1887078 1953580 1957398 2002671 2053499 2086438 2103725 2209578 2210580 2215535 2310773
4354 2310773 2380525 2470172 2479639 2433677 2529192 2657116 2715922 2808140 2873396 2898437 2984722
4343 2984722 3094576 3211357 3296777 3381985 3473875 3624697 3717720 3800863 3966943 4111698
$$ packed form
4426H85364k5520L3061J4633N8451J08301P526j01926l7271Q28R2010R911n0839
4414I94529l3688Q694P8818l1537j0825J5875J05032N0097r0406m363L7508K9038
4402A148772j525m0340L3697L6039j5990J6840M2925N5938J8274N2388l8623L6773
4390A345168j1869J508j5757j8829P4637N578j6623J5956N3972J24215l2721O036
4378A531271K1210K2933O552P806j8546M0107L3710P3310O9473l625l5141n386
4366A743674J06988L6416O6502L818M5273N0828L2939J7287J05853J002M955R5238
4354B310773O9752Q9647R467m5962R5515J27924N8806R2218O5256K5041Q6285
4343B984722J09854J16781Q5420Q5208R1890J50822R3023Q3143J66080J44755
$$ plain form
4333 4111698 4345985 4531227 4671924 4918729 5164202 5417680 5601070 5898186 6192797 6519587
4323 6519587 6831043 7111051 7471079 7754003 8080126 8501816 8989956 9459646 9913514 10499351
4313 10499351 11072280 11738289 12501313 13302697 14087425 14839822 15546434 16132137 16609416
4304 16609416 17082441 17626803 18169431 18808980 19544198 20395634 21426817 22615902 23904648
4295 23904648 25221291 26436628 27410213 28038110 28378278 28427379 28407013 28460680 28524278 28742565
4285 28742565 29123388 29722622 30516822 31539907 32715933 33793132 34531833 34883749 34657390
4276 34657390 33934754 32970467 32011074 31051508 30324390 29755364 29343068 29226970 29379384
4267 29379384 29657809 29929159 30115383 29951855 29456486 28514294 27327454 25996315 24695197
$$ packed form
4333D111698K34287J85242J40697K46805K45473K53478J83390K97116K94611L26790
4323F519587L11456K80008L60028K82924L26123M21690M88140M69690M53868N85837
4313A0499351N72929O66009P63024Q01384P84728P52397P06612N85703M77279
4304A6609416M73025N44362N42628O39549P35218Q51436J031183J189085J288746
4295B3904648J316643J215337R73585O27897L40168M9101k0366N3667O3598K18287
4285B8742565L80823N99234P94200J023085J176026J077199P38701L51916k26359
4276C4657390p22636r64287r59393r59566p27118n69026m12296j16098J52414
4267B9379384K78425K71350J86224j63528m95369r42192j186840j331139j301118
$$ plain form
4258 24695197 23474437 22408006 21543719 20873604 20373408 19900411 19561907 19275173 18839041
4249 18839041 18345371 17719398 16903800 16029028 15239182 14411111 13652806 12991097 12418987
4240 12418987 11869659 11440608 11137079 10772943 10421564 10124805 9838174 9544190 9184698
4231 9184698 8792749 8491402 8239417 7997873 7814575 7580455 7404882 7227742 7123612 6971852
4221 6971852 6799606 6660428 6530415 6478339 6453452 6338229 6296574 6218458 6134760 6092532 6089879
4210 6089879 6005180 5888711 5877231 5846540 5809909 5802114 5780535 5695722 5679039 5668172 5655178
4199 5655178 5629571 5652534 5579477 5581314 5638536 5615509 5567563 5518742 5536391 5572628 5537570 5542765
4187 5542765 5548148 5583763 5624226 5584595 5604998 5751216 5729931 5680339 5702336 5670714 5665049 5706973
$$ packed form
4258B4695197j220760j066431q64287o70115n00196m72997l38504k86734m36132
4249A8839041m93670o25973q15598q74772p89846q28071p58305o61709n72110
4240A2418987n49328m29051l03529l64136l51379k96759k86631k93984l59492
4231I184698l91949l01347k51985k41544j83298k34120j75573j77140j04130j51760
4221F971852j72246j39178j30013n2076k4887j15223m1655p8116q3698m2228k653
4210F089879q4699j16469j1480l0691l6631p795k1579q4813j6683j0867j2994
4199E655178k5607K2963p3057J837N7222k3027m7946m8821J7649L6237l5058N195
4187E542765N383L5615M0463l9631K0403J46218k1285m9592K1997l1622n665M1924
$$ plain form
4175 5706973 5729181 5664667 5623254 5681531 5753349 5731216 5752820 5834045 5830489 5799174 5871056 5830545
4163 5830545 5733342 5780669 5778044 5849154 5804367 5820990 5817199 5816576 5866319 5807686 5805816 5870199
4151 5870199 5826794 5808246 5819233 5825416 5847465 5847717 5861266 5861075 5849634 5822045 5849689 5883999
4139 5883999 5905277 5871762 5826857 5811346 5819740 5832483 5812457 5790769 5873095 5900216 5949688 5956167
4127 5956167 5922341 5909220 5933488 5952107 5978038 5986593 6028202 5998510 5977127 6029550 6044682 6057778
4115 6057778 6084666 6075211 6041261 6053792 6018200 6049670 6066948 6023788 6040494 6011886 5994226 5982548
4103 5982548 5967039 5975437 5967417 5961451 5899558 5785524 5806964 5775950 5771867 5756695 5722319 5732294
4091 5732294 5697544 5652094 5594534 5564641 5578164 5627910 5635829 5664460 5663336 5639824 5615757 5663767
$$ packed form
4175E706973K2208o4514m1413N8277P1818k2133K1604Q1225l556l1315P1882m0511
4163E830545r7203M7327k625P1110m4787J6623l791o23M9743n8633j870O4383
4151E870199m3405j8548J0987O183K2049K52J3549j91j1441k7589K7644L4310
4139E883999K1278l3515m4905j5511Q394J2743k0026k1688Q2326K7121M9472O479
4127E956167l3826j3121K4268J8619K5931Q555M1609k9692k1383N2423J5132J3096
4115F057778K6888r455l3950J2531l5592L1470J7278m3160J6706k8608j7660j1678
4103E982548j5509Q398q020n966o1893j14034K1440l1014m083j5172l4376R975
4091E732294l4750m5450n7560k9893J3523M9746P919K8631j124k3512k4067M8010
$$ plain form
4079 5663767 5656790 5673718 5656400 5631709 5650496 5715380 5799865 5862925 5877305 5926344 6009940 6081627
4067 6081627 6186673 6271551 6277737 6370339 6480373 6579242 6676940 6749971 6886073 7041256 7133247
4056 7133247 7248154 7392130 7534636 7701822 7922607 8065537 8287605 8525306 8724913 8986297
4046 8986297 9231305 9457045 9766005 10104718 10427481 10787945 11230386 11671218 12144268 12563846
4036 12563846 12973911 13501173 14057251 14735544 15507825 16370281 17234969 18187687 19196259
4027 19196259 20350671 21651280 23162238 24830100 26732630 28815063 31056109 33613135
4019 33613135 36369132 39442756 42878936 46616187 50634359 54867849 59418563 64129031
4011 64129031 68643190 72902660 76761871 80107202 82889018 85022674 86473532 87410273
$$ packed form
4079E663767o977J6928j7318k4691J8787O4884Q4485O3060J4380M9039Q3596P1687
4067F081627J05046Q4878O186R2602J10034R8869R7698P3031J36102J55183R1991
4056G133247J14907J43976J42506J67186K20785J42930K22068K37701J99607K61384
4046H986297K45008K25740L08960L38713L22763L60464M42441M40832M73050M19578
4036A2563846M10065N27262N56078O78293P72281Q62456Q64688R52718J008572
4027A9196259J154412J300609J510958J667862J902530K082433K241046K557026
4019C3613135K755997L073624L436180L737251M018172M233490M550714M710468
4011F4129031M514159M259470L859211L345331K781816K133656J450858R36741
$$ plain form
4003 87410273 87840704 87843059 87570535 87111181 86699110 86297829 86019854 85753426 85371169 84763194
3993 84763194 83759365 82245762 80280223 77825343 74941099 71525671 67691241 63587504
3985 63587504 59336596 55125483 51056504 47160508 43594904 40235247 37218107 34566549
3977 34566549 32201554 30129666 28271174 26589090 25027439 23599060 22343998 21207331
3969 21207331 20128805 19144936 18306325 17545716 16796472 16126827 15518510 15029758 14490769
3960 14490769 13940696 13510580 13058733 12744014 12446565 12217284 11865220 11507884 11230403
3951 11230403 10968122 10689204 10472111 10304866 10060829 9895547 9695000 9540418 9398203
3942 9398203 9289522 9158018 8948332 8769487 8718532 8656677 8540933 8421082 8316050 8168400
$$ packed form
4003H7410273M30431K355k72524m59354m12071m01281k77975k66428l82257o07975
3993H4763194j003829j513603j965539k454880k884244l415428l834430m103737
3985F3587504m250908m211113m068979l895996l565604l359657l017140k651558
3977C4566549k364995k071888j858492j682084j561651j428379j255062j136667
3969B1207331j078526r83869q38611p60609p49244o69645o08317m88752n38989
3960A4490769n50073m30116m51847l14719k97449k29281l52064l57336k77481
3951A1230403k62281k78918k17093j67245k44037j65282k00547j54582j42215
3942I398203j08681j31504k09686j78845n0955o1855j15744j19851j05032j47650
$$ plain form
3932 8168400 8052057 7969246 7966622 7853633 7751236 7680496 7641162 7572625 7530884 7482058 7518058
3921 7518058 7544314 7545928 7603761 7647167 7725051 7803505 7833458 7948989 8028663 8045252 8188387
3910 8188387 8325013 8434087 8568195 8719557 8896982 9071014 9327900 9532641 9775229 10129908
3900 10129908 10501170 10905875 11241740 11628066 12110512 12637433 13306520 14060462 14751637
3891 14751637 15530835 16310857 17123774 17988129 18826822 19656556 20430034 21094557 21569345
3882 21569345 21857196 22025333 22183365 22068787 21883226 21582076 21162434 20669141 20170250
3873 20170250 19730259 19378486 19187574 19043328 18893160 18838099 18929051 19081575 19316091 19629948
3863 19629948 20029791 20487730 21009286 21595840 22315055 23057404 23920786 24837067 25875031
$$ packed form
3932H168400j16343q2811k624j12989j02397p0740l9334o8537m1741m8826L6000
3921G518058K6256J614N7833M3406P7884P8454K9953J15531P9674J6589J43135
3910H188387J36626J09074J34108J51362J77425J74032K56886K04741K42588L54679
3900A0129908L71262M04705L35865L86326M82446N26921O69087P53942O91175
3891A4751637P79198P80022Q12917Q64355Q38693Q29734P73478O64523M74788
3882B1569345K87851J68137J58032j14578j85561l01150m19642m93293m98891
3873B0170250m39991l51773j90912j44246j50168n5061R0952J52524K34516L13857
3863A9629948L99843M57939N21556N86554P19215P42349Q63382R16281J037964
$$ plain form
3854 25875031 27089388 28411525 29832501 31464380 33352655 35375338 37710880 40365809
3846 40365809 43306490 46557147 50134647 54202005 58707325 63748901 69291789 75383195
3838 75383195 82077820 89375247 97147551 105130322 113006637 120546289 127728919 134261325
3830 134261325 140180692 145242426 149398564 152503611 154478826 155526395 155828701 155569216
3822 155569216 154868183 153731977 152217956 150360307 148198547 145811056 143247026 140546644
3814 140546644 137371754 133846650 129864157 125555199 120871995 115788891 110290181 104487012
3806 104487012 98598514 92653751 86616509 80846938 75352831 70041001 64984385 60283359
3798 60283359 56002830 52188946 48655638 45498942 42607489 40016583 37791014 35699244
$$ packed form
3854B5875031J214357J322137J420976J631879J888275K022683K335542K654929
3846D0365809K940681L250657L577500M067358M505320N041576N542888O091406
3838G5383195O694625P297427P772304P982771P876315P539652P182630O532406
3830A34261325N919367N061734M156138L105047J975215J047569L02306k59485
3822A55569216p01033j136206j514021j857649k161760k387491k564030k700382
3814A40546644l174890l525104l982493m308958m683204n083104n498710n803169
3806A04487012n888498n944763o037242n769571n494107n311830n056616m701026
3798F0283359m280529l813884l533308l156696k891453k590906k225569k091770
$$ plain form
3790 35699244 33808447 32091429 30543684 29118163 27928510 26811133 25747621 24877456
3782 24877456 24046197 23298575 22659228 22115202 21740438 21397302 21064605 20814477 20751089 20719910
3772 20719910 20677966 20690101 20796255 21059615 21349630 21617186 21938449 22098186 22301843 22455611
3762 22455611 22551397 22590643 22517474 22384399 22132335 21759871 21193411 20628769 20017172 19301620
3752 19301620 18525101 17761629 16924303 16022270 15204711 14449483 13797753 13213864 12606573
3743 12606573 12034964 11575804 11031167 10626143 10296380 9882832 9556991 9268990 9013890
3734 9013890 8674931 8441348 8293520 8146204 7947642 7744775 7666445 7515858 7373932 7218743
3724 7218743 7097871 7002138 6862809 6823299 6764061 6690482 6611210 6560119 6504784 6370776 6322008
$$ packed form
3790C5699244j890797j717018j547745j425521j189653j117377j063512q70165
3782B4877456q31259p47622o39347n44026l74764l43136l32697k50128o3388l1179
3772B0719910m1944J2135J06154K63360K90015K67556L21263J59737K03657J53768
3762B2455611R5786L9246p3169j33075k52064l72464n66460n64642o11597p15552
3752A9301620p76519p63472q37326r02033q17559p55228o51730n83889o07291
3743A2606573n71609m59160n44637m05024l29763m13548l25841k88001k55100
3734I013890l38959k33583j47828j47316j98562k02867p8330j50587j41926j55189
3724G218743j20872r5733j39329l9510n9238p3579p9272n1091n5335j34008m8768
$$ plain form
3713 6322008 6335123 6239828 6224105 6183887 6108183 6036216 5956162 5885532 5797466 5772512 5725270
3702 5725270 5651875 5595817 5605812 5638505 5568975 5495599 5463193 5363014 5262523 5169130 5152072
3691 5152072 5074786 5021506 4985407 4960670 4917769 4864072 4819504 4891238 4875395 4893749 4906534
3680 4906534 4835015 4834694 4846233 4835565 4871554 4934519 4919658 4885085 4943410 5032658 5076929 5090634
3668 5090634 5071317 5154797 5266961 5325070 5406114 5441751 5489367 5591345 5682146 5842261 5911950
3657 5911950 5921150 6013874 6080613 6177158 6282880 6398569 6529838 6621634 6698211 6830420 6983659
3646 6983659 7160850 7405453 7627921 7824817 7959980 8220126 8541477 8831020 9173958 9629183
3636 9629183 10123940 10588198 11125321 11767491 12399990 13118379 13921676 14775413 15636557 16490540
$$ packed form
3713F322008J3115r5295j5723m0218p5704p1967q0054p0630q8066k4954m7242
3702E725270p3395n6058R995L2693o9530p3376l2406j00179j00491r3393j7058
3691E152072p7286n3280l6099k4737m2901n3697m4568P1734j5843J8354J2785
3680D906534p1519l21J1539j0668L5989O2965j4861l4573N8325Q9248M4271J3705
3668E090634j9317Q3480J12164N8109Q1044L5637M7616J01978R0801J60115O9689
3657E911950R200R2724O6739R6545J05722J15689J31269R1796P6577J32209J53239
3646F983659J77191K44603K22468J96896J35163K60146L21351K89543L42938M55225
3636I629183M94757M64258N37123O42170O32499P18389Q03297Q53737Q61144Q53983
$$ plain form
3626 16490540 17338817 18247588 19163707 20009121 20801850 21454957 22075790 22530768 23025042
3617 23025042 23492764 23875204 24184145 24452605 24590430 24609726 24646850 24686055 24708917 24656751
3607 24656751 24520178 24334585 24180208 23908564 23622534 23283599 22885080 22429015 21890292
3598 21890292 21250592 20770733 20267414 19859452 19482964 19311840 19269716 19229650 19309719 19493407
3588 19493407 19830875 20291190 20850222 21459269 22156118 23115304 24182902 25422817 26851424
3579 26851424 28366751 30121656 32066205 34257725 36676391 39384156 42339847 45526437
3571 45526437 48829471 52191518 55468931 58664237 61606571 64302550 66902487 69261924
3563 69261924 71413728 73427803 75160679 76525397 77600843 78383801 78915587 79334525 79595702
$$ packed form
3626A6490540Q48277R08771R16119Q45414P92729O53107O20833M54978M94274
3617B3025042M67722L82440L08941K68460J37825J9296L7124L9205K2862n2166
3607B4656751j36573j85593j54377k71644k86030l38935l98519m56065n38723
3598B1890292o39700m79859n03319m07962l76488j71124m2124m0066Q0069J83688
3588A9493407L37468M60315N59032O09047O96849R59186J067598J239915J428607
3579B6851424J515327J754905J944549K191520K418666K707765K955691L186590
3571D5526437L303034L362047L277413L195306K942334K695979K599937K359437
3563F9261924K151804K014075J732876J364718J075446P82958N31786M18938K61177
$$ plain form
3554 79595702 79575483 79233614 78654844 78025147 77418448 76725621 75876042 74834453 73566630
3545 73566630 71950671 70127711 68233773 66262013 64394256 62690079 61215144 60126644
3537 60126644 59456112 59156902 59268968 59792176 60655262 61874263 63426945 65133222 66919173
3528 66919173 68878828 70834654 72657130 74427061 75947018 77225467 78230360 79100127
3520 79100127 79781185 80201163 80452568 80523443 80394301 80101392 79706944 79105714 78199022 76945043
3510 76945043 75496331 73762466 71805959 69571647 67260046 64760368 62019286 59180360
3502 59180360 56217276 53189990 50162312 47190381 44401240 41749179 39286890 36953839
3494 36953839 34755363 32851223 31096273 29596778 28308725 27190925 26138456 25311009
$$ packed form
3554G9595702k0219l41869n78770o29697o06699o92827q49579j041589j267823
3545G3566630j615959j822960j893938j971760j867757j704177j474935j088500
3537F0126644o70532k99210J12066N23208Q63086J219001J552682J706277J785951
3528F6919173J959655J955826J822476J769931J519957J278449J004893Q69767
3520G9100127O81058M19978K51405P0875j29142k92909l94448o01230r06692j253979
3510G6945043j448712j733865j956507k234312k311601k499678k741082k838926
3502E9180360k963084l027286l027678k971931k789141k652061k462289k333051
3494C6953839k198476j904140j754950j499495j288053j117800j052469q27447
$$ plain form
3486 25311009 24614470 24020087 23531451 23140968 22845165 22669472 22644439 22703742 22879917 23143782
3476 23143782 23517565 23912954 24380224 24876817 25488899 26070943 26536199 27040803 27465338
3467 27465338 27855702 28217233 28453459 28615123 28840502 28970651 29075232 29135761 29086911 29034240
3457 29034240 28975536 28765022 28509358 28262701 27929226 27619064 27125369 26704766 26201072 25666393
3447 25666393 25169686 24617569 24014431 23311493 22613873 21875145 21117398 20400931 19723852
3438 19723852 19107269 18527244 17999847 17507630 17039861 16506175 15933289 15537132 15105369
3429 15105369 14706072 14395804 14121958 13898768 13654385 13536744 13433889 13342237 13297236 13365150
3419 13365150 13402338 13536901 13683861 13874850 14121224 14300119 14614319 14982863 15362849 15811116
$$ packed form
3486B5311009o96539n94383m88636l90483k95803j75693k5033N9303J76175K63865
3476B3143782L73783L95389M67270M96593O12082N82044M65256N04604M24535
3467B7465338L90364L61531K36226J61664K25379J30149J04581O0529m8850n2671
3457B9034240n8704k10514k55664k46657l33475l10162m93695m20603n03694n34679
3447B5666393m96707n52117o03138p02938o97620p38728p57747p16467o77079
3438A9723852o16583n80025n27397m92217m67769n33686n72886l96157m31763
3429A5105369l99297l10268k73846k23190k44383j17641j02855r1652m5001O7914
3419A3365150L7188J34563J46960J90989K46374J78895L14200L68544L79986M48267
$$ plain form
3409 15811116 16337962 16992100 17576706 18237988 19047332 19912523 20869524 21953182 23179632
3400 23179632 24505596 26036059 27811256 29740994 31857852 34194226 36656268 39493081
3392 39493081 42730309 46251656 49968755 53834726 57630600 61303171 64783061 68265990
3384 68265990 71880730 75631245 79581001 83624927 87343026 90527822 93039553 94840564
3376 94840564 95979390 96576603 96593482 96213882 95276246 93568575 91178998 88193847 84555096
3367 84555096 80498037 76182930 71693806 67008083 62298544 57785797 53359343 49141721
3359 49141721 45298103 41784443 38521652 35645404 33130485 30820933 28752808 26960770
3351 26960770 25376109 23851391 22431681 21226617 20123476 19149342 18243668 17428991 16671211
$$ packed form
3409A5811116N26846O54138N84606O61282Q09344Q65191R57001J083658J226450
3400B3179632J325964J530463J775197J929738K116858K336374K462042K836813
3392C9493081L237228L521347L717099L865971L795874L672571L479890L482929
3384F8265990L614740L750515L949756M043926L718099L184796K511731J801011
3376I4840564J138826N97213J6879l79600r37636j707671k389577k985151l638751
3367H4555096m057059m315107m489124m685723m709539m512747m426454m217622
3359D9141721l843618l513660l262791k876248k514919k309552k068125j792038
3351B6960770j584661j524718j419710j205064j103141r74134r05674q14677p57780
$$ plain form
3342 16671211 15934065 15309492 14717373 14186574 13730077 13332922 12957403 12576383 12337452
3333 12337452 12035709 11741496 11506336 11340474 11166603 10999488 10821815 10756807 10866077 10835862
3323 10835862 10760159 10778857 10848509 10870272 10898955 10960649 10946955 10941885 10937685 10880774 10756158
3312 10756158 10586591 10392526 10154189 9816006 9553963 9268468 8853043 8420741 8082039
3303 8082039 7725348 7433123 7187504 6947222 6720338 6478213 6264671 6035791 5827364 5654440
3293 5654440 5500373 5391600 5307521 5276207 5207955 5098349 4978797 4936304 4962571 4849534
3283 4849534 4765503 4647168 4634137 4615774 4562310 4504315 4474061 4460494 4473624 4470857 4452413
3272 4452413 4394542 4348683 4378975 4335777 4297783 4331968 4382629 4351925 4311950 4334521 4409892
$$ packed form
3342A6671211p37146o24573n92119n30799m56497l97155l75519l81020k38931
3333A2337452l01743k94213k35160j65862j73871j67115j77673o5008J09270l0215
3323A0835862p5703J8698O9652K1763K8683O1694j3694n070m200n6911j24616
3312A0756158j69567j94065k38337l38183k62043k85495m15425m32302l38702
3303H082039l56691k92225k45619k40282k26884k42125k13542k28880k08427j72924
3293E654440j54067j08773q4079l1314o8252j09606j19552m2493K6267j13037
3283D849534q4031j18335j3031j8363n3464n7995l0254j3567J3130k767j8444
3272D452413n7871m5859L0292m3198l7994L4185N0661l0704l9975K2571P5371
$$ plain form
3261 4409892 4338533 4381526 4485268 4483559 4518755 4458071 4438210 4428368 4375494 4383477 4420148 4361718
3249 4361718 4281435 4223513 4176491 4202275 4142107 4189061 4125352 4080803 4160867 4192448 4240039
3238 4240039 4245864 4336623 4382087 4402173 4283929 4246846 4331992 4315116 4319580 4347846 4360587 4378357
3226 4378357 4319120 4327385 4375828 4405832 4382731 4390508 4429955 4380454 4330776 4342570 4403841 4351696
3214 4351696 4368426 4355427 4319272 4294375 4348372 4372385 4367541 4365691 4428921 4487908 4456475 4467955
3202 4467955 4533102 4589485 4581280 4635341 4652336 4720226 4855429 4918679 4913560 5010843 5094889 5185153
3190 5185153 5342129 5394911 5493488 5656618 5753194 5810296 5982611 6007939 6146367 6255084
3180 6255084 6303896 6477248 6650721 6768683 6924728 6953332 7096748 7218347 7288681 7488181
$$ packed form
3261D409892p1359M2993J03742j709L5196o0684j9861r842n2874P983L6671n8430
3249D361718q0283n7922m7022K5784o0168M6954o3709m4549Q0064L1581M7591
3238D240039N825R0759M5464K0086j18244l7083Q5146j6876M464K8266J2741J7770
3226D378357n9237Q265M8443L0004k3101P777L9447m9501m9678J1794O1271n2145
3214D351696J6730j2999l6155k4897N3997K4013m844j850O3230N8987l1433J1480
3202D467955O5147N6383q205N4061J6995O7890J35203O3250n119R7283Q4046R0264
3190E185153J56976N2782R8577J63130R6576N7102J72315K5328J38428J08717
3180F255084M8812J73352J73473J17962J56045K8604J43416J21599P0334J99500
$$ plain form
3170 7488181 7596786 7741404 7904795 8070286 8269103 8404317 8604843 8805724 8929945 9222771
3160 9222771 9443016 9640661 9834948 10141540 10386372 10730251 11132553 11484215 11866393 12242974
3150 12242974 12649022 13131123 13641241 14098442 14603472 15193602 15823453 16546595 17252996
3141 17252996 17995421 18762622 19636245 20575579 21558101 22582416 23677702 24830834 26058080
3132 26058080 27442691 29012705 30665427 32408988 34315496 36314590 38319936 40478172
3124 40478172 42618488 44805937 47119809 49608058 52470578 55633486 59166897 63178926
3116 63178926 67695832 72768441 78369480 84641670 91672735 99502526 108230039 118137167
3108 118137167 129584648 142728803 157702193 174488270 192922262 212688165 233629425
$$ packed form
3170G488181J08605J44618J63391J65491J98817J35214K00526K00881J24221K92826
3160I222771K20245J97645J94287L06592K44832L43879M02302L51662L82178L76581
3150A2242974M06048M82101N10118M57201N05030N90130O29851P23142P06401
3141A7252996P42425P67201Q73623R39334R82522J024315J095286J153132J227246
3132B6058080J384611J570014J652722J743561J906508J999094K005346K158236
3124D0478172K140316K187449K313872K488249K862520L162908L533411M012029
3116F3178926M516906N072609N601039O272190P031065P829791Q727513R907128
3108A18137167J1447481J3144155J4973390J6786077J8433992J9765903K0941260
$$ plain form
3101 233629425 256191046 280559195 307496061 338551036 374043328 410374254 438007676
3094 438007676 447311990 436275424 409869645 375222910 338435898 303125260 270596070
3087 270596070 241555127 216751088 195953778 178501048 163513866 150409957 138581061
3080 138581061 127817654 117924271 108747859 100430981 93047163 86512862 80807198 75661736
3072 75661736 70999038 66805382 63011714 59526739 56276973 53312417 50661354 48100196
3064 48100196 45690208 43406177 41212342 39197480 37438752 35792557 34290870 32937310
3056 32937310 31567715 30320348 29089884 28012948 26961554 26004910 25182087 24392654 23518872
3047 23518872 22730000 22005429 21385072 20656437 19961226 19381402 18866195 18298496 17723064
$$ packed form
3101B33629425K2561621K4368149K6936866L1054975L5492292L6330926K7633422
3094D38007676R304314j1036566k6405779l4646735l6787012l5310638l2529190
3087B70596070k9040943k4804039k0797310j7452730j4987182j3103909j1828896
3080A38581061j0763407r893383r176412q316878p383818o534301n705664n145462
3072G5661736m662698m193656l793668l484975l249766k964556k651063k561158
3064D8100196k409988k284031k193835k014862j758728j646195j501687j353560
3056C2937310j369595j247367j230464j076936j051394r56644q22823p89433q73782
3047B3518872p88872p24571o20357p28635o95211n79824n15207n67699n75432
$$ plain form
3038 17723064 17216600 16613891 16136867 15688855 15242805 14760233 14420700 14009132 13675568
3029 13675568 13351583 12993298 12626598 12357883 12064264 11796057 11531217 11270268 11012350
3020 11012350 10722840 10530255 10305733 10068661 9799706 9631308 9447648 9199740 8950829
3011 8950829 8791974 8642671 8469523 8317176 8193574 8018307 7843558 7697211 7524497 7414951
3001 7414951 7389640 7275398 7209456 7100296 7009269 6962863 6853485 6722318 6518002 6447070
2991 6447070 6390642 6316567 6248765 6092218 6007730 5959098 5862960 5781424 5646441 5589426 5521326
2980 5521326 5375859 5299608 5192851 5077388 4991636 4871962 4775026 4729116 4619357 4511381
2970 4511381 4430380 4332002 4235781 4231889 4181621 4153861 4070725 3990520 3932481 3837333 3819623 3783903
$$ packed form
3038A7723064n06464o02709m77024m48012m46050m82572l39533m11568l33564
3029A3675568l23985l58285l66700k68715k93619k68207k64840k60949k57918
3020A1012350k89510j92585k24522k37072k68955j68398j83660k47908k48911
3011H950829j58855j49303j73148j52347j23602j75267j74749j46347j72714j09546
3001G414951k5311j14242o5942j09160r1027m6406j09378j31167k04316p0932
2991F447070n6428p4075o7802j56547q4488m8632r6138q1536j34983n7015o8100
2980E521326j45467p6251j06757j15463q5752j19674r6936m5910j09759j07976
2970D511381q1001r8378r6221l892n0268k7760q3136q0205n8039r5148j7710l5720
$$ plain form
2958 3783903 3705498 3607639 3591115 3547141 3419879 3324242 3297254 3232919 3260443 3205745 3083310
2947 3083310 3028581 3055623 3103614 3064013 3002705 2910399 2852145 2788828 2717935 2655715 2630882
2936 2630882 2673446 2657165 2587668 2535811 2470724 2522732 2566623 2582741 2556645 2545009 2551778 2604383
2924 2604383 2638173 2583876 2488876 2553617 2570786 2508660 2522216 2512042 2532402 2518137 2474124
2913 2474124 2446372 2397848 2356585 2343656 2346508 2409683 2399239 2310287 2271418 2226844 2173439 2179536
2901 2179536 2201681 2215407 2193224 2151514 2060442 2032761 2068667 2015341 1917127 1938154 1933765 1926017
2889 1926017 1909983 1815574 1828166 1816554 1779509 1682702 1642070 1661362 1657967 1620212 1533450 1599751
2877 1599751 1564026 1537308 1558738 1490959 1431056 1409422 1311296 1320212 1308074 1310313 1372725 1371305
$$ packed form
2958C783903p8405r7859j6524m3974j27262r5637k6988o4335K7524n4698j22435
2947C083310n4729K7042M7991l9601o1308r2306n8254o3317p0893o2220k4833
2936B630882M2564j6281o9497n1857o5087N2008M3891J6118k6096j1636O769N2605
2924B604383L3790n4297r5000O4741J7169o2126J3556j0174K0360j4265m4013
2913B474124k7752m8524m1263j2929K852O3175j0444q8952l8869m4574n3405O097
2901B179536K2145J3726k2183m1710r1072k7681L5906n3326r8214K1027m389p748
2889A926017j6034r4409J2592j1612l7045r6807m0632J9292l395l7755q6762O6301
2877A599751l5725k6718K1430o7779n9903k1634r8126Q916j2138K239O2412j420
$$ plain form
2865 1371305 1341134 1328728 1365467 1400948 1372559 1378986 1365872 1369974 1385388 1348107 1354265 1332533
2853 1332533 1306057 1309726 1376844 1359844 1311736 1336657 1389322 1398034 1403504 1382464 1361200 1292767
2841 1292767 1337154 1337196 1357532 1397958 1381387 1343927 1312867 1333662 1358719 1427528 1492113 1495824
2829 1495824 1517917 1536110 1526826 1572880 1640595 1756456 1779663 1786008 1874996 1977439 2089542
2818 2089542 2148878 2274164 2393921 2496781 2660286 2821957 3036109 3110749 3123288 3078386
2808 3078386 2866128 2732366 2629005 2455917 2263892 2026669 1917500 1850612 1741888 1646600
2798 1646600 1508331 1487372 1417831 1337636 1336309 1297639 1308567 1224474 1159434 1142861 1064196
2787 1064196 1021958 999740 1008572 978382 941529 945903 939685 866456 805172 875513 825038 785596
$$ packed form
2865A371305l0171j2406L6739L5481k8389O427j3114M102J5414l7281O158k1732
2853A332533k6476L669O7118j7000m8108K4921N2665Q712N470k1040k1264o8433
2841A292767M4387M2K0336M0426j6571l7460l1060K0795K5057O8809O4585L711
2829A495824K2093J8193r284M6054O7715J15861K3207O345Q8988J02443J12103
2818B089542N9336J25286J19757J02860J63505J61671K14152P4640J2539m4902
2808C078386k12258j33762j03361j73088j92025k37223j09169o6888j08724r5288
2798A646600j38269k0959o9541q0195j327l8670J0928q4093o5040j6573p8665
2787A064196m2238k2218Q832l0190l6853M374o218p3229o1284P0341n0475l9442
$$ plain form
2775 785596 819088 850652 770305 719127 730262 794261 816394 763009 734809 668568 629695 633132
2763 633132 693033 655932 665496 697993 649106 625552 684213 763317 733229 691000 667684 630329
2751 630329 606591 559635 485125 504759 516301 546893 523174 586216 557794 512547 557228 547624
2739 547624 517442 480270 486752 479102 478158 530801 523853 410423 423505 467822 500613 478600
2727 478600 471919 501153 500260 486838 519391 551136 583461 510675 513140 441719 358792 386975
2715 386975 413953 378767 401542 422467 420148 478230 471328 397718 418079 457433 449288 452224
2703 452224 404727 350772 357373 392389 341423 397872 363574 315299 347146 384994 372919 306150
2691 306150 339866 349287 348378 392695 387391 386276 405408 428219 424192 382306 411721 341611 308387
$$ packed form
2775G85596L3492L1564q0347n1178J1135O3999K2133n3385k8200o6241l8873L437
2763F33132N9901l7101R564L2497m8887k3554N8661P9104l0088m2229k3316l7355
2751F30329k3738m6956p4510J9634J1542L0592k3719O3042k8422m5247M4681r604
2739E47624l0182l7172O482p650r44N2643o948j13430J3082M4317L2791k2013
2727D78600o681K9234q93j3422L2553L1745L2325p2786K465p1421q2927K8183
2715C86975K6978l5186K2775K0925k319N8082o902p3610K0361L9354q145K936
2703D52224m7497n3955O601L5016n0966N6449l4298m8275L1847L7848j2075o6769
2691C06150L3716R421r09M4317n304j115J9132K2811m027m1886K9415p0110l3224
$$ plain form
2678 308387 329412 415518 408480 345019 324622 257049 336675 306090 300864 319534 331884 284563
2666 284563 223418 294209 326511 333828 295134 324718 340463 315717 350950 326040 278338 263572
2654 263572 274167 245163 226364 175753 193607 205371 252664 326967 300297 317548 333994 323252
2642 323252 280260 366172 375390 316559 326193 331577 262081 226843 235574 271534 260105 288712
2630 288712 292348 232286 243708 242234 210549 208193 230471 196667 211888 234066 285930 289323
2618 289323 281754 234506 201170 243815 298962 275168 268858 316835 321335 316214 331349 275425
2606 275425 217615 234721 233513 274799 312450 274940 252355 265667 276112 279022 253416 239237
2594 239237 186361 184923 220800 284687 298083 310817 283743 288915 280444 328227 266148 211125
$$ packed form
2678C08387K1025Q6106p038o3461k0397o7573P9626l0585n226J8670J2350m7321
2666B84563o1145P0791L2302P317l8694K9584J5745k4746L5233k4910m7702j4766
2654B63572J0595k9004j8799n0611J7854J1764M7293P4303k6670J7251J6446j0742
2642C23252m2992Q5912R218n8831R634N384o9496l5238Q731L5960j1429K8607
2630B88712L636o0062J1422j474l1685k356K2278l3804J5221K2178N1864L393
2618B89323p569m7248l3336M2645N5147k3794o310M7977M500n121J5135n5924
2606B75425n7810J7106j208M1286L7651l7510k2585J3312J0445K910k5606j4179
2594B39237n2876j438L5877O3887J3396J2734k7074N172q471M7783o2079n5023
$$ plain form
2582 211125 268508 316809 360894 329173 331732 307091 329992 261368 302252 261541 230628 181047
2570 181047 133903 139236 187796 223831 204923 199351 176521 235928 310210 240315 163774 239160
2558 239160 276973 222287 212347 219161 268064 224145 157683 197076 144110 111229 140495 156334
2546 156334 193523 175205 209656 209050 155054 126619 198636 230123 259168 295363 228143 225512
2534 225512 245965 228829 192648 253052 245545 217308 219548 260702 244214 212701 187579 208575
2522 208575 196605 175363 192947 178663 187848 182957 218204 240333 211245 203457 180328 169706
2510 169706 137434 159815 162352 125152 122388 137792 133315 135776 195829 174615 85056 83153 89950
2497 89950 125627 101749 109847 147245 146154 191965 166512 191524 238876 241105 212125 217955 168398
$$ packed form
2582B11125N7383M8301M4085l1721K559k4641K2901o8624M0884m0711l0913m9581
2570A81047m7144N333M8560L6035j8908n572k2830N9407P4282o9895p6541P5386
2558B39160L7813n4686r940O814M8903m3919o6462L9393n2966l2881K9266J5839
2546A56334L7189j8318L4451o06n3996k8435P2017L1487K9045L6195o7220k631
2534B25512K0453j7136l6181O0404p507k8237K240M1154j6488l1513k5122K0996
2522B08575j1970k1242J7584j4284R185m891L5247K2129k9088p788k3129j0622
2510A69706l2272K2381K537l7200k764J5404m477K461O0053k1214q9559j903O797
2497H9950L5677k3878Q098L7398j091M5811k5453K5012M7352K229k8980N830m9557
$$ plain form
2484 168398 168632 177547 213851 210299 201568 119702 78813 94732 54399 119805 124670 219430 168203
2471 168203 176351 207470 182944 189746 257641 244441 184581 202553 183409 164154 182544 200554
2459 200554 229788 184161 171398 177552 194935 157497 131709 242819 241936 177642 162177 265325
2447 265325 273539 212908 262568 219408 193598 224618 248274 286716 284371 226536 193743 196076
2435 196076 200091 208131 229732 227622 196473 213342 205087 246667 264193 265963 213145 255818 273226
2422 273226 304732 292387 232579 257331 262138 225932 213482 171403 261278 322750 258815 178185
2410 178185 202164 275103 275012 236342 310680 296619 241013 216949 230358 240443 229660 329640
2398 329640 364565 419894 414248 367546 387463 370338 314107 313774 329092 304169 273273 383475
$$ packed form
2484A68398K34Q915L6304l552q731q1866m0889J5919m0333O5406M865R4760n1227
2471A68203Q148L1119k4526O802O7895j3200n9860J7972j9144j9255J8390J8010
2459B00554K9234m5627j2763O154J7383l7438k5788J11110q83o4294j5465J03148
2447B65325Q214o0631M9660m3160k5810L1020K3656L8442k345n7835l2793K333
2435A96076M015Q040K1601k110l1149J6869q255M1580J7526J770n2818M2673J7408
2422B73226L1506j2345n9808K4752M807l6206j2450m2079Q9875O1472o3935q0630
2410A78185K3979P2939r1l8670P4338j4061n5606k4064J3409J0085j0783R9980
2398C29640L4925N5329n646m6702J9917j7125n6231l33J5318k4923l0896J10202
$$ plain form
2386 383475 431942 402268 490034 547626 516373 477542 447698 406395 465620 501870 508363 589507
2374 589507 561782 541074 515561 554813 571224 601152 618427 629766 641627 629977 693619 721387
2362 721387 736795 805188 797307 776433 860334 927907 937720 981976 1044856 1044088 1119151 1195421
2350 1195421 1250001 1313711 1427493 1537698 1651421 1747635 1800862 1899306 2028522 2137323
2340 2137323 2231803 2287137 2474635 2712162 2914229 3058959 3219565 3433432 3696495 3991013
2330 3991013 4335558 4691951 5084033 5611317 6123725 6726703 7397541 8070397 8783869 9742156
2320 9742156 10822300 11991064 13249629 14695878 16314303 17901534 19831937 22471078
2312 22471078 25979868 29190650 29740659 28305923 25787170 22838980 20042895 17722106
$$ packed form
2386C83475M8467k9674Q7766N7592l1253l8831k9844m1303N9225L6250O493Q1144
2374E89507k7725k0708k5513L9252J6411K9928J7275J1339J1861j1650O3642K7768
2362G21387J5408O8393p881k0874Q3901O7573R813M4256O2880p68P5063P6270
2350A195421N4580O3710J13782J10205J13723R6214N3227R8444J29216J08801
2340B137323R4480N5334J87498K37527K02067J44730J60606K13867K63063K94518
2330C991013L44545L56393L92082N27284N12408O02978O70838O72856P13472R58287
2320I742156J080144J168764J258565J446249J618425J587231J930403K639141
2312B2471078L508790L210782N50009j434736k518753k948190k796085k320789
$$ plain form
2304 17722106 15588158 13629962 12103043 10874601 9906092 9077162 8449006 7861306 7339055
2295 7339055 6891780 6401886 5839367 5363894 5036910 4734881 4360244 4008611 3820374 3602107
2285 3602107 3362030 3161872 3013112 2916817 2721844 2623188 2508225 2384948 2213839 2142130
2275 2142130 2002402 1939804 1850382 1778152 1712783 1645378 1573174 1558468 1502893 1446313 1392852
2264 1392852 1346067 1298339 1239272 1229390 1202277 1127444 1062072 1046412 1082072 1017092 944088 875981
2252 875981 902624 885049 849961 832813 800782 734377 737987 762777 755782 783841 750533 744664
2240 744664 814078 707511 699342 691937 612704 655106 671201 615076 524025 563504 565990 561943
2228 561943 499247 447594 486754 526629 459860 458469 464954 440043 397800 498770 474132 410030
$$ packed form
2304A7722106k133948j958196j526919j228442r68509q28930o28156n87700n22251
2295G339055m47275m89894n62519m75473l26984l02029l74637l51633j88237k18267
2285C602107k40077k00158j48760r6295j94973r8656j14963j23277j71109p1709
2275B142130j39728o2598q9422p2230o5369o7405p2204j4706n5575n6580n3461
2264A392852m6785m7728n9067r882k7113p4833o5372j5660L5660o4980p3004o8107
2252H75981K6643j7575l5088j7148l2031o6405L610K4790o995K8059l3308n869
2240G44664O9414j06567q169p405p9233M2402J6095n6125r1051L9479K486m047
2228E61943o2696n1653L9160L9875o6769j391O485k4911m2243J00970k4638o4102
$$ plain form
2216 410030 359197 389277 404045 414264 382778 376910 423677 405654 394357 396153 404541 448296
2204 448296 434037 395012 396608 425396 359216 340499 357096 363399 348964 292689 237324 246123
2192 246123 283436 280557 303690 217415 242618 262828 270818 284433 275655 234169 239202 225073
2180 225073 228122 273476 267473 266798 212659 227121 222887 236128 167816 122757 120839 103078 114364
2167 114364 181131 159067 151539 171084 133782 169756 186291 222488 211591 146942 111865 106249
2155 106249 87643 147112 117588 136470 157295 155544 111594 130749 140797 129714 130826 154625
2143 154625 148054 116622 175054 193138 163953 114075 160229 114287 147984 183283 162113 147470
2131 147470 137010 86201 87395 148497 136939 123194 144694 147800 114058 177592 169855 123421
$$ packed form
2216D10030n0833L0080J4768J0219l1486n868M6767j8023j1297J796Q388M3755
2204D48296j4259l9025J596K8788o6180j8717J6597O303j4435n6275n5365Q799
2192B46123L7313k879K3133q6275K5203K0210P990J3615q778m1486N033j4129
2180B25073L049M5354o003o75n4139J4462m234J3241o8312m5059j918j7761J1286
2167A14364O6767k2064p528J9545l7302L5974J6535L6197j0897o4649l5077n616
2155A06249j8606N9469k9524J8882K0825j751m3950J9155J0048j1083J112K3799
2143A54625o571l1432N8432J8084k9185m9878M6154m5942L3697L5299k1170j4643
2131A47470j0460n0809J194O1102j1558j3745K1500L106l3742O3534p737m6434
$$ plain form
2119 123421 82851 46202 119474 114968 110026 111167 62183 58652 96899 129788 83215 83500 89136
2106 89136 84587 90674 74132 92689 135326 72826 66993 108752 112872 97423 84444 -779 28209
2093 28209 31828 20448 73229 45037 87838 111633 77584 60354 134078 94656 26792 22273
2081 22273 43077 31454 43882 37464 65187 116124 132777 73346 40271 102788 68783 72958
2069 72958 108040 95822 47822 75371 127710 138396 95837 121488 101511 86996 84555 111824
2057 111824 108033 92792 126509 90152 83913 123595 66019 45475 102891 216883 207635 133962
2045 133962 133139 167639 215561 243040 251248 238836 213253 192426 243840 161745 111210 80222
2033 80222 82683 98591 92876 136417 132182 114370 149624 133500 70378 33084 -523 54074
$$ packed form
2119A23421m0570l6649P3272m506m942J141m8984l531L8247L2889m6573K85N636
2106H9136m549O087j6542J8557M2637o2500n833M1759M120j5449j2979q5223K8988
2093B8209L619j1380N2781k8192M2801K3795l4049j7230P3724l9422o7864m519
2081B2273K0804j1623J2428o418K7723N0937J6653n9431l3075O2517l4005M175
2069G2958L5082j2218m8000K7549N2339J0686m2559K5651j9977j4515k441K7269
2057A11824l791j5241L3717l6357o239L9682n7576k0544N7416J13992r248p3673
2045A33962q23L4500M7922K7479Q208j2412k5583k0827N1414q2095n0535l0988
2033H0222K461J5908n715M3541m235j7812L5254j6124o3122l7294l3607N4597
$$ plain form
2021 54074 39131 53974 79039 62085 13504 -45664 -3090 44761 32500 99728 90019 55562
2009 55562 44794 28961 28296 6218 23093 -8388 24420 48135 52616 -612 74602 86001
1997 86001 56822 40165 89879 50538 -14476 -7150 13628 57075 40343 69711 83758 50699
1985 50699 62336 36023 12448 -20551 22016 9754 26197 26097 33156 44136 65309 71399 17575
1972 17575 53709 66248 88852 64880 25489 6832 78554 92366 55410 7322 74712 116010
1960 116010 20490 -24722 -8033 2859 -27105 -30420 5600 -20897 14320 18130 -13767 17011
1948 17011 2078 46695 50151 -13327 -35930 16492 -9917 17284 -2369 -29601 20407 25689
1936 25689 89916 49190 -46982 -61020 -28207 1755 58019 5272 -42777 33727 48412 61193
$$ packed form
2021E4074j4943J4843K5065j6954m8581n9168M2574M7851j2261O7228r709l4457
2009E5562j0768j5833o65k2078J6875l1481L2808K3715M481n3228P5214J1399
1997H6001k9179j6657M9714l9341o5014P326K0778M3447j6732K9368J4047l3059
1985E0699J1637k6313k3575l2999M2567j2262J6443j00P059J0980K1173O090n3824
1972A7575L6134J2539K2604k3972l9391j8657P1722J3812l6956m8088O7390M1298
1960A16010r5520m5212J6689J0892k9964l315L6020k6497L5217L810l1897L0778
1948A7011j4933M4617L456o3478k2603N2422k6409K7201j9653k7232N0008N282
1936B5689O4227m0726r6172j4038L2813K9962N6264n2747m8049P6504J4685J2781
$$ plain form
1924 61193 98267 40036 52216 28075 -32157 -47945 -81251 -17876 21557 -28247 93067 97638
1912 97638 55331 -10356 -230 77709 82727 45740 23373 43469 100396 41148 -12136 28205
1900 28205 24426 14950 -1915 15825 2218 7766 15537 40094 92394 148978 127169 110236 53142
1887 53142 11828 67097 43471 22861 52509 -15258 8384 36714 -30116 -2404 42132 93404
1875 93404 65557 5232 -18741 -32256 -35538 -48591 4467 25498 55606 56254 20405 6896
1863 6896 -15444 -979 -21464 6270 30745 41477 40606 -13760 -8228 -34510 2936 19646 -22392
1850 -22392 -13948 -45010 -18295 7783 -74336 -4528 -276 -54429 28054 64934 20363 33886
1838 33886 16148 -51285 2384 -38995 671 11685 36334 16652 -44009 -34472 30795 67106
$$ packed form
1924F1193L7074n8231J2180k4141o0232j5788l3306O3375L9433m9804J21314M571
1912I7638m2307o5687J0126P7939N018l6987k2367K0096N6927n9248n3284M0341
1900B8205l779r476j6865J7740j3607N548P771K4557N2300N6584k1809j6933n7094
1887E3142m1314N5269k3626k0610K9648o7767K3642K8330o6830K7712M4536N1272
1875I3404k7847o0325k3973j3515l282j3053N3058K1031L0108O48l5849j3509
1863F896k2340J4465k0485K7734K4475J0732q71n4366N532k6282L7446J6710m2038
1850b2392Q444l1062K6715K6078q2119O9808M252n4153Q2483L6880m4571J3523
1838C3886j7738o7433N3669m1379L9666J1014K4649j9682o0661R537O5267L6311
$$ plain form
1826 67106 65172 116001 10767 -60892 -37752 -50502 -50516 46357 15012 -13991 -23117 -8965 39505
1813 39505 3438 -48731 28180 66284 16621 38381 40849 24050 19168 -11211 -4902 51200
1801 51200 33854 -74839 -71385 -8432 -37925 5152 24169 24509 61737 43529 -30236 -58876
1789 -58876 -16044 2358 57802 54385 22116 25171 -26645 -3271 24663 -728 -11449 -76245
1777 -76245 -39490 7785 -9978 -8793 -12502 -4239 -14447 21767 -38124 -33341 -16868 16551 28775
1764 28775 26625 -720 -65484 -13281 -4416 -37501 -59323 -99134 -75029 4632 -101711 -22126
1752 -22126 17736 34583 6836 -18145 -31632 19787 27061 -21587 -25078 -25177 -6603 16839 1547
1739 1547 -19441 43886 27605 -38162 -33036 -22273 -31114 28732 -11391 -16747 -15590 -37778 -79008
$$ packed form
1826F7106j934N0829j05234p1659K3140j2750j4R6873l1345k9003r126J4152M8470
1813C9505l6067n2169P6911L8104m9663K1760K468j6799m882l0379O309N6102
1801E1200j7346j08693L454O2953k9493M3077J9017L40L7228j8208p3765k8640
1789e8876M2832J8402N5444l417l2269L055n1816K3374K7934k5391j0721o4796
1777g6245L6755M7275j7763J185l709Q263j0208L6214n9891M783J6473L3419J2224
1764B8775k150k7345o4764N2203Q865l3085k1822l9811K4105P9661j06343P9585
1752b2126L9862J6847k7747k4981j3487N1419P274m8648l491r9J8574K3442j5292
1739A547k0988O3327j6281o5767N126J0763q841N9846m0123n356J157k2188m1230
$$ plain form
1726 -79008 -35885 3192 -12941 -23509 -6091 17949 8092 -63123 -75342 -55970 -46360 -59948
1714 -59948 -91435 -42028 -30209 -36124 -27371 16529 6722 -14272 59762 33630 37277 10219 -5122
1701 -5122 -40207 -39450 50883 64271 32074 8666 4462 17638 17487 35454 26245 39532 7282
1688 7282 20631 -5848 -34501 -50738 -52589 -53651 -21052 2219 -16247 14745 57908 25676
1676 25676 -27543 -66344 -37846 -59693 -38755 352 -14097 -39965 3478 25581 -7495 -6695
1664 -6695 -67420 -52696 -31669 -2010 -27033 16783 17695 19767 -27644 -32678 -30293 51275 74843
1651 74843 3500 14219 55098 58821 3241 26874 5068 -45350 -17776 9532 55325 29995
1639 29995 -21318 -38698 -40703 -49046 -15297 -37140 36470 58328 21958 25874 37723 5112
$$ packed form
1726g9008M3123L9077j6133j0568J7418K4040r857p1215j2219J9372R610j3588
1714e9948l1487M9407J1819n915Q753M3900r807k0994P4034k6132L647k7058j5341
1701e122l5085P57R0333J3388l2197k3408m204J3176j51J7967r209J3287l2250
1688G282J3349k6479k8653j6237j851j062L2599K3271j8466L0992M3163l2232
1676B5676n3219l8801K8498k1847K0938L9107j4449k5868M3443K2103l3076Q00
1664f695o0725J4724K1027K9659k5023M3816R12K072m7411n034K385Q1568K3568
1651G4843p1343J0719M0879L723n5580K3633k1806n0418K7574K7308M5793k5330
1639B9995n1313j7380k005q343L3749k1843P3610K1858l6370L916J1849l2611
$$ plain form
1627 5112 -32946 -8955 -23528 -59345 -15525 3717 -3950 -50069 -38533 8729 -26842 31977
1615 31977 9714 -38658 -76732 -19056 -52507 -69963 -61397 -122948 -89997 -101023 -56520 -27344
1603 -27344 -72745 -40380 45853 58331 33326 -2445 -51101 -20050 4900 -45656 -59661 -37153
1591 -37153 -24790 -11670 684 -39987 -40436 -16545 4159 44618 34293 1092 32604 60687
1579 60687 69572 23649 51610 8297 67504 53969 49862 74151 -11620 -19410 -42357 3879
1567 3879 10570 31134 -21939 -84401 -92188 -60113 -60538 -14079 -101718 -143806 -119898 -38421 32175
1554 32175 -2539 -27392 -12928 -34175 12806 40173 28605 2735 -6526 -609 30930 51254
1542 51254 64693 70670 80316 30247 -26107 -56435 -77160 -25684 -33054 -44264 -32990 -40237 -53056
$$ packed form
1627E112l8058K3991j4573l5817M3820J9242p667m6119J1536M7262l5571N8819
1615C1977k2263m8372l8074N7676l3451j7456Q566o1551L2951j1026M4503K9176
1603b7344m5401L2365Q6233J2478k5005l5771m8656L1051K4950n0556j4005K2508
1591c7153J2363J3120J2354m0671m49K3891K0704M0459j0325l3201L1512K8083
1579F0687Q885m5923K7961m3313N9207j3535m107K4289q5771p790k2947M6236
1567C879O691K0564n3073o2462p787L2075m25M6459q7639m2088K3908Q1477P0596
1554C2175l4714k4853J4464k1247M6981K7367j1568k5870r261N917L1539K0324
1542E1254J3439N977R646n0069n6354l0328k0725N1476p370j1210J1274p247j2819
$$ plain form
1529 -53056 -15292 10407 12369 -10275 -12000 -11735 -6427 214 -28211 1952 -6092 -7444 65631
1516 65631 54313 68004 92343 16244 -35573 -8717 -14255 -59873 -27396 10557 39168 -24283
1504 -24283 -20135 22792 55426 14573 -47993 -39306 -4992 16073 8074 12053 -46202 -25079 -18514
1491 -18514 -21383 1294 55692 18951 78112 53555 29749 35858 27345 11625 26657 31009 12121
1478 12121 17060 -23468 -5562 12006 42749 44305 -72915 -83768 -56117 -88249 -70973 -25027
1466 -25027 11111 46402 122948 48365 -98 14016 34712 59700 -18879 -41314 -44054 -31661
1454 -31661 -348 -39446 -52122 -20429 -35881 -85912 -73289 -9139 -10309 -7524 -27359 -81918
1442 -81918 -12545 21444 51007 10254 -100739 -71571 -56655 -46085 -86763 -63071 -97841 -86727
$$ packed form
1529e3056L7764K5699J962k2644j725K65N308O641k8425L0163q044j352P3075
1516F5631j1318J3691K4339p6099n1817K6856n538m5618L2477L7953K8611o3451
1504b4283M148M2927L2634m0853o2566Q687L4314K1065p999L979n8255K1123O565
1491a8514k869K2677N4398l6741N9161k4557k3806O109q513j5720J5032M352j8888
1478A2121M939m0528J7906J7568L0743J556j17220j0853K7651l2132J7276M5946
1466b5027L6138L5291P6546p4583m8463J4114K0696K4988p8579k2435k740J2393
1454c1661L1313l9098j2676L1693j5452n0031J2623O4150j170K785j9835n4559
1442h1918O9373L3989K9563m0753j10993K9168J4916J0570m0678K3692l4770J1114
$$ plain form
1430 -86727 -58386 -64643 -19285 -9466 49893 60756 13497 -30798 -10605 34176 65041 31890
1418 31890 -45294 -19558 -13981 -59974 -35895 -13049 -19520 -20455 19845 -32192 -61853 5567 24031
1405 24031 24193 13144 -54440 -91271 -10730 65535 6006 -18030 -72754 -77319 -19133 3223
1393 3223 -59243 -95872 -72338 -45296 -5544 -30365 -39521 -11731 -44720 26938 34932 -46085
1381 -46085 1162 -3088 -38584 3632 116205 100367 52496 31706 14843 38061 34463 23340
1369 23340 33894 13991 -32571 -45134 -55987 -87082 -75409 -106250 -51319 -46192 -11439 26915
1357 26915 -58177 -19627 -30480 -51142 -30536 -40647 -88408 -48731 -36024 -36032 -18198 -1227 -22964
1344 -22964 -38791 -61203 -83967 -63439 -55544 479 -6935 -40897 -13032 -1270 11796 -10189
$$ packed form
1430h6727K8341o257M5358R819N9359J0863m7259m4295K0193M4781L0865l3151
1418C1890p7184K5736N577m5993K4079K2846o471r35M0300n2037k9661O7420J8464
1405B4031J62j1049o7584l6831Q0541P6265n9529k4036n4724m565N8186K2356
1393C223o2466l6629K3534K7042L9752k4821r156K7790l2989P1658P994q1017
1381d6085M7247m250l5496M2216J12573j5838m7871k0790j6863K3218l598j1123
1369B3340J0554j9903m6562j2563j0853l1095J1673l0841N4931N127L4753L8354
1357B6915q5092L8550j0853k0662K0606j0111m7761L9677J2707qJ7834J6971k1737
1344b2964j5827k2412k2764K0528P895N6023p414l3962K7865J1762J3066k1985
$$ plain form
1332 -10189 -12459 -76968 -84935 -37773 -43151 -57773 -64077 -118550 -109296 -56021 18803 -7867 6771
1319 6771 36524 92073 46700 -25673 36084 32306 -175 35655 67622 114222 57555 3728
1307 3728 30240 53244 159 -41328 -8249 -20953 -6323 -8933 36084 -32501 -35585 -40486 8732
1294 8732 -15131 38902 -967 34766 45343 -10180 -27283 -4916 -34447 -23945 -26528 -4530
1282 -4530 -25960 -29202 -5565 -21116 -36967 20664 53602 42031 -38745 14888 59852 16447
1270 16447 25701 8171 12351 -6650 9038 -12376 16561 41373 -8308 -53005 -17105 -52989
1258 -52989 -48549 -70392 -26829 -19643 25594 68905 24543 29515 46439 4272 -31174 -78842
1246 -78842 -28628 -5981 -82 4973 -23989 -47358 4908 20222 21831 21160 -9096 -73217 -63598
$$ packed form
1332a0189k270o4509p967M7162n378j4622o304n4473R254N3275P4824k6670J4638
1319F771K9753N5549m5373p2373O1757l778l2481L5830L1967M6600n6667n3827
1307C728K6512K3004n3085m1487L3079j2704J4630k610M5017o8585l084m901M9218
1294H732k3863N4033l9869L5733J0577n5523j7103K2367k9531J0502k583K1998
1282d530k1430l242K3637j5551j5851N7631L2938j1571q0776N3633M4964m3405
1270A6447R254j7530M180j9001J5688k1414K8937K4812m9681m4697L5900l5884
1258e2989M440k1843M3563P186M5237M3311m4362M972J6924m2167l5446m7668
1246g8842N0214K2647N899N055k8962k3369N2266J5314J609o71l0256o4121R619
$$ plain form
1233 -63598 -7952 26791 60773 53023 18355 -27508 -41673 -64998 -6444 -8252 -91347 -32650
1221 -32650 -9676 -33013 -44255 22290 20640 -92936 -84781 -24940 -27562 -13580 10957 9984 -15304
1208 -15304 -24587 -15868 -10429 -29858 20811 43113 45416 39025 53401 -6111 -32907 844 -84204
1195 -84204 -64519 -45098 -31956 -30711 -86222 -77551 -32138 -80805 -47271 -27888 4585 58360
1183 58360 48646 -31325 -33939 6518 -57341 -54253 -7613 24964 77228 86603 63154 5322 -2980
1170 -2980 2576 -42886 -39684 -17435 -42917 33903 63546 56442 74905 52798 -18189 -36455 -46785
1157 -46785 -36459 -25609 15592 16631 18043 34155 34453 15177 -59967 -49506 -33892 -36335 -59801
1144 -59801 -53090 -35853 -29159 -44684 -74316 -70404 -92434 -75422 -6170 19867 -26987 -36836 -24935
$$ packed form
1233f3598N5646L4743L3982p750l4668m5863j4165k3325N8554j808q3095N8697
1221c2650K2974k3337j1242O6545j650j13576Q155N9841k622J3982K4537r73k5288
1208a5304r283Q719N439j9429N0669K2302K303o391J4376n9512k6796L3751q5048
1195h4204J9685J9421J3142J245n5511Q671M5413m8667L3534J9383L2473N3775
1183E8360r714p9971k614M0457o3859L088M6640L2577N2264R375k3449n7832q302
1170b980N556m5462L202K2249k5482P6820K9643p104J8463k2107p0987j8266j0330
1157d6785J0326J0850M1201J039J412J6112K98j9276p5144J0461J5614k443k3466
1144e9801O711J7237O694j5525k9632L912k2030J7012O9252K6037m6854r849J1901
$$ plain form
1131 -24935 -54412 -23121 6611 -33089 -28615 30815 23935 54789 11917 -32099 -39469 23676
1119 23676 39612 -51343 -17297 3135 -11272 -29808 -2488 17021 82253 65305 56519 37041
1107 37041 -21438 17978 16477 7783 -63848 -28750 18987 1615 -1646 -2788 45351 -1736 -43614
1094 -43614 -41253 -56835 -8579 11052 17748 -12354 -48921 -14981 23845 -19319 -10875 20331
1082 20331 -27546 -45854 628 18971 84398 65394 76275 53086 -55689 -66576 -19769 -34477
1070 -34477 -43925 5569 57651 -11565 -44273 -61361 -44365 -32861 -20708 -26297 -36770 -34168
1058 -34168 -30079 -6482 13223 70350 13020 17001 11069 -22581 -40026 -31463 9722 52271 89390
1045 89390 82814 60163 61617 55082 -4120 32342 -667 6649 -7614 6884 11937 -10705 -50019
$$ packed form
1131b4935k9477L1291K9732l9700M474N9430o880L0854m2872m4016p370O3145
1119B3676J5936r0955L4046K0432j4407j8536K7320J9509O5232j6948q786j9478
1107C7041n8479L9416j501q694p1631L5098M7737j7372l261j142M8139m7087m1878
1094d3614K361j5582M8256J9631O696l0102l6567L3940L8826m3164Q444L1206
1082B0331m7877j8308M6482J8343O5427j9004J0881k3189j08775j0887M6807j4708
1070c4477r448M9494N2082o9216l2708j7088J6996J1504J2153n589j0473K602
1058c4168M089K3597J9705N7127n7330L981n932l3650j7445Q563M1185M2549L7119
1045H9390o576k2651J454o535n9202L6462l3009P316j4263J4498N053k2642l9314
$$ plain form
1032 -50019 -83326 -33243 -55774 -46062 -64976 -5016 -26338 -58640 -62774 -29076 25118 25352 60327
1019 60327 9676 -40897 -11311 -55123 -28369 -22610 -18076 2825 52521 21823 -96617 -110234
1007 -110234 -26489 -34 33481 44341 -27309 21973 86717 58726 122431 36770 34781 5085
995 5085 2744 6922 -16416 -41721 -624 36599 -6135 298 -21058 -62888 -74295 -56532 8845
982 8845 -18357 4039 27741 20023 44336 21501 3762 28025 41452 34856 43955 18060 35037
969 35037 79490 87312 46630 7102 42158 37642 4202 -7711 32189 29181 35992 34559 -8079
956 -8079 45113 43940 6656 -45933 12690 192 36403 34188 54067 -49622 -21828 -25552 18709
943 18709 -6768 -49100 -47792 -42017 15718 12095 -21128 21696 -55393 -77504 -55354 -72289 -42558
$$ packed form
1032e0019l3307N0083k2531R712j8914N9960k1322l2302m134L3698N4194K34L4975
1019F0327n0651n0573K9586m3812K6754N759M534K0901M9696l0698j18440j3617
1007a10234Q3745K6455L3515J0860p1650M9282O4744k7991O3705q5661j989k9696
995E085k341M178k3338k5305M1097L7223m2734O433k1356m1830j1407J7763O5377
982H845k7202K2396K3702p718K4313k2835j7739K4263J3427o596R099k5895J6977
969C5037M4453P822m0682l9528L5056m516l3440j1913L9900l008O811j433m2638
956h079N3192j173l7284n2589N8623j2498L6211k215J9879j03689K7794l724M4261
943A8709k5477m2332J308N775N7735l623l3223M2824p7089k2111K2150j6935K9731
$$ plain form
930 -42558 -43374 41805 107306 84121 39083 8993 24612 80422 68822 95184 51463 42388 104728
917 104728 101019 21630 -7224 -25553 -20961 -10107 8292 18111 25908 -11055 7565 62583 44348
904 44348 90054 67746 46785 40528 4067 -14281 -36938 -22169 4745 -22850 35379 35446 -2725
891 -2725 -27018 -918 37069 10321 44773 37044 -5797 -8574 -1123 983 48109 88761 78872
878 78872 61668 85323 91312 60975 55785 -13121 -52503 -10494 -10859 -13081 -55713 -70831 -68820
865 -68820 -24335 -10052 28298 37896 18758 -17208 -56446 -29594 2314 -81201 -113813 -75582
853 -75582 -70877 14564 58703 9737 49007 63668 43995 -38040 -16763 -37730 -18607 -37149
841 -37149 -49593 -38283 -30249 -39442 -81516 -38522 -23452 4240 373 7880 28770 -39662 -132101
$$ packed form
930d2558q16Q5179O5501k3185m5038l0090J5619N5810j1600K6362m3721r075O2340
917A04728l709p9389k8854j8329M592J0854J8399R819P797l6963J8620N5018j8235
904D4348M5706k2308k0961o257l6461j8348k2657J4769K6914k7595N8229O7l8171
891b725k4293K6100L7987k6748L4452p729m2841k777P451K106M7126M0652r889
878G8872j7204K3655N989l0337n190o8906l9382M2009l65k222m2632j5118K011
865f8820M4485J4283L8350R598j9138l5966l9238K6852L1908q3515l2612L8231
853g5582M705Q5441M4139m8966L9270J4661j9673q2035K1277k0967J9123j8542
841c7149j2444J1310Q034r193m2074M2994J5070K7692l867P507K0890o8432r2439
$$ plain form
828 -132101 -87563 -94111 -79475 -23298 -58761 -36891 8587 -35664 90654 71627 -16663 -42641
816 -42641 4980 -20989 -57199 -19312 -21184 37276 41349 50863 29491 -1750 -2581 -44754 -38094
803 -38094 -26711 42630 49979 29997 34606 -2579 5174 37024 65082 74232 118476 95975 87184
790 87184 81935 -12704 674 -53597 -36149 34618 29615 80836 43732 61771 84690 79335 57116
777 57116 22710 -27526 -3060 -36918 11985 -5684 -21306 -39501 28583 58507 33215 -49160
765 -49160 3079 67131 62913 45848 -26701 25146 28390 -5005 -35938 -68204 -90554 -46108
753 -46108 -12757 5719 -62056 -59579 -61362 -10399 37084 44636 42233 30244 29093 -31877 -64494
740 -64494 13466 58562 -33090 -100565 -52386 7196 -18231 -29458 -9222 1227 -3771 -43036
$$ packed form
828a32101M4538o548J4636N6177l5463K1870M5478m4251J26318j9027q8290k5978
816d2641M7621k5969l6210L7887j872N8460M073R514k1372l1241q31m2173O660
803c8094J1383O9341P349j9982M609l7185P753L1850K8058R150M4244k2501q791
790H7184n249r4639J3378n4271J7448P0767n003N1221l7104J8039K2919n355k2219
777E7116l4406n0236K4466l3858M8903j7669j5622j8195O8084K9924k5292q2375
765d9160N2239O4052m218j7065p2549N1847L244l3395l0933l2266k2350M4446
753d6108L3351J8476o7775K477j783N0963M7483P552k403j1989j151o0970l2617
740f4494P7960M5096r1652o7475M8179N9582k5427j1227K0236J0449m998l9265
$$ plain form
728 -43036 16104 -46412 -33009 -39230 -73324 -31189 9821 -42285 -23584 -9265 24693 53241
716 53241 98904 92452 44515 23604 -65895 -1164 -71472 -87791 -55205 -97879 -66008 -78928
704 -78928 -35472 -23893 -32537 -7295 -46118 -114946 6891 58606 103964 63166 64735 79770
692 79770 33599 37060 -15586 16255 -31766 26034 59105 -20865 -3762 18984 31385 -3170
680 -3170 -24581 34011 6258 -8262 21945 23372 -9358 -21702 -37145 -43874 -22473 -22697 2785
667 2785 50344 78065 96069 54367 -3307 -442 -12345 -42932 -11006 -48485 30933 79476
655 79476 22093 29429 36590 18802 26637 54685 73007 38454 16293 43920 70252 883 -100900
642 -100900 -46652 5865 21092 34307 -27612 -26307 -24077 -2802 -22206 7945 -8116 38843
$$ packed form
728d3036N9140o2516J3403o221l4094M2135M1010n2106J8701J4319L3958K8548
716E3241M5663o452m7937k0911q9499O4731p0308j6319L2586m2674L1871j2920
704g8928M3456J1579q644K5242l8823o8828J21837N1715M5358m0798J569J5035
692G9770m6171L461n2646L1841m8021N7800L3071p9970J7103K2746J2401l4555
680c170k1411N8592k7753j4520L0207J427l2730j2344j5443o729K1401k24K5482
667B785M7559K7721J8004m1702n7674K865j1903l0587L1926l7479P9418M8543
655G9476n7383P336P161j7788P835K8048J8322l4553k2161K7627K6332o9369j01783
642a00900N4248N2517J5227J3215o1919J305K230K1275j9404L0151j6061M6959
$$ plain form
630 38843 -35283 -64367 -50084 -5326 27735 -13582 20833 19449 53361 38736 -26487 -78064
618 -78064 -60535 -43557 -13643 -13070 -5559 -25689 -32499 -11143 7819 16601 75691 56281 59285
605 59285 51659 30824 27537 33280 3995 5365 53163 23306 -10434 -51321 -37030 -64532 -30795
592 -30795 6035 -896 15195 14232 -44381 -92232 -71191 -54270 4694 -5256 -17629 -4021 9555
579 9555 -6572 -13869 -53683 -51426 -38295 -31846 10455 -4934 -1846 42531 37663 20337 9367
566 9367 6254 -26555 -2072 -12971 -42536 15206 1203 58949 63272 -2257 -11185 -15454 -47144
553 -47144 -9703 55979 53479 59296 42871 41748 6997 -328 -86283 -58102 11679 8425 -14150
540 -14150 30267 37830 48121 23548 -2725 25145 10618 18654 -31871 10800 35226 73791
$$ packed form
630C8843p4126k9084J4283M4758L3061m1317L4415j384L3912j4625o5223n1577
618g8064J7529J6978K9914N73P511k0130o810K1356J8962Q782N9090j9410L004
605E9285p626k0835l287N743k9285J370M7798k9857l3740m0887J4291k7502L3737
592c0795L6830o931J6091r63n8613m7851K1041J6921N8964r950j2373J3608J3576
579I555j6127p297l9814K257J3131O449M2301j5389L088M4377m868j7326j0970
566I367l113l2809K4483j0899k9565N7742j4003N7746M323o5529q928m269l1690
553d7144L7441O5682k500N817j6425j123l4751p325q5955K8181O9781l254k2575
540a4150M4417P563J0291k4573k6273K7870j4527Q036n0525M2671K4426L8565
$$ plain form
528 73791 -41305 -1743 41967 41638 1880 -22958 -7285 -27023 -44032 -39103 -22539 -16314 -20633
515 -20633 16376 94907 84134 62464 -15623 21578 60681 64396 73314 75317 9794 -15005 26383
502 26383 34965 20062 65027 58346 25949 57493 -3918 -12500 -38721 -57590 -3216 16706 53825
489 53825 42438 -35695 -48436 22845 49052 51907 10545 -35613 -35683 -25588 6487 44406 47958
476 47958 68853 112796 70272 43884 27741 44213 164 4293 41928 12697 35448 44207
464 44207 20208 39722 22039 -15607 -8414 -31071 -78697 -44940 47302 -1227 29234 52432
452 52432 57389 19671 28889 101065 105545 -36828 -33318 -17569 16694 63836 -5122 33059 30797
439 30797 36369 3402 23191 6491 37882 2993 -30950 36535 49359 46480 8935 32413
$$ packed form
528G3791j15096L9562M3710l29l9758k4838J5673j9738j7009M929J6564O225m319
515b0633L7009P8531j0773k1670p8087L7201L9103L715Q918K003o5523k4799M1388
502B6383Q582j4903M4965o681l2397L1544o1411q582k6221j8869N4374J9922L7119
489E3825j1387p8133j2741P1281K6207K855m1362m6158p0J0095L2075L7919L552
476D7958K0895M3943m2524k6388j6143J6472m4049M129L7635k9231K2751Q759
464D4207k3999J9514j7683l7646P193k2657m7626L3757R2242m8529L0461K3198
452E2432M957l7718R218P2176M480j42373L510J5749L4263M7142o8958L8181k262
439C0797N572l2967J9789j6700L1391l4889l3943O7485J2824k879l7545K3478
$$ plain form
427 32413 8501 -32464 15443 45989 10159 43296 32842 4694 -20549 -24565 -44438 -100523
415 -100523 -28633 -44759 -74398 -31669 -56726 -50585 -67281 -86132 -30637 -45869 -13821 -48113
403 -48113 -50805 -48664 14061 11180 50517 44887 -3104 60960 59360 35972 -8167 -34985 -67572
390 -67572 -78652 -99300 -59835 -23291 42675 35230 46456 37966 32804 29636 13557 -7529 -35547
377 -35547 -26055 -5612 -41439 30376 94990 61915 23912 -99358 -152763 -83898 3193 17198
365 17198 50599 36176 -18318 -45193 -43041 -3682 -1833 44991 25689 5950 -53976 -81069
353 -81069 -35684 -22036 18670 -18938 -50002 -99579 -110383 -118881 -42249 -14166 -15871 14485
341 14485 38561 38017 80404 -3096 -63812 -33691 -60983 -73974 -76063 -56604 -42504 -23007 10400
$$ packed form
427C2413k3912m0965M7907L0546l5830L3137j0454k8148k5243m016j9873n6085
415a00523P1890j6126k9639M2729k5057O141j6696j8851N5495j5232L2048l4292
403d8113k692K141O2725k881L9337n630m7991O4064j600k3388m4139k6818l2587
390f7572j1080k0648L9465L6544O5966p445J1226q490n162l168j6079k1086k8018
377c5547R492K0443l5827P1815O4614l3075l8003j23270n3405O8865Q7091J4005
365A7198L3401j4423n4494k6875K152L9359J849M6824j9302j9739n9926k7093
353h1069M5385J3648M0706l7608l1064m9577j0804q498P6632K8083j705L0356
341A4485K4076n44M2387q3500o0716L0121k7292j2991k089J9459J4100J9497L3407
$$ plain form
328 10400 -36512 -16778 -13838 23578 80335 7774 -25085 -35547 -37766 -39127 -4558 -59283 -66632
315 -66632 37500 27046 42895 38173 -3921 18301 74717 21599 45670 70502 10477 -34317
303 -34317 -27674 25726 920 16801 13882 -9317 -29527 21904 -32061 -24465 -33134 -2965 -13882
290 -13882 -33953 14997 50039 38129 14670 -11485 -26344 25646 9911 8993 -30338 -16228
278 -16228 25945 -40483 -65672 -7601 960 2983 40527 -12733 -14701 -35900 -18897 -10234 13656
265 13656 10454 4461 8170 -13299 -22265 -38552 -12092 -5051 20607 -53070 -51303 -77789 -62048
252 -62048 -79112 -132524 -87362 -57997 -39907 -8748 5517 -44792 -22170 -53728 3448 18271
240 18271 22504 30212 -15208 846 -19442 -17453 12428 55736 22958 -23468 -52292 -9842 -1788
$$ packed form
328A0400m6912J9734K940L7416N6757p2561l2859j0462k219j361L4569n4725p349
315f6632J04132j0454J5849m722m2094K2222N6416n3118K4071K4832o0025m4794
303c4317O643N3400k4806J5881k919k3199k0210N1431n3965P596q669L0169j0917
290a3882k0071M8950L5042j1910k3459k6155j4859N1990j5735r18l9331J4110
278a6228M2173o6428k5189N8071Q561K023L7544n3260j968k1199J7003Q663K3890
265A3656l202n993L709k1469q966j6287K6460P041K5658p3677J767k6486J5741
252f2048j7064n3412M5162K9365J8090L1159J4265n0309K2622l1558N7176J4823
240A8271M233P708m5420J6054k0288J989K9881M3308l2778m6426k8824M2450Q054
$$ plain form
227 -1788 6387 7430 29733 14356 -28506 -24567 10077 -28653 -22420 -10977 15138 34857 -15070
214 -15070 4842 -5845 -48958 -56764 -12895 -17478 -30079 -46110 -51147 -51336 -29411 -49673 -4804
201 -4804 5379 -17690 5485 -2075 30230 34621 -3665 15366 8486 -1486 17736 28370 2300
188 2300 -8289 35951 60156 25266 12817 -25915 -26287 2638 14472 60806 53904 48364 9004
175 9004 -51138 -31734 -18994 -70140 -20862 -12743 -64603 -49416 -562 -3182 -36518 39171 47365
162 47365 25973 22246 38132 24031 -5974 -23253 -17983 -22017 17607 45429 37457 -3736 -25151
149 -25151 2805 -11641 22638 7342 -22046 7835 74704 -6520 -12320 -5412 -14655 35301 25462
136 25462 40124 48918 21618 33684 14020 29263 34581 -18788 6430 25071 -7669 27193
$$ packed form
227a788Q175J043K2303j5377m2862L939L4644l8730O233J1443K6115J9719m9927
214a5070J9912j0687m3113p806M3869m583j2601j6031n037j89K1925k0262M4869
201d804J0183k3069K3175p560L2305M391l8286J9031o880r972J9222J0634k6070
188B300j0589M4240K4205l4890j2449l8732l72K8925J1834M6334o902n540l9360
175I004o0142J9404J2740n1146M9278Q119n1860J5187M8854k620l3336P5689Q194
162D7365k1392l727J5886j4101l0005j7279N270m034L9624K7822p972m1193k1415
149b5151K7956j4446L4279j5296k9388K9881O6869q1224n800O908r243M9956r839
136B5462J4662Q794k7300J2066j9664J5243N318n3369K5218J8641l2740L4862
$$ plain form
124 27193 -3481 -68262 -66033 -33759 7624 -3382 -44203 -36527 -15009 21723 33196 6239
112 6239 -48513 -26546 -23418 -50798 -31094 -41786 -52999 -26665 4877 23257 -2757 11346
100 11346 -32182 -49712 -4878 10964 28690 1175 -43750 -65873 -79785 -46999 -28700 -55849
88 -55849 75 36112 20744 -14733 -14977 25662 20612 -28681 12096 -24802 -11947 17386 -24344
75 -24344 -619 47022 12335 -16 -5146 22446 8879 -7301 22353 -22204 -10679 -26385
63 -26385 -56904 -44548 -72558 -60313 -7835 -21029 -5088 -2857 -1122 -2904 29277 22561 31067
50 31067 43398 13479 9917 -7513 1529 -4925 18066 15507 13337 -6421 20936 -35184 -10205
37 -10205 1538 -9764 39270 18025 4867 -25386 12796 36153 33190 4952 31025 82202
$$ packed form
124B7193l0674o4781K229L2274M1383j1006m0821P676K1518L6732J1473k6957
112F239n4752K1967L128k7380J9704j0692j1213K6334L1542J8380k6014J4103
100A1346m3528j7530M4834J5842J7726k7515m4925k2123j3912L2786J8299k7149
88e5849N5924L6037j5368l5477k44M0639n050m9293M0777l6898J2855K9333m1730
75b4344K3725M7641l4687j2351n130K7592j3567j6180K9654m4557J1525j5706
63b6385l0519J2356k8010J2245N2478j3194J5941K231J735j782L2181o716Q506
50C1067J2331k9919l562j7430R042o454K2991k559k170j9758K7357n6120K4979
37a0205J1743j1302M9034k1245j3158l0253L8182K3357k963k8238K6073N1177
$$ plain form
25 82202 16050 27886 27422 -3872 30959 41749 -11153 -19072 -19346 -34990 -24598 23309 33102
12 33102 -4246 -5169 -1251 -6531 11867 25922 19909 -32116 -57232 -27293 -51624 -14375
0 -14375
$$ packed form
25H2202o6152J1836m64l1294L4831J0790n2902p919k74j5644J0392M7907R793
12C3102l7348r23L918n280J8398J4055o013n2025k5116K9939k4331L7249
0a4375
$$ Imaginary data points
##PAGE= N=2
##DATA TABLE= (X++(I..I)), XYDATA
$$ plain form
16383 -1337896 -1316122 -1319665 -1300431 -1272370 -1254581 -1259323 -1272444 -1250586 -1185270 -1163154 -1197651 -1166286
16371 -1166286 -1132593 -1104811 -1102422 -1094093 -1048069 -1023047 -1049628 -1054046 -1017873 -974028 -986068 -996097
16359 -996097 -945666 -928850 -846934 -806375 -784687 -792618 -873484 -812278 -808071 -802279 -787513 -712933
16347 -712933 -691786 -687357 -647951 -664958 -643246 -637177 -629419 -615503 -595555 -603868 -588554 -572603
16335 -572603 -515439 -542524 -505856 -501399 -441596 -363937 -390371 -381916 -441595 -445119 -406662 -372684
16323 -372684 -331877 -297782 -311814 -281159 -249309 -248976 -245667 -235016 -202483 -136644 -145777 -153188
16311 -153188 -135473 -129008 -113655 -99708 -37561 -32065 -23552 -48685 -63740 -24799 -33369 7008
16299 7008 -37261 -23595 39603 61444 95051 62906 74210 98540 134813 196402 202051 186658
$$ packed form
16383a337896K1774l543J9234K8061J7789m742j3121K1858O5316K2116l4497L1365
16371a166286L3693K7782K389Q329M6024K5022k6581m418L6173M3845j2040j0029
16359i96097N0431J6816Q1916M0559K1688p931q0866O1206M207N792J4766P4580
16347g12933K1147M429L9406j7007K1712O069P758J3916J9948q313J5314J5951
16335e72603N7164k7085L6668M457N9803P7659k6434Q455n9679l524L8457L3978
16323c72684M0807L4095j4032L0655L1850L33L309J0651L2533O5839r133p411
16311a53188J7715O465J5353J3947O2147N496Q513k5133j5055L8941q570M0377
16299G008m4269J3666O3198K1841L3607l2145J1304K4330L6273O1589N649j5393
$$ plain form
16287 186658 149281 130804 207002 254301 210094 216921 199195 220134 263075 287014 359096 347091
16275 347091 383637 345934 320945 343108 361782 408457 376720 364976 398195 414572 430982
16264 430982 458680 484269 513149 531246 473721 462807 519439 516205 484946 509225 525516 589021
16252 589021 579184 604546 593630 563325 580564 562466 622352 624056 637594 643291 628685 651351
16240 651351 654369 700465 728536 723403 716886 750273 777847 799178 769676 788611 819881 804509
16228 804509 837540 835090 881109 879941 880800 796339 803542 816750 849294 863214 866875 849687 809589
16215 809589 874167 893130 873166 974645 993842 969077 1000538 960814 925413 901872 966284
16204 966284 996896 953687 951265 987051 978626 973763 991325 1033672 1062856 1074412 1073027 1077299
$$ packed form
16287A86658l7377j8477P6198M7299m4207O827j7726K0939M2941K3939P2082j2005
16275C47091L6546l7703k4989K2163J8674M6675l1737j1744L3219J6377J6410
16264D30982K7698K5589K8880J8097n7525j0914N6632l234l1259K4279J6291O3505
16252E89021r837K5362j0916l0305J7239j8098N9886J704J3538N697j4606K2666
16240F51351L018M6096K8071n133o517L3387K7574K1331k9502J8935L1270j5372
16228H04509L3031k450M6019j168Q59q4461P203J3208L2544J3920L661j7188m0098
16215H09589O4578J8963j9964J01479J9197k4765L1461l9724l5401k3541O4412
16204I66284L0612m3209k422L5786q425m863J7562M2347K9184J1556j385M272
$$ plain form
16192 1077299 1081039 1106963 1089533 1108017 1101495 1090968 1069076 1115184 1165317 1136406 1107674 1122330
16180 1122330 1118820 1076733 1078391 1111144 1151060 1184477 1167982 1139979 1052669 1104220 1186432 1140719
16168 1140719 1164342 1211261 1207933 1229601 1186937 1133978 1115932 1113255 1174189 1247198 1224906 1217567
16156 1217567 1231272 1255070 1200354 1170995 1213280 1262590 1232133 1218028 1184874 1186245 1168099
16145 1168099 1202802 1305005 1246146 1260793 1315355 1326284 1262886 1284300 1282895 1255784 1234983
16134 1234983 1229151 1231825 1263132 1274148 1273532 1231647 1216884 1222614 1296427 1361002 1344736 1296937
16122 1296937 1269890 1292187 1355666 1358787 1356300 1355771 1442860 1434773 1417287 1328044 1385598 1374532
16110 1374532 1296979 1306901 1356408 1411680 1409272 1350532 1294176 1315173 1340095 1356282 1318558 1351587
$$ packed form
16192A077299L740K5924j7430J8484o522j0527k1892M6108N0133k8911k8732J4656
16180A122330l510m2087J658L2753L9916L3417j6495k8003q7310N1551Q2212m5713
16168A140719K3623M6919l328K1668m2664n2959j8046k677O0934P3009k2292p339
16156A217567J3705K3798n4716k9359M2285M9310l0457j4105l3154J371j8146
16145A168099L4703J02203n8859J4647N4562J0929o3398K1414j405k7111k0801
16134A234983n832K674L1307J1016o16m1885j4763N730P3813O4575j6266m7799
16122A296937k7047K2297O3479L121k487n29Q7089q087j7486q9243N7554j1066
16110A374532p7553R922M9507N5272k408n8740n6356K0997K4922J6187l7724L3029
$$ plain form
16098 1351587 1319489 1290315 1336945 1361750 1367850 1375958 1401423 1390815 1449535 1386241 1323665 1356321
16086 1356321 1376280 1349031 1363841 1385100 1394674 1446895 1382242 1402821 1448046 1389155 1347290
16075 1347290 1380436 1366237 1422442 1445669 1364999 1390962 1353622 1400602 1416149 1441121 1438364
16064 1438364 1417221 1422089 1402055 1384355 1364550 1384499 1378459 1406614 1361360 1374412 1349228 1350940
16052 1350940 1319129 1340465 1368994 1384847 1367126 1442323 1432422 1357420 1311166 1349904 1356498 1406654
$$ packed form
16098A351587l2098k9174M6630K4805O100Q108K5465j0608N8720o3294o2576L2656
16086A356321J9959k7249J4810K1259R574N2221o4653K0579M5225n8891m1865
16075A347290L3146j4199N6205K3227q0670K5963l7340M6980J5547K4972k757
16064A438364k1143M868k0034j7700j9805J9949o040K8155m5254J3052k5184J712
16052A350940l1811K1336K8529J5853j7721P5197r901p5002m6254L8738O594N0156
$$ [...]
##END NTUPLES=NMR SPECTRUM
##END=
