##TITLE=1H_CA-9353-22
 200.13MHz,DMSO-d6,
 8 sc
 
 23.6.2025
##JCAMPDX= 6.0         $$ Bruker NMR JCAMP-DX V2.0
##DATA TYPE= NMR SPECTRUM
##DATA CLASS= NTUPLES
##ORIGIN= UXNMR, Bruker Analytische Messtechnik GmbH
##OWNER= pz
$$ XWIN-NMR		Version 3.5
$$ Mon Jun 23 14:33:37 2025 Russian Standard Time (UT+4h)  she@DPX200
##.OBSERVE FREQUENCY= 200.1313
##.OBSERVE NUCLEUS= ^1H
##.ACQUISITION MODE= SIMULTANEOUS
##.ACQUISITION SCHEME= undefined
##.AVERAGES= 8
##.DIGITISER RES= 18
##SPECTROMETER/DATA SYSTEM= spect
##.PULSE SEQUENCE= zg30
##.SOLVENT NAME= CDCl3
##.SHIFT REFERENCE= (INTERNAL, CDCl3, 0, 15.5067)
##AUDIT TRAIL= $$ (NUMBER, WHEN, WHO, WHERE, WHAT)
$$ ##TITLE= Audit trail, XWIN-NMR		Version 3.5
$$ ##JCAMPDX= 5.01
$$ ##ORIGIN= Bruker BioSpin GmbH
$$ ##OWNER= she
$$ F:/spectra/data/she/nmr/H-C/1/pdata/1/auditp.txt
$$ ##AUDIT TRAIL=  $$ (NUMBER, WHEN, WHO, WHERE, WHAT)
(   1,<2025-06-23 14:31:17.35 +0400>,<she>,<DPX200>,
      <created by zg, POWCHK disabled, PULCHK disabled
       configuration hash MD5:
       00 E9 B6 7A A2 85 ED C7 34 08 36 98 17 FE 4E 26
       data hash MD5: 16K
       97 5E 63 22 53 4A 40 3B 15 F7 86 7A 59 68 A7 0C>)
(   2,<2025-06-23 14:31:21.31 +0400>,<she>,<DPX200>,
      <Start of raw data processing
       efp BC_mod = 2 LB = 0.25 FT_mod = 6 PKNL = 1 PHC0 = -1197.921 PHC1 = 12.9922 SI = 16K 
       data hash MD5: 16K
       08 C9 5D 02 1A 5E 39 60 12 29 46 FF 83 BC 49 BF>)
(   3,<2025-06-23 14:31:57.59 +0400>,<she>,<DPX200>,
      <pk PHC0 = 11.85878 PHC1 = -18.4 
       data hash MD5: 16K
       28 4D 36 4A 41 17 18 71 7F 73 56 0E 8A 73 4A B5>)
(   4,<2025-06-23 14:32:01.67 +0400>,<she>,<DPX200>,
      <abs ABSG = 5 
       data hash MD5: 16K
       21 58 D0 E1 3B 81 1E B4 F7 13 36 F3 F7 D6 69 C9>)
$$ ##END=
$$ 
$$ hash MD5
$$ 30 15 13 6E DB F8 BE 66 4C F7 86 6C 76 3B 37 59
##$RELAX= 
##$RELAX= 
##$RELAX= 
##$RELAX= 
##$RELAX= 
##$RELAX= 
$$ Bruker specific parameters
$$ --------------------------
##$DU= <F:/spectra>
##$EXPNO= 1
##$NAME= <H-C>
##$PROCNO= 1
##$TYPE= <nmr>
##$USER= <she>
##$AMP= (0..31)
100 100 100 100 100 100 100 100 100 100 100 100 100 100 100 100 100 100 
100 100 100 100 100 100 100 100 100 100 100 100 100 100 
##$AQSEQ= 0
##$AQ_mod= 1
##$AUNM= <au_zg>
##$AUTOPOS= <>
##$BF1= 200.13
##$BF2= 200.13
##$BF3= 200.13
##$BF4= 200.13
##$BF5= 200.13
##$BF6= 200.13
##$BF7= 200.13
##$BF8= 200.13
##$BYTORDA= 1
##$CFDGTYP= 0
##$CFRGTYP= 5
##$CHEMSTR= <none>
##$CNST= (0..31)
1 1 145 1 1 1 1 1 1 1 1 1 1 1 1 1 1 1 1 1 1 1 1 1 1 1 1 1 1 1 1 1 
##$CPDPRG= <>
##$CPDPRG1= <>
##$CPDPRG2= <>
##$CPDPRG3= <>
##$CPDPRG4= <mlev>
##$CPDPRG5= <mlev>
##$CPDPRG6= <mlev>
##$CPDPRG7= <mlev>
##$CPDPRG8= <mlev>
##$CPDPRGB= <>
##$CPDPRGT= <>
##$D= (0..31)
0 0.7 0 0 0 0 0 0 0 0 0 0.03 0 0 0 0 0 0 0 0 0 0 0 0 0 0 0 0 0 0 0 0 
##$DATE= 1750674676
##$DBL= (0..7)
120 120 120 120 120 120 120 120 
##$DBP= (0..7)
150 150 150 150 150 150 150 150 
##$DBP07= 0
##$DBPNAM0= <>
##$DBPNAM1= <>
##$DBPNAM2= <>
##$DBPNAM3= <>
##$DBPNAM4= <>
$$ [...]
##$SUBNAM3= <"">
##$SUBNAM4= <"">
##$SUBNAM5= <"">
##$SUBNAM6= <"">
##$SUBNAM7= <"">
##$SUBNAM8= <"">
##$SUBNAM9= <"">
##$SW= 18.0517328524113
##$SWIBOX= (0..15)
0 0 2 0 0 0 0 0 0 0 0 0 0 0 0 0 
##$SW_h= 3612.71676300578
##$TD= 16384
##$TD0= 1
##$TE= 0
##$TE2= 300
##$TE3= 300
##$TEG= 300
##$TL= (0..7)
0 120 120 120 120 120 120 120 
##$TP= (0..7)
150 150 150 150 150 150 150 150 
##$TP07= 0
##$TPNAME0= <>
##$TPNAME1= <>
##$TPNAME2= <>
##$TPNAME3= <>
##$TPNAME4= <>
##$TPNAME5= <>
##$TPNAME6= <>
##$TPNAME7= <>
##$TPOAL= (0..7)
0.5 0.5 0.5 0.5 0.5 0.5 0.5 0.5 
##$TPOFFS= (0..7)
0 0 0 0 0 0 0 0 
##$TUNHIN= 0
##$TUNHOUT= 0
##$TUNXOUT= 0
##$USERA1= <user>
##$USERA2= <user>
##$USERA3= <user>
##$USERA4= <user>
##$USERA5= <user>
##$V9= 5
##$VALIST= <valist>
##$VCLIST= <CCCCCCCCCCCCCCC>
##$VD= 0
##$VDLIST= <DDDDDDDDDDDDDDD>
##$VPLIST= <PPPPPPPPPPPPPPP>
##$VTLIST= <TTTTTTTTTTTTTTT>
##$WBST= 1024
##$WBSW= 4
##$XGAIN= (0..3)
0 0 0 0 
##$XL= 0
##$YL= 0
##$YMAX_a= 645350
##$YMIN_a= -838815
##$ZGOPTNS= <>
##$ZL1= 120
##$ZL2= 120
##$ZL3= 120
##$ZL4= 120
##$ABSF1= 15.49348
##$ABSF2= -2.55837
##$ABSG= 5
##$ABSL= 3
##$ALPHA= 0
##$AQORDER= 0
##$ASSFAC= 0
##$ASSFACI= 0
##$ASSFACX= 0
##$ASSWID= 0
##$AUNMP= <proc_1d>
##$AZFE= 0.1
##$AZFW= 0.1
##$BCFW= 0
##$BC_mod= 2
##$BYTORDP= 0
##$COROFFS= 0
##$CY= -3
##$DATMOD= 1
##$DC= 0
##$DFILT= <>
##$DTYPP= 0
##$F1P= 0
##$F2P= 0
##$FCOR= 1
##$FTSIZE= 16384
##$FT_mod= 6
##$GAMMA= 0
##$GB= 0
##$INTBC= 1
##$INTSCL= 3.241238e-09
##$ISEN= 128
##$LB= 0.25
##$LEV0= 0
##$LPBIN= 0
##$MAXI= 10000
##$MC2= 0
##$MEAN= 0
##$ME_mod= 0
##$MI= 1.114404
##$NCOEF= 0
##$NC_proc= -6
##$NLEV= 6
##$NOISF1= 3.799351
##$NOISF2= 2.8
##$NSP= 0
##$NTH_PI= 0
##$NZP= 0
##$OFFSET= 15.5067
##$PC= 1
##$PHC0= -1186.062
##$PHC1= -5.4078
##$PH_mod= 1
##$PKNL= yes
##$PPARMOD= 0
##$PSCAL= 0
##$PSIGN= 0
##$REVERSE= no
##$SF= 200.130003002955
##$SI= 16384
##$SIGF1= 3
##$SIGF2= 2
##$SINO= 0.751879
##$SIOLD= 32768
##$SREGLST= <19F.Aceton>
##$SSB= 0
##$STSI= 16384
##$STSR= 0
##$SW_p= 3612.71676300578
##$SYMM= 0
##$S_DEV= 0
##$TDeff= 16384
##$TDoff= 0
##$TI= <>
##$TILT= no
##$TM1= 0
##$TM2= 0
##$TOPLEV= 0
##$USERP1= <user>
##$USERP2= <user>
##$USERP3= <user>
##$USERP4= <user>
##$USERP5= <user>
##$WDW= 1
##$XDIM= 16384
##$YMAX_p= 357841374
##$YMIN_p= -658830
$$ End of Bruker specific parameters
$$ ---------------------------------
##NTUPLES= NMR SPECTRUM
##VAR_NAME=  FREQUENCY,     SPECTRUM/REAL,   SPECTRUM/IMAG
##SYMBOL=    X,             R,               I
##VAR_TYPE=  INDEPENDENT,   DEPENDENT,       DEPENDENT
##VAR_FORM=  AFFN,          ASDF,            ASDF
##VAR_DIM=   16384,         16384,           16384
##UNITS=     HZ,            ARBITRARY UNITS, ARBITRARY UNITS
##FACTOR=    0.220516191357247, 1,           1
##FIRST=     3103.35582992354, 0,            0
##LAST=      -509.360933082239, 0,           0
##MIN=       -509.360933082239, -658830,     0
##MAX=       3103.35582992354, 357841374,    0
$$ Real data points
##PAGE= N=1
##DATA TABLE= (X++(R..R)), XYDATA
$$ [...]
8539A7007706q83793q54114q06755p40182o20007o06159m28845l44258k33172
$$ 17007706 16123913 15269799 14463044 13722862 13102855 12496696 12067851 11723593 11490421
8530A1490421k47281l15982l03317j36870O8533Q2465J26434K6083L14680L41037
$$ 11490421 11243140 10927158 10623841 10486971 10555504 10637969 10764403 10790486 11105166 11446203
8520A1446203K38651L09817N37952L43633N6141R3527R8659m9295k52930k43923
$$ 11446203 11684854 11994671 12532623 12876256 12932397 13025924 13124583 13075288 12822358 12578435
8510A2578435k12196k86692j07831j90881o5850j66056k05119l20794m51236m37242
$$ 12578435 12366239 12079547 11971716 11780835 11714985 11548929 11343810 11023016 10571780 10134538
8500A0134538o27688n74798n46923n75375n76730l20187m05777n04231k52902
$$ 10134538 9506850 8932052 8385129 7809754 7233024 6912837 6507060 6002829 5749927
8491E749927j63915m08946k96629j43434k78694k45285j89893n5472j13845k19354
$$ 5749927 5586012 5177066 4880437 4737003 4458309 4213024 4023131 3967659 3853814 3634460
8481C634460q1847j07107m6557j95776q1455j8478p7973k0314j02014r7538j40202
$$ 3634460 3552613 3445506 3398949 3203173 3121718 3103240 3025267 3004953 2902939 2805401 2665199
8470B665199j27333j23336o9963j6897j6643K3451j80357j79649k13733l413n7335
$$ 2665199 2537866 2414530 2344567 2327670 2311027 2334478 2154121 1974472 1760739 1757326 1699991
8459A699991j23328j36367J052m191r4901r3755J09614o761n6984l4453o5959
$$ 1699991 1576663 1440296 1441348 1437157 1342256 1248501 1358115 1351354 1294370 1259917 1193958
8448A193958n8569j7347J2457q7822O5637r3670j02465k7387J01827o9113N2721
$$ 1193958 1135389 1118042 1130499 1042677 1108314 1014644 912179 884792 986619 917506 970227
8437I70227o5415N4854k4438J7883N9614k7960k0362p1852j25467l4207j8518
$$ 970227 904812 959666 935228 953111 1012725 984765 964403 892551 767084 732877 714359
8426G14359J78000j8969l3926r6268l5204J8949j37140m8023l7360L0422J5449
$$ 714359 892359 873390 839464 743196 707992 726941 589801 541778 504418 534840 550289
8415E50289J9446q5973j48381N8255l9632j9861M1362o2961j743j0051o6322R352
$$ 550289 569735 483762 335381 393636 354004 334143 375505 312544 310801 300750 234428 243780
8403B43780l8526P6919J66418k0944j62932j47455N1387N0173O4449J011j28635
$$ 243780 205254 282173 448591 427647 264715 117260 168647 218820 283269 284280 155645
8392A55645q6099N7772J07730k1000j3973O2952m4618j74215k3486J55280r315
$$ 155645 69546 127318 235048 214048 200075 263027 218409 44194 20708 175988 166673
8381A66673P0445o7643m3347j0214K2574j24126o3813o1431J19987J06415o686
$$ 166673 237118 169475 126128 115914 138488 14362 -49451 -110882 9105 115520 108834
8370A08834n5453P2425j23801Q287L4313M0049J5396l9145O0696n7722j28171
$$ 108834 53381 125806 2005 10292 44605 84654 100050 60905 121601 63879 -64292
8359f4292N3994J20300N2298o8442k25981O0714O8770k6297k1186P6434n2140
$$ -64292 -10298 110002 162300 93858 -132123 -71409 -2639 -28936 -50122 26312 -25828
8348b5828p1062J0545k5002J8830m266Q7688K2090l4151r011o9157p1905l6068
$$ -25828 -96890 -86345 -111347 -92517 -96783 -9095 12995 -21156 -30167 -99324 -171229 -207297
8336b07297R7018k7971L6978J4138j25333Q3160R4265j18751l72O0985j11678
$$ -207297 -110279 -138250 -101272 -87134 -212467 -129307 -35042 -153793 -154165 -93180 -204858
8325b04858L0618r537o9525P1479J04456K2277m362n9432j23279J90004k0892
$$ -204858 -174240 -183777 -253302 -181823 -77367 -55090 -59452 -118884 -242163 -52159 -73051
8314g3051J45229o3150n9042m867j04160o5935K1642J90J11127O9040j09236o3218
$$ -73051 72178 9028 -50014 -54881 -159041 -224976 -203334 -203144 -92017 -22977 -132213 -195431
8302a95431m6043R7548m0687K2753k382O142n2602p1309k2891m7475r110P1482
$$ -195431 -241474 -143926 -184613 -161860 -164242 -158100 -210702 -282011 -304902 -352377 -361487 -290005
8290b90005j28732J6420J23743Q4556N2281j3174l417k3312j10759l6417K8016
$$ -290005 -418737 -402317 -278574 -194018 -141737 -154911 -158328 -181640 -292399 -328816 -300800
8279c00800p2047Q2924r8417J3405J02468m3189n7521Q8310R5527J27032L6170
$$ -300800 -372847 -289923 -388340 -374935 -272467 -315656 -373177 -284867 -189340 -62308 -26138
8268b6138m4516k2383q4214K1286j58039n3406P2886M3543N1293o949l1070L6707
$$ -26138 -70654 -93037 -177251 -155965 -314004 -367410 -294524 -250981 -199688 -206637 -237707 -201000
8256b01000j64971j28634N6628N2542J20277r4573N0006m813n9258N3127P3358
$$ -201000 -365971 -494605 -437977 -385435 -265158 -359731 -309725 -314538 -373796 -320669 -247311
8245b47311P4459r107p7549P8098M0416j51454M6475k7017Q3941R8018M5610j12983
$$ -247311 -172852 -181959 -259508 -181410 -140994 -292448 -245973 -272990 -189049 -91031 -45421 -158404
8233a58404j09115O6851J14261J7855q1819M091q7953N9255M7393J1967L1971
$$ -158404 -267519 -200668 -86407 -68552 -150371 -146280 -234233 -174978 -127585 -115618 -83647
8222h3647K4499j08594n8178n5781k4883J15862l7337L9301q9416L812j07758
$$ -83647 -59148 -167742 -225920 -281701 -306584 -190722 -228059 -188758 -278174 -274362 -382120
8211c82120J75562k8074L0979M2916M5921N979P3498J41981o5400j46098m7393
$$ -382120 -206558 -234632 -203653 -160737 -114816 -108837 -35339 106642 41242 -104856 -152249
8200a52249j4983k6895p7733l916J10313J29894o1524L29135J117788j006411
$$ -152249 -167232 -194127 -271860 -275776 -165463 -35569 -97093 232042 1349830 343419
8190C43419n10563j5730n6618J08004O877L6314K9560J05573p2710r9797m4953
$$ 343419 -167144 -182874 -239492 -131488 -124611 -88297 -58737 46836 -25874 -125671 -170624
8179a70624k9097o6174O7409N8536j8719p789o7064k0881Q9099p6054k338J03108
$$ -170624 -199721 -265895 -198486 -139950 -158669 -166458 -233522 -254403 -165304 -241358 -243696 -140588
8167a40588M1437p4660P5476q5316L8102K5204K8799j29637m5258p9047J17458
$$ -140588 -99151 -173811 -98335 -183651 -145549 -120345 -91546 -221183 -266441 -345488 -228030
8156b28030r4015j8081m854R6704o190k2233M6058O5727N4361J10243n4819j57084
$$ -228030 -322045 -340126 -344980 -248276 -254466 -276699 -230641 -164914 -110553 -310 -55129 -212213
8144b12213q2658K4045J00341K7610r300l5158M8225j27858J4606J53827l8687
$$ -212213 -294871 -270826 -170485 -142875 -152175 -187333 -139108 -266966 -252360 -98533 -137220
8133a37220p8924R6474q5972p362k9845o7858P848N0954R8683J7632j0382J20202
$$ -137220 -216144 -119670 -205642 -213004 -242849 -310707 -302859 -251905 -153222 -135590 -145972 -25770
8121b5770r3990J4793L0340L2206L1526j53827j66080J56561Q6338k7274m5872
$$ -25770 -119760 -104967 -74627 -42421 -10895 -164722 -330802 -174241 -87903 -115177 -161049
8110a61049j13721l0827K1874P2440l1895L8926N1497J2462l1386j0453J00463
$$ -161049 -274770 -305597 -283723 -211283 -243178 -204252 -152755 -140293 -171679 -182132 -81669
8099h1669j19175q5269L2874L1679n8957l0916O0680R386k3726j4044j2366Q9170
$$ -81669 -200844 -286113 -253239 -221560 -280517 -311433 -250753 -241367 -265093 -279137 -291503 -202333
8087b02333Q6850P647k7118j33878l1896L8462k7875P9513J70204j00151j6863
$$ -202333 -115483 -107836 -134954 -268832 -300728 -262266 -290141 -210628 -40424 -140575 -157438
8076a57438q2224m8850l4374J2917J08080j4580k393O0468n4184p9676m1801K0994
$$ -157438 -239662 -288512 -322886 -309969 -201889 -216469 -218862 -158394 -212578 -292254 -334055 -313061
8064c13061L0217o6042J09373j1508J46878J4895n0398n0420j37573K4180Q6812
$$ -313061 -282844 -348886 -239513 -251021 -104143 -89248 -139646 -190066 -327639 -303459 -216647
8053b16647M8963n1116o685l3169j7521O0849J0426r1692l1992J8980m2679J13002
$$ -216647 -167684 -218800 -225485 -258654 -276175 -215326 -204900 -296592 -328584 -309604 -352283 -239281
8041b39281R7619K7495o2637J9939N4562n4596p6401q7074J24527J14301P4092
$$ -239281 -141662 -114167 -176804 -156865 -102303 -156899 -233300 -320374 -195847 -81546 -7454
8030g454q1087o6142k9681J4491K8858n4483O743j11500n0293K15161j65R8868
$$ -7454 -88541 -154683 -184364 -169873 -141015 -195498 -188755 -300255 -350548 -135387 -135552 -36684
8018c6684O2496M4189o6372n0521K8060j14870L1967L239p466O5953L6217o5310
$$ -36684 25812 70001 3629 -46892 -18832 -133702 -101735 -98496 -105962 -40009 -3792 -69102
8006f9102j04802L6238K1355M773k2747p745J6921m504J131K0107k3149q8555
$$ -69102 -173904 -137666 -116311 -111538 -134285 -142030 -125109 -129613 -128482 -108375 -131524 -220079
7994b20079q599M5626L1641J20591L8214j08632L9181L8658K3134k7880n5518
$$ -220079 -228678 -183052 -151411 -30820 7394 -101238 -62057 -23399 -265 -28145 -83663
7983h3663J01712J27120o3027r4149j41628J2159J66075J06830q6537M2008m2076
$$ -83663 18049 145169 82142 -12007 -153635 -141476 24599 131429 44892 86900 44824
7972D4824K0024j1009n5346J05321q6151K917J06504j24836N1091K9541o4114
$$ 44824 64848 53839 -1507 103814 17663 20580 127084 2248 53339 82880 18766
7961A8766R5616k3267O126O089n3302j202Q8321J3397q5315R6974j0734N2937
$$ 18766 114382 91115 97241 103330 50028 48826 137147 150544 65229 162203 151469 204406
7949B04406r4008l2041L7578j6929P4406n7839o3949O2901j030N7779J9188n4699
$$ 204406 110398 78357 115935 99006 173412 115573 51624 114525 113495 171274 190462 135763
7937A35763O1440j1019l6176j8767L9565Q3835J02322j70850M0092Q3733k1711
$$ 135763 197203 186184 150008 131241 170806 254641 356963 186113 226205 309938 288227
7926B88227k3546m0994j19202K7049M453Q0465k4765J01571P9632j35920l4475
$$ 288227 264681 223687 104485 131534 135987 216452 191687 293258 372890 236970 202495
7915B02495L1519p8648m6138O1305l1621M4996j4135l0294q7338l4188Q2825l2341
$$ 202495 234014 155366 109228 170533 138912 183908 169773 139479 52141 17953 100778 68437
7903F8437O2007J9682j08270Q3264j30697n8308J22545M7393J30504N6455n9096
$$ 68437 130444 150126 41856 125120 -5577 -63885 58660 106053 236557 293012 233916
7892B33916j7488o1650J4876J3542M8948n0757j20543n6656M2690j4456L667L9488
$$ 233916 216428 154778 169654 183196 232144 181387 60844 4188 46878 32422 36089 75577
7880G5577n7341J12780k0064P8345O3577j32947o4880M6466K1140j5706l2229
$$ 75577 18236 131016 110952 189297 252874 119927 55047 101513 122653 106947 74718
7869G4718J3204R7026l79p5149Q2159K2910k6145j55877o987J14706j0897r9154
$$ 74718 87922 184948 184569 109420 191579 214489 188344 32467 25480 140186 129289 30135
7857C0135K3650J23637r795j05677N846J60614M9226M030K1458l6885o2281J26539
$$ 30135 53785 177422 167627 61950 67796 228410 277636 281666 303124 266239 203958 330497
7845C30497k7082r4750o4242L2410J48631q544p4430K9458O5085n2838j22750
$$ 330497 303415 208665 144423 176833 325464 316920 242490 271948 337033 284195 161445
7834A61445J00060N4530l1070j36440J5035K7085M3663K9292k4634r1310M3764
$$ 161445 261505 316035 284965 148525 163560 190645 234308 263600 238966 147656 191420
7823A91420L1547m4706J26019l5565k6054J15791j12972q782J8795m7681j5804
$$ 191420 222967 178261 304280 268715 242661 358452 245480 236698 255493 207812 192008
7812A92008O5677M2364P027N0372r7316L1802N6877J21031r3749L1224Q1197O3722
$$ 192008 257685 300049 307076 357448 260132 291934 348811 469842 376093 407317 488514 552236
7800E52236n5393j30008j11514J07460Q5295r8666J3720L4177j19274J18238P1200
$$ 552236 496843 366835 255321 362781 448076 349410 363130 397307 278033 396271 467471
7789D67471j49767o2530P9938N2029N286k2615o6449J45635p4752O4155Q7028
$$ 467471 317704 255174 335112 387141 392427 369812 303363 448998 374246 438401 525429
7778E25429k0735O187J993j15140M508J2241J68374P7655m2464l3116j404n1226
$$ 525429 504694 510881 512874 397734 402242 414483 582857 660512 618048 584932 583528 532302
7766E32302m5698J18314P1146O7925j11504m8470N0531J05231o1873o8529l8241
$$ 532302 486604 604918 676064 743989 632485 584015 634546 739777 677904 609375 571134
7755E71134P6984r5293J4007O5237l2235J18825r1558J3474P0011O5923l8789
$$ 571134 648118 552825 566832 632069 599834 718659 627101 640575 710586 776509 737720
7744G37720q0415Q4918J12551R874J8650O7371k650o3604N3815J6202m3368R1595
$$ 737720 657305 742223 854774 864648 883298 950669 948019 884415 938230 954432 911064 1002659
7732A002659o9409j47278N2487J42761m4775R6571P0860N0864o6157P7686o5139
$$ 1002659 933250 785972 838459 981220 936445 1033016 1103876 1154740 1088583 1166269 1101130
7721A101130j9687K6743o6529J30023n2382j54418J2067K38070Q1039L7691q457
$$ 1101130 1081443 1108186 1041657 1171680 1119298 964880 976947 1215017 1296056 1333747 1325290
7710A325290m8367p132P7248j2268J29576O8882j3410j22089K9085K8081O3938
$$ 1325290 1276923 1269791 1347039 1334771 1464347 1533229 1519819 1397730 1426815 1454896 1518834
7699A518834j9294R1139m4541m1533J05568r6896O7942j4984O2122L444N3180
$$ 1518834 1499540 1590679 1546138 1504605 1610173 1513277 1581219 1566235 1628357 1631801 1684981
7688A684981P898j04879M9814J30524n1521l8820P9578J8019J18784M50k285J11700
$$ 1684981 1692879 1588000 1637814 1768338 1716817 1677997 1757575 1775594 1894378 1894828 1892543 2004243
7676B004243k8641k9027J20786q7757k743J10626Q0616o6726R6363L1266J2474
$$ 2004243 1975602 1946575 2067361 1979604 1976861 2087487 2168103 2101377 2197740 2229006 2241480
7665B241480O1282J9762p6410P9989Q7298r7687J28641L9677L4836Q3349J9656
$$ 2241480 2302762 2322524 2246114 2326103 2413401 2315714 2444355 2484032 2518868 2602217 2621873
7654B621873J4208m9300j17983J88954J34112J28842o5647J8910p9747J29030
$$ 2621873 2636081 2586781 2468798 2657752 2791864 2920706 2855059 2873969 2794222 2923252
7644B923252O0249k5037N1409J07496J70495m5753j56420R0485J09688J57338
$$ 2923252 2983501 2958464 3009873 3117369 3287864 3242111 3085691 3176176 3285864 3443202
7634C443202J04757J35016J26348k5345j16175O7303N2700M9483J52809J13970
$$ 3443202 3547959 3682975 3809323 3783978 3667803 3735106 3787806 3837289 3990098 4104068
7624D104068m7630p6419N2508J17026J18443K4094J0836J00303O3046K3396M1224
$$ 4104068 4056438 3980019 4032527 4149553 4267996 4292090 4302926 4403229 4466275 4489671 4530895
7613D530895J0572M6751M2326P2786P6678J42044n266j453J63911J02778j3878
$$ 4530895 4541467 4588218 4630544 4703330 4780008 4922052 4916786 4915333 5079244 5182022 5168144
7602E168144j46443J84630J28523k1949K78429N1869R9612o4482j18675J18873
$$ 5168144 5021701 5206331 5334854 5312905 5591334 5643203 5742815 5678333 5559658 5678531
7592E678531J50966j11614o2615K36537J54300n2531J74908J23106n646p6895
$$ 5678531 5829497 5717883 5655268 5891805 6046105 5993574 6168482 6291588 6285942 6209047
7582F209047l480Q4362J22400k5399N7575L5664J90284J23520O1071L5866j21309
$$ 6209047 6205567 6289929 6412329 6386930 6444505 6480169 6670453 6793973 6855044 6890910 6769601
7571F769601J275K5764P1956J78505N9958q6894j19207J00189M285J5416J27814
$$ 6769601 6770876 6796640 6868596 7047101 7107059 7020165 6900958 7001147 7005432 7020848 7148662
7560G148662J00463N0149j23862k8758L8274r5170L3920k2481J52583Q907M691
$$ 7148662 7249125 7299274 7175412 7146654 7184928 7089758 7123678 7101197 7253780 7262687 7267378
7549G267378J04331L3660k9424K9122J65322J8205l0171K120l1850N5771j13462
$$ 7267378 7371709 7405369 7375945 7405067 7570389 7588594 7558423 7560543 7528693 7584464 7471002
7538G471002n0043o6152j59492k42441N5912j81680o9247J88373k68904j32020
$$ 7471002 7420959 7354807 7195315 6952874 7008786 6827106 6757859 6946232 6677328 6545308
7528F545308m3778R0982j85698q8810j26173o3153r723P3358j78624N8881o9006
$$ 6545308 6501530 6592512 6406814 6318004 6191831 6128678 6118955 6192313 6013689 6072570 6003564
7517F003564p1715k35310q5985L3771j2615l9935n3241j98176k10132K7596m104
$$ 6003564 5931849 5696539 5610554 5644325 5631710 5591775 5538534 5340358 5130226 5157822 5153718
7506E153718p9824K6006j4378j41631q9477J12432j17085k22581p0257k9847K3958
$$ 5153718 5073894 5099900 5085522 4943891 4854414 4966846 4849761 4627180 4556923 4527076 4551034
7495D551034q1238M9217j42310k93158R755j4225L9343L6917p9118j90787j76536
$$ 4551034 4469796 4519013 4376703 4083545 4093300 4079075 4118418 4155335 4076217 3885430 3708894
7484C708894k3519Q4330J37937j18128o3781n2135k30612q0985o3651j62371n8710
$$ 3708894 3685375 3769705 3907642 3789514 3725733 3673598 3442986 3362001 3298350 3135979 3077269
7473C077269Q5471l5147j35115N5350k1715M8393k2351n3577j11496m6872R0097
$$ 3077269 3162740 3127593 2992478 3047828 3026113 3074506 3052155 2998578 2887082 2840210 2930307
7462B930307p1453j88999m1098j55975N8459P4927p2894j3556n3701k6267j42197
$$ 2930307 2858854 2669855 2628757 2472782 2531241 2606168 2533274 2519718 2466017 2439750 2297553
7451B297553j82236J5614R6291L9597O4207n9607k58414m8524L33R4250j1961
$$ 2297553 2115317 2130931 2227222 2266819 2331026 2271419 2013005 1964481 1964814 2059064 2047103
7440B047103M627m4148r9181L7834L7043K495j76588n4956O8569n0242r0646L2458
$$ 2047103 2051730 2007582 1908401 1946235 1983278 1985773 1809185 1754229 1822798 1772556 1681910 1714368
7428A714368j2042j43206l0156J0123j09809P1760m5678q9712M6289n1911j33384
$$ 1714368 1702326 1559120 1528964 1539087 1429278 1501038 1455360 1365648 1411937 1360026 1226642
7417A226642O3893L5972J04174o9254l8567J4732M3461Q4980j08547o7762r0777
$$ 1226642 1290535 1326507 1430681 1361427 1322860 1337592 1381053 1466033 1357486 1289724 1198947
7406A198947l4793J5619J3441p5290J08126p3319L0478j41559o3215N3787L4396
$$ 1198947 1164154 1179773 1193214 1117924 1226050 1152731 1183209 1041650 978435 1032222 1066618
7395A066618J30519m6948p4702j31707o1194l862M347l5001k2795l9026k5230
$$ 1066618 1197137 1150189 1075487 943780 882586 878724 883071 848070 825275 786249 761019
7384G61019O090O2381J3127j7974J42221j15117j35074N0176m7354q5100P0700
$$ 761019 767109 829490 842617 824643 966864 851747 716673 766849 719495 634395 705095
7373G05095k9933o5217m5506l8825M6666J27924M0532o6085k38798P2820J24857
$$ 705095 675162 609945 564439 525614 572280 700204 740736 674651 435853 508673 633530
7362F33530q3299L4990k3077R6960m5040j48295M0987J11277q8050j20058m6935
$$ 633530 550231 585221 562144 659104 614064 465769 506756 618033 529983 409925 362990
7351C62990K2952k607K099n7275Q9529J28253m4400j97013P4916J38944q7139
$$ 362990 385942 383335 385434 328159 417688 545941 501541 304528 379444 518388 431249
7340D31249j04807L2134K6983l6321o3827J3540M8385O5278o5384M7929r0029
$$ 431249 326442 358576 385559 349238 285411 298951 347336 412614 347230 395159 305130
7329C05130N5854Q227O79L303j37756j24307N2437O2715K9234O4309m9660j02859
$$ 305130 360984 369211 369890 373193 235437 111130 163567 226282 255516 319825 270165 167306
7317A67306j00722N8019Q1989L5387k2484J0531m9939n4414L7274J3456j02372
$$ 167306 66584 124603 206592 241979 219495 230026 180087 125673 162947 176403 74031
7306G4031R8193r8728J5652J72441k9535l0382j0024O6704o3461l4747P1081J675
$$ 74031 172224 73496 89148 261589 232054 201672 191648 258352 194891 160144 231225 232900
7294B32900O376l2322m189L1189r1964j63897J30028Q3124p2628l9356Q9329J1645
$$ 232900 239276 206954 202765 233954 141990 -21907 108121 191245 118617 79261 168590 180235
7282A80235p3594j6760R2242J0196q3082o3154N7531M79l0502n3065N0600p0578
$$ 180235 106641 89881 182123 192319 109237 46083 103614 104093 73591 20526 71126 548
7270E48m3860k939O6056k2181n0611n9744n3349Q6399P3708L0724n040p2701j13353
$$ 548 -43312 -46251 19805 -2376 -52987 -112731 -166080 -79681 -5973 24751 19711 -52990 -166343
7257a66343J23417N2974n377j1262o3517P6980q1683o1276r2708n8586J71425
$$ -166343 -42926 10048 4671 -6591 -70108 6872 -74811 -136087 -228795 -287381 -115956
7246a15956R9484j8687j12474q2128O174J0659M1912j5774N107O7140P6857n377
$$ -115956 -16472 -35159 -147633 -229761 -223587 -212928 -171016 -186790 -181683 -114543 -37686 -43063
7234d3063m1226l229p8401J1909R9330M0393j24645J0581J9971J19982j94260
$$ -43063 -84289 -87518 -165919 -154010 -54680 -14287 -138932 -128351 -108380 11602 -182658
7223a82658M6197l7314P845M2452L835q92M231j63328M6123L3990M4835n6067
$$ -182658 -136461 -173775 -165930 -123478 -119643 -120535 -116304 -279632 -233509 -199519 -154684 -210751
7211b10751l7727p5526j10889J09493K2101P1060N2981j00530j13624J1333J8963
$$ -210751 -248478 -324004 -434893 -325400 -303299 -232239 -179258 -279788 -393412 -382079 -363116
7200c63116J57094j507m4356K852L8935j01267K5920j11872O1078J63111Q7289
$$ -363116 -206022 -207529 -251885 -249033 -210098 -311365 -285445 -397317 -336239 -173128 -85839
7189h5839q9175o6286m5918L6421J13265J3505k71172P0575L9766p8108l751l8036
$$ -85839 -175014 -241300 -287218 -250797 -137532 -124027 -395199 -324624 -284858 -362966 -366717 -404753
7177d04753L3965J20383M9363n4119N6280l4419j75681k7250J17048N4429j8994
$$ -404753 -370788 -250405 -201042 -255161 -198881 -233300 -408981 -436231 -319183 -264754 -283748
7166b83748j04267O1671j8612j55593M9388P4968n2089J02781N4434m4332M2409
$$ -283748 -388015 -326344 -344956 -500549 -451161 -376193 -428282 -325501 -271067 -315399 -272990
7155b72990L9570q5874l0466o2408Q315R1582p3798m838m8051m2156N3033J18918
$$ -272990 -233420 -319294 -349760 -412168 -403853 -312271 -386069 -390907 -438958 -481114 -428081 -309163
7143c09163j9833k7529o8542O4720K4495o2399Q3642j33431j08657J66483O8585
$$ -309163 -328996 -356525 -425067 -360347 -335852 -398251 -314609 -448040 -556697 -390214 -321629
7132c21629r2628J06618j21895J5733J709Q652N99N4558K9432n5190m5585m8668
$$ -321629 -414257 -307639 -429534 -413801 -412092 -403440 -402841 -348283 -318851 -374041 -419626 -468294
7120d68294L922l7434L073L7989m8478K1680M0921K6664N7012p7736j9695K4029
$$ -468294 -464372 -501806 -498733 -460744 -509222 -487542 -446621 -419957 -362945 -440681 -460376 -436347
7108d36347q508J8172O9414j8964n6697J50577l6806J2474l9010m7301k8566J1267
$$ -436347 -444855 -426683 -357269 -376233 -432930 -282353 -319159 -306685 -345695 -392996 -421562 -410295
7096d10295L5878k8878J8730m956p8960k3671L0562k7464R2190k4882j4865L6577
$$ -410295 -374417 -403295 -384565 -389521 -468481 -492152 -461590 -489054 -396864 -421746 -436611 -400034
7084d00034m8819k5000q950J31396J3792l7547N9319q947l9630l0312P069j20226
$$ -400034 -448853 -473853 -482803 -351407 -337615 -375162 -315843 -324790 -364420 -394732 -387663 -507889
7072e07889J9198j57216Q765K21964Q236K296J6994Q7632o5174k0332N2337n3916
$$ -507889 -488691 -645907 -637142 -415178 -406942 -404646 -387652 -300020 -365194 -385526 -333189 -387105
7060c87105K3246j34705q3320O9887K01144O2020p9900l8964k5037L6404j8333
$$ -387105 -363859 -498564 -581884 -511997 -310853 -248833 -328733 -367697 -392734 -356330 -374663
7049c74663k08986Q9200N5135r4779L1992R3879m1857m1953q1547M6451J77870
$$ -374663 -583649 -494449 -439314 -534093 -502101 -408222 -450079 -492032 -573579 -527128 -349258
7038c49258j1210q1441K5255n4531N842n88k2226J4952p2893K30550j2658l5499
$$ -349258 -360468 -441909 -416654 -471185 -465343 -465931 -488157 -473205 -546098 -315548 -328206 -363705
7026c63705J03698n8432j01444q737K1835R037Q4811m3419Q1114j22479p1331
$$ -363705 -260007 -318439 -419883 -428620 -406785 -397748 -312937 -356356 -275242 -397721 -469052
7015d69052M7600p2218P9618j4616q2876P1620n3443r4108J48968N7192j4940
$$ -469052 -421452 -493670 -414052 -428668 -511544 -439924 -493367 -587475 -438507 -381315 -396255
7004c96255R2540m5609P3549o3440j16943l3267N9324N4909j05511m6605k938
$$ -396255 -303715 -349324 -275775 -339215 -456158 -489425 -430101 -375192 -480703 -527308 -530246
6993e30246J31091p7213o2927J44341R0973n5537k0525L9954k9072p5191J3006
$$ -530246 -399155 -476368 -539295 -394954 -303981 -359518 -380043 -340089 -369161 -444352 -431346
6982d31346J14889m2334R209j5811j0960N6614K2355p1311o7064P493j6145p4566
$$ -431346 -316457 -358791 -349582 -365393 -376353 -319739 -297384 -368695 -435759 -428266 -444411 -518977
6970e18977j39853Q3773J15534J19742o1036L1770m28j09957o933R0545p828P9723
$$ -518977 -658830 -575057 -459523 -339781 -400817 -369047 -369475 -479432 -486365 -395820 -403648 -323925
6958c23925K2966R0439j40832o9831O6402K056o2878P844Q0290L8707m6151q160
$$ -323925 -300959 -210520 -351352 -421183 -354781 -352725 -415603 -407759 -327469 -288762 -334913 -343073
6946c43073k2538O4859J1660J37644k9590j34251l9786J03705m2176o7955q7469
$$ -343073 -365611 -300752 -289092 -151448 -181038 -315289 -355075 -251370 -293546 -361501 -448970
6935d48970K241J14418M8006j02074P460K0835m4297m5580m5184J67916P9476
$$ -448970 -446729 -332311 -284305 -386379 -378919 -358084 -402381 -447961 -493145 -325229 -245753
6924b45753o7662k3609J31190K0709j45448L2337J6940m72P188m2734j3116k6946
$$ -245753 -313415 -337024 -205834 -185125 -330573 -298236 -281296 -281768 -274580 -317314 -330430 -357376
6912c57376k1492q9489J7504N1887K17138n7943R9706n3517k2204l5167M0454
$$ -357376 -378868 -468357 -450853 -398966 -181828 -239771 -140065 -193582 -215786 -250953 -210499
6901b10499q7318q54j13650M7282M0549N8540j6718P7132P4816p9384q7584j11243
$$ -210499 -297817 -298671 -412321 -365039 -324490 -265950 -282668 -205536 -130720 -210104 -297688 -408931
6889d08931O7090J23087n2822L9395J2275j8925J2990M699r978m52l0060j01341
$$ -408931 -341841 -218754 -271576 -232181 -219906 -238831 -225841 -221142 -231120 -231572 -261632 -362973
6877c62973n2659J34596N4893k6661j14688Q6874M8023o5682J26418r7090n0310
$$ -362973 -415632 -281036 -226143 -252804 -367492 -280618 -232595 -298277 -171859 -268949 -319259
6866c19259K6903k5705O5542N3353p6179j318O9257L9953J2681j451j02861J50673
$$ -319259 -292356 -318061 -252519 -199166 -275345 -276663 -207406 -167453 -154772 -156223 -259084 -108411
6854a08411K6450j30441r7682L1576O7218l4702n63o1731P417R4833O9912l4971
$$ -108411 -81961 -212402 -310084 -278508 -211290 -245992 -246555 -308286 -300869 -206036 -136124 -171095
6842a71095m901R2199k3711j4555K9381j21560r0801J02478R0058n3560K4822
$$ -171095 -175996 -83797 -107508 -122063 -92682 -214242 -305043 -202565 -112507 -166067 -141245
6831a41245k4802N6644J30967j52208K0391q348N1652L2228J02655j71445p3326
$$ -141245 -166047 -109403 21564 -130644 -110253 -118601 -66949 -34721 67934 -103511 -176837
6820a76837J16954o5463m607j241P185L2874p366O8787m3284O9140o2867k15473
$$ -176837 -59883 -125346 -129953 -131194 -124009 -91135 -98501 -29714 -72998 -3858 -66725 -282198
6808b82198l9988K01077L9907L9885k1150l9130Q601Q3406L388o4623O0611o1188
$$ -282198 -322186 -121109 -81202 -41317 -62467 -101597 -92996 -9590 -6202 -70825 -10214 -71402
6796g1402j76247L7704K25533K0511j33053j9924R2641M936K132j11402L0612
$$ -71402 -247649 -209945 15588 36099 -96954 -116878 -24237 -19301 -17169 -128571 -97959
6785i7959P760J00461j01424k0401J03577K9250m9353q1403O0459L2617o5240
$$ -97959 -90199 10262 -91162 -111563 -7986 21264 -28089 -109492 -49033 -16416 -81656
6774h1656m1151m9413P6213J54927o2876O8004l7037M7793J384L7084o6585o8744
$$ -81656 -122807 -172220 -96007 58920 -3956 64048 27011 74804 76188 113272 46687 -22057
6762b2057Q7236r536q6577M6010q5036m5199Q8669l0485j4668Q6814o2604r8887
$$ -22057 65179 55643 -30934 15076 -69960 -115159 -26490 -56975 -71643 15171 -47433 -146320
6750a46320Q2937l3529P8071j10701N0748l1853K0445L8464J7970P4455k1049
$$ -146320 -63383 -96912 -18841 -129542 -78794 -110647 -90202 -51738 -33768 40687 19638
6739A9638l1609k8111J20708K1484o3055O7847l9645O8667j54132l7841J10310
$$ 19638 -11971 -40082 80626 102110 39055 106902 67257 135924 -18208 -56049 54261
6728E4261o5140N2957J35673j36920k5555J34304N1016n8000j03048l4123M590
$$ 54261 -10879 42078 177751 40831 15276 149580 200596 142596 39548 5425 10015
6717A0015O2805P2928Q5306K0461n5745j51248R3509l4981J59092P0008p3234
$$ 10015 72820 145748 231054 251515 195770 44522 138031 103050 262142 332150 258916
6706B58916p8279j6060O5825O2253q1703q2110j5906J52501j808j42422J34655
$$ 258916 180637 164577 230402 292655 210952 128842 112936 265437 263629 121207 255862
6695B55862J8022k3865l8740P11o3206k6755N3694J03132K9667J54478l0866j02513
$$ 255862 273884 250019 211279 211990 148784 122029 175723 278855 308522 463000 432134 329621
6683C29621r0827q4316R0192P3959n9901K6334j5447J3702M397P4925j416j09590
$$ 329621 238794 154478 244670 318629 258728 285062 269615 283317 287714 362639 361223 251633
6671B51633P1984K7949l2362m3496m1947P3933O1376j21629p5418Q2535J19115
$$ 251633 323617 351566 319204 275708 233761 307694 369070 247441 172023 254558 373673
6660C73673N9117q9464n4404M7141k8631K4821k0258K7960m0428k1322N1974n1882
$$ 373673 432790 343326 288922 336063 307432 332253 311995 339955 299527 278205 330179 278297
6648B78297R4404K6775j9783j2942p4103P5857P7154K8568o3093j07964q1579
$$ 278297 372701 399476 379693 366751 292648 368505 445659 474227 411134 303170 221591
6637B21591N4917J13265K07614j22986o2361R6726j46947M6759N0963j39970J11035
$$ 221591 276508 389773 597387 474401 412040 508766 361819 408578 459541 319571 430606
6626D30606J8109M0461K0744p2905j4274K4151m2679l7504q5993J39165N0432
$$ 430606 448715 489176 509920 437015 422741 446892 404213 366709 280716 419881 470313
6615D70313M8067K2181l0359k6089p4203J00097o4123j302J1663n6846k9587n6456
$$ 470313 518380 540561 510202 484113 409910 510007 445884 444582 456245 399399 369812 313356
6603C13356P0011R5074j42535R7578Q1266n0089j06424N1432K0548L9672M2416
$$ 313356 383367 478441 335906 433484 514750 464661 358237 409669 430217 469889 512305
6592E12305O1453L431L7579n4726q277R0755n936q231j3878m8294J13992n5412
$$ 512305 573758 577189 614768 560042 551765 642520 636584 628353 614475 566181 680173 624761
6580F24761l7055q2304N251R6944M066j57J6280K8447k8599O379r7978O8679r258
$$ 624761 587706 505402 510653 607597 611663 611506 627786 656233 627634 634013 536035 604714 595456
6567E95456j7408L8845j36623N326P6003Q1990N9938K201L5434o8774k9408R9851
$$ 595456 578048 616893 480270 485596 561599 643589 703527 705728 741162 672388 642980 742831
6555G42831l2750O6104R905m1937J60032m077l6281m8387o7537P0767P8110j34603
$$ 742831 710081 776185 786090 744153 904185 900108 863827 815440 747903 818670 896780 762177
6543G62177P5834p8768J16365j16221m4395M7902N9804M5651l8763l1769J3924
$$ 762177 838011 759243 875608 759387 714992 762894 822698 868349 829586 797817 811741
6532H11741R9986q9815N4502R0216Q9054j58473Q690N6509j49843L1072J53099
$$ 811741 911727 821912 876414 966630 1055684 897211 905901 962410 812567 843639 996738
6521I96738P6622r9937k4234J9559k4177p1861K3145m8801Q7436O9637k080J47180
$$ 996738 1073360 973423 949189 968748 944571 872710 895855 847054 934490 1004127 1002047 1149227
6509A149227j32423J09j748L9412q0046r8396M9638m481R3772p5550O2273N8961
$$ 1149227 1016804 1016913 1015165 1054577 974531 876135 925773 921292 1015064 939514 1001787 1060748
6497A060748o9849L3318P6258O1638J2641k270N7969p2964K3938O5785L3773m8511
$$ 1060748 990899 1024217 1100475 1162113 1174754 1172484 1230453 1157489 1181427 1247212 1280985 1232474
6485A232474p2046q9990Q8081J68121k543J9130l8202J05672r511r5315n6126
$$ 1232474 1160428 1070438 1158519 1326640 1324097 1343227 1305025 1410697 1401186 1305871 1249745
6474A249745J60218J6236M6445n9561q450J5606n0698L3771m8685O514Q9595j1672
$$ 1249745 1409963 1426199 1472644 1413083 1404633 1420239 1369541 1403312 1354627 1361141 1450736 1439064
6462A439064J08335j64765J7016J34701O9776M6382n2627r0429Q6966m3338J3244
$$ 1439064 1547399 1382634 1399650 1534351 1604127 1650509 1597882 1507453 1594419 1551081 1564325
6451A564325Q4465k12867J29983K7535m5993O7846k8726O4650O8356o2366l767
$$ 1564325 1648790 1435923 1565906 1593441 1547448 1615294 1586568 1651218 1719574 1657208 1653441
6440A653441n9917N6109N3934l3942l9066K18370J13314j02997N9908P522j25819
$$ 1653441 1593524 1649633 1703567 1669625 1630559 1848929 1962243 1859246 1919154 1926676 1800857
6429A800857m9627P1733J23138j15471P1023j0119q7790p618j4674Q603Q7309
$$ 1800857 1751230 1822963 1946101 1830630 1901653 1891534 1803744 1796126 1781452 1790055 1877364
6418A877364j1515Q8322Q5051j50P8478j5636j5665O542l1831J02459J57800j00530
$$ 1877364 1865849 1954171 2039222 2039072 2117550 2101914 2086249 2092791 2060960 2163419 2321219 2220689
6406B220689N8187J01407j43938j32974J05017l9778p747N2461j13256L3032J08070
$$ 2220689 2278876 2380283 2236345 2103371 2208388 2168610 2160863 2213324 2100068 2133100 2241170
6395B241170Q511J84R4853K3467j3531J15560m0049N338j819j325J0575O412N1531
$$ 2241170 2249681 2249865 2344718 2368185 2354654 2470214 2430165 2435503 2433684 2432359 2442934 2449346 2500877
6382B500877m472Q4314j00067j49p712k64K7799M6210J61487J04963l3933k4570
$$ 2500877 2496405 2580719 2480652 2480503 2472791 2472527 2500326 2546536 2708023 2812986 2779053 2754483
6370B754483J7685M0373j4159j86n0833L9568J35169m5311J00717M5007k0531
$$ 2754483 2772168 2812541 2798382 2798196 2747363 2786931 2922100 2876789 2977506 3022513 3001982
6359C001982j4777M8812J5744P4071K8948j329J8897j539R6756m381j94489J67549
$$ 3001982 2987205 3036017 3051761 3125832 3154780 3153451 3172348 3170809 3267565 3263184 3068695 3236244
6347C236244J82184m8203j02107M4044M8092Q1624J5850J00010l5495q0522J56211
$$ 3236244 3418428 3370225 3268118 3312162 3360254 3441878 3457728 3557738 3522243 3441721 3597932
6336C597932N2653o404j38776R4545N7102J4045J10078l6533J02477Q755J3078
$$ 3597932 3650585 3644181 3505405 3599950 3657052 3671097 3781175 3744642 3847119 3855874 3868952
6325C868952J16332o0963O0650L309J28810p0693M543m8245O52J07940j6229N4873
$$ 3868952 3985284 3924321 3984971 3988280 4117090 4046397 4050940 4002695 4003347 4111287 4095058 4149931
6313D149931J01434m4883n8571O0274k9397M2643K5678K3541J6790O5350J42888
$$ 4149931 4251365 4206482 4147911 4208185 4178788 4221431 4247109 4270650 4287440 4352790 4495678
6302D495678J50077l1387j4381r1252l7461Q3172K9009N3098J03446l7156J9594
$$ 4495678 4645755 4614368 4599987 4508735 4471274 4554446 4583455 4636553 4739999 4702843 4722437
6291D722437Q0939j08829o4482P3841J90991K6150K0956N1535j42333N2293N5693
$$ 4722437 4803376 4694547 4630065 4703906 4894897 4921047 4942003 4993538 4851205 4903498 4959191
6280D959191J01952Q5650N7335m2609K4865j45861l3225J38984Q410J18039J0249
$$ 4959191 5061143 5146793 5204128 5161519 5186384 5040523 5007298 5146282 5154692 5272731 5282980
6269E282980j2451J54529J34754j06287N1532P7434M0299K457K8952O9318R2942
$$ 5282980 5270529 5425058 5559812 5453525 5505057 5582491 5622790 5625247 5654199 5723517 5816459
6258E816459j41380J6769K60929m404j48972P2905J13282J66124k4342J2683J03567
$$ 5816459 5675079 5691848 5952777 5948373 5799401 5872306 5985588 6151712 6127370 6140053 6243620
6247F243620L9077r2640N6793L9652K6937R3938M816j8092Q6977j0304R3172N2445
$$ 6243620 6282697 6190057 6246850 6286502 6313439 6407377 6412193 6394101 6481078 6470774 6563946 6616391
6235F616391l3685O0769N7617P9537J5815J57013j7451r5911Q0236J9364J18111
$$ 6616391 6582706 6643475 6701092 6780629 6796444 6953457 6936006 6840095 6920331 6939695 7057806
6224G057806Q1090j9418J33212J28651N1758O4437R259l8095j7242J35494J58747
$$ 7057806 7138896 7119478 7252690 7381341 7433099 7497536 7506795 7468700 7451458 7586952 7745699
6213G745699K5934J13064R5749J49935J22147J11453P4555P6081K5826R5215N2619
$$ 7745699 7771633 7884697 7980446 8130381 8252528 8363981 8438536 8514617 8540443 8635658 8688277
6202H688277J31294j971P1592J07993L00592K64463M598J12468K32956K5871K2216
$$ 8688277 8819571 8817600 8889192 8997185 9297777 9562240 9566838 9679306 9912262 9938133 9960349
6191I960349K42297Q8194N948K39830K27487J85747K62236K75688K01211L58921
$$ 9960349 10202646 10290840 10296788 10536618 10764105 10949852 11212088 11487776 11688987 12047908
6181A2047908K79504J82199K83522M12417K15305K66807M52614M19153K80873
$$ 12047908 12327412 12509611 12793133 13205550 13420855 13687662 14140276 14559429 14840302
6172A4840302L78347L05869M18369M94214M03958L49402M49824L68447K66474
$$ 14840302 15218649 15524518 15942887 16437101 16841059 17190461 17640285 18008732 18275206
6163A8275206L57432J84275K33390L35119K13431R6997J88806M3776L8672j17433
$$ 18275206 18632638 18816913 19050303 19385422 19598853 19695850 19884656 19928432 19967104 19849671
6153A9849671l1107j85439j78187k20922k67395m11982j89202k60511k54114k09908
$$ 19849671 19818564 19633125 19454938 19234016 18966621 18554639 18365437 18104926 17850812 17640904
6143A7640904j83617k0557j62772j69543N0999n6146l617l0844K1164J59303M8755
$$ 17640904 17457287 17436730 17273958 17104415 17155414 17099268 17095651 17064807 17085971 17245274 17294029
6132A7294029J65519J71758J59410L25326K01224J77991K55715L15524M63320
$$ 17294029 17459548 17631306 17790716 18116042 18317266 18495257 18750972 19066496 19529816
6123A9529816M25042M66060L33408M15417N44685N88063N93679O35295P88329
$$ 19529816 19954858 20420918 20754326 21169743 21714428 22302491 22896170 23531465 24319794
6114B4319794O99226O17477P40622P35542P37939Q06807Q05032P26513O76633
$$ 24319794 25019020 25636497 26377119 27112661 27850600 28657407 29462439 30188952 30865585
6105C0865585O02263N56085M89391M65819M73131L29048L64466J92969J3746k9201
$$ 30865585 31467848 32023933 32513324 32979143 33452274 33781322 34145788 34338757 34352503 34323302
6095C4323302j78139j07887N5381l03239k73799j35794k31863l02435m52168k57483
$$ 34323302 34145163 34037276 34092657 33789418 33515619 33379825 33147962 32845527 32393359 32135876
6085C2135876k60033j72842j22355k47655k49996j49500j01110J24870L4343N376
$$ 32135876 31875843 31703001 31580646 31332991 31082995 30933495 30832385 30957255 30991598 30996974
6075C0996974k7807j47487N9999o3500J10179K15270R0593K06614L4072r501p7998
$$ 30996974 30969167 30821680 30881679 30818179 30928358 31143628 31234221 31440835 31474907 31465406 31387408
6064C1387408O9497N3496R3071j06126r1880o9741N1501L419r5913M8435j12874
$$ 31387408 31456905 31510401 31603472 31497346 31405466 31335725 31387226 31390645 31294732 31343167 31230293
6053C1230293n4283R378r7124j04968q8314j32196q8409k1230p2088J4119P4722
$$ 31230293 31176010 31185388 31088264 30983296 30894982 30762786 30674377 30653147 30581059 30595178 30669900
6042C0669900J1172l0767J6808P5307R3580N8267O7072J27568K15285K62335J52770
$$ 30669900 30681072 30650305 30667113 30742420 30836000 30894267 30961339 31088907 31304192 31566527 31719297
6031C1719297K10075J42122J7306M5667L61897K53473L9524O0899J05703R7523
$$ 31719297 31929372 32071494 32088800 32134467 32496364 32749837 32789361 32850260 32955963 33053486
6021C3053486j3797k3352j45041q3575k3651m9289j27075j85889j31844j44615
$$ 33053486 33039689 33016337 32871296 32787721 32764070 32714781 32587706 32401817 32269973 32125358
6011C2125358k138p9188k83448k10429k35128k67153j24447k47194l96423l33193
$$ 32125358 32123220 32044032 31760584 31550155 31315027 31047874 30923427 30676233 30279810 29946617
6001B9946617l22084l90525l26126m39065m33214m54143n68175p04277m53406
$$ 29946617 29624533 29234008 28907882 28468817 28035603 27581460 27013285 26309008 25855602
5992B5855602n78835n66687o20849k64021m25389m32271l66436l37652l75925
$$ 25855602 25276767 24710080 24089231 23825210 23399821 22967550 22601114 22263462 21887537
5983B1887537m12160k17448l42317m3182j38357k80028j12664j2751j56694r6938
$$ 21887537 21475377 21257929 20915612 20872430 20734073 20454045 20341381 20328630 20171936 20074998
5973B0074998J4076N654m3091k25106j31773j76931o5828j00406j44625j38061
$$ 20074998 20089074 20094728 20051637 19826531 19694758 19517827 19451999 19351593 19206968 19068907
5963A9068907l02648k39197k23292l4965k8872O2334n3811j21837N5596R8566
$$ 19068907 18766259 18527062 18303770 18268805 18239933 18302267 18248456 18126619 18182215 18280781
5953A8280781J15402R4287J94648J69214J32325N4586j62502M6778l1709j05971
$$ 18280781 18396183 18490470 18685118 18854332 18986657 19041243 18878741 18925519 18893810 18787839
5943A8787839K0038k26692k67894l30801l96182l71236l82509l82675k77954j89969
$$ 18787839 18807877 18581185 18313291 17982490 17586308 17215072 16832563 16449888 16171934 15981965
5933A5981965l64603k52628l06439k47373q6611r4651k35644j13923J5569m4910
$$ 15981965 15617362 15364734 15058295 14810922 14724311 14629660 14394016 14280093 14295662 14250752
5923A4250752o6303L6382k14105j38605j04819N6122o3191q6284j30834n8513
$$ 14250752 14184449 14220831 14006726 13868121 13763302 13819424 13756233 13669949 13539115 13480602
5913A3480602q8615j4880j82482j68586j34620j37434o8491o9983j10313j76761
$$ 13480602 13391987 13377107 13194625 13026039 12891419 12753985 12685494 12615511 12505198 12328437
5903A2328437j32107k30376l6445j39618j92808q4078k00095m7985p8512j21576
$$ 12328437 12196330 11965954 11929509 11789891 11597083 11513005 11312910 11264925 11186413 11064837
5893A1064837j30170j37690q4348j19387j12987j04441n1415m7611r6237K1583
$$ 11064837 10934667 10796977 10712629 10593242 10480255 10375814 10324399 10276788 10180551 10202134
5883A0202134j11818M409n6015j37479m0557j33714L1567k1323n1100j75251j8065
$$ 10202134 10090316 10094725 10038710 9901231 9860674 9726960 9758527 9737204 9686104 9510853 9492788
5872I492788o8361J76612J60673M4200j68095j02841r271k7230J6725k7061l0531
$$ 9492788 9424427 9601039 9761712 9805912 9637817 9534976 9525705 9498475 9515200 9488139 9457608
5861I457608P0071K6585P3260N7373L3022Q5188P1757K1157M1217p2754J40424
$$ 9457608 9527679 9554264 9627524 9684897 9717919 9803107 9874864 9896021 9937238 9864484 10004908
5850A0004908J15097M6253O9384l6601L6922M0946k3415q4424J36829L5710M979
$$ 10004908 10120005 10166258 10235642 10199041 10235963 10276909 10253494 10169070 10305899 10341609 10346588
5839A0346588m9474O2663j861m0691M7346L1864J92878o3964j8223J01178Q9340
$$ 10346588 10297114 10359777 10357916 10317225 10364571 10396435 10589313 10525349 10507126 10608304 10697644
5828A0697644r9882J13299J13483N0444J16064P1697k4461j7897k0707J43740
$$ 10697644 10597762 10711061 10824544 10874988 10991052 11062749 11038288 11020391 10999684 11143424
5818A1143424J49611L212N0154o604j08901j9954J42533Q6598q4889n6259K4694
$$ 11143424 11293035 11296247 11346401 11339797 11230896 11210942 11353475 11440073 11355184 11298925 11323619
5807A1323619m9752K1356j8723O6498J471L0239o8253l0233Q8626m4184O3529
$$ 11323619 11273867 11295223 11276500 11342998 11344469 11374708 11306455 11276222 11364848 11320664 11384193
5796A1384193J26982m5986r7078J33086o6001N3255J55705J6727K7265O4253J82677
$$ 11384193 11511175 11465189 11368111 11501197 11435196 11488451 11644156 11660883 11688148 11752401 11935078
5785A1935078l3528o3957K0332P6099L998O2884q7691J00305J8646j11044R7681
$$ 11935078 11901550 11837593 11857925 11934024 11938022 12000906 11913215 12013520 12032166 11921122 12018803
5774A2018803J39301K02785K809k9783k8499M1477m2622O0516J19757j4150r3361
$$ 12018803 12158104 12360889 12363698 12333915 12305416 12346893 12304271 12364787 12484544 12470394 12377033
5763A2377033P2908N9255J3127R1491O0032L2536Q7533L2084J1497K06517j4366
$$ 12377033 12449941 12509196 12522323 12613814 12673846 12706382 12793915 12825999 12837496 13044013 13029647
5752A3029647k1545J81966l4890J53220n0826J2571J70311n3839O6556J31539
$$ 13029647 13008102 13190068 13155178 13308398 13257572 13270143 13440454 13386615 13453171 13584710
5742A3584710J33343J03237Q8799q322N0451P4449J53856J41262M0470m0392R8883
$$ 13584710 13718053 13821290 13910089 13901767 13952218 14026667 14180523 14321785 14362255 14321863 14420746
5731A4420746J36086R2452N547M1634R5889J04370N0136J28993r820J49538Q7492
$$ 14420746 14556832 14649284 14654831 14696465 14792354 14896724 14946860 15075853 15066033 15215571 15303063
5720A5303063Q0201J19584L3127J37541J12090k9525J31490J06039M2378J39610
$$ 15303063 15383264 15502848 15535975 15673516 15785606 15756081 15887571 15993610 16035988 16175598
5710A6175598J04227J05516J79905J4011J72185Q4554K6293J28330R2137J94871
$$ 16175598 16279825 16385341 16565246 16579257 16751442 16835996 16862289 16990619 17082756 17277627
5700A7277627J52530P0902J31445o7898J02287K05821N7676j4101J64478J91937
$$ 17277627 17430157 17501059 17632504 17564606 17666893 17872714 17930390 17916289 18080767 18272704
5690A8272704P0608O3423J50233J22942L332J96428K04580P5623J15938J11683
$$ 18272704 18343312 18406735 18556968 18679910 18683242 18879670 19084250 19159873 19275811 19387494
5680A9387494N6448J66908P1334N0184J54965N5673J39527J21260J71758N115
$$ 19387494 19443942 19610850 19682184 19732368 19887333 19943006 20082533 20203793 20375551 20380666
5670B0380666N6336K86643J57963P2326J53111K12683L1008L01124P4126Q2258
$$ 20380666 20437002 20723645 20881608 20953934 21107045 21319728 21350736 21651860 21725986 21808244
5660B1808244R9178J67398J66696k6076J84071J91966K48992K54406J93182K30357
$$ 21808244 21907422 22074820 22241516 22215440 22399511 22591477 22840469 23094875 23288057 23518414
5650B3518414J94594J06327J52114K38544J84216K63901K38849K60192J51270
$$ 23518414 23713008 23819335 23971449 24209993 24394209 24658110 24896959 25157151 25308421
5641B5308421K55247K22079K69434J14180J57932K42198K94539K16900L15324
$$ 25308421 25563668 25785747 26055181 26169361 26327293 26569491 26864030 27080930 27396254
5632B7396254K02080K38396K81441L54711K14160J98587M58108K78125L04567
$$ 27396254 27598334 27836730 28118171 28472882 28687042 28885629 29343737 29621862 29926429
5623B9926429M13492L38734J71252L27781M20127K71121K37063L65584L61323
$$ 29926429 30339921 30678655 30849907 31177688 31597815 31868936 32105999 32471583 32832906
5614C2832906K67544K51047L35662L44991J24299M66011L66750L08194K52555
$$ 32832906 33100450 33351497 33687159 34032150 34156449 34622460 34989210 35297404 35549959
5605C5549959M74750L84577K59354L82600L97677K39594L30064M03218M19040
$$ 35549959 36024709 36409286 36668640 37051240 37448917 37688511 38018575 38421793 38840833
5596C8840833L90173L68146L69372M22632N49161M74645M73480M63805M72407
$$ 38840833 39231006 39599152 39968524 40391156 40940317 41414962 41888442 42352247 42824654
5587D2824654N11385N77547M32301N45570M62987O01597P74656N13361N11611
$$ 42824654 43336039 43913586 44345887 44891457 45354444 45956041 46730697 47244058 47755669
5578D7755669P16696O72219R00026N90253O13958P40954J000543Q83989P55452
$$ 47755669 48472365 49144584 50044610 50634863 51248821 51989775 52990318 53874307 54629759
5569E4629759Q73235R17448R27903J117654Q54830Q75547J145182J237813J245643
$$ 54629759 55502994 56420442 57348345 58465999 59320829 60196376 61341558 62579371 63825014
5560F3825014J166438J253598J261345J326655J454646J516591J570593J550151
$$ 63825014 64991452 66245050 67506395 68833050 70287696 71804287 73374880 74925031
5552G4925031J531897J602334J800460J869771J870319K037142J984170K168610
$$ 74925031 76456928 78059262 79859722 81729493 83599812 85636954 87621124 89789734
5544H9789734K197712K414085K458574K651736K824703K780245L056968L128366
$$ 89789734 91987446 94401531 96860105 99511841 102336544 105116789 108173757 111302123
5536A11302123L221416L411145L613290L781191L899855M059874M348898M518436
$$ 111302123 114523539 117934684 121547974 125329165 129229020 133288894 137637792 142156228
5528A42156228M804540N156362N302963N542379N908656N996139O336169O620152
$$ 142156228 146960768 152117130 157420093 162962472 168871128 174867267 181203436 187823588
5520A87823588O741036P369033P659673P976682Q375554Q560318Q784176R071694
$$ 187823588 194564624 201933657 209593330 217570012 225945566 234505884 243290060 252361754
5512B52361754R460513R306340R659619R531189R516668R263997Q873379Q393534
$$ 252361754 261822267 271128607 280788226 290319415 299836083 309100080 317973459 326366993
5504C26366993P697643O769051N968727M760353L503611K185223N89773p54475
$$ 326366993 334064636 340833687 346802414 351562767 355066378 357251601 357841374 357086899
5496C57086899k233800l604375m868031o079849p061801p849159q576497q907002
$$ 357086899 354853099 351248724 346380693 340300844 333239043 325389884 316813387 307906385
5488C07906385r335143r528723r536608r656874r664131r343616r216651q966221
$$ 307906385 298571242 289042519 279505911 269849037 260184906 250841290 241624639 232658418
5480B32658418q711412q350455q077856p913142p450423p048638p055257o719990
$$ 232658418 223947006 215596551 207518695 199605553 192155130 185106492 178051235 171331245
5472A71331245o421710o177123n928261n600593n369403n380874n052822m754959
$$ 171331245 164909535 158732412 152804151 147203558 141834155 136453281 131400459 126645500
5464A26645500m645360m453234m338961m013931l996616l727107l532297l393447
$$ 126645500 122000140 117546906 113207945 109194014 105197398 101470291 97937994 94544547
5456I4544547l370878l044318l003378k895436k544373k590828k459251k417889
$$ 94544547 91173669 88129351 85125973 82230537 79686164 77095336 74636085 72218196
5448G2218196k185934k245945k073760k037881j896071j787980j770781j639872
$$ 72218196 70032262 67786317 65712557 63674676 61778605 59990625 58219844 56579972
5440E6579972j604921j457940j402554j406332j349293j353921j163187j215584
$$ 56579972 54975051 53517111 52114557 50708225 49358932 48005011 46841824 45626240
5432D5626240j153897j174993j062002r60273j055025q51807r71291q58039p76861
$$ 45626240 44472343 43297350 42235348 41275075 40220050 39368243 38396952 37538913 36762052
5423C6762052q62584q52899o86418q27981o99764o83889o64034o74885p13334
$$ 36762052 35899468 35046569 34360151 33532170 32832406 32148517 31484483 30809598 30096264
5414C0096264n12011m81925o25414m69313p53514m01186m20941m32745n24062
$$ 30096264 29584253 29102328 28476914 28007601 27254087 26852901 26431960 25999215 25475153
5405B5475153n14041m75798m65225k69936l45040l29025m36349l35725l95122
$$ 25475153 24961112 24485314 24020089 23750153 23405113 23076088 22639739 22304014 21908892
5396B1908892l57767l56584l46211l65451l65394j86099k38914l74212k68638
$$ 21908892 21551125 21194541 20848330 20482879 20117485 19931386 19692472 19318260 19049622
5387A9049622l76242k77718l79056j47047j19775k57020m16956j33669j36281
$$ 19049622 18673380 18395662 18016606 17869559 17749784 17492764 17075808 16942139 16805858
5378A6805858l45084j87119k3328j47937l27505k80910k48337j15295r9716j97529
$$ 16805858 16460774 16273655 16250327 16102390 15774885 15493975 15245638 15130343 15030627 14833098
5368A4833098k16400j62567k58740j57722r3830k34798q8537q8067m9654o2453
$$ 14833098 14616698 14454131 14195391 14037669 13943839 13709041 13620504 13532437 13482783 13420330
5358A3420330k85947o5164k5064r7102k20063k17851k0822j06551k56234j10836
$$ 13420330 13134383 13069219 13044155 12947053 12726990 12509139 12488317 12381766 12125532 12014696
5348A2014696j59239n4265j23443j66186j12160j38959O7731j20491K7700k8002
$$ 12014696 11855457 11801192 11677749 11511563 11399403 11260444 11328175 11207684 11235384 11207382
5338A1207382j41341k11500K2542q2235l5356j23944j79939R535j29985j09746
$$ 11207382 11066041 10854541 10877083 10794848 10759492 10635548 10455609 10465144 10335159 10225413
5328A0225413l9230n7309j84300O1482J1588o9921k39057J6968P3561j08561j34942
$$ 10225413 10186183 10128874 9944574 10006056 10017644 9947723 9708666 9725634 9799195 9690634 9555692
5317I555692j46323j2463o8563j23971j02248o485J5136R9979r2418m1437r8825
$$ 9555692 9409369 9396906 9328343 9204372 9102124 9095639 9110775 9210754 9118336 9076899 8978074
5306H978074p5715n3954m7947K7028M2332j23825j49834Q0418n294l2770J164
$$ 8978074 8902359 8848405 8800458 8827486 8869818 8745993 8596159 8676577 8671283 8638513 8639677
5295H639677j40727j8511J52583j23905q8026m9661N5000j05K4973n3378q2112
$$ 8639677 8498950 8480439 8633022 8509117 8421091 8371430 8426430 8426325 8451298 8397920 8315808
5284H315808o4821L2465l7274m9700J74300L8751o6804j8615M2296m1013N928
$$ 8315808 8250987 8283452 8246178 8196478 8370778 8409529 8342725 8324110 8366406 8325393 8331321
5273H331321L082J67504j45298j14285j0088Q848n3132Q1381R6596o0094j3550
$$ 8331321 8334403 8501907 8356609 8242324 8232236 8241084 8187952 8269333 8365929 8305835 8292285
5262H292285k0589o8279J84670n4036j66600n9670J36746J43349k9539m186n568
$$ 8292285 8271696 8203417 8388087 8334051 8167451 8107781 8244527 8387876 8358337 8354151 8348583
5251H348583J25780K156m2022p6825O7376L7471J88211J01693m354l0215j596
$$ 8348583 8474363 8476519 8434497 8357672 8425048 8462519 8650730 8752423 8748069 8717854 8716258
5240H716258j644P4429r6310k2560r8875J14690J15269J88839J1484p4537J05458
$$ 8716258 8714614 8789043 8692733 8670173 8571298 8685988 8801257 8990096 9001580 8927043 9032501
5229I032501J05853J58653K8843p7787O9899P6725K2787N0115J49164K29611J37842
$$ 9032501 9138354 9297007 9325850 9248063 9317962 9394687 9417474 9467589 9616753 9846364 9984206
5218I984206o0277k8426J79943J39959J12830J00970J43065J12605K59208o3024
$$ 9984206 9923929 9895503 10075446 10215405 10328235 10429205 10572270 10684875 10944083 10881059
5208A0881059J02386K00460J67863J95191K42914R5661J65279M7242J55152K60433
$$ 10881059 10983445 11183905 11351768 11546959 11789873 11885534 12050813 12098055 12253207 12513640
5198A2513640J07121K30099L6593J79717K48155J04998J94027J69093n182J18933
$$ 12513640 12620761 12850860 12887453 13067170 13315325 13420323 13614350 13783443 13778261 13897194
5188A3897194J54337J76274J19755J60831J5079R0929J04075R1066R720j4698
$$ 13897194 14051531 14227805 14347560 14508391 14523470 14614399 14718474 14809540 14819260 14804562
5178A4804562K04420Q6436R4359q175l6265J60124j5392J41197J37765L8130J7724
$$ 14804562 15008982 15095418 15189777 15181602 15145337 15305461 15290069 15431266 15569031 15607161 15624885
5167A5624885J08235J27207J85444R1944J08413J34672J05300P7412K04256K18759
$$ 15624885 15733120 15860327 16045771 16137715 16246128 16380800 16486100 16563512 16767768 16986527
5157A6986527J80711J83825P2587J90608J98905L41985J03558K39250J46194J10500
$$ 16986527 17167238 17351063 17423650 17614258 17813163 18155148 18258706 18497956 18644150 18754650
5147A8754650K44438J14574L7513J18936J69302K04733J06093l0104M0243J97410
$$ 18754650 18999088 19113662 19151175 19270111 19439413 19644146 19750239 19720135 19760378 19957788
5137A9957788J15980j47387J6406J67089l5462R3471j15013j01919O5375j84797
$$ 19957788 20073768 19926381 19942787 20109876 20074414 20167885 20052872 19950953 20016328 19831531
5127A9831531l4496K0338j83533p8202r9826k9110j4620q9300k34271n1846j79115
$$ 19831531 19797035 19817373 19633840 19555638 19455812 19426702 19412082 19322782 19088511 19036665 18857550
5116A8857550R1844q8442j19388k0187j5456j25738o6649p0856n9201M046P3634
$$ 18857550 18949394 18860952 18741564 18721377 18705921 18580183 18513534 18442678 18383477 18387523 18461157
5105A8461157J29234o8927L2122j04119p6311j35911K848j67751J36927r0388
$$ 18461157 18590391 18521464 18553586 18449467 18373156 18237245 18240093 18072342 18209269 18118881
5095A8118881j76575k76436k7539j86656p8354j65169j39966k49083j89092j61906
$$ 18118881 17942306 17665870 17638331 17451675 17373321 17208152 17068186 16819103 16630011 16468105
5085A6468105k23126j12796j97661k22182k47552j07641j83001r2897k47885k06054
$$ 16468105 16244979 16132183 15934522 15712340 15464788 15357147 15174146 15081249 14833364 14627310
5075A4627310j74135j88138j97188k13003j83908j17871j16695k64722j70458
$$ 14627310 14453175 14265037 14067849 13854846 13670938 13553067 13436372 13171650 13001192
5066A3001192j56637j22867J19574j63056j19232o3300j53965r5871j41000q8761
$$ 13001192 12844555 12721688 12841262 12678206 12558974 12495674 12341709 12245838 12104838 12016077
5056A2016077q7531J08492L7566r9564O1410L5034j98241j07984J56985Q8390
$$ 12016077 11928546 12037038 12074604 11975040 12036450 12071484 11873243 11765259 11922244 12010634
5046A2010634R7936K0665O7102M7125K03857K8943N0655O0615P2146L1678L4626
$$ 12010634 12108570 12129235 12196337 12243462 12447319 12476262 12526917 12587532 12659678 12691356 12725982
5035A2725982J32494J87422J07856J35615Q3549M0648J66482J55610J66317K16482
$$ 12725982 12858476 13045898 13153754 13289369 13372918 13413566 13580048 13735658 13901975 14118457
5025A4118457K02264J91105N7091J35008J08335J86445J14092L22515J90481J3319
$$ 14118457 14320721 14511826 14568917 14703925 14812260 14998705 15112797 15435312 15625793 15639112
5015A5639112P9128J26854K00811J16280K01571O9858J77816J16349P1232J19665
$$ 15639112 15718240 15845094 16045905 16162185 16363756 16433614 16611430 16727779 16799011 16918676
5005A6918676J14825N3318J11222J48557J82183R9574J65427J36378K67040J70410
$$ 16918676 17033501 17086819 17198041 17346598 17528781 17628355 17793782 17930160 18197200 18367610
4995A8367610J93225J39715O0286J24368K58249J07539K45733L01524J22516J05729
$$ 18367610 18560835 18700550 18760836 18885204 19143453 19250992 19496725 19798249 19920765 20026494
4985B0026494J97658Q5786J17430J04213O5187N0319J66198J04170J20614Q2738
$$ 20026494 20224152 20309938 20427368 20531581 20596768 20647087 20813285 20917455 21038069 21120807
4975B1120807M3845J44249j5354p753j29499P89P5915J60049j06936l4334J39090
$$ 21120807 21164652 21308901 21293547 21285794 21156295 21157084 21232999 21393048 21286112 21251778 21390868
4964B1390868j76943M8259R4299M4876j7079J0138l9297j49314O0614N4244J65032
$$ 21390868 21213925 21262184 21356483 21401359 21384280 21394418 21355121 21205807 21266421 21320665 21485697
4953B1485697J00926R3231j5990Q8483j8485K02680K05662J69023P9300r1619
$$ 21485697 21586623 21679854 21663864 21752347 21733862 21936542 22142204 22311227 22390527 22298908
4943B2298908K29668J80564J31526K05341L6942L16654K84293J89431J81537L70960
$$ 22298908 22528576 22709140 22840666 23046007 23082949 23399603 23683896 23873327 24054864 24425824
4933B4425824J60700J19306J63831J18456j29753l68642l46989j57103j15289
$$ 24425824 24586524 24705830 24869661 24988117 24858364 24489722 24142733 23985630 23870341
4924B3870341k46971j09491j67430j95856k95243M4290p3115p8758j06050k36075
$$ 23870341 23623370 23513879 23346449 23150593 22855350 22899640 22826525 22747767 22641717 22405642
4914B2405642j97725N457j45142j20710k38792j17377p7665r8697l20985k00535
$$ 22405642 22207917 22213374 22068232 21947522 21708730 21591353 21513688 21414991 21094006 20893471
4904B0893471m6418l4040j09648j23696j97311j59481m6392j06323R0557j66168
$$ 20893471 20847053 20813013 20703365 20579669 20382358 20222877 20176485 20070162 20160719 19994551
4894A9994551j83295p3108L7806j71467l0837O2652P192J839K0773M0832K1931
$$ 19994551 19811256 19738148 19775954 19604487 19573650 19636302 19643494 19645333 19666106 19706938 19728869
4883A9728869J50753L3968j23368J2394M5100J75186J21713Q679l9942J40725
$$ 19728869 19879622 19913590 19790222 19802616 19847716 20022902 20144615 20153294 20113352 20254077
4873B0254077L04753Q3231J32187K09080L65983J02854J09061O8315L38357K89004
$$ 20254077 20558830 20642061 20774248 20983328 21349311 21452165 21561226 21629541 21967898 22256902
4863B2256902J17774J03972K93240K37771L07487J18341O0469K08664J43277K63849
$$ 22256902 22374676 22478648 22771888 23009659 23317146 23435487 23495956 23704620 23847897 24111746
4853B4111746L01880L37650J95689K34852K77450L39859K64403M12803L41774
$$ 24111746 24413626 24751276 24946965 25181817 25459267 25799126 26063529 26476332 26818106
4844B6818106K42314L79430M38435J80580J06037K49588K09769J41192K2352J14540
$$ 26818106 27060420 27439850 27878285 28058865 28164902 28414490 28624259 28765451 28787803 28902343
4834B8902343o856r3115K3981j60506j48218j67896l0682r5725n611p4562j25001
$$ 28902343 28895487 28802372 28826353 28665847 28517629 28349733 28319051 28223326 28217715 28143153 28018152
4823B8018152q5941M2629j41130j34408P9070Q2514J2972P844l2983K05716R271
$$ 28018152 27932211 27974840 27833710 27699302 27778372 27860886 27873858 27881702 27848719 28054435 28063706
4812B8063706K44734J97065Q5558J9313L6471Q5564J04568J07126L862Q8186j9337
$$ 28063706 28308440 28505505 28591063 28610376 28646847 28732411 28836979 28944105 28947967 29036153 29016816
4801B9016816J05825J67323Q5779N5254K10515J68575J84189J65185K60522K27637
$$ 29016816 29122641 29289964 29375743 29430997 29641512 29810087 29994276 30159461 30419983 30647620
4791C0647620N23422K85797K70045K54533J43490M6169k05109j19614j83405q0419
$$ 30647620 31171042 31456839 31726884 31981417 32124907 32171076 31965967 31846353 31662948 31582529
4781C1582529q0182l07552k31250j64487l11845k54611j91766l04797l96109l33467
$$ 31582529 31502347 31194795 30963545 30799058 30487213 30232602 30040836 29736039 29339930 29006463
4771B9006463l78629k24800j01260k16910l77332k71050l83708j53189k90053
$$ 29006463 28627834 28403034 28301774 28084864 27707532 27436482 27052774 26899585 26609532
4762B6609532k17858j35936l37733r5864k850k79343p3953j33855k23964k28132
$$ 26609532 26391674 26255738 25918005 25822141 25819291 25539948 25465995 25332140 25108176 24880044
4752B4880044k14344q6407k61213l39552j37804p1694k76436j62430j76537J2515
$$ 24880044 24665700 24579293 24318080 23978528 23840724 23769030 23492594 23330164 23153627 23166142
4742B3166142l06362j84281j17777j65832k25897j17932j4780r7675l3055O968
$$ 23166142 22859780 22675499 22557722 22391890 22165993 22048061 22033281 21935606 21902551 21909519
4732B1909519j27024j312J11609J09687K9877J38488J5786J89159J58864J28331
$$ 21909519 21782495 21781183 21892792 22002479 22032356 22170844 22186630 22375789 22534653 22662984
4722B2662984P6630J46969K07639K93007K42411K29950L81598K65099K87020K64624
$$ 22662984 22739614 22886583 23094222 23387229 23629640 23859590 24241188 24506287 24793307 25057931
4712B5057931L65494O17794N47250L43350M32880M34936L97657M41197N71126
$$ 25057931 25423425 26041219 26588469 26931819 27364699 27799635 28197292 28638489 29209615
4703B9209615N95913N17089O29644N79432N93848N63699N51742O78332N97484
$$ 29209615 29805528 30322617 30952261 31531693 32125541 32689240 33240982 33919314 34516798
4694C4516798O23418N88545P82177N47587M15198P57736O65547N59802O85928
$$ 34516798 35140216 35728761 36510938 37058525 37473723 38231459 38897006 39456808 40142736
4685D0142736O28932N89018N11778N96380O28456N84605N35723P39828O75797
$$ 40142736 40771668 41360686 41872464 42468844 43097300 43681905 44217628 44957456 45633253
4676D5633253N64992O42360O62654O08374P64213Q03262N60250N72921O57524
$$ 45633253 46198245 46840605 47503259 48111633 48875846 49679108 50239358 50812279 51469803
4667E1469803P31289O11948O33945M01060K72284M31868J20937L6278k4917k07329
$$ 51469803 52201092 52813040 53446985 53848045 54120329 54552197 54673134 54709412 54684495 54477166
4657E4477166j84100l35617m31945n31762l60618m67617m76330n78946m98619
$$ 54477166 54293066 53957449 53525504 52993742 52633124 52165507 51689177 51110231 50611612
4648E0611612m93100n43847m88687n29596n52621n75761m68653n55012n06755
$$ 50611612 50118512 49574665 49085978 48556382 48003761 47428000 46959347 46404335 45897580
4639D5897580m21777m20443m55809m77768l80296l65738l77299j75774q0065R4390
$$ 45897580 45475803 45055360 44599551 44121783 43741487 43375749 42998450 42822676 42742611 42837001
4629D2837001K39919L53154K37308J67731M5833K25176K59700k49741j133582
$$ 42837001 43076920 43430074 43667382 43835113 43880946 44106122 44365822 44116081 42982499
4620D2982499j448760j364074j297730j127811q66154n65650m05027j70189J04471
$$ 42982499 41533739 40169665 38871935 37744124 36877970 36312320 35907293 35737104 35841575
4611C5841575J83320L24273O53913P93367Q55396Q77836J174893J154433J117662
$$ 35841575 36024895 36349168 37003081 37796448 38651844 39529680 40704573 41859006 42976668
4602D2976668J199642J198085J302174J151631J162033J273669J243613J090105
$$ 42976668 44176310 45374395 46676569 47828200 48990233 50263902 51507515 52597620
4594E2597620Q99598O28542N59237M40057L78487K34988K70427p4013m71097r27963
$$ 52597620 53497218 54125760 54684997 55125054 55503541 55738529 56008956 55934943 55463846 54535883
4584E4535883j126640j247213j336259j321032j309770j441981j515497j708805
$$ 54535883 53409243 52162030 50825771 49504739 48194969 46752988 45237491 43528686
4576D3528686j804921j842722j818738j755857j748528j708591j532889j723573
$$ 43528686 41723765 39881043 38062305 36306448 34557920 32849329 31316440 29592867
4568B9592867j712634j577323j415778j287379j253948j115421j017777j059243
$$ 29592867 27880233 26302910 24887132 23599753 22345805 21230384 20212607 19153364
4560A9153364q42550p98610q01502n83348m95613n56709n72117l54679n82590
$$ 19153364 18310814 17512204 16710702 16127354 15631741 15075032 14502915 14148236 13565646
4551A3565646m84550l75261k77212l73144m79550l77706j15575k76687k13357
$$ 13565646 13081096 12705835 12428623 12055479 11575929 11198223 11082648 10805961 10592604
4542A0592604l83433k50556j70053j60289l58473j58334o4230j18518k39135j81181
$$ 10592604 10209171 9958615 9788562 9628273 9269800 9111466 9047236 8928718 8689583 8508402
4532H508402m4494j55538j07652j50841k01349j00568J1783p1836j12641J06838
$$ 8508402 8463908 8308370 8200718 8049877 7848528 7747960 7759743 7687907 7575266 7682104
4522G682104k6848j33611j96945l6571l6391j41510l0707j18934o6608M527m1614
$$ 7682104 7655256 7521645 7324700 7288129 7251738 7110228 7079521 6960587 6893979 6898506 6856892
4511F856892j6740r6885j7751M3270Q4631l9875m8767J673j48560j00431p5355
$$ 6856892 6840152 6743267 6725516 6768786 6853417 6813542 6764775 6766448 6617888 6517457 6442102
4500F442102J73605K4530j67065p5463L2412l3045r3467j366m0028L5648N1933
$$ 6442102 6615707 6640237 6473172 6397709 6430121 6397076 6303609 6302243 6262215 6297863 6349796
4489F349796K3330O7519J3121k8331m9917j31572P5112n0149Q5738Q9027m3826
$$ 6349796 6373126 6440645 6453766 6425435 6375518 6243946 6319058 6268909 6354647 6443674 6399848
4478F399848p2346p3363j12739O421K69734j6906r2386j94450J44186L1200K8995
$$ 6399848 6327502 6254139 6141400 6147821 6417555 6400649 6308263 6113813 6257999 6289199 6318194
4467F318194J13886p7046j00493J2106j4823q8356Q9206p6139l6046J65753N8656
$$ 6318194 6432080 6355034 6254541 6266647 6251824 6163468 6252674 6176535 6140489 6306242 6364898
4456F364898m1410r81K0031j385o6521j0535N0262m1506q4594K698R6124J36210
$$ 6364898 6323488 6322507 6342538 6341153 6274632 6264097 6314359 6272853 6188259 6190957 6287081 6423291
4444F423291o073m5854q4168m4850J21126P747m2696q2335k570l117L3582P0298
$$ 6423291 6417218 6371364 6287196 6242346 6363472 6371219 6328523 6246188 6243618 6240501 6274083 6344381
4432F344381N3456k2308R706R0384J28202j22085r8810J6719J09130m868J38392
$$ 6344381 6397837 6375529 6385235 6475619 6603821 6481736 6382926 6399645 6508775 6503907 6642299
4421F642299L7672l2154N9806o3519j7839L6611J10618R1369j71582N3426l8253
$$ 6642299 6679971 6647817 6707623 6644104 6626265 6662876 6773494 6864863 6693281 6746707 6708454
4410F708454n548J08564K1890N9604l725L7230J63709K5504r4916j5304J0290
$$ 6708454 6702906 6811470 6833360 6892964 6889239 6926469 7090178 7115682 7020766 7005462 7015752
4399G015752J15743j5759J62809n7543p3285j0994J11928O1760J32339J59915
$$ 7015752 7131495 7115736 7278545 7221002 7147717 7136723 7248651 7310411 7442750 7602665
4389G602665l811j39821j201P5209J7966J23534L2638k5412l9195K3676P3148
$$ 7602665 7598854 7459033 7457832 7533041 7551007 7674541 7707179 7681767 7642572 7666248 7739396
4378G739396J45562M5565J16146O3842L1205l1549M869J0577J15180p1559r423
$$ 7739396 7884958 7930523 8046669 8110511 8141716 8110167 8115036 8125613 8240793 8169234 8159811
4367H159811K03336L5270p0299M2245J27503K7255P9707o243K8411R5367J63119
$$ 8159811 8363147 8398417 8328118 8370363 8497866 8525121 8604828 8598585 8626996 8722363 8885482
4356H885482M9070r2137J7600J86915J51477N9634O2123O182O5613Q3893J97870
$$ 8885482 8934552 8842415 8860015 9046930 9198407 9258041 9320164 9326346 9391959 9475852 9673722
4345I673722K8931M0023J13398J22209K49896P3026J5996k3345K22148J53471
$$ 9673722 9702653 9742676 9856074 9978283 10228179 10301205 10317201 10293856 10516004 10669475
4335A0669475J51665P4557J76190K16208J35594K05355J17777O9014J36257J96026
$$ 10669475 10821140 10895697 11071887 11288095 11423689 11629044 11746821 11815835 11952092 12148118
4325A2148118J48314R462L35525L28611K72804K82171K40460L86485M24224L10926
$$ 12148118 12296432 12305894 12641419 12970030 13242834 13525005 13765465 14151950 14576174 14887100
4315A4887100J72142M80374M07457K63442M42517M37814N59011O03210L24855
$$ 14887100 15059242 15539616 15947073 16210515 16653032 17090846 17649857 18253067 18577922
4306A8577922L25477N93661N32768N56770N80291N53026N28794N63875P11677
$$ 18577922 18903399 19497060 20029828 20586598 21166889 21719915 22248709 22812584 23524261
4297B3524261O30203N81751O11722O22694M94363P38360Q12307N86601M96712
$$ 23524261 24154464 24736215 25347937 25970631 26464994 27203354 28015661 28602262 29098974
4288B9098974N06694N36914N14441L78544N29590M10821M58010N34882K50681
$$ 29098974 29605668 30142582 30657023 31035567 31565157 31975978 32433988 32968870 33219551
4279C3219551K49239K79999K86940J38758K44086J49104L3199R3871j59901j00392
$$ 33219551 33468790 33748789 34035729 34174487 34418573 34567677 34600876 34694747 34534846 34434454
4269C4434454j34620j89459k62100j76353l61717k28527k46827n11618l83803
$$ 34434454 34299834 34110375 33848275 33671922 33310205 33081678 32834851 32323233 31939430
4260C1939430l63685m19343n12821m60740m93944l67054o30764n39712o01032
$$ 31939430 31575745 31156402 30643581 30182841 29688897 29321843 28691079 28151367 27550335
4251B7550335n74102n76927m82028n22808n57291n83370m34947m64948n98876
$$ 27550335 26976233 26399306 25917278 25394470 24837179 24253809 23818862 23353914 22755038
4242B2755038m06340l07478n90232n32317l55490l55070l83243l79116l43441
$$ 22755038 22348698 22041220 21450988 20918671 20563181 20208111 19824868 19445752 19102311
4233A9102311k34134k43093l30690j01893j75754l08996l69405k75166j21379
$$ 19102311 18868177 18625084 18294394 18192501 18016747 17707751 17338346 17063180 16941801
4224A6941801q3251J0529m7286N1566p4163j652J91269J07369K68661K89265K57348
$$ 16941801 16858550 16869079 16821793 16873359 16799196 16797544 16988813 17096182 17364843 17654108 17911456
4213A7911456L43373P22655R05052J031146J154124J543419J105449R95680P98132
$$ 17911456 18254829 18977484 19882536 20913682 22067806 23611225 24716674 25712354 26510486
4204B6510486J194339O98737o59506j659245j908774j717340j553132j265809
$$ 26510486 27704825 28403562 27744056 26084811 24176037 22458697 20905565 19639756
4196A9639756j218316q88746p31908o98449n18190l28921l36087k26517j78726
$$ 19639756 18421440 17532694 16800786 16102337 15584147 15255226 14919139 14692622 14513896
4187A4513896l64176j60979j86266j38720j56169j70723O5133k8374j96019k24637
$$ 14513896 14149720 13988741 13802475 13663755 13507586 13336863 13401996 13373622 13177603 12952966
4177A2952966l5084j52854k24355k33091M147P4350K6353r2645p4234j87311l5285
$$ 12952966 12917882 12765028 12540673 12307582 12311729 12386079 12412432 12319787 12245553 12058242 12022957
4166A2022957J6255n0524N6138m0229J09179k3963N1731L5089n5450K4112j55411
$$ 12022957 12039212 11988688 12044826 12004597 12113776 12089813 12141544 12176633 12121183 12145295 11989884
4155A1989884j37950J23656N2549l0732O7569J01698j2426j20796J2301N1723
$$ 11989884 11851934 11975590 12028139 11997407 12064976 12166674 12154248 12033452 12045753 12097476
4145A2097476P0211P3057O8284j46476O7139j0503p9117J57031n7761K6733J15695
$$ 12097476 12167687 12240744 12309028 12162552 12229691 12219188 12140071 12297102 12239341 12266074 12381769
4134A2381769k5317k167J09503k8232k8133K39300R6114j4276Q6404M2240p915
$$ 12381769 12356452 12354285 12463788 12435556 12407423 12646723 12742837 12728561 12814965 12857205 12849290
4123A2849290r7830o2528J27228N4261O9705J26045K73117K5623k9520M1757P0458
$$ 12849290 12751460 12688932 12816160 12870421 12940126 13066171 13339288 13364911 13335391 13377148 13447606
4112A3447606J25949o077J04287Q2765J32078J03649J62520J80469J47149k2367
$$ 13447606 13573555 13567478 13671765 13754530 13886608 13990257 14152777 14333246 14480395 14458028
4102A4458028l9112J09521j2610O2546J40511J39454O5167J33286J16444P1342
$$ 14458028 14418916 14528437 14515827 14578373 14718884 14858338 14923505 15056791 15173235 15244577
4092A5244577O0867K29292J95913P1268J27444K61072J96267J6406R6116K41966
$$ 15244577 15305444 15534736 15730649 15801917 15929361 16190433 16386700 16403106 16499222 16741188
4082A6741188J05277J30648N2296q857L74605J91097J34422K45542L54153J49707
$$ 16741188 16846465 16977113 17029409 17020552 17395157 17586254 17720676 17966218 18320371 18470078
4072A8470078K26924J71612L62357J64716J48200L97007L35370L22995L28493
$$ 18470078 18697002 18868614 19230971 19395687 19543887 19940894 20276264 20599259 20927752
4063B0927752M41672L30997L85249M20182N58969O39480Q81578Q75063R77050
$$ 20927752 21369424 21700421 22085670 22505852 23064821 23704301 24585879 25460942 26437992
4054B6437992R59329Q81413O18791O47738P72888M77524J5757j98265m08193k96161
$$ 26437992 27397321 28278734 28897525 29545263 30318151 30795675 30811432 30613167 30204974 29908813
4044B9908813k97288k48890M1405P9898K29923K2638K17494L29141L08998J97977
$$ 29908813 29611525 29362635 29404040 29483938 29713861 29736499 29953993 30283134 30592132 30790109
4034C0790109L93510M54581L11963M21880M71541L90373L25449N15149L75401
$$ 30790109 31183619 31638200 31950163 32372043 32843584 33233957 33559406 34074555 34449956
4025C4449956K51618M35578L30498L71703N82582L99857L49825M74386M91831
$$ 34449956 34701574 35137152 35467650 35839353 36421935 36821792 37171617 37646003 38137834
4016C8137834L96354N16089N44153N40296N50065O70483N63412M96940M79029
$$ 38137834 38534188 39050277 39594430 40134726 40684791 41355274 41918686 42415626 42894655
4007D2894655O14818P61041P18706O54102N67064O09750N31874M81590N40948
$$ 42894655 43509473 44270514 44989220 45643322 46210386 46820136 47352010 47833600 48374548
3998D8374548N68092N21705M87178O21409O45814M46574L89961N54809N55892
$$ 48374548 48942640 49464345 49951523 50572932 51218746 51665320 52055281 52610090 53165982
3989E3165982O37796N97996N83801O83435P36798N72851N95142Q05899P14374
$$ 53165982 53803778 54401774 54985575 55669010 56405808 56978659 57573801 58379700 59094074
3980E9094074P72597P99041P03467P02498Q15194Q78124P95237O01551P57129
$$ 59094074 59866671 60665712 61369179 62071677 62886871 63764995 64560232 65161783 65918912
3971F5918912O63496O89123O67826N90893O70896N90672M50687N52953L70444
$$ 65918912 66582408 67271531 67939357 68530250 69201146 69791818 70242505 70795458 71165902
3962G1165902M90966N39636L83201L56061L81764N13985N85233K64085L46977
$$ 71165902 71656868 72196504 72579705 72935766 73317530 73831515 74416748 74680833 75027810
3953G5027810L95582L99358K87177K57146J36714J34417J61298K01560J89058
$$ 75027810 75423392 75822750 76109927 76367073 76503787 76638204 76799502 77001062 77190120
3944G7190120k7767Q8552K0219q6751j00590n2117o0520j86094k21281j63987
$$ 77190120 77162353 77250905 77271124 77184373 77083783 77031666 76971146 76785052 76563771 76399784
3934G6399784j98473l07168l92337m17516l01527l80116n68307m51719m79232
$$ 76399784 76201311 75894143 75501806 75084290 74782763 74402647 73834340 73382621 72903389
3925G2903389m70012m94584o20889o38047m97597k86222m35003m80560l16798
$$ 72903389 72433377 71938793 71317904 70679857 70182260 69896038 69461035 68980475 68663677
3916F8663677m05519k03576k33119K2144r6410j50434J09041N3228J32538J26488
$$ 68663677 68258158 68054582 67821463 67843607 67747197 67596763 67705804 67759032 67891570 68018058
3906F8018058K18154K39432J99960K82153K44655L34466K63760K12842J36276
$$ 68018058 68236212 68475644 68675604 68957757 69202412 69536878 69800638 70013480 70149756
3897G0149756K24041M3043R299J99567j9815p4008L8623j80358p9250j25367k05739
$$ 70149756 70373797 70416840 70426139 70625706 70605891 70531883 70570506 70390148 70310898 70185531 69979792
3886F9979792k75454j39445k58573l36436l01469k18444j94719l20046m01333
$$ 69979792 69704338 69564893 69306320 68969884 68668415 68449971 68255252 67935206 67533873
3877F7533873m55787l32709l58932n38476n88645o25361n88737o38972o74741
$$ 67533873 67078086 66745377 66386445 65847969 65259324 64633963 64045226 63406254 62731513
3868F2731513p09054p44070o91728q11126q31487q39359q74073p50168p89136
$$ 62731513 62022459 61278389 60586661 59775535 58944048 58104689 57230616 56480448 55691312
3859E5691312r80407q34246q98236r09907r36527r51004j065545r82091j106819
$$ 55691312 54710905 53876659 52978423 52068516 51131989 50180985 49115440 48133349 47026530
3850D7026530r46573j070635r73446j011576r91781r57835p90420r95501r81903
$$ 47026530 46079957 45009322 44035876 43024300 42032519 41074684 40284264 39288763 38306860
3841C8306860q45097p00180n07374p37672n69082o27040n07140l54440l21317
$$ 38306860 37461763 36761583 36254209 35516537 34947455 34320415 33813275 33458835 33137518
3832C3137518l48849m60604l46216k22536j821L0160k05465j28288K5129m5546
$$ 33137518 32788669 32328065 31981849 31759313 31757492 31787652 31582187 31453899 31479028 31433482
3822C1433482J18197J67315P1389R2481K6340K11983m680p6373k0663J17328R1153
$$ 31433482 31551679 31718994 31790383 31882864 31909204 32121187 32116507 32040134 32019471 32136799 32227952
3811C2227952n7421R522J42606n1291o1466j72923l3509L9501m6440O9781o8320
$$ 32227952 32170531 32180053 32322659 32271368 32209902 32036979 32003470 32042971 31996531 32066312 31997992
3800C1997992j43558q4022j0243k14193j39544K1547o886O809N1319r053J5628
$$ 31997992 31854434 31770412 31760169 31545976 31406432 31427979 31421093 31427902 31479221 31470168 31485796
3789C1485796K04475J44466j8429Q1031J67724K64669K02162M06232M24961K53287
$$ 31485796 31690271 31834737 31816308 31897339 32065063 32329732 32531894 32938126 33363087 33616374
3779C3616374L51022L08646M20250K53794K66540K50233K12911K15932K10150
$$ 33616374 33967396 34276042 34696292 34950086 35216626 35466859 35679770 35895702 36105852
3770C6105852O6235J08377k1576J31817l3600j79449j8857q6921l9268r4773r1069
$$ 36105852 36172087 36280464 36258888 36390705 36357105 36177656 36158799 36071878 36032610 35937837 35846768
3759C5846768j2190O8645K3340K1130J19698J34747J81543J97605J47592L54251
$$ 35846768 35834578 35903223 35926563 35947693 36067391 36202138 36383681 36581286 36728878 37083129
3749C7083129L28437L42290K60548L68188N39506N16223L82822N54792O81861
$$ 37083129 37411566 37753856 38014404 38382592 38922098 39438321 39821143 40375935 41057796
3740D1057796O34540O17561P15975Q42628R14529R83262R20265J081534J027065
$$ 41057796 41692336 42309897 43025872 43868500 44783029 45766291 46686556 47768090 48795155
3731D8795155R66178J151247J269832J353268J323463J392257J253049J243994
$$ 48795155 49761333 50912580 52182412 53535680 54859143 56251400 57504449 58748443
3723E8748443J253883J205200J250559J154605J066866J227885R98671J004799
$$ 58748443 60002326 61207526 62458085 63612690 64679556 65907441 66906112 67910911
3715F7910911P74725Q52802R69636Q73849R10772J049936Q37015J083872J238229
$$ 67910911 68685636 69538438 70508074 71381923 72292695 73342631 74179646 75263518 76501747
3706G6501747J102463J111916J255370J172561J013522J206895J014204R76394
$$ 76501747 77604210 78716126 79971496 81144057 82157579 83364474 84378678 85355072
3698H5355072P88831N57735K10113J80132O9652m04990p11813q20086j080459
$$ 85355072 86143903 86701638 86911751 87091883 87161535 86756545 86044732 85224646 84144187
3689H4144187j221919j474479j584825j729959j436379j570583j812522j821183
$$ 84144187 82922268 81447789 79862964 78133005 76696626 75126043 73313521 71492338
3681G1492338j478430j464486j403184j116798j237858j049304j109082p86575
$$ 71492338 70013908 68549422 67146238 66029440 64791582 63742278 62633196 61846621
3673F1846621q57867p20214o11736m34059m68407n75351m20443n14675o42916
$$ 61846621 60988754 60268540 59656804 59222745 58754338 58178987 57758544 57243869 56600953
3664E6600953n70897n60229n45112o46027q01595p98078q43036q14366r46464
$$ 56600953 56030056 55469827 54924715 54278688 53477093 52679015 51835979 51021613 50075149
3655E0075149p19502j010752r04427q61862q61280p68171q45238q30036p77364
$$ 50075149 49355647 48344895 47440468 46578606 45717326 44949155 44103917 43273881 42496517
3646D2496517o43242o59138n53007m16489n61766l15304l61489k98796l00183
$$ 42496517 41853275 41194137 40641130 40224641 39662875 39347571 38986082 38687286 38387103
3637C8387103k38667l19086k47235k77362m11464k76237j92912k89552j69074
$$ 38387103 38148436 37829350 37582115 37304753 36893289 36617052 36424140 36134588 35965514
3628C5965514j74188k41101n3422P673r53r3900r2685L1259n3454p5013k044p6627
$$ 35965514 35791326 35550225 35496803 35504476 35503523 35409623 35316938 35348197 35294743 35219730 35217686 35141059
3616C5141059o219O5426J00720j32105k56874j79683o4424k54086k75180k38638
$$ 35141059 35134840 35200266 35300986 35168881 34912007 34732324 34667900 34413814 34138634 33899996
3606C3899996m39291l19586k04528l77828l78304n42474m84666m01247m48522
$$ 33899996 33460705 33141119 32936591 32558763 32180459 31637985 31153319 30752072 30303550
3597C0303550m90611l92662m37818l55823l35974l61381l44905k51901l68007
$$ 30303550 29812939 29420277 28982459 28626636 28290662 27929281 27584376 27332475 26964468
3588B6964468j64872k21720l23656k33046k27959k27490l45310l94868k07641
$$ 26964468 26799596 26577876 26254220 26021174 25793215 25565725 25220415 24825547 24617906
3579B4617906n9239J0697m4234o9889k08329l7700j14527j39366q1757j15306
$$ 24617906 24558667 24569364 24525130 24455241 24246912 24209212 24094685 23955319 23873562 23758256
3569B3758256J2538o1738N7683m6776Q0543L7164o1998o0596O8393M6118J00608
$$ 23758256 23770794 23709056 23766739 23719963 23800506 23837670 23775672 23715076 23783469 23829587 23930195
3558B3930195q764j086K44084R6812Q8847J01334Q7310J65233J81228J23259J83593
$$ 23930195 23921431 23920345 24164429 24261241 24350088 24451422 24538732 24703965 24885193 25008452 25192045
3547B5192045K20661J06027J14110K82219K85295K85051K47705K95292J97971
$$ 25192045 25412706 25518733 25632843 25915062 26200357 26485408 26733113 27028405 27226376
3538B7226376K33663L47986L88815M55888M55311K82719L08521M15174M33913
$$ 27226376 27460039 27808025 28196840 28652728 29108039 29390758 29699279 30114453 30548366
3529C0548366M33515M93836M38882M35375O35009N58875N90596O31785N09318
$$ 30548366 30981881 31475717 31914599 32349974 32984983 33543858 34134454 34766239 35275557
3520C5275557O20918O80584Q22897R08101P39214P55685R73999J067850J038584
$$ 35275557 35896475 36577059 37399956 38308057 39047271 39802956 40776955 41844805 42883389
3511D2883389J161634J075350J346820J410063J372347J474611J564530J710207
$$ 42883389 44045023 45120373 46467193 47877256 49249603 50724214 52288744 53998951
3503E3998951J751630J936515J881840K042905K285722K365413K466877K641999
$$ 53998951 55750581 57687096 59568936 61611841 63897563 66262976 68729853 71371852
3495G1371852K892990K948712L026564L106196L319866L227023L508026L480744
$$ 71371852 74264842 77213554 80240118 83346314 86666180 89893203 93401229 96881973
3487I6881973L370723L314435L305804L168282L131944K823853K646734K348509
$$ 96881973 100252696 103567131 106872935 110041217 113173161 115997014 118643748 120992257
3479A20992257K044139J808490J336715J054217P24938M69508P892m34897n79662
$$ 120992257 123036396 124844886 126181601 127235818 127960756 128430264 128438156 128003259 127423597
3470A27423597q90694j231322j509097j954445k124247k450247k529518k802568
$$ 127423597 126532903 125301581 123792484 121838039 119713792 117263545 114734027 111931459
3462A11931459l127991l222229l424128l373936l504132l460324l505507l356027
$$ 111931459 108803468 105581239 102157111 98783175 95279043 91818719 88313212 84957185
3454H4957185l435231l286915l165122l020443k819739k866498k686599k726654
$$ 84957185 81521954 78235039 75069917 72049474 69229735 66363237 63676638 60949984
3446F0949984k129253k032312k268832k054935j844890j717878j670919j544843
$$ 60949984 58820731 56788419 54519587 52464652 50619762 48901884 47230965 45686122
3438D5686122j403911j509767j335719j151427j190990j141844j085522j090970
$$ 45686122 44282211 42772444 41436725 40285298 39094308 37952464 36866942 35775972
3430C5775972q08869q33954r08246p28905o89553p43149o24705n36472n17404
$$ 35775972 34967103 34133149 33224903 32495998 31806445 31063296 30438591 29902119 29384715
3421B9384715n46448o57979m01714l23967m22985k48110l52908m14244m38806
$$ 29384715 28838267 28180288 27778574 27454607 27031622 26783512 26430604 26016360 25577554
3412B5577554k33206j41654k54562k01237q8354j59073j38291j90516j56202p1707
$$ 25577554 25344348 25202694 24948132 24746895 24658541 24499468 24361177 24170661 24014459 23942752
3402B3942752L2866L4269j08406j4442J83564O9136Q0001Q1002K8303N0354J84647
$$ 23942752 23975618 24009887 23901481 23887039 24070603 24139739 24219740 24300742 24329045 24379399 24564046
3391B4564046J68223J13890N2590N5081M8907O0305L8387P3478K8479j20730q5504
$$ 24564046 24732269 24846159 24898749 24953830 25002737 25063042 25101429 25174907 25203386 25082656 24997152
3380B4997152j89996m6410j55388M847M7629l3459j66231Q3059O5417M7216R1735
$$ 24997152 24807156 24760746 24605358 24610205 24657834 24624375 24458144 24541203 24606620 24653836 24745571
3369B4745571Q2689K07625J48755K25613K23252J62818K66381L04505L21021M27419
$$ 24745571 24828260 25035885 25184640 25410253 25633505 25796323 26062704 26367209 26688230 27115649
3359B7115649L24062M34885M45296N41690N16104M62781N43156N98921N96468
$$ 27115649 27439711 27874596 28319892 28861582 29377686 29840467 30383623 30982544 31579012
3350C1579012P25543O76364J015093R07953J043152J098150Q62455J140638J088335
$$ 31579012 32304555 32980919 33996012 34903965 35947117 37045267 37907722 39048360 40136695
3341D0136695J223926J264356J347999J297104J289277J275299J239846J257478
$$ 40136695 41360621 42624977 43972976 45270080 46559357 47834656 49074502 50331980
3333E0331980J214580J274994J228361J004192Q57238O60575N60729K65241L24297
$$ 50331980 51546560 52821554 54049915 55054107 55911345 56571920 57132649 57397890 57722187
3324E7722187K34379J76631k088p9669j14339j63823j77441k18241l25455l92072
$$ 57722187 57956566 58133197 58131109 58051440 57937101 57773278 57595837 57377596 57052141 56660069
3314E6660069k54092m62143m05220m97891o38702p55759r65483r33618j098571
$$ 56660069 56405977 55943834 55538614 55040723 54402021 53646262 52680779 51747161 50648590
3305E0648590j190060j296501j196023j324291j460839j353629j311766j441520
$$ 50648590 49458530 48162029 46966006 45641715 44180876 42827247 41515481 40073961
3297D0073961j433599j338282j248078j292886j214787j015763j154086q00640
$$ 40073961 38640362 37302080 36054002 34761116 33546329 32530566 31376480 30575840
3289C0575840r30858j009922p90207p98816p02823p33402n26433n52301n20463
$$ 30575840 29644982 28635060 27844853 27046037 26343214 25609812 25083379 24531078 24010615
3280B4010615l98282m55529m48964n08272m42203l36405j85523j86209k20129
$$ 24010615 23612333 23156804 22707840 22199568 21757365 21420960 21235437 21049228 20829099
3271B0829099j87998k03973k72902j34761k40845j58688O8221k12226q1223L0228
$$ 20829099 20641101 20437128 20164226 20029465 19788620 19629932 19698153 19485927 19404704 19434932
3261A9434932L8757O3441Q7046n4739P856K03040r6225m2194k50215p0937J02852
$$ 19434932 19473689 19537130 19624176 19569437 19577293 19780333 19684108 19641914 19391699 19320762 19423614
3250A9423614k56037j52987k81141k00845j07218k23453j61669l29777j59239
$$ 19423614 19167577 19014590 18733449 18532604 18425386 18201933 18040264 17710487 17551248
3241A7551248j97544k65307k87510k96992p1739j23576k92828k12780J6605j53803
$$ 17551248 17353704 17088397 16800887 16503895 16432156 16308580 16015752 15802972 15819577 15665774
3231A5665774j54364j00195m8287m9000o2520M3536j08514j32473M3705R926n2639
$$ 15665774 15511410 15411215 15362928 15313928 15251408 15294944 15186430 15053957 15097662 15107588 15054949
3220A5054949k0223j860R5067J5095O9972P985l1128N6899L5117l2892J52242
$$ 15054949 15034726 15032866 15127933 15143028 15213000 15220985 15189857 15246756 15281873 15248981 15401223
3209A5401223m2144k6057O3061K79727J84483O7985K8748J49036L5950J08989
$$ 15401223 15359079 15333022 15396083 15675810 15860293 15928278 15957026 16106062 16142012 16251001
3199A6251001N8174P0466K05834L0645j643J55761J64285J38182N15N4844J08115
$$ 16251001 16309175 16379641 16585475 16616120 16614477 16770238 16934523 17072705 17073220 17128064 17236179
3188A7236179N1022J31020P4798J55206j6547K38732J48851m5328J78321J88903
$$ 17236179 17287201 17418221 17493019 17648225 17631678 17870410 18019261 17973933 18152254 18341157
3178A8341157P8324J15556J07827K04647J45277J98879J44532J52212N1162J72882
$$ 18341157 18419481 18535037 18642864 18847511 18992788 19191667 19336199 19488411 19539573 19712455
3168A9712455J73474K36643N9904L05770L09127J84517Q5231K00951K51864K31038
$$ 19712455 19885929 20122572 20182476 20488246 20797373 20981890 21067121 21268072 21519936 21750974
3158B1750974K37223K06658K45120K26492K76182L64724K56078L41656L41370
$$ 21750974 21988197 22194855 22439975 22666467 22942649 23307373 23563451 23905107 24246477
3149B4246477M47596N59180L80847L65737M11495L01291L99415N36318M93993
$$ 24246477 24694073 25253253 25634100 25999837 26411332 26712623 27112038 27648356 28142349
3140B8142349M46026M73483N39534P11518O54943M69747Q38327O77732N76463
$$ 28142349 28588375 29061858 29601392 30312910 30967853 31437600 32275927 32953659 33530122
3131C3530122O65005P05867R22213R43388Q83287J045232R03238J032533J105930
$$ 33530122 34195127 34900994 35823207 36766595 37649882 38695114 39598352 40630885 41736815
3122D1736815J184671J312970J324234J462872J483400J451202J638651J805319
$$ 41736815 42921486 44234456 45558690 47021562 48504962 49956164 51594815 53400134
3114E3400134J875439K085717K102044K246801K541015K657731K881551K982384
$$ 53400134 55275573 57361290 59463334 61710135 64251150 66908881 69790432 72772816
3106G2772816L173514L504564L545968L825858M235160M434968M959640N313317
$$ 72772816 75946330 79450894 82996862 86822720 91057880 95492848 100452488 105765805
3098A05765805N734708N942815O605823P065576P596741Q131625Q545959R139707
$$ 105765805 111500513 117443328 124049151 131114727 138711468 146843093 155389052 164528759
3090A64528759R566766R783930J0120381J0155891J0191774R661542Q806927P725172
$$ 164528759 174095525 183879455 193999836 204155727 214347501 224009043 232815970 240541142
3082B40541142O050339M160618J786848p19547l394087n730949p778853r176051
$$ 240541142 246591481 250752099 252538947 251819400 248425313 242694364 234915511 225739460
3074B25739460j0134233j0617547j0463485j0466794r859101r448564r260815
$$ 225739460 215605227 204987680 194524195 184057401 174198300 164749736 155488921
3067A55488921q806508q642318p868171p529369p165911o482762n957428n734280
$$ 155488921 146682413 138040095 130171924 122642555 115476644 108993882 103036454 97302174
3059I7302174n251058m721168m530624m110086l921265l699704l508254l395153
$$ 97302174 92051116 87329948 82799324 78689238 74767973 71068269 67560015 64164862
3051F4164862l234139k977231k885001k642256k474631k410652k351816k273710
$$ 64164862 60930723 57953492 55068491 52426235 49951604 47540952 45189136 42915426
3043D2915426k108946j890016j779052j845795j581520j466458j387480j383102
$$ 42915426 40806480 38916464 37137412 35291617 33710097 32243639 30856159 29473057
3035B9473057j096014j108898j177630j051130j086864r58274p25249q79379p59046
$$ 29473057 28377043 27268145 26090515 25039385 23952521 22994247 22268998 21389619 20630573
3026B0630573p79966o29775o63226o22022o32544n99242m68346n53523m95014
$$ 20630573 19850607 19220832 18557606 17935584 17303040 16703798 16235452 15681929 15186915
3017A5186915n57245l39443k06667m90178n31886l70848l65977l08081m08484
$$ 15186915 14629670 14290227 14083560 13593382 13061496 12690648 12324671 12016590 11608106
3008A1608106k54496k35564m54812k92920j76417l26449l47743j63208k66257
$$ 11608106 11353610 11118046 10663234 10370314 10193897 9867448 9519705 9356497 9090240
2999I090240q2095k39477j43815k06382k13590k07599k95451k13468j99805l0081
$$ 9090240 9008145 8768668 8624853 8418471 8204881 7997282 7701831 7488363 7288558 7258477
2989G258477m9440k28870k38777j07207k86956k44089r5753l5517K0754p6777
$$ 7258477 7209037 6980167 6741390 6634183 6347227 6103138 6007385 5971868 5992622 5915845
2979E915845j97271q6073l16045K15k13611n6622n9029o1404q3431j23773q0029
$$ 5915845 5718574 5632501 5316456 5316671 5103060 5046438 4987409 4926005 4842574 4718801 4638772
2968D638772p1707n7650k32436p1541p4357K7241k5888r6234p3561j32708k03192
$$ 4638772 4567065 4509415 4276979 4205438 4131081 4158322 4132434 4036200 3962639 3829931 3626739
2957C626739n7075O7266J11536j66525k27390n5313r7344j48151K8373k6316m3970
$$ 3626739 3569664 3636930 3748466 3581941 3354551 3299238 3201894 3053743 3082116 3055800 3011830
2946C011830j27025m036l4796o4067o4744k9088o9147L0081P458j46147j37743
$$ 3011830 2884805 2880769 2845973 2781906 2717162 2688074 2618927 2649008 2656466 2510319 2372576
2935B372576p5834P4292l1916o4370j01007M723n1194M7552l8168l8760j89662
$$ 2372576 2296742 2371034 2339118 2274748 2173741 2178464 2127270 2174822 2136654 2097894 1908232
2924A908232n9316j1719m8405m9769P2272J8249o4928o1184p2924m7531J16644
$$ 1908232 1848916 1837197 1788792 1739023 1811295 1829544 1764616 1703432 1630508 1582977 1699621
2913A699621R8747j88666n8685m4269j11701P2387L9562O6234p8272P1716q413
$$ 1699621 1798368 1609702 1551017 1506748 1395047 1467434 1506996 1573230 1494958 1566674 1558261
2902A558261j00910P6759r5720j19970o3777L1707j4658n5951l3293q0627J6484
$$ 1558261 1457351 1534110 1438390 1318420 1254643 1286350 1271692 1215741 1182448 1101821 1118305
2891A118305j48203L2260m093N0567N6571p1415P3808p5264n3845m0646O6627
$$ 1118305 970102 1002362 998269 1048836 1105407 1033992 1107800 1032536 978691 938045 1004672
2880A004672J4522J9927r2570J1884n7561j78755l1334j4130O3258Q4669r58R0280
$$ 1004672 1019194 1039121 946551 958435 900874 722119 690785 676655 739913 824582 823624 913904
2868I13904P7799j4605p6661q8189J9874q3844k0066J38063j2441M2849o0862
$$ 913904 991703 977098 900437 812248 832122 748278 728212 866275 853834 896683 835821
2857H35821M5005q0438r6462J19593L1966k49020K7291L0761L4979O4712j0909
$$ 835821 880826 800388 703926 823519 855485 606465 633756 664517 699496 764208 753299
2846G53299M3397O0911k6107j29993p672j6391P5150n1318p8313J32240o5719
$$ 753299 796696 857607 831500 701507 693835 677444 752594 701276 622963 755203 689484
2835F89484J30426N4362l3617O4484L796o5938L828j8910j16831J02272L4062
$$ 689484 819910 874272 840655 905139 908935 842997 846825 827915 711084 813356 847418
2824H47418L0650l1788k4498Q3623k3786k169K9699j9558r6600J56325J1952P9428
$$ 847418 878068 846280 821782 905405 881619 879450 909149 889591 792991 949316 961268 1040696
2812A040696M6166n294J10932p5763q6695O4786J00101j2334K04786L6598N6652
$$ 1040696 1086862 1081568 1192500 1116737 1030042 1094828 1194929 1182595 1387381 1423979 1480631
2801A480631k038L7831j0469p0967j9115R0003O1145o5521r7501M0633m8390r9929
$$ 1480631 1478593 1516424 1505955 1434988 1415873 1505876 1567021 1501500 1403999 1444632 1396242 1296313
2789A296313J5287N5314m8754j3076j77694q543Q8830j65341r0496o7665n7344
$$ 1296313 1311600 1366914 1318160 1305084 1127390 1118847 1207677 1042336 951840 884175 826831
$$ [...]
##END NTUPLES=NMR SPECTRUM
##END=
