##TITLE=1H_CA-9334-2
 200.13MHz,DMSO-d6,
 8 sc
 
 29.4.2025
##JCAMPDX= 6.0         $$ Bruker NMR JCAMP-DX V2.0
##DATA TYPE= NMR SPECTRUM
##DATA CLASS= NTUPLES
##ORIGIN= UXNMR, Bruker Analytische Messtechnik GmbH
##OWNER= pz
$$ XWIN-NMR		Version 3.5
$$ Tue Apr 29 14:34:15 2025 Russian Standard Time (UT+4h)  she@DPX200
##.OBSERVE FREQUENCY= 200.1313
##.OBSERVE NUCLEUS= ^1H
##.ACQUISITION MODE= SIMULTANEOUS
##.ACQUISITION SCHEME= undefined
##.AVERAGES= 8
##.DIGITISER RES= 18
##SPECTROMETER/DATA SYSTEM= spect
##.PULSE SEQUENCE= zg30
##.SOLVENT NAME= CDCl3
##.SHIFT REFERENCE= (INTERNAL, CDCl3, 0, 15.5254)
##AUDIT TRAIL= $$ (NUMBER, WHEN, WHO, WHERE, WHAT)
$$ ##TITLE= Audit trail, XWIN-NMR		Version 3.5
$$ ##JCAMPDX= 5.01
$$ ##ORIGIN= Bruker BioSpin GmbH
$$ ##OWNER= she
$$ F:/spectra/data/she/nmr/H-C/1/pdata/1/auditp.txt
$$ ##AUDIT TRAIL=  $$ (NUMBER, WHEN, WHO, WHERE, WHAT)
(   1,<2025-04-29 14:32:59.03 +0400>,<she>,<DPX200>,
      <created by zg, POWCHK disabled, PULCHK disabled
       configuration hash MD5:
       00 E9 B6 7A A2 85 ED C7 34 08 36 98 17 FE 4E 26
       data hash MD5: 16K
       F1 3C 5B A9 45 8E E0 2A 7B 5F 2B 24 3A B8 9C B0>)
(   2,<2025-04-29 14:33:03.23 +0400>,<she>,<DPX200>,
      <Start of raw data processing
       efp BC_mod = 2 LB = 0.25 FT_mod = 6 PKNL = 1 PHC0 = -1192.683 PHC1 = 11.79221 SI = 16K 
       data hash MD5: 16K
       7A 3A DE 4B 19 03 6E BE 41 A9 F7 D3 83 61 15 80>)
(   3,<2025-04-29 14:33:36.03 +0400>,<she>,<DPX200>,
      <pk PHC0 = 6.501236 PHC1 = -8.799999 
       data hash MD5: 16K
       A7 A9 92 1A DB 8B 3A A5 CE CE 4D BB 07 3D 2F 98>)
(   4,<2025-04-29 14:33:40.45 +0400>,<she>,<DPX200>,
      <abs ABSG = 5 
       data hash MD5: 16K
       FF 4C F4 D6 74 39 47 50 C6 86 F8 09 DC FD EC A9>)
$$ ##END=
$$ 
$$ hash MD5
$$ BA 28 A2 A1 B0 53 44 6E B6 46 89 2B 64 5E 4B EA
##$RELAX= 
##$RELAX= 
##$RELAX= 
##$RELAX= 
##$RELAX= 
##$RELAX= 
$$ Bruker specific parameters
$$ --------------------------
##$DU= <F:/spectra>
##$EXPNO= 1
##$NAME= <H-C>
##$PROCNO= 1
##$TYPE= <nmr>
##$USER= <she>
##$AMP= (0..31)
100 100 100 100 100 100 100 100 100 100 100 100 100 100 100 100 100 100 
100 100 100 100 100 100 100 100 100 100 100 100 100 100 
##$AQSEQ= 0
##$AQ_mod= 1
##$AUNM= <au_zg>
##$AUTOPOS= <>
##$BF1= 200.13
##$BF2= 200.13
##$BF3= 200.13
##$BF4= 200.13
##$BF5= 200.13
##$BF6= 200.13
##$BF7= 200.13
##$BF8= 200.13
##$BYTORDA= 1
##$CFDGTYP= 0
##$CFRGTYP= 5
##$CHEMSTR= <none>
##$CNST= (0..31)
1 1 145 1 1 1 1 1 1 1 1 1 1 1 1 1 1 1 1 1 1 1 1 1 1 1 1 1 1 1 1 1 
##$CPDPRG= <>
##$CPDPRG1= <>
##$CPDPRG2= <>
##$CPDPRG3= <>
##$CPDPRG4= <mlev>
##$CPDPRG5= <mlev>
##$CPDPRG6= <mlev>
##$CPDPRG7= <mlev>
##$CPDPRG8= <mlev>
##$CPDPRGB= <>
##$CPDPRGT= <>
##$D= (0..31)
0 0.7 0 0 0 0 0 0 0 0 0 0.03 0 0 0 0 0 0 0 0 0 0 0 0 0 0 0 0 0 0 0 0 
##$DATE= 1745922778
##$DBL= (0..7)
120 120 120 120 120 120 120 120 
##$DBP= (0..7)
150 150 150 150 150 150 150 150 
##$DBP07= 0
##$DBPNAM0= <>
##$DBPNAM1= <>
##$DBPNAM2= <>
##$DBPNAM3= <>
##$DBPNAM4= <>
$$ [...]
##$SUBNAM3= <"">
##$SUBNAM4= <"">
##$SUBNAM5= <"">
##$SUBNAM6= <"">
##$SUBNAM7= <"">
##$SUBNAM8= <"">
##$SUBNAM9= <"">
##$SW= 18.0517328524113
##$SWIBOX= (0..15)
0 0 2 0 0 0 0 0 0 0 0 0 0 0 0 0 
##$SW_h= 3612.71676300578
##$TD= 16384
##$TD0= 1
##$TE= 0
##$TE2= 300
##$TE3= 300
##$TEG= 300
##$TL= (0..7)
0 120 120 120 120 120 120 120 
##$TP= (0..7)
150 150 150 150 150 150 150 150 
##$TP07= 0
##$TPNAME0= <>
##$TPNAME1= <>
##$TPNAME2= <>
##$TPNAME3= <>
##$TPNAME4= <>
##$TPNAME5= <>
##$TPNAME6= <>
##$TPNAME7= <>
##$TPOAL= (0..7)
0.5 0.5 0.5 0.5 0.5 0.5 0.5 0.5 
##$TPOFFS= (0..7)
0 0 0 0 0 0 0 0 
##$TUNHIN= 0
##$TUNHOUT= 0
##$TUNXOUT= 0
##$USERA1= <user>
##$USERA2= <user>
##$USERA3= <user>
##$USERA4= <user>
##$USERA5= <user>
##$V9= 5
##$VALIST= <valist>
##$VCLIST= <CCCCCCCCCCCCCCC>
##$VD= 0
##$VDLIST= <DDDDDDDDDDDDDDD>
##$VPLIST= <PPPPPPPPPPPPPPP>
##$VTLIST= <TTTTTTTTTTTTTTT>
##$WBST= 1024
##$WBSW= 4
##$XGAIN= (0..3)
0 0 0 0 
##$XL= 0
##$YL= 0
##$YMAX_a= 371088
##$YMIN_a= -488438
##$ZGOPTNS= <>
##$ZL1= 120
##$ZL2= 120
##$ZL3= 120
##$ZL4= 120
##$ABSF1= 15.53865
##$ABSF2= -2.513202
##$ABSG= 5
##$ABSL= 3
##$ALPHA= 0
##$AQORDER= 0
##$ASSFAC= 0
##$ASSFACI= 0
##$ASSFACX= 0
##$ASSWID= 0
##$AUNMP= <proc_1d>
##$AZFE= 0.1
##$AZFW= 0.1
##$BCFW= 0
##$BC_mod= 2
##$BYTORDP= 0
##$COROFFS= 0
##$CY= -3
##$DATMOD= 1
##$DC= 0
##$DFILT= <>
##$DTYPP= 0
##$F1P= 0
##$F2P= 0
##$FCOR= 1
##$FTSIZE= 16384
##$FT_mod= 6
##$GAMMA= 0
##$GB= 0
##$INTBC= 1
##$INTSCL= 3.241238e-09
##$ISEN= 128
##$LB= 0.25
##$LEV0= 0
##$LPBIN= 0
##$MAXI= 10000
##$MC2= 0
##$MEAN= 0
##$ME_mod= 0
##$MI= 1.114404
##$NCOEF= 0
##$NC_proc= -6
##$NLEV= 6
##$NOISF1= 3.799351
##$NOISF2= 2.8
##$NSP= 0
##$NTH_PI= 0
##$NZP= 0
##$OFFSET= 15.52543
##$PC= 1
##$PHC0= -1186.182
##$PHC1= 2.99221
##$PH_mod= 1
##$PKNL= yes
##$PPARMOD= 0
##$PSCAL= 0
##$PSIGN= 0
##$REVERSE= no
##$SF= 200.129999254167
##$SI= 16384
##$SIGF1= 3
##$SIGF2= 2
##$SINO= 0.751879
##$SIOLD= 32768
##$SREGLST= <19F.Aceton>
##$SSB= 0
##$STSI= 16384
##$STSR= 0
##$SW_p= 3612.71676300578
##$SYMM= 0
##$S_DEV= 0
##$TDeff= 16384
##$TDoff= 0
##$TI= <>
##$TILT= no
##$TM1= 0
##$TM2= 0
##$TOPLEV= 0
##$USERP1= <user>
##$USERP2= <user>
##$USERP3= <user>
##$USERP4= <user>
##$USERP5= <user>
##$WDW= 1
##$XDIM= 16384
##$YMAX_p= 380299990
##$YMIN_p= -444114
$$ End of Bruker specific parameters
$$ ---------------------------------
##NTUPLES= NMR SPECTRUM
##VAR_NAME=  FREQUENCY,     SPECTRUM/REAL,   SPECTRUM/IMAG
##SYMBOL=    X,             R,               I
##VAR_TYPE=  INDEPENDENT,   DEPENDENT,       DEPENDENT
##VAR_FORM=  AFFN,          ASDF,            ASDF
##VAR_DIM=   16384,         16384,           16384
##UNITS=     HZ,            ARBITRARY UNITS, ARBITRARY UNITS
##FACTOR=    0.220516191357247, 1,           1
##FIRST=     3107.10423941435, 0,            0
##LAST=      -505.61252359143, 0,            0
##MIN=       -505.61252359143, -444114,      0
##MAX=       3107.10423941435, 380299990,    0
$$ Real data points
##PAGE= N=1
##DATA TABLE= (X++(R..R)), XYDATA
$$ [...]
8550A34812725m293960n293610n842078o331538o611847o478587o025981n558646
8542H8376478n039960m533612l989823l643043l111000k768759k346278j983677
8534F0960326j827907j533039j296667j162380r71028r10183p81463p97667o58707
8525E1021285o60962n31378n49536n89311l57694o13045o38441n10215o27758
8516D5942945o52710n26142l51840l80440l31872k02209q4921k7358m551M6702
8506D3427604J96123K56958K65025K54271L75328J73829L56365N07505K42581
8497D6055589M49597M98040M02291N12647N74128N13271O68474O82617O37636
8488E0994290N17555O67521P62451O46924Q49203R94256J023239J298595J256697
$$ y = [134812725, 130518765, 125225155, 119383077, 113051539, 106439692, 99961105, 93935124, 88376478, 83336518, 78802906, 74813083, 71170040, 68059040, 65290281, 62944003, 60960326, 59132419, 57599380, 56302713, 55140333, 54169305, 53259122, 52477659, 51679992, 51021285, 50360323, 49828945, 49279409, 48690098, 48332404, 47719359, 47080918, 46570703, 45942945, 45290235, 44764093, 44412253, 44031813, 43699941, 43497732, 43412811, 43385453, 43380902, 43427604, 43623727, 43880685, 44145710, 44399981, 44775309, 44949138, 45305503, 45813008, 46055589, 46505186, 47003226, 47405517, 47918164, 48492292, 49005563, 49674037, 50356654, 50994290, 51511845, 52179366, 52941817, 53588741, 54437944, 55432200, 56455439, 57754034, 59010731]
8479E9010731J555383J715692J802313J819527J752157J807984J896040J708762
8471G3068589J745043J700577J587238J479167J445962J648365J607414J449188
8463H5731543J498918J335003J272823J108434P54754L88288J319l21988o95867
8454I1073227q86363j200221j089534j241259j186600r26739o39729j90929N1447
8445H3763300L77343O35243P86026Q73209R67007J163511J450202J430509J507261
8436I2953611J486323J571972J554717J842763J835432K011207K064550K218518
8428A07539093K162496J809747J938816J628735J416611J067375O15669L70620
8420A18549162K40464K0845L39194M15794O70235J316983J782357K163016K473811
$$ y = [59010731, 60566114, 62281806, 64084119, 65903646, 67655803, 69463787, 71359827, 73068589, 74813632, 76514209, 78101447, 79580614, 81026576, 82674941, 84282355, 85731543, 87230461, 88565464, 89838287, 90946721, 91701475, 92089763, 92091082, 91769094, 91073227, 90186864, 88986643, 87897109, 86655850, 85469250, 84542511, 83902782, 83711853, 83763300, 84140643, 84775886, 85561912, 86435121, 87402128, 88565639, 90015841, 91446350, 92953611, 94439934, 96011906, 97566623, 99409386, 101244818, 103256025, 105320575, 107539093, 109701589, 111511336, 113450152, 115078887, 116495498, 117562873, 118178542, 118549162, 118789626, 118810471, 119149665, 119565459, 120235694, 121552677, 123335034, 125498050, 127971861]
8411A27971861K857494K464196K317391J771435Q67129J53202o02244j354879
8403A36445585j720895k180600k576828k707873k801339k571241k479433k067286
8395A17340090j938209j829426j808049j711021j543174j724679j910145j991059
8387A02884328j905326k124990j945135j843904j665379j384367p62376j40744
8379I1112107o1250N29157J011020J152424J231911J179957P29819L90763l08300
8370I6967608q10292j257629j698058k167077k432152k737360k805253k823614
8362H0236173k965138k675551k334244k284831k224506j893152j880256j833893
8354F2144602j869348j880299j801764j747566j697796j697385j658650j404265
$$ y = [127971861, 130829355, 133293551, 135610942, 137382377, 138249506, 138402708, 137800464, 136445585, 134724690, 132544090, 129967262, 127259389, 124458050, 121886809, 119407376, 117340090, 115401881, 113572455, 111764406, 110053385, 108510211, 106785532, 104875387, 102884328, 100979002, 98854012, 96908877, 95064973, 93399594, 92015227, 91252851, 91112107, 91050857, 91580014, 92591034, 93743458, 94975369, 96155326, 96885145, 97275908, 96967608, 96157316, 94899687, 93201629, 91034552, 88602400, 85865040, 83059787, 80236173, 77271035, 74595484, 72261240, 69976409, 67751903, 65858751, 63978495, 62144602, 60275254, 58394955, 56593191, 54845625, 53147829, 51450444, 49791794, 48387529]
8346D8387529j342928j015709p03222n86586l35472M4474N9289K88047M87236
8337D5282658L35390K53671k09786n40911j033459j346218j472751j637252j688762
8328C7942580j397839j325177j288480j022044p97469p21746o78554o21824l91752
8319B9697695m17057n51199n23416o63111o31454m49623n22587k89937l45228
8310B5304083l72154j85670K5854J19579K39520M37364N10157P51144Q23567Q25478
8300B8478922Q59902O57330N09152J40663n17061q74977r08558j086540j185065
8291B6073768j386178j157938r31276p77333o97332p22380n54680m32428k51942
8282A9162281m47540m40854n21946o63591p43525p12915r04973o55400p51271
$$ y = [48387529, 47044601, 46028892, 45325670, 44739084, 44403612, 44448086, 44507375, 44795422, 45282658, 45618048, 45871719, 45661933, 45121022, 44087563, 42741345, 41268594, 39631342, 37942580, 36544741, 35219564, 33931084, 32909040, 32111571, 31389825, 30711271, 30089447, 29697695, 29280638, 28729439, 28206023, 27542912, 26911458, 26461835, 25939248, 25649311, 25304083, 24931929, 24746259, 24772113, 24891692, 25131212, 25568576, 26078733, 26829877, 27653444, 28478922, 29338824, 29996154, 30505306, 30645969, 30128908, 29253931, 28345373, 27258833, 26073768, 24687590, 23529652, 22598376, 21821043, 21123711, 20401331, 19846651, 19414223, 19162281, 18714741, 18273887, 17751941, 17088350, 16344825, 15631910, 14726937, 14071537, 13320266]
8273A3320266n56881m93454n86417o19618n09158n04465l26996k76215m44807
8264I002255l23456k25931k28311l77105l44648r9320r2232j44728k02425l47158
8254F616941j62151K1613l80901k07002m7414j47037r3349l6069m2798p6611K1131
8243E466353l01207l238K4818k02364j97749K8472n7626o632j13688K4889n5756
8232D606272q1076J7940j23638j2214o6618j0948K7951k0707J22520r4962p8772
8221D285748p3027J5264O7226j05755p8833m1897j09114J25655m9279p3316l6016
8210C926656q6042N3555n1997R3673n9359n6647p6410j8908J15755J06041K4632
8199C970949Q8892P75K24212j77236J15060l6304L29250k20433j040412r192M4759
$$ y = [13320266, 12763385, 12269931, 11683514, 11063896, 10554738, 10050273, 9723277, 9447062, 9002255, 8678799, 8452868, 8224557, 7847452, 7502804, 7403484, 7311252, 7166524, 6964099, 6616941, 6454790, 6476403, 6095502, 5888500, 5841086, 5694049, 5600700, 5564631, 5521833, 5445222, 5466353, 5165146, 5161908, 5186726, 4984362, 4786613, 4815085, 4757459, 4750827, 4637139, 4662028, 4606272, 4525196, 4543136, 4419498, 4407284, 4340666, 4329718, 4357669, 4336962, 4459482, 4364520, 4285748, 4212721, 4227985, 4295211, 4189456, 4110623, 4068726, 3959612, 4085267, 4035988, 3962672, 3926656, 3840614, 3894169, 3842172, 3935845, 3876486, 3819839, 3743429, 3724521, 3840276, 3946317, 3970949, 4059841, 4060616, 4284828, 4107592, 4222652, 4186348, 4515598, 4295165, 3254753, 3245561, 3290320]
8188C290320K11352l6768K6337M9106n2666J2590j1405j07893k7628j3006j1493
8177C328846k1003j91223l3384J6756j23987l1248Q8658K4596j25257O2146m7990
8166B946910j29860J41601j21990K6953q8393J4462j7646o2568N1155L4873o4040
8155B731457j24131Q0433q9198j060j1303o4260L2602n0021j18248p9233N1081
8144B358119r2033m3044N3470K8853k03859r3694K3184Q7134J54245q940q8795
8133B174640r9475j4599m0930J1477q939q3117o7352K0090j16416P905P1252o8160
8121A786376q0032J02545p282L478p4695j84990n8205O9704l1377Q156J02641
8110A636319N9990P448l1000j32983l4530R1962O6374j1431m2359n0814M2887
$$ y = [3290320, 3501672, 3464904, 3491241, 3540347, 3487681, 3500271, 3488866, 3380973, 3353345, 3340339, 3328846, 3307843, 3116620, 3083236, 3099992, 2976005, 2944757, 3033415, 3058011, 2932754, 2994900, 2946910, 2817050, 2958651, 2836661, 2863614, 2775221, 2789683, 2772037, 2709469, 2760624, 2795497, 2731457, 2607326, 2687759, 2598561, 2597501, 2586198, 2521938, 2554540, 2504519, 2386271, 2307038, 2358119, 2266086, 2223042, 2276512, 2305365, 2101506, 2007812, 2030996, 2118130, 2272375, 2263435, 2174640, 2075165, 2060566, 2019636, 2031113, 2022174, 1939057, 1871705, 1891795, 1775379, 1783284, 1854536, 1786376, 1706344, 1808889, 1801607, 1805085, 1730390, 1545400, 1487195, 1556899, 1525522, 1533678, 1636319, 1696309, 1703757, 1672757, 1539774, 1505244, 1597206, 1663580, 1652149, 1609790, 1558976, 1601863]
8099A601863J15512Q9894m2538r8344K7257K5913n8587r7497N444K9842K5289
8088A624048N1672R8885o4790o2767R2494n3441r1711P2671N7886P3113n6562
8077A741498K4992M6717J27236k17901J4284k5822l4116J05285j1673l6659J25004
8066A858845J35265j15765m4794J71571J27131j2655N8535L0717N548R6068J34501
8055B444967l122N2957J29038K65345o2762k11500J55149R7295L7051m414j27406
8044B772598P1915K23368K31648K7729M8548M5414J59504M5559m6285R7240K15979
8033C893217o6867J9387R5787J59001R9868K01353J29332J7780J35589J76472
8023D860919M7367J59157L77293J17728K06744K85390J48398K92161K41514R4912
$$ y = [1601863, 1717375, 1807269, 1764731, 1666387, 1693644, 1719557, 1660970, 1563473, 1568917, 1598759, 1624048, 1675720, 1774605, 1709815, 1647048, 1739542, 1686101, 1594390, 1667061, 1724947, 1798060, 1741498, 1766490, 1813207, 1940443, 1722542, 1736826, 1711004, 1676888, 1782173, 1770500, 1733841, 1858845, 1994110, 1878345, 1833551, 2005122, 2132253, 2119598, 2178133, 2208850, 2214398, 2310466, 2444967, 2441845, 2494802, 2623840, 2889185, 2826423, 2614923, 2770072, 2867367, 2904418, 2900004, 2772598, 2844513, 3067881, 3299529, 3327258, 3375806, 3421220, 3580724, 3626283, 3579998, 3677238, 3893217, 3826350, 3845737, 3941524, 4100525, 4200393, 4401746, 4531078, 4548858, 4684447, 4860919, 4908286, 5067443, 5444736, 5562464, 5769208, 6054598, 6202996, 6495157, 6736671, 6831583]
8013F831583K39576M64380K59457K15480M56173L61758L88694L77471M41117N16516
8003A0552205N05337O25984N80370P07322P34538O52452N96511N03159N25621
7994A5983499L68679L61457K99606K29967J03555j13439n9069k35544k39603k56910
7984A6442198j28265k02445k28328k6523n5357K6597p9843p5782j09005k2121
7974A5541126k6447j98313k38712j6761o5218l4745o5931p064J08064O9787L19727
7963A5385513L18939L02817J70389P6482K90244J50702J03008m2734j26563j76043
7953A6452754j36275l49584l10733l56959k66333m62440m05344k91520l84219
7944A3489347j28902j93846l76091j26263l35815l84164l05957m21855l62905
$$ y = [6831583, 7071159, 7535539, 7794996, 8010476, 8466649, 8828407, 9217101, 9594572, 10035689, 10552205, 11057542, 11683526, 12263896, 12971218, 13705756, 14358208, 14954719, 15457878, 15983499, 16352178, 16713635, 17013241, 17243208, 17346763, 17233324, 17174255, 16938711, 16699108, 16442198, 16313933, 16111488, 15883160, 15856637, 15801280, 15827877, 15748034, 15672252, 15563247, 15541126, 15514679, 15316366, 15077654, 15060893, 14995675, 14960930, 14894999, 14887935, 14995999, 15065786, 15385513, 15704452, 16007269, 16177658, 16254140, 16544384, 16695086, 16798094, 16755360, 16628797, 16452754, 16316479, 15966895, 15656162, 15299203, 15032870, 14570430, 14165086, 13873566, 13489347, 13360445, 13166599, 12790508, 12664245, 12328430, 11944266, 11638309, 11216454, 10853549]
7935A0853549l66394m66341m43325k91476m05159l78229k45551l34797m17519
7926G504758l56286k03876j06638j01322k03832j13877j95282k34722N6765r7592
7916E948096n1478j4467J53785n6688j03888P1291r039p8455M4294P5654P257
7905E986362K30357J55634K92254M02956K45517K17738J72924L59639M25915L73589
7895H862885L12137J05396Q0034J12298j51785L5775j60523k96848n4716m319
7885H840334j86925p7542J26280j24942J9231N2266Q5119J36561J516J7871j83374
7874H706395k01552o7418k46648k84953p9018r0452j21301q7435k48849j26422
7864G152347K2574K9243J29188P4703J76012J59353K80422L72286Q4237P9761
$$ y = [10853549, 10487155, 10020814, 9577489, 9286013, 8880854, 8502625, 8257074, 7922277, 7504758, 7148472, 6944596, 6837958, 6736636, 6532804, 6418927, 6223645, 5988923, 6045688, 5948096, 5896618, 5882151, 6035936, 5979248, 5875360, 5946651, 5937612, 5859157, 5903451, 5979105, 5986362, 6216719, 6372353, 6664607, 7067563, 7313080, 7530818, 7703742, 8063381, 8489296, 8862885, 9175022, 9280418, 9360452, 9472750, 9320965, 9356740, 9196217, 8899369, 8844653, 8840334, 8653409, 8575867, 8702147, 8577205, 8596436, 8648702, 8733821, 8870382, 8871898, 8889769, 8706395, 8504843, 8437425, 8190777, 7905824, 7826806, 7736354, 7615053, 7527618, 7278769, 7152347, 7174921, 7204164, 7333352, 7408055, 7584067, 7743420, 8023842, 8396128, 8480365, 8560126]
7854H560126L0709l3047O3788j76754j98529j09156j26707j20249j84663k30824
7844G474694j66538q6528j3197n5112p8107n3232p7087j64932j75299j46215k12121
7833F246326k17532l22746l17040l79594k48033j10097k65347k72523j81630j95193
7823C736591j93376j76949k29517j81635q6078j0392j38676j24299j65506r6020
7813B334143J3049k1660o4121j43208j25252o9978N9366l18629j84697J86496
7803A665509j40442m7882k9759m5231o9844n4511k4670r2944J6759q1960p897
7792A087128R0578l0598l3370j54754l3615J00925J0971j01394N3425m6127L1465
7781I74634l9826j35000l7393o782M0282j0261K4995L0367j10422O599J45261
$$ y = [8560126, 8590835, 8557788, 8621576, 8444822, 8246293, 8137137, 8010430, 7890181, 7705518, 7474694, 7308156, 7221628, 7208431, 7153319, 7075212, 7021980, 6944893, 6779961, 6604662, 6458447, 6246326, 6028794, 5706048, 5389008, 5009414, 4761381, 4651284, 4385937, 4113414, 3931784, 3736591, 3543215, 3366266, 3136749, 2955114, 2869036, 2858644, 2719968, 2595669, 2430163, 2334143, 2347192, 2325532, 2261411, 2118203, 1992951, 1922973, 1982339, 1663710, 1479013, 1665509, 1525067, 1477185, 1447426, 1402195, 1332351, 1277840, 1253170, 1160226, 1176985, 1095025, 1087128, 1177706, 1147108, 1113738, 958984, 925369, 1026294, 1037265, 935871, 989296, 943169, 974634, 934808, 799808, 762415, 755633, 795915, 785654, 810649, 841016, 730594, 737193, 882454]
7770H82454J1707j63384n006N684K8993J26047j50948r8542K3375k4167j81270
7759D54943L924M6936k5300l1343M8920M5981K6606j66525q6082P1323k619n1298
7747C35466l5960n418l2943J18565j86073N749J81968o049J16876j43816k5321
7736C23044J8381j63687q4600J52609N1605R7175l9434J9210j14841K8801j2523
7725B75740K7781J6630l6968K9950k2382l3223k4554l8146M5973j6970l4267J8620
7713B08184k4183N7595r1266J23443J00688o5153J4634j05186m274k5898M6750
7702B35334O9768j07280K7079N3795M541L960o8060j28392k2369P0992R1609M3762
7690B74739j37217n2044J77952R5637L902M5800k8857p1943l3088M2683L7235
$$ y = [882454, 894161, 730777, 725771, 731455, 760448, 886495, 735547, 637005, 660380, 636213, 454943, 458867, 505803, 480503, 449160, 498080, 544061, 570667, 404142, 318060, 389383, 386764, 335466, 299506, 294088, 261145, 379710, 193637, 199386, 381354, 375305, 492181, 348365, 323044, 341425, 177738, 93138, 245747, 297352, 394527, 355093, 374303, 259462, 288263, 275740, 303521, 320151, 283183, 313133, 290751, 257528, 232974, 194828, 240801, 223831, 189564, 208184, 184001, 241596, 150330, 273773, 374461, 309308, 323942, 218756, 214482, 188584, 235334, 305102, 197822, 224901, 278696, 283237, 287197, 219137, 90745, 68376, 139368, 230977, 274739, 137522, 85478, 263430, 359067, 362969, 408769, 379912, 307969, 274881, 317564, 354799]
7679C54799N5122j58409J9843M9037L3812l0411m7890L1934m0300L3805L7729
7668C39071P465m1497J7493j25572J04481Q8540J07531o7422j36485k8810N608
7657B70403M1729M5510j42751p2787J27779Q9941r4559k17421n8029K22683J263
7646B13761k2745N6827O1370j7502n8881n7968J90297J5891K3913q7346m7887
7635B69730j9462R7275k4359J30593r2926n53k2385j50580P9841L7427L0674r8537
7623B36738j40423L6717J62638L7418q045q6045l2025k3250Q6857M5520O4730
7612C80830P8467j81267j47877K45768n7945l6359o945P912O9683Q842r423q04
7600C50882J08000j5336q8173K0744M2758P5412J8848R6914O8688r4184J4968
$$ y = [354799, 409921, 251512, 271355, 320392, 354204, 323793, 275903, 307837, 267537, 301342, 339071, 346536, 305039, 322532, 196960, 301441, 389981, 497512, 430090, 293605, 264795, 270403, 312132, 357642, 214891, 142104, 269883, 359824, 265265, 47844, -10185, 212498, 213761, 191016, 247843, 309213, 291711, 232830, 174862, 365159, 381050, 404963, 317617, 269730, 250268, 347543, 323184, 453777, 360851, 360298, 337913, 187333, 267174, 304601, 335275, 236738, 96315, 133032, 295670, 333088, 325043, 238998, 206973, 183723, 270580, 316100, 380830, 459297, 278030, 130153, 375921, 317976, 281617, 274672, 282584, 352267, 361109, 351686, 350882, 458882, 443546, 355373, 376117, 418875, 494287, 513135, 610049, 678737, 584553, 599521]
7589E99521K212J1292Q8579m6613j16225k3259N4300O3350M6156k5834J2046k4317
7577F41208J9925R2290O3511K7921J03586M5992J68286m9352q4663R5952J45385
7566A270041O1838J70614p7719N0908K40950J58710N540K03727K03431J56801
7556B444841J09979J56000K88232J66603L24967J05700K70326M21217K41548K97258
7546D826671M89400M55215M51244N18196N42284O10272P38036R57913J016520
7537A0605751J083003J210170J644932J931770J790862J183786M43670j27019
7529A9766925o01320j278802j835475j475108j379766j301047j135061j084425
7521I675921r48100r87716q28994o23805p23779n63345m60633l80018j97078l75827
$$ y = [599521, 601733, 613025, 701604, 654991, 538766, 515507, 569807, 633157, 679313, 653479, 665525, 641208, 661133, 753423, 816934, 844855, 948441, 994433, 1162719, 1113367, 1028704, 1124656, 1270041, 1331879, 1502493, 1424774, 1475682, 1716632, 1875342, 1880882, 2084609, 2288040, 2444841, 2554820, 2710820, 2999052, 3165655, 3490622, 3596322, 3866648, 4287865, 4529413, 4826671, 5316071, 5771286, 6222530, 6740726, 7283010, 7893282, 8631318, 9589231, 10605751, 11688754, 12898924, 14543856, 16475626, 18266488, 19450274, 19893944, 19766925, 19165605, 17886803, 16051328, 14576220, 13196454, 11895407, 10760346, 9675921, 8727821, 7740105, 6911111, 6287306, 5563527, 5000182, 4539549, 4159531, 3962453, 3586626]
7511C586626l69403m3956j41234k63181j55106k29206n7135j74002p5895j33886
7501A943622j63678j78131p2767J33187j87465q3541N5423l1688m4468j88321
7491A182173r5481l788j29908o2496r0180O2586m0527n9414p9267j3737M384L6118
7479G10463k9584j68316q6731k602o9976m5237K2427M8625p824N9687l6371j02453
7467B92108r417q691K4052J22855k0506r9608O0923j3104p5346K41j35658j8798
7455A19051m4220o2872P2120L5333p2379J35085l7037r012l385l9462n2193J34058
7443A75087J23272j72980m9338j2605Q6527p3693q7332k4193O1666M0185P7073
7432A43669j9644l9144q4975p960L320Q0466n036L1462n917J2871K1773k10012
$$ y = [3586626, 3217223, 3173267, 3032033, 2768852, 2613746, 2384540, 2327405, 2153403, 2077508, 1943622, 1779944, 1601813, 1529046, 1662233, 1474768, 1391227, 1446650, 1414962, 1370494, 1182173, 1086692, 1082904, 952996, 890500, 800320, 862906, 822379, 762965, 683698, 669961, 674345, 710463, 680879, 512563, 425832, 423230, 353254, 308017, 330444, 379069, 371245, 430932, 394561, 292108, 282691, 274000, 298052, 420907, 400401, 300793, 361716, 348612, 273266, 273507, 137849, 119051, 74831, 11959, 84079, 119412, 47033, 182118, 145081, 136069, 132684, 93222, 41029, 175087, 298359, 125379, 76041, 63436, 149963, 76270, -11062, -35255, 26411, 66596, 143669, 124025, 84881, -94, -8054, -4734, 75732, 70696, 102158, 96241, 109112, 130885, -79127]
7420g9127L8980J35368k3404o8692p9172m681P4721J55663j42093n2932N4114
7409H745N6901n1624r8874K8776j10767n3982L4848P2069R042J83512O0448j09965
7397B9129n9082j0966k1218m0235P7216l7024p7269j3067P3684j15083J5770P2985
7385a05160J1330o8178r378O9848N0211R994r1102k7568O1929J16367m770j09324
7373i5801r8095L5577J6525O2569J9960n462J47261L6955m7517qp2655j27704
7361a28395N9522J1139j68231J35940o782n8462Q5895n0719j48812J25118N2049
7350i1738o3937m4109P856R8296K9210M6147P5513q4431L8918o5241j90150j0939
7338b54605J0712R7055k5409K7249P8309m3383R3463j32553n9733q2880n223J7196
$$ y = [-79127, -40147, 95221, 71817, 3125, -76047, -80728, -6007, 149656, 7563, -45369, 8745, 65646, 14022, -84852, -56076, -166843, -220825, -185977, -113908, -104866, 78646, 139094, 29129, -29953, -40919, -62137, -102372, -25156, -62180, -139449, -152516, -78832, -193915, -178145, -105160, -93830, -162008, -171386, -101538, -51327, -41333, -132435, -160003, -98074, 18293, 13523, -95801, -193896, -158319, -141794, -79225, -59265, -64727, 82534, 119489, 71972, 71964, -691, -128395, -68873, -57734, -225965, -90025, -96807, -155269, -69374, -120093, -268905, -143787, -91738, -155675, -199784, -191928, -93632, -64422, -18275, 57238, -27193, 11725, -53516, -243666, -254605, -243893, -146838, -172247, -144998, -66689, -110072, -16609, -149162, -208895, -291775, -296998, -279802]
7326b79802L8956L9844j758o515k2593L6555r3541N3475O6334k5471j3005Q6702
7314a20819j2665m2584r5753k7505q9935n4853K39101N6228n2088o3966m4217
7303c09056J11441n7445m8859J08787P2598n3416J12096k6483N454o273J1664
7292g9492N3294j01358o0621m1212M0242Q3696j09700k235J19584p1435k3469
7281a92706K3151J26219j1067p2403o1450j1714N6733j4681P5743j45778j20738
7270c48691M5388J01455m4932j01108k7727J44505k597P2039K1540O2048o8822
7259a46902J5449J8761m986L4029n8677j8896k6902J08693m1473q0501L3641R2666
7247g5098q7826j17325J6778R6226N2972j0016p790k6869O8780R956j31137P522
$$ y = [-279802, -240846, -201002, -202760, -209275, -231868, -195313, -288854, -235379, -169045, -194516, -207521, -120819, -133484, -176068, -271821, -299326, -389261, -444114, -205013, -148785, -200873, -264839, -309056, -197615, -255060, -303919, -195132, -122534, -175950, -63854, -90337, -84883, -91156, -79492, -26198, -127556, -188177, -229389, -189147, -105451, -215151, -217386, -97802, -169237, -192706, -169555, -43336, -54403, -126806, -188256, -199970, -143237, -157918, -82175, -227953, -348691, -303303, -201848, -246780, -347888, -375615, -231110, -233707, -161668, -140128, -78080, -146902, -131453, -112692, -117678, -83649, -142326, -161222, -188124, -79431, -120904, -201405, -167764, -75098, -162924, -280249, -263471, -167245, -114273, -124289, -132079, -158948, -90168, -80212, -211349, -203827]
7235b03827m6018J8030j4888M0632J26140l3938j5917j3450j37970J4351j0050
7224b76905n1599o0342J27492K1537L268R0191O9951j469M2629j79135n4675m7835
7212c16892Q7580k3776n2003L9315M9541J73409m3113j42037J9906J16927j12692
7201b03835k7234L1647r998Q701K665m309P8133r7171j17774o9236M2131Q3123
7189b83157K8340L8452L3663K0563j55348j5871R9566l0843m2585K352J41023
7178a63845N4473n0479r2012r322J4861N8546M8131L5842P228k6074L437r7572
7166b16786n7711J14050j4233j4966N6158K7420j53174Q6120J78314N4419k70938
7155b11327j04330J45589J03308j24798m2151M3315n5088Q7324J0222j21796O9509
$$ y = [-203827, -249845, -231815, -246703, -206071, -79931, -113869, -129786, -143236, -281206, -266855, -276905, -328504, -388846, -261354, -239817, -236549, -146358, -76407, -77876, -35247, -214382, -269057, -316892, -229312, -253088, -305091, -265776, -216235, -42826, -85939, -227976, -208070, -91143, -203835, -231069, -199422, -209420, -200719, -198054, -202363, -124230, -221401, -339175, -408411, -366280, -283157, -254817, -216365, -182702, -162139, -317487, -333358, -233792, -264635, -307220, -304868, -163845, -109372, -159851, -251863, -261185, -246324, -187778, -139647, -103805, -96577, -122651, -119214, -216786, -274497, -160447, -174680, -189646, -133488, -106068, -259242, -173122, 5192, 59611, -211327, -315657, -170068, -66760, -191558, -233709, -190394, -245482, -158158, -147936, -269732, -200223]
7144b00223k701r6146k9285R1032J12130J29557N08j31532N3434q3984p8337l8195
7132b73742J39784N704j01238j3088J14195m8807O9859P2992N9974j13068j5827
7121a03262n7609J09552M679J5832J1459r1536l3090l477Q2365K0073Q0563j9999
7109A5550j12459o391l7357q9149n5900K7343K0594N3420R6259M2330j00009m5195
7097a90964J6980J8602J7523Q3538j07782O3552M3311j13624o3637m7509j20735
7086d00745R2737J53390n3160j550J09996M2647k5100j3888j07368k0833q3772
7075c07646J70865l3512P078n0116J03886j5430p6065O2289Q8503j46796R7361
7064i9583j56517J6337m6868j28000O1317N6299J57219n6916L7763m3217r9878
$$ y = [-200223, -202924, -299070, -328355, -237323, -125193, 4364, 4872, -126660, -73226, -157210, -235547, -273742, -133958, -128254, -229492, -242580, -128385, -177192, -107333, -34341, 25633, -87435, -103262, -160871, -51319, -46640, -30808, -19349, -110885, -143975, -147452, -65087, -45014, 35549, 15550, -96909, -103300, -140657, -229806, -285706, -258363, -237769, -184349, -88090, -45760, -145769, -190964, -173984, -155382, -137859, -54321, -162103, -98551, -55240, -168864, -232501, -280010, -400745, -308008, -154618, -207778, -209328, -99332, -56685, -81785, -95673, -203041, -223874, -307646, -136781, -170293, -163215, -213331, -109445, -124875, -200940, -138651, -50148, -196944, -99583, -256100, -239763, -286631, -414631, -353314, -297015, -139796, -196712, -158949, -202166, -302044]
7053c02044N5877P1330L7053L6357o8022M3275M3704m9541m8352m3031J55591
7042f7803K3936q7488j21837j399K6828m6912n4628J572p251Q1237L8251K0224
7030a95270j0444R349M3417K2096m4780j733n1407N2541r799p7822m7246j1063
7018c22161J50552j1187N33M2775M9886k2885J56610k1994L7939K3456j54649
7007g1125j05766Q1088p25m5364R60O4818j03476M8569q1057n6186P2978L0860
6995a64426M0799j28306p6108K03413m2395k2596o8755k9873k7235J5970M6039
6984b53473O1053N8103K4438l6038r4734Q7554j39728M0232n40L5978N4083j26834
6972b89906R6859P0481l1777p1104j7885l894P9099P2872m4994n6365J642J9243
$$ y = [-302044, -246167, -174837, -137784, -101427, -169449, -126174, -82470, -132011, -180363, -223394, -67803, -43867, -131355, -253192, -254591, -227763, -274675, -329303, -327731, -334982, -253745, -215494, -195270, -205714, -196365, -152948, -130852, -175632, -177365, -228772, -176231, -186030, -263852, -311098, -322161, -171609, -182796, -182263, -139488, -89602, -112487, 44123, 22129, 60068, 83524, -71125, -176891, -95803, -96528, -141892, -140932, -76114, -179590, -131021, -212078, -268264, -195286, -164426, -123627, -251933, -328041, -124628, -167023, -189619, -258374, -288247, -315482, -299512, -253473, -192420, -134317, -109879, -145917, -240651, -153097, -292825, -252593, -253133, -217155, -163072, -289906, -193047, -122566, -154343, -225447, -243332, -247226, -168127, -95255, -140249, -196614, -194972, -175729]
6960a75729o9981J20779J1187p5065M614P4629j41054j0594Q9950L9168N3167
6949g8929r9510O5918L5100m7949r9020M0119N0818j25514j8091p9991J49245
6938b07804P0281j63194P041r866J59090n6882j22296O1417M7854k9955L7824
6927b06490r8167J35309P2579p3816j5237l6039O225o135J38884M1730j3463n3265
6915a07885P5237j82450j9602J17747J833m279m9578j024N4385N292M529j29384
6903b35179q476Q5123l272l3137J09125L0113m0211J59j05557M5939M1597M2220
6891g1556r1120r95p6030M4114J29148m9032N2853p2326M1325M9556r9069l0589
6879a73721P6944J1027j56273L2968J39373r1261o232n3001J7607L6509j14416
$$ y = [-175729, -245710, -124931, -113744, -188809, -184195, -109566, -250620, -261214, -171264, -132096, -78929, -178439, -112521, -77421, -125370, -224390, -184271, -133453, -258967, -277058, -357049, -207804, -137523, -300717, -293676, -303542, -144452, -201334, -323630, -262213, -214359, -244314, -206490, -304657, -169348, -96769, -170585, -185822, -221861, -215636, -221771, -82887, -41157, -54620, -107885, -32648, -215098, -234700, -116953, -115120, -119399, -168977, -170001, -115616, -110324, -105795, -235179, -243655, -158532, -161804, -194941, -85816, -55703, -95914, -95755, -201312, -155373, -113776, -71556, -162676, -163671, -239701, -195587, -66439, -115471, -62618, -134944, -93619, -44063, -143132, -173721, -96777, -85750, -242023, -209055, -69682, -160943, -167175, -220176, -202569, -166060, -280476]
6868b80476J7197J35527J19953j42972m4013O5795N6030k3115o7629j2385j04753
6857b80841p8599R9612n2114j00518M3633J21852J24232J5809J5142l9365l2318
6846a63475j05089k5153M7502L3124J2789P9537o2769J9518p1979n8639J74726
6835a19908L6633Q3251J174k1501j02001n4264l4325j1410P8225P324j3416Q1352
6823f8866M6273j23617O4310O0604j19932j20601R0261k8693j1065R5677k2108
6812a37757n0557R4542l5260p2216J05073k7856R20n6265P2496P0550m6128p8926
6800a61384p5770J38554O1935j32574j16336J02567J07960N3434j0687J1976q149
6789b8474j63297l7242Q7791N4499Q328J8610l4687M6361l2787J8914J9k5951
$$ y = [-280476, -263279, -127752, -7799, -150771, -194784, -128989, -72959, -96074, -163703, -176088, -280841, -359440, -259828, -311942, -412460, -368827, -246975, -122743, -106934, -91792, -131157, -163475, -268564, -293717, -246215, -213091, -200302, -120765, -183534, -164016, -235995, -294634, -119908, -83275, -24, 1150, -20351, -122352, -176616, -210941, -222351, -144126, -136802, -150218, -68866, -22593, -146210, -81900, -21296, -141228, -261829, -171568, -200261, -211326, -115649, -137757, -188314, -93772, -129032, -201248, -96175, -124031, -123111, -179376, -106880, -36330, -82458, -161384, -237154, -98600, -36665, -169239, -285575, -183008, -75048, -21614, -32301, -20325, -28474, -191771, -229013, -141222, -86723, -78395, -59785, -94472, -48111, -80898, -61984, -61965, -87916]
6777h7916Q7970r3450j18087R3885L9116o5886o5808n0446j080Q030P4066k5892
6765b05498o190r20J02682q0171l1116M2888R5409p5761q8042O8232Q348P3206
6753i6933J24713Q705k63062Q831R7021j834m2368L9861o3787Q7276J4593o5360
6741a52344p1838j0130K7759J17516j3602j66637M5528R3090l3646K6701o9992
6730b07595J17977K5712K2647m8857r0739N0668k4453n4145n7401J21502m028
6719a48712j79904J64659J37867j05756l6231K6175J1513o2616q7155J62278N2840
6708f5042r8428L121K4642Q802L4446J0911n3433K3323o1503p564N7780K6662
6696i6283O8478l9820n8652n7411K9844M7404o9840J43703l2984r259n3518J0310
$$ y = [-87916, 54, -93396, -211483, -117598, -78482, -144368, -210176, -260622, -261702, -253672, -179606, -205498, -211688, -212608, -109926, -190097, -221213, -178325, -82916, -158677, -246719, -178487, -170139, -96933, 27780, 36485, -226577, -217746, -120725, -122559, -164927, -125066, -188853, -101577, -86984, -152344, -224182, -234312, -206553, -89037, -102639, -269276, -223748, -130658, -164304, -137603, -207595, -89618, -63906, -41259, -90116, -180855, -130187, -154640, -208785, -266186, -144684, -148712, -328616, -163957, -26090, -131846, -168077, -141902, -130389, -193005, -280160, -117882, -65042, -163470, -160349, -135707, -126905, -92459, -81548, -134981, -111658, -173161, -180725, -122945, -96283, -27805, -67625, -126277, -183688, -153844, -106440, -176280, -32577, -65561, -74820, -128338, -118028]
6684a18028k2685L3136L4982k8855o3978M5704j5753P5162L9158j98718O1512
6673a58363j9107O677R3262P4297n965p1174M1494n6942K4990l6632n744j14533
6661b27740O9173P2764K3608m1243J8365n1888K2731K6658M870j9840o3345J5986
6649a49901m2332K5987J52769k6895l3246M9973q1152k6215J3373l9510o062Q5454
6637g7757J8207J44713j07681n7176m0988j8696j0504Q3112N8380j9979J11651
6626H3282M5270j75136n8104m3562k013R1669j83245J9283N3418J9035O6943R61
6614h2199o0972R6903j0426q5174P3480l1656K8074k2434l8089j31628J78206
6603h5915N1244P913j28696l3841J578P4011L7926K8453J49103M3085j60887j43668
$$ y = [-118028, -140713, -107577, -72595, -101450, -165428, -119724, -135477, -60315, -21157, -219875, -158363, -177470, -170793, -77531, -3234, -9199, -80373, -38879, -95821, -70831, -107463, -113207, -227740, -158567, -85803, -62195, -103438, -85073, -136961, -114230, -87572, -82702, -102542, -165887, -149901, -192233, -166246, -13477, -40372, -73618, -23645, -104797, -131012, -117639, -157149, -163211, -77757, -59550, 85163, -22518, -79694, -120682, -139378, -149882, -66770, -8390, -28369, 83282, 128552, -46584, -104688, -148250, -150263, -58594, -241839, -222556, -169138, -150103, -83160, -82199, -143171, -46268, -56694, -141868, -68388, -100044, -71970, -94404, -132493, -264121, -85915, -34671, -26758, -155454, -189295, -187717, -113706, -75780, -47327, 101776, 144861, -16026, -159694]
6591a59694m455j39863K43344J10408m8430o2253K238r6461r9466J55775K8487
6580g0370j9725R3197L9951j46018j9371N2378L3401p993k4166R1380R461n4710
6568b2585L7856j03611N3772m6753n5175k5772j22804P9522k6451J23310J22997
6557A4306K160o6367l9514L9107l2810n1879r527K5409N5345R4957p4973m9317
6545i3103p1862p266J29694l1302P8047K8859o2431n1933J85484j45818P5826
6534C4195q8156j13944K1756J34473n5112j20658Q3490j7035p0525Q8708l9198
6523a42006r3152R9565o8415J94554J46874J2642j28002l1138L2496J4461q1994
6512d4115k8626O5163M8979o5059l1200J41384k8190l6181l5251n6241R1238M1060
$$ y = [-159694, -164149, -304012, -60668, 49740, 1310, -60943, -58705, -155166, -254632, -98857, -70370, -90095, 3102, 43053, -102965, -122336, -69958, -36557, -44550, -68716, 22664, 32125, -22585, 15271, -88340, -34568, -81321, -136496, -162268, -285072, -205550, -232001, -108691, 14306, 16466, -49901, -89415, -50308, -83118, -134997, -144524, -119115, -63770, 31187, -43786, -93103, -164965, -172231, -42537, -73839, 4208, 33067, -29364, -81297, 104187, -41631, 34195, -53961, -167905, -146149, -11676, -66788, -187446, -103956, -120991, -191516, -102808, -142006, -235158, -135593, -204008, -9454, 137420, 150062, 22060, -9078, 23418, 37879, -44115, -72741, -7578, 41401, -23658, -54858, 86526, 58336, 22155, -13096, -69337, 21901, 62961]
6500F2961p8001j03945j1845J2398J50919J05182m9155q0384M310k6273m2880
6489e6713l0748n6866l267M5631o2684P1840j45213L5288J47237N5235K2016j56687
6477a34931L7285n1583P7948O0917J9935M6207p7615p2642Q0362N8208p8561J56944
6465A22474r1517l8113q1609P6851P8646l2144L6850P1766n518k4715l6405O2248
6453A38814P214L6869l5883j63820k4546R0635L4437R1417J08580j33722q4268
6442F5727O9424q4884j33195P3592P6179q2140M9225J01506j33939l91l1682Q2664
6430E2086j50321J93746k0997j8931o7795Q8309M5493K5769n6413L8252r0725
6419C8473k4283K04487n9931j1612o669J12096l9451n3289p3171o6301K591k1356
$$ y = [62961, -15040, -118985, -130830, -118432, 32487, 137669, 88514, 8130, 12440, -13833, -56713, -87461, -144327, -147594, -101963, -164647, -92807, -238020, -202732, -55495, -260, 21756, -134931, -97646, -149229, -71281, -10364, 9571, 55778, -21837, -94479, -14117, 44091, -34470, 122474, 30957, -7156, -88765, -11914, 66732, 34588, 71438, 143204, 137686, 112971, 76566, 138814, 146028, 182897, 147014, -16806, -41352, 49283, 83720, 175137, 283717, 149995, 65727, 135151, 50267, -82928, -9336, 66843, -15297, 33928, 135434, 1495, 1104, -30578, 52086, -98235, 95511, 74514, 55583, -12212, 76097, 121590, 147359, 90946, 129198, 38473, 14190, 218677, 158746, 147134, 140465, 252561, 213110, 159821, 86650, 20349, 22940, 1584]
6407A584k667J56234K9062l4586j05669l99P4111j45596o447J00674o6578J46910
6395A46633m0595j04563n666K5301K8557N4000r5486l0990P616L093N0545O601
6383D5046o0723k3390L7347J3329R9915j03833K2619j770L1500k5617M0363p3768
6371A018j9987n698j23832L5684J82182J6232j32396O5296m301l5947J0558j05988
6359a17179N9969J708O1629K18666M586j39214p2910l6767n633P248o4715N2781
6347b9831j1727j161J07609J3982k6555j01696J22539R4911l5876k1260N0228
6336A61163N8218n14q4357j53706M6498K7990N0311L559k2598j711m7596n510
6324C1747P8236q700L6832j41732k7158M5750q048Q6429L1053j33476J7769M6655
$$ y = [1584, -1083, 155151, 184213, 149627, 43958, 43559, 117670, -27926, -34373, 66301, -277, 146633, 106038, 1475, -4191, 21110, 49667, 103667, 8181, -22809, -15193, -12100, 38445, 45046, -15677, -39067, -1720, 11609, 111524, 7691, 30310, 28540, 60040, 34423, 74786, 1018, -18969, -24667, -148499, -112815, 69367, 85599, -46797, 18499, 14198, -21749, -11191, -117179, -57210, -55502, 6127, 224793, 229379, 90165, 17255, -19512, -25145, -17897, -82612, -29831, -41558, -42719, 64890, 78872, 52317, -49379, 73160, 168071, 132195, 110935, 161163, 219381, 218867, 134510, -19196, 27302, 55292, 105603, 109162, 86564, 84853, 37257, 31747, 109983, 101283, 138115, -3617, -30775, 14975, 6927, 93356, 124409, -9067, 8702, 55357]
6312E5357P3735n3764O2791j30857P789N4731j69678K53376J4008j5464j01714
6301E0310j33888P9340P0640q532o9778J33740p4230n1756l789R8222N2938n1417
6289I1800J3334R6166Q154o1420q3425j5488r097O5004J09165j31523p2088j5158
6277d576J1405m6044N7587j11095L4083J74619n4388p139n9107o6194L5610j6517
6265e1756P8812M1544K970n365M604M6741J1245L0514k6663m7484K027O1615m6910
6252A01894O569p7617J90896R3690m4565r8838m3606r4805q8132J61027l5986
6241G0527M618o2325O9476L2726j8222n8827k2773M5230M4866l0658K1925J1869
6229A08432J43185k7871M7882j13646n0912L5966J02M1682K9023P9023j9762k9711
$$ y = [55357, 129092, 75328, 138119, 7262, 15051, 69782, -99896, 153480, 167488, 152024, 50310, -83578, -4238, 66402, 57870, -11908, 121832, 47602, -4154, -7943, 90279, 143217, 91800, 105134, 201300, 209454, 148034, 64609, 49121, 40024, 105028, 214193, 82670, 10582, -4576, 6829, -39215, 18372, -92723, -58640, 115979, 61591, 54452, -4655, -70849, -35239, -51756, 27056, 68600, 71570, 66205, 70809, 117550, 128795, 159309, 132646, 85162, 87189, 148804, 101894, 108463, 30846, 221742, 315432, 270867, 172029, 128423, 33618, -54514, 106513, 70527, 75145, 12820, 82296, 115022, 96800, 37973, 15200, 60430, 105296, 74638, 96563, 108432, 251617, 223746, 271628, 157982, 107070, 143036, 143138, 184820, 213843, 292866, 273104, 243393]
6217B43393j08593M1484J12705P5026j76805m15Q3349q4470j45996n7712O801
6206a1233J00198N4120k8822P6725O4874j83267n8196Q2130r2179R1706O5607
6195A61663J2881n0625J65233M6061n4052k03859n0770R2347J02161q6085l8054
6184I6901J92341J15313j83072j75407O1549P7970j46092Q658R8367J4472q695
6173A52305r5509M9185J41057k2339j79348N1803l6992K3812J15238K615o6091
6162A35736l4828J8065K7083j08826J203N4425R7316m8695k3290K8716O5385J19116
6150C31406p3755l8744J21800J0215m9545m808q7918j6950k5867j05855J36652
6139A96631O246K9541L008M43k4039M2420K5772m6519r4866j197o2620m5722O4164
$$ y = [243393, 134800, 176284, 288989, 364015, 187210, 186795, 270144, 185674, 39678, -18034, -11233, 88965, 143085, 114263, 190988, 255862, 72595, 14399, 96529, 4350, 96056, 161663, 174544, 123919, 289152, 335213, 281161, 77302, 26532, 118879, 221040, 134955, 96901, 289242, 404555, 221483, 46076, 107625, 185595, 39503, 48161, 146528, 161000, 152305, 56796, 105981, 247038, 224699, 45351, 97154, 60162, 83974, 199212, 201827, 135736, 100908, 118973, 146056, 37230, 38433, 92858, 190174, 141479, 118189, 146905, 212290, 331406, 257651, 218907, 340707, 350922, 301377, 296569, 208651, 191701, 165834, 59979, 196631, 202877, 232418, 235426, 235869, 211830, 254250, 280022, 233503, 138637, 137440, 74820, 29098, 93262]
6126I3262j2435O5332k9126P4656K3559q2914l0016k6105O4325J7785l171O4417
6114B19569O4088J10506q5512j13587j2840l2676K8446N8693k8876j27977k8802
6103E1032J23968J1543L2138O2238N6912k6330j10389J79999j10144p9217R9898
6092B91648J4567K0662M5563l3869q6240L4596J16631p4887j33900j0495l0982
6081A53294l594J28295k4349J3513J08532j29016j69249J30635O4257k922R1835
6070C61231J9018k0728j86313Q316J39752L6001o8082Q109L2669J04260m436j4953
6058D14844R6651j9365N0253j31059j08290R0622j9841K3177j16699m5669O406
6047B41030P6880p0932J2221m7405n0329J28174J23407K0827p1198m4201o9574
$$ y = [93262, 80827, 146159, 117033, 191689, 215248, 132334, 102318, 76213, 140538, 158323, 155152, 219569, 283657, 394163, 308651, 195064, 182224, 149548, 177994, 236687, 207811, 79834, 51032, 175000, 186543, 218681, 280919, 337831, 311501, 201112, 381111, 270967, 191750, 291648, 306215, 326877, 372440, 338571, 252331, 286927, 403558, 328671, 194771, 184276, 153294, 149700, 277995, 253646, 267159, 375691, 246675, 77426, 208061, 272318, 269396, 361231, 380249, 359521, 173208, 181524, 321276, 357277, 289195, 297304, 329973, 434233, 429797, 414844, 511495, 492130, 542383, 411324, 303034, 393656, 373815, 396992, 280293, 234624, 241030, 317910, 246978, 259199, 211794, 161465, 289639, 413046, 433873, 362675, 318474, 248900]
6036B48900k1606p5556p9025J20126J36324K1497p5256O8424j8336k4827J253
6025C01918O7090J46607J5578n1888j9361j9283m7515O6837o3268M8811m4026
6014D01500l1077J28947J9032j5062j9558J9324j09357J04231J8118q124j59686
6003C48288P9264J29073j23872p0439L3027J27014j141J8600R526R318j8997R4736
5991F34397k7132O7359J07278j4619j08554M1717K118n5133K4947j2580p0254
5980E89544p565P0527j4493J480j51504M2248J01196R5323Q728p1922o941q9025
5968E67596Q7997K6996L426k0912k3305l3155N7r4958J21826n2580K1289m5745
5956E58532m0501K31618l9855j1719K2997J0803M4017q5676J0182L0685k3460
$$ y = [248900, 227294, 151738, 72713, 192839, 329163, 350660, 275404, 343828, 325492, 300665, 301918, 369008, 515615, 531193, 479305, 459944, 440661, 393146, 459983, 396715, 445526, 401500, 370423, 499370, 518402, 503340, 483782, 503106, 393749, 497980, 516098, 507974, 348288, 427552, 556625, 432753, 362314, 395341, 522355, 521214, 539814, 549340, 558658, 539661, 634397, 607265, 674624, 781902, 767283, 658729, 700446, 702564, 647431, 672378, 659798, 589544, 581979, 652506, 638013, 639493, 487989, 530237, 631433, 726756, 735484, 663562, 656621, 567596, 655593, 682589, 686015, 665103, 641798, 608643, 608700, 513742, 635568, 582988, 604277, 558532, 518031, 749649, 709794, 698075, 721072, 731875, 775892, 690216, 700398, 731083, 707623]
5945G07623J31358j93686l6876M8009p5999M9403l9485M7526R886j6260L363J07286
5933G42148q6R6761o9612m0766m4617p9111J36297R8284O1402q5597m4835r8234
5921F72034p7272K9163N271o8832J36799J26473j51734l4330M6135J2191L8670
5910G34568L8707K8089q1015m264N354o6794R2609o7750L0918M8706j03236m1914
5898F13978J07788N0105m2785O294l0149n9251L4196Q0426L40P2137J3909j62309
5886F84679L4105J74301q8151l3157q0827k2736J12669l6193j5385N9357K4108
5875H12770J15016o551j195j24313q8941p8630K33327M4761j9568j65289n9992
5864F61395L8522Q0155k1786P257O5068J8075r484n5441k3442M2419J26261P0971
$$ y = [707623, 838981, 645295, 608419, 656428, 580429, 629832, 590347, 637873, 647759, 631499, 634862, 742148, 742062, 838823, 769211, 728445, 683828, 604717, 741014, 839298, 900700, 815103, 770268, 672034, 594762, 623925, 629196, 560364, 697163, 823636, 671902, 637572, 683707, 695898, 734568, 773275, 801364, 720349, 716085, 721439, 654645, 747254, 679504, 710422, 759128, 655892, 613978, 721766, 771871, 729086, 735380, 705231, 645980, 680176, 760602, 760942, 833079, 846988, 684679, 718784, 893085, 804934, 771777, 690950, 668214, 780883, 744690, 729305, 788662, 812770, 927786, 921235, 920040, 795727, 706786, 628156, 861483, 906244, 886676, 721387, 661395, 699917, 780072, 758286, 765543, 830611, 848686, 839202, 783761, 760319, 802738, 928999, 999970]
5852I99970r6372m5305j6919J2740J953J8428J77636j7175j8403M9819O1442r7037
5840A030777k5780k11398N6759M1542R609N2383O2793p4901M7372j1744m4563
5829I32849R964N2177N2330O3608m3981m9589P6417N9589m3170n0434R0319r8663
5817A051416k2779k8662m371J47756n894l8980n9083M6969O9081n9185p859k1701
5805A066708J8817J7039P9460J2949j6270o506m3178l173r8306J02712J08702
5794A238954l0224j2603q357J0392J48880r463o2440P828P2961J6730J9473L906
5782A396037P916o6365m4048J77944k2524p4157M3120K5342j5318K4695j09851
5771A342791O0452J17119k6191K2707M553J4618m8215j9170J65859o7845l6403
$$ y = [999970, 903598, 858293, 841374, 854114, 856067, 874495, 1052131, 1034956, 1016553, 1066372, 1127814, 1030777, 1004997, 793599, 850358, 891900, 901509, 953892, 1016685, 941784, 989156, 977412, 932849, 942813, 994990, 1047320, 1110928, 1066947, 1017358, 1093775, 1153364, 1110194, 1059760, 1150079, 1051416, 1028637, 999975, 995604, 1143360, 1137466, 1098486, 1039403, 1086372, 1155453, 1096268, 1088409, 1066708, 1085525, 1102564, 1182024, 1194973, 1178703, 1172197, 1129019, 1125846, 1027540, 1130252, 1238954, 1208730, 1196127, 1187770, 1198162, 1347042, 1337579, 1275139, 1282967, 1355928, 1372658, 1392131, 1396037, 1403953, 1337588, 1293540, 1471484, 1448960, 1374803, 1417923, 1443265, 1427947, 1452642, 1342791, 1403243, 1520362, 1494171, 1516878, 1521431, 1536049, 1487834, 1468664, 1634523, 1566678, 1530275]
5760A530275j026Q7163K923L6594j2720n1700P3929j12572P9673P1054q8990k5467
5748A589136O6118j19133o4542O6298K8453L3518P4701j05949K1489m4898R5802
5737A640993n010o0209K53113m4849n7223q791J1491j79212J25333O8381k616
5726A741401N7568O4306j03152J45945Q1038M3154P852j73265M8158J17338M7992
5715B078335p9683J02811q2569q6112j2624J11409m1129j32317J35754J11360
5705B105235m6886o464R585j9378M4569N7202k8537l6442M7809j31618J37729
5694B132804M3472R9166L432n6189k9434j07198O5051N7326j24722K3285J05338
5683B212331Q5533M6456J20116P0281l5225r401q3926r6249j0909P4430J27336
$$ y = [1530275, 1529249, 1616412, 1619335, 1655929, 1643209, 1591509, 1665438, 1552866, 1632539, 1703593, 1614603, 1589136, 1655254, 1536121, 1471579, 1537877, 1566330, 1599848, 1674549, 1568600, 1590089, 1545191, 1640993, 1635983, 1575774, 1828887, 1784038, 1726815, 1718024, 1729515, 1550303, 1675636, 1744017, 1741401, 1798969, 1863275, 1760123, 1906068, 1987106, 2030260, 2038112, 1864847, 1913005, 2030343, 2078335, 1998652, 2101463, 2018894, 1932782, 1920158, 2031567, 1990438, 1858121, 1993875, 2105235, 2058349, 2051885, 2061470, 2042092, 2086661, 2143863, 2115326, 2078884, 2126693, 1995075, 2132804, 2176276, 2275442, 2278874, 2222685, 2193251, 2086053, 2151104, 2208430, 2083708, 2106993, 2212331, 2297864, 2344320, 2464436, 2534717, 2499492, 2490091, 2406165, 2309916, 2299007, 2373437, 2500773]
5672B500773J58221n3877j3971j02116J80904J10570p732L6428L0711r0034J97887
5661B947764K2283K631l1285J74320L8722j7056J77132j14063o8081K50324N499
5650C388190j57436P6525K7692J40353R5059n4090P5242R71q247J25516Q992Q574
5638C727341J35555J31487j3142q0296J64618P7739K5910l1334P6823J45027J23453
5627D483181n4442K3104J9325N7607J82031M8290k1731P9863J53704Q7825L708
5616E062465q6033J86709j05579M6339J18790Q6710M2339M3471P5055M4505J60298
5605E675069L5069m4618J19210J32304J08462J64000J64643o2445N7616Q9117
5595F438427J42799l4781O1493Q7678K89440J76182Q1165J77754Q1058l2716J82263
$$ y = [2500773, 2658994, 2605117, 2591146, 2489030, 2669934, 2780504, 2772772, 2809200, 2839911, 2749877, 2947764, 2970047, 2972678, 2941393, 3115713, 3154435, 3137379, 3314511, 3200448, 3132367, 3382691, 3388190, 3230754, 3307279, 3334971, 3475324, 3570383, 3516293, 3591535, 3592506, 3584259, 3709775, 3718767, 3727341, 3862896, 3994383, 3981241, 3900945, 4065563, 4143302, 4169212, 4137878, 4214701, 4359728, 4483181, 4428739, 4451843, 4471168, 4528775, 4710806, 4759096, 4737365, 4817228, 4970932, 5058757, 5062465, 4976432, 5163141, 5057562, 5103901, 5222691, 5309401, 5351740, 5395211, 5470266, 5514771, 5675069, 5710138, 5665520, 5784730, 5917034, 6025496, 6189496, 6354139, 6291694, 6349310, 6438427, 6581226, 6546445, 6607938, 6695616, 6985056, 7161238, 7242403, 7420157, 7501215, 7468499, 7650762]
5584G650762J48497J33789J12814N529P2164K52167J37113R8830K32883m2686
5574H801862O5697K18760L26990J44308O7922K07963J53725J88182K15465K25415
5564A0616289K04883R2587J67474J58657J51977J53597K48306K70788J62507J60914
5554A2387979K63145L19062K97204K13127K54708K67696L04422L57916L61632
5545A5026891K61036L05749L53522L97444M98895M36324M13276L17709L94385
5536A8405231M69135O17621M63308N10437N24995M84605N35339M67051Q06955
5527B3284677N97014N65385O55479P97537Q12116P73191J011628Q62778R66730
5518C0326535J040245R15576J182789J001404J238609J377791J340279J393390
$$ y = [7650762, 7799259, 7933048, 8045862, 8051391, 8123555, 8375722, 8512835, 8611665, 8844548, 8801862, 8867559, 9086319, 9413309, 9557617, 9625539, 9833502, 9987227, 10175409, 10390874, 10616289, 10821172, 10913759, 11081233, 11239890, 11391867, 11545464, 11793770, 12064558, 12227065, 12387979, 12651124, 12970186, 13267390, 13480517, 13735225, 14002921, 14307343, 14665259, 15026891, 15287927, 15593676, 15947198, 16344642, 16843537, 17279861, 17693137, 18010846, 18405231, 18874366, 19491987, 19955295, 20465732, 20990727, 21475332, 22010671, 22477722, 23284677, 23881691, 24447076, 25102555, 25900092, 26712208, 27485399, 28497027, 29359805, 30326535, 31366780, 32282356, 33465145, 34466549, 35705158, 37082949, 38423228, 39816618]
5510C9816618J553158J690645J784777J747643J924542K047762K225336K396600
5502E5187081K456797K529227K833088K970405L182730L463581L509079L919274
5494H0051262M362797M619850M670193N046471N627267N862994O239119O808375
5486A23288328P176525P628080Q028857Q513657R244564R685361J0103071J0777217
5478A94445660J1362586J2125457J2820109J3529571J4437492J4964428J5373853
5471B89059156J5716539J5567010J5178746J3940012J1981501R755151O465660
5464C77663775K636215j138778m753844q099826j1257045j3485027j5236185j6218739
5456C10110546j6735261j7087994j6648793j6090937j5312150j4494540j3718726
$$ y = [39816618, 41369776, 43060421, 44845198, 46592841, 48517383, 50565145, 52790481, 55187081, 57643878, 60173105, 63006193, 65976598, 69159328, 72622909, 76131988, 80051262, 84414059, 89033909, 93704102, 98750573, 104377840, 110240834, 116479953, 123288328, 130464853, 138092933, 146121790, 154635447, 163880011, 173565372, 183668443, 194445660, 205808246, 217933703, 230753812, 244283383, 258720875, 273685303, 289059156, 304775695, 320342705, 335521451, 349461463, 361442964, 371198115, 377663775, 380299990, 379161212, 374407368, 366307542, 355050497, 341565470, 326329285, 310110546, 293375285, 276287291, 259638498, 243547561, 228235411, 213740871, 200022145]
5449B00022145j2732730j1703753j0877111r979816r278881q595795p799017p182723
5441A21872319o705974o267787n818709n344073m884611m695918m324810m121018
5433G9709419l612444l504562l392462l024725k909727k792088k478614k335900
5425E5658897k288244k206089k090229j978408j774984j740986j664869j668423
5417D0246665j483234j297460j394189j287284j230625j326302r50514j129089
5409C0147968j037743q87934p80244p15468q78282q12541q27464p48954o80721
5400B2778617q57751q32646m74486n17488m90218o42068n72520n12127n54239
5391A7325074k36304n39868n14733l33198n58322l78117l49290k99516k10348
$$ y = [200022145, 187289415, 175585662, 164708551, 154728735, 145449854, 136854059, 129055042, 121872319, 115166345, 108898558, 103079849, 97735776, 92851165, 88155247, 83830437, 79709419, 76096975, 72592413, 69199951, 66175226, 63265499, 60473411, 57994797, 55658897, 53370653, 51164564, 49074335, 47095927, 45320943, 43579957, 41915088, 40246665, 38763431, 37465971, 36071782, 34784498, 33553873, 32227571, 31277057, 30147968, 29110225, 28222291, 27442047, 26726579, 25848297, 25035756, 24208292, 23459338, 22778617, 21920866, 21088220, 20613734, 20096246, 19606028, 18963960, 18391440, 17879313, 17325074, 17088770, 16548902, 16034169, 15700971, 15142649, 14764532, 14415242, 14115726, 13905378]
5382A3905378l16546l78572j95231l16020l79716l30230k68832l70624j63808
5373A1185799j44976k64598k65194k08306j94650k15554j70208k42992k25068
5364I254253j17266k75907l35653j68349j72999k28107j98941j83127j67480j75890
5354G230534j06103j59956r4651l16963j3073k09463q7705j8248j94064j59129
5344E871179n6269j56726j10192K5440k37362j88751j04196J0649j2082r9910
5334D941780q3383L8914j57978k1361j23432J9231j14783j20331k08706n7496
5324D112455L8729q778j72091p7314o5909J648j6699L6807p460j62172j28052
5313C551164q4411p845J273N9802j46153Q583l5381j82270K4297j21901k03373
$$ y = [13905378, 13588832, 13210260, 13015029, 12699009, 12319293, 11989063, 11720231, 11349607, 11185799, 11040823, 10776225, 10511031, 10302725, 10108075, 9892521, 9722313, 9479321, 9254253, 9136987, 8861080, 8525427, 8357078, 8184079, 7955972, 7757031, 7573904, 7406424, 7230534, 7124431, 6964475, 6869824, 6552861, 6539788, 6330325, 6242620, 6224372, 6030308, 5871179, 5814910, 5658184, 5547992, 5573432, 5336070, 5147319, 5043123, 5053772, 5041690, 4941780, 4858397, 4897311, 4739333, 4717972, 4594540, 4613771, 4498988, 4378657, 4169951, 4112455, 4151184, 4142406, 3970315, 3893001, 3827092, 3828740, 3812041, 3848848, 3841388, 3679216, 3551164, 3466753, 3458908, 3460181, 3519983, 3373830, 3382413, 3347032, 3164762, 3189059, 3067158, 2863785]
5302B863785j4340j14807n6321k9904M9449n457l5594n615J8125j00050O724j3886
5290B562109n622p4139J0910J31589j65590L8739N967j01177j01841r046J1012
5279B302911r5573q361o5302O8629l0644M1549j23235Q5781q3580l5231M8330
5268B105274L5418j05157k1816k6869L2465n654l6328J22180o4239j36194j36168
5257A762912K8208o4596N7322J19008O2364j54280q0227m4999L2689J08783p1662
5246A755522j61308J23517m9983p8522m1591M1394n6204n3840m1605K5870L3196
5235A496446r6651k7325k5447k2002l3593o3063J10521p864j1049q4266o229R1479
5223A320957r3002n1335Q2724j16936o7869P6711M6036j41859K2619O8152k3633
$$ y = [2863785, 2849445, 2734638, 2678317, 2648413, 2697862, 2692405, 2656811, 2651196, 2669321, 2569271, 2575995, 2562109, 2556487, 2482348, 2493258, 2624847, 2459257, 2497996, 2503963, 2402786, 2300945, 2291899, 2302911, 2207338, 2198977, 2133675, 2202304, 2171660, 2213209, 2089974, 2175755, 2092175, 2056944, 2105274, 2140692, 2035535, 2013719, 1986850, 2019315, 2013661, 1977333, 2099513, 2035274, 1899080, 1762912, 1791120, 1726524, 1783846, 1902854, 1965218, 1810938, 1730711, 1685712, 1718401, 1827184, 1755522, 1594214, 1717731, 1667748, 1589226, 1547635, 1589029, 1532825, 1478985, 1437380, 1463250, 1496446, 1399795, 1372470, 1347023, 1325021, 1291428, 1228365, 1338886, 1331022, 1319973, 1235707, 1229478, 1320957, 1227955, 1176620, 1259344, 1142408, 1074539, 1151250, 1197286, 1055427, 1078046, 1146198, 1122565]
5212A122565j07009k3210o444L6844j1153l7339J01426j2017j2453j8749N0274
5201A082735m3394K0638j14588m0386o4933J35723j84507j33200M4776Q8758R3083
5190H84705L6569r5254r7360J30351m1461n3578K3050Q4764j5405n5733j43939
5179F56709L8098j7554N532J26941R9696j27221p8769m6806j6049K0071j55131
5168E05517M8428o0046l3325M1372J7307N5031r0472p4961J2974N7530K522o586
5156D75291O0822L340j35124R5513J21506j56171K4314k9627l1478l07j9837J01097
5144E09339j08953L1033P6077n4145M8949K4927k0216n5836L9535L342Q1051k5654
5132E49449p7358l240N727L3585M1344p5476J22296k1219j22434n1532M1121p3619
$$ y = [1122565, 1015556, 992346, 985902, 1022746, 1011593, 974254, 1075680, 1063663, 1051210, 1032461, 1082735, 1039341, 1059979, 945391, 905005, 840072, 975795, 791288, 658088, 702864, 791622, 884705, 921274, 826020, 728660, 859011, 817550, 763972, 787022, 871786, 856381, 800648, 656709, 694807, 677253, 682785, 809726, 909422, 782201, 703432, 656626, 640577, 660648, 505517, 553945, 493899, 460574, 501946, 519253, 574284, 483812, 408851, 421825, 479355, 481877, 475291, 536113, 539453, 404329, 499842, 621348, 465177, 489491, 459864, 428386, 428079, 408242, 509339, 400386, 431419, 507496, 453351, 502300, 527227, 507011, 451175, 490710, 494052, 575103, 549449, 472091, 468851, 474578, 508163, 549507, 474031, 596327, 575108, 452674, 401142, 442263, 368644]
5120C68644J23802m359j03575J20508M1792r2571l1584Q2038l7421O1113j76021
5109C52366k44813N4972J49688m3167n3394J65691k2840j9095j64503O1742N4341
5098B90988L171J21731J24805j73863j07253K4313o2593P8359m9235J76709O755
5087D33887M1942o5902L2998q77l8201j00556M1230K9079M6645j75758M7037J17928
5075D09452M5666R80o3686r8358j26722J19437Q9976J01956o9882j4821m2200
5064C51798j2484J347M170j1130J667P4227m1813R0595j5715m4342o6635k5312
5052C06373p70J27974R469j55719l484K01683o6614j49008R4446P0896O3547P5857
5040E74650L7431j65673j0061m936Q3332m6170L9905L2291K8383k1633n1225o1321
$$ y = [368644, 492446, 488087, 384512, 505020, 546812, 454241, 422657, 504695, 467274, 528387, 352366, 107553, 162525, 312213, 269046, 215652, 381343, 358503, 339408, 174905, 236647, 290988, 294159, 415890, 540695, 366832, 259579, 283892, 221299, 299658, 250423, 427132, 433887, 475829, 409927, 442925, 442048, 403847, 303291, 344521, 373600, 420245, 244487, 291524, 409452, 455118, 456098, 392412, 294054, 167332, 286769, 376745, 478701, 408819, 393998, 351798, 339314, 340661, 344831, 333701, 335368, 409595, 367782, 458377, 442662, 398320, 331685, 306373, 305603, 433577, 443046, 287327, 283843, 485526, 418912, 269904, 364350, 435246, 498793, 574650, 612081, 446408, 436347, 431411, 514743, 468573, 508478, 540769, 569152, 547519, 496294, 434973]
5028D34973o074J48131k773q5404p0359p3268L2356J39497O1475M8385L5141n4318
5016F07762j23676j3432j8907j02044K7166J6975j09565k0429J82332J4626Q7525
5005E48333R089k28132J44908j7198N466k4255j00089q1152p9125K10787J44706
4994E33338j98736r825Q9015N791Q0320j38608L4738q548m4801M7901J35840p9999
4982D46426j09429O0143J8632N6177P7414j23190p4658n3790k9675J48666O9940
4971D86656p9735n453K5963k8986n1534M9765J07936m0874K14716o7314r2615
4960E18525k3891L3044q3586j1255Q7282J7760K7324L4889M461k9126J0001P0726
4948F56154K45540k7090R6738j4207q7855J35485O5925J19352o040N5444K10057
$$ y = [434973, 428899, 577030, 574257, 488853, 418494, 345226, 377582, 517079, 578554, 626939, 662080, 607762, 484086, 470654, 451747, 349703, 376869, 393844, 284279, 263850, 446182, 460808, 548333, 557422, 329290, 474198, 457000, 462466, 438211, 338122, 256970, 177845, 388632, 533338, 334602, 324777, 413792, 419583, 499903, 361295, 396033, 387485, 342684, 390585, 526425, 446426, 336997, 397140, 415772, 471949, 549363, 426173, 351515, 297725, 268050, 416716, 486656, 406921, 401468, 427431, 398445, 346911, 396676, 504612, 463738, 678454, 611140, 518525, 494634, 527678, 444092, 432837, 520119, 537879, 565203, 600092, 604553, 575427, 585428, 656154, 901694, 874604, 971342, 957135, 869280, 1004765, 1070690, 1190042, 1184002, 1239446, 1449503]
4937A449503K24271L5037K733J74627L3490K54397K59445J44758J42306P0378
4927B790945J90239L38173L52269M54205M33176L86358K56428K52011R6790j69022
4917E381572k51503k50578l63276m97443m01638k87139j56161k96166l91235j76827
4907B309606j12632k12080j07471J6001o0859j48227j03742j36894j08256m0842
4897A294604O8801M0926o1273k8468k0923q3957o1053n0677l3895J33444o7587
4886A129942j79162Q177K3553r9530r6593J5549n8723P857j05416m8829R3560
4875F90385P0010J5601p3663o954r8128j75772j57941m6861R0706J40392Q0132
4864E27907r3504M401K1143j4258m542O4888p9082o3840J08372O2038Q8113Q5899
$$ y = [1449503, 1673774, 1708811, 1711544, 1886171, 1919661, 2174058, 2433503, 2578261, 2720567, 2790945, 2981184, 3319357, 3671626, 4125831, 4559007, 4945365, 5201793, 5453804, 5550594, 5381572, 5130069, 4879491, 4516215, 4018772, 3617134, 3329995, 3173834, 2877668, 2486433, 2309606, 2196974, 1984894, 1877423, 1893424, 1832565, 1684338, 1580596, 1443702, 1335446, 1294604, 1363405, 1404331, 1343058, 1314590, 1293667, 1209710, 1148657, 1097980, 1064085, 1197529, 1129942, 950780, 958957, 982510, 882980, 786387, 801936, 743213, 751070, 645654, 596825, 690385, 760395, 775996, 702333, 695379, 597251, 421479, 263538, 216677, 307383, 447775, 527907, 434403, 438804, 459947, 445689, 441147, 506035, 426953, 363113, 471485, 533523, 621636, 707535]
4852G07535k5581j50697p4344m7621M1812P1276J18827N701K1019j54530K5144
4841E38541J14924r5726L9624P8910J02654j23869j5116n6353q0560k3908O6739
4830E45860J46541P3964j6803l8231j0514R8223q1815o9482Q7935k0966k5811
4819F88901J60631L5096J6767P0769K6091j10941p976P4158m1831J04248M3969
4808A059882L9343L0626Q0585J48876J36484L5169J42515J21881R3499j27561
4798A761299J36890K8470J97563K86797J11412J56480K49001K28988L12733K22302
4788C691935L59318M59945M20511L56302K43833j2285k41787j56232l00962k97885
4778D522693m01508l07310l43563k38907k13751j73301l52127j72545j41059k12704
$$ y = [707535, 681954, 531257, 456913, 409292, 451104, 522380, 641207, 646908, 667927, 513397, 538541, 653465, 557739, 597363, 676273, 778927, 655058, 639942, 583589, 503029, 479121, 545860, 692401, 766365, 749562, 711331, 700817, 799040, 717225, 647743, 735678, 714712, 688901, 849532, 884628, 901395, 972164, 998255, 887314, 879338, 953496, 911665, 1015913, 1059882, 1099225, 1129851, 1210436, 1359312, 1495796, 1530965, 1673480, 1795361, 1888860, 1761299, 1898189, 1926659, 2124222, 2411019, 2522431, 2678911, 2927912, 3156900, 3469633, 3691935, 4051253, 4511198, 4931709, 5288011, 5531844, 5519559, 5277772, 5121540, 4820578, 4522693, 4121185, 3813875, 3470312, 3231405, 3017654, 2844353, 2492226, 2319681, 2178622, 1965918]
4768A965918j30866j73511l0478j1164j03393q7438O6860L9453k17131q6547J1677
4757A243380k04963N0320J19812k6524l8205m3227Q4687J25564q5689L1402K7939
4746A284496r8761K1659n3707m0007r0497M1972o460r8670J5044K8662p4198j66503
4734G63030L1498R1291q0510J45482o2052L6830m7513n8133J5505K1673M9857
4723I06958j83664K7996M1371J27538J28636o4692P0471j13515Q9031O0146l5429
4712A054847J22813o9399j04555p3844J30745J77139j20789n1501p4455J08303
4702A099304J40850J8249L4239K2152k1553l4512o6897L103K51401o805o8933
4691A370598M085J43522n8952L0024Q7379o7015j0067N286j542J24004L3919J52578
$$ y = [1965918, 1835052, 1661541, 1631063, 1619899, 1516506, 1429068, 1495928, 1535381, 1318250, 1231703, 1243380, 1038417, 1088737, 1208549, 1182025, 1143820, 1100593, 1185280, 1310844, 1225155, 1256557, 1284496, 1185735, 1207394, 1153687, 1113680, 1023183, 1065155, 1058695, 960025, 975069, 1003731, 929533, 763030, 794528, 885819, 805309, 950791, 888739, 925569, 878056, 819923, 835428, 857101, 906958, 723294, 751290, 792661, 920199, 1048835, 984143, 1054614, 941099, 1030130, 1090276, 1054847, 1177660, 1108261, 1003706, 929862, 1060607, 1237746, 1116957, 1065456, 991001, 1099304, 1240154, 1258403, 1292642, 1314794, 1293241, 1258729, 1191832, 1194935, 1446336, 1439531, 1370598, 1374683, 1518205, 1459253, 1489277, 1576656, 1509641, 1499574, 1504860, 1503318, 1627322, 1661241, 1813819]
4679A813819M3797n9603j10632N8601J37124R9227K1646j6701j5871O7233K09791
4668B248431R4533N8950R2203l1448m8285J00296K17794J18987M7901m2892J56609
4657C013079J49790N5259J04463O4674J22153K34482J85214J95698J32054l945
4647D252921K17350K50537L10459L24428K44046K63823K96843L02066N20377M90230
4637G473080L39936L72109M65073M69083N49515O99963O72043P87889Q36648R20489
4627A3585828R71833J230396J399796J614560J628991J668361J372703Q32824
4619B4305292N64014M1173r6607m09071l68199m0851Q8434J23195K58654O50946
4609B5116980O88262R36573J148916J288891J527565J748779J871628J719362
$$ y = [1813819, 1857616, 1798013, 1687381, 1745982, 1883106, 1982333, 2003979, 1987278, 1971407, 2038640, 2248431, 2342964, 2401914, 2494117, 2462669, 2414384, 2514680, 2732474, 2851461, 2899362, 2856470, 3013079, 3162869, 3218128, 3322591, 3387265, 3509418, 3743900, 3929114, 4124812, 4256866, 4252921, 4470271, 4720808, 5031267, 5355695, 5599741, 5863564, 6160407, 6462473, 6982850, 7473080, 7813016, 8185125, 8650198, 9119281, 9668796, 10368759, 11040802, 11828691, 12665339, 13585828, 14557661, 15788057, 17187853, 18802413, 20431404, 22099765, 23472468, 24305292, 24869306, 24910479, 24813872, 24404801, 24036602, 23995751, 24084185, 24207380, 24466034, 25116980, 25805242, 26741815, 27890731, 29179622, 30707187, 32455966, 34327594, 36046956]
4601C6046956J718515J782718J859857J812923K052977K018755J977049K006659
4593E1276409J689004J288351J275991J147274J029469J068855P82140N30731
4585F0088224L66823l54607o36489r49205j164714j257630j298992j493865j700596
4576E1598949j734282j996844k220799k405393k340030k132015k069040k124484
4568C4576062k152612k156638k155209k035340j921658j909863j742622j452668
4560A9049452j474061j164659j230701j217405r55838p95747p89703o87644o44313
4551A0089381o08260n32176n73054m19726n46185m10152k91374k17449l53646
4542F137359m36932k05972j50668j59371k46236k22932k30431k49797j69722j00159
$$ y = [36046956, 37765471, 39548189, 41408046, 43220969, 45273946, 47292701, 49269750, 51276409, 52965413, 54253764, 55529755, 56677029, 57706498, 58775353, 59557493, 60088224, 60455047, 60100440, 59463951, 58514746, 57350032, 56092402, 54793410, 53299545, 51598949, 49864667, 47867823, 45647024, 43241631, 40901601, 38769586, 36700546, 34576062, 32423450, 30266812, 28111603, 26076263, 24154605, 22244742, 20502120, 19049452, 17575391, 16410732, 15180031, 13962626, 13006788, 12211041, 11421338, 10733694, 10089381, 9481121, 8948945, 8375891, 7956165, 7409980, 6999828, 6708454, 6491005, 6137359, 5700427, 5494455, 5343787, 5184416, 4938180, 4715248, 4484817, 4235020, 4065298, 3965139]
4532C965139o4301j51695r6973k71162j46856j98031j31611j10756J1462m6575
4522B758641j65673j41162N35j02552j63202j04846n6409q1542k2838J16162j88255
4511A848859r3168Q2863l2522m3722j69811o2657j4163k1897j39144j48236n8492
4500A147910K5879j2927J28877N3133q9315n7250j18065J3919N814o9070J078
4489A029983J6266l9366p0661O8975j4808o0458J5898n2151o142Q559r4579n3924
4477G47592O0190J88454l3186j88264r1175J02421O1418n7686n2539K2393l2320
4466G27298p8107P8878J6830l3524o7062J9133n0156n025r8763J74535j41629
4455E42408q913L3102r1017J11049K9037j02644p1545J30729q4885o5908K6132
$$ y = [3965139, 3900838, 3749143, 3652170, 3381008, 3234152, 3036121, 2904510, 2793754, 2805216, 2758641, 2592968, 2451806, 2452341, 2349789, 2186587, 2081741, 2025332, 1943790, 1920952, 2037114, 1848859, 1755691, 1838554, 1806032, 1762310, 1592499, 1529842, 1515679, 1493782, 1354638, 1206402, 1147910, 1173789, 1160862, 1289739, 1342872, 1253557, 1196307, 1078242, 1092161, 1097975, 1028905, 1029983, 1046249, 1006883, 936222, 1005197, 990389, 929931, 945829, 893678, 887536, 896095, 801516, 747592, 807782, 996236, 963050, 774786, 683611, 786032, 847450, 789764, 737225, 759618, 727298, 649191, 728069, 744899, 711375, 644313, 663446, 613290, 608265, 509502, 684037, 542408, 533495, 566597, 475580, 586629, 615666, 513022, 441477, 572206, 487321, 421413, 447545]
4444D47545q0645n2650J22764J15940q0074q2746O0228K0737k11506Q9442k009
4433C47026k3024n6735p8172k8700O3033K8349l1429o6773L6321J62147J3421
4422C65464o1510M3420l0880j13176n5052J2524M1039p0334K2114O6360M6835
4411B66804q1290m746Q803o1162L2045k5499m047Q4940K14126R219r8597j3353
4399C27243j22542l6794j5985L054L7111k9688q1971K9789r552q8494J856N5932
4387F9959q6126O8556M9814M4457k1890k7757o2992j1401N2038J31540j13084
4376I3114R486n4263j00358M7442J48451K8860J2146J09501j02515j17182R2388
4365A67070N0330J5050m0126j9520J2416p6231M08o4887O4045j8796n016J27313
$$ y = [447545, 366900, 314250, 437014, 552954, 472880, 390134, 450362, 471099, 259593, 349035, 347026, 324002, 267267, 189095, 160395, 223428, 251777, 220348, 153575, 189896, 352043, 365464, 303954, 347374, 316494, 203318, 148266, 160790, 201829, 131495, 153609, 219969, 266804, 185514, 180768, 189571, 128409, 160454, 134955, 130908, 215848, 429974, 439193, 340596, 327243, 204701, 167907, 151922, 154976, 192087, 162399, 80428, 110217, 100665, 12171, 14027, 69959, -16167, 52389, 102203, 146660, 124770, 97013, 34021, 22620, 74658, 206198, 93114, 102600, 48337, -52021, -4579, 143872, 172732, 184878, 294379, 191864, 74682, 167070, 217400, 232450, 192324, 172804, 185220, 108989, 109397, 44510, 108555, 89759, 84743, 212056]
4353B12056r5787j72792K36988O8564j6322n9616k515L4608j07549j1887O4801
4342A50549M6027p2986J503L8894Q9121j05578Q6828o7017j637N191l8538K2928
4330A55285n4522M839R5209J55437j11173j96011l1816J06490P7414l8454r4945
4319F7753k5843J5889j3976N7250M9988O7193J17102k02080O0472J1640L8009
4308B43397L7103J54442l8510q6324n3232Q2421m6348m9012R1744O9244l6342
4297C68583L2777j3711R261L7182K4727n8921L8614J32338j70485r4221R3099
4286C99243J54995k0741K6036m3731j23114N9926J19297p9370j5672O8786n047
4275E40608l0106j18102K5294l6084J0772K43208p2393j68527L7614J9106j44053
$$ y = [212056, 116269, -56523, 180465, 249029, 232707, 173091, 170576, 205184, 97635, 85748, 150549, 196576, 123590, 125093, 163987, 253108, 147530, 234358, 167341, 165704, 170895, 132357, 155285, 100763, 105602, 200811, 356248, 245075, 49064, 17248, 123738, 201152, 162698, 67753, 41910, 57799, 43823, 101073, 151061, 218254, 335356, 133276, 193748, 205388, 243397, 280500, 434942, 396432, 310108, 256876, 339297, 292949, 243937, 335681, 404925, 368583, 401360, 387649, 396910, 434092, 458819, 399898, 438512, 570850, 400365, 306144, 399243, 554238, 533497, 559533, 515802, 392688, 452614, 571911, 492541, 476869, 545655, 540608, 510502, 392400, 417694, 381610, 392382, 635590, 563197, 394670, 432284, 451390, 307337]
4264C07337n2253l4427q7445l6827K08654J26714l0635j0312n9957p9222K411
4253B54038o1120m0333o7793J81123L2499j17122J601q6055R2427P4209j29210
4242A34264p8207P7169K1790J72339m8324k6561n5877o4131O5566o5172o2019
4231G0837r0207P9097O8284M8053j0998O6922R0750m0327R286J47814q3832j12258
4219B43421j3046O0894L1133K7340K8561N4862p1335n6084p8867k9531N9377O7655
4207C24380m7896q460P9455N1909n4028m7807k8170P5770m4449J10816J7324j19423
4195C09421J8079j2609M801J400j01553m3762J49275N7661j40289n3588O9244
4184B58080M2735o0324k3865J24153L320J0691m9947L1321k9392j3645n7608l8607
$$ y = [307337, 255084, 220657, 133212, 96385, 305039, 431753, 401118, 390806, 330849, 251627, 254038, 192918, 152585, 84792, 265915, 298414, 181292, 182893, 96838, 189265, 263474, 134264, 56057, 133226, 155016, 327355, 279031, 252470, 196593, 132462, 198028, 132856, 70837, -19370, 59727, 128011, 176064, 165066, 231988, 322738, 282411, 291697, 439511, 355679, 243421, 230375, 291269, 322402, 349742, 378303, 433165, 361830, 305746, 226879, 197348, 256725, 324380, 276484, 268024, 347479, 399388, 345360, 297553, 269383, 345153, 300704, 411520, 428844, 309421, 327500, 314891, 319692, 321092, 219539, 175777, 325052, 382713, 242424, 188836, 258080, 300815, 240491, 216626, 340779, 344099, 354790, 304843, 336164, 306772, 293127, 235519, 196912]
4172A96912o2026J16165q033J07739J35559l5699k41130K9449Q933J51710L2379
4161D31958j486J69034p5129o8324l5579j05543R8467K5797o0460k0970p7475
4150B80290J09658n416n040L5503k0331r1660l6298j2231o871j6785j05245K7596
4138A53170P9442R6395o0198k4910P2657J095O0768j1330l276m0923r520m3209
4126B70161M2434N5834O2956j06879p0823J30260K7095O0972j33719q2460N4653
4115C10484R5531L7470N8538J7936M5435n3611j4768O4331j8973J46316N8923
4104G47612M2336j79498j38014Q1165L253j4785M4552J23788p0743r4539O9166
4093F14293J49767M6121j8593M4350K4685O0595P661J19618k8626J16701J7552
$$ y = [196912, 134886, 251051, 243018, 350757, 486316, 450617, 209487, 238936, 247869, 399579, 431958, 430472, 599506, 524377, 456053, 420474, 314931, 413398, 439195, 378735, 357765, 280290, 389948, 384532, 379492, 414995, 394664, 303004, 266706, 254475, 247604, 230819, 125574, 153170, 232612, 329007, 268809, 243899, 316556, 317651, 378419, 367089, 363813, 322890, 313370, 270161, 312595, 368429, 431385, 324506, 253683, 383943, 411038, 472010, 338291, 255831, 310484, 406015, 443485, 502023, 519959, 565394, 511783, 497015, 561346, 542373, 688689, 747612, 789948, 610450, 472436, 553601, 556854, 542069, 586621, 710409, 639666, 545127, 614293, 764060, 810181, 791588, 835938, 860623, 921218, 928879, 1048497, 1019871, 1136572, 1154124]
4082A154124l1266J25042K12234L1830J51589J81335P5431J42571j0021J59062
4072B191931K52334J14417J46242J86489J99650K80977K67603K19350K70708L07133
4062D436834M12948M55692N27869N25828O62571P80104R53496P54592M46960J98108
4052A0155002j44828k43696n07128o75031o07723o21729m91714n95718m63843
4043E803592l37937l33672l39264m27779k52905k26119k33925k21512k23786j01417
4033C105276K6768j20909k20182r8701o7801p8732j86531j95009q2674j73351
4023A908154j72885m2327J27472k11473Q7189p2823j22096j02096k8112j04415
4013A266588l9782j0396Q9485L3634n2212m2636P7708o1713r0793J07040o6383
$$ y = [1154124, 1122858, 1247900, 1460134, 1491964, 1643553, 1824888, 1900319, 2042890, 2032869, 2191931, 2444265, 2558682, 2704924, 2891413, 3091063, 3372040, 3639643, 3858993, 4129701, 4436834, 4849782, 5305474, 5833343, 6359171, 7021742, 7801846, 8755342, 9509934, 9956894, 10155002, 10010174, 9766478, 9259350, 8584319, 7976596, 7354867, 6863153, 6267435, 5803592, 5465655, 5131983, 4792719, 4364940, 4112035, 3885916, 3651991, 3430479, 3206693, 3105276, 3132044, 3011135, 2790953, 2692252, 2624451, 2545719, 2359188, 2164179, 2081505, 1908154, 1735269, 1692942, 1820414, 1608941, 1696130, 1623307, 1501211, 1399115, 1371003, 1266588, 1226806, 1216410, 1305895, 1339529, 1287317, 1244681, 1322389, 1260676, 1169883, 1276923, 1210540]
4002A210540J81305L2277R1194O8390N3729j3492q8261j94231j13269J03450r7347
3991A234285p4986M7442j13683o8688q2229J6680O7219p1244j66689O7462Q70
3980H56439m7342P7992m8880j34800m040O7478l3448J3303M9040j29415n5740
3969F10587N5493Q450Q6662p3768J3697L7542p1519R7907p353P5662O6946M7591
3957I47897R0222m9217P3347J13491R369J0790N2543R419O4563O8367K791J7608
3945A411190P9480j2538K9527l7192k9918Q486n3825o9607p9387j02964J03081
3934A246333n9380K057j55875q3039n5255p0838R7021L2131R278j19225l3149
3923H10059J17758K6755j56209K408m4611N2964O4515J75894l4337j20723n3872
$$ y = [1210540, 1391845, 1424122, 1515316, 1583706, 1637435, 1623943, 1535682, 1341451, 1228182, 1331632, 1234285, 1159299, 1206741, 1093058, 1024370, 942141, 958821, 1026040, 954796, 788107, 855569, 856439, 809097, 887089, 838209, 703409, 699369, 766847, 733399, 746702, 795742, 666327, 610587, 666080, 674530, 761192, 687424, 701121, 738663, 667144, 765051, 757698, 833360, 900306, 947897, 1038119, 988902, 1062249, 1175740, 1185109, 1195899, 1248442, 1257861, 1322424, 1390791, 1393582, 1411190, 1490670, 1478132, 1507659, 1470467, 1440549, 1449035, 1395210, 1325603, 1246216, 1143252, 1246333, 1186953, 1189010, 1033135, 950096, 894841, 824003, 921024, 953155, 962433, 843208, 810059, 927817, 954572, 798363, 800771, 756160, 809124, 873639, 1049533, 1015196, 894473, 840601]
3912H40601J35465j22411j50010k1017n8348p661L9119k5644j71312L666p2491
3901C89957l8413N2973j3792j2529j49234P8070O7689o2690J4698R9270J7422
3890D43421m4907R0726p9092j04251l8943l3999P0902M3120m8330O3473J4434
3879C76554P4968j58791j26934O8446P1361P7940m6535j2376l5140O5728O2744
3868D17965j8438j23635J6662O5074L9262m5980M9121L208m9302K8918n5733L1223
3856C58345L3849L8896o4519J4345m4550M8712j7383j9620M4029j0627n8136O0820
3844C84161r9012Q3326M0671k2918q1221r7378Q6664O2869j01590P0816R9732
3833D26120l0496j16000p2042J09360P1599K8980p3266m0592j00217M583J00347
$$ y = [840601, 976066, 853655, 703645, 682628, 624280, 616619, 655738, 630094, 458782, 462448, 389957, 351544, 404517, 390725, 378196, 228962, 307032, 374721, 312031, 326729, 425999, 443421, 398514, 489240, 410148, 305897, 266954, 232955, 303857, 346977, 298647, 362120, 376554, 451522, 292731, 165797, 234243, 305604, 383544, 337009, 324633, 289493, 355221, 417965, 399527, 275892, 292554, 357628, 396890, 350910, 400031, 403239, 353937, 382855, 327122, 358345, 392194, 431090, 366571, 380916, 336366, 385078, 367695, 348075, 392104, 381477, 323341, 384161, 285149, 368475, 409146, 386228, 305007, 207629, 294293, 357162, 255572, 326388, 426120, 395624, 279624, 207582, 316942, 388541, 417521, 344255, 303663, 203446, 208029, 308376]
3822C08376N8530o4703N5391L2190M3927o9566M7672m819Q9053P3620q6469l8235
3810D44967M7780r1493j48535J28078P7892k34435J02913O1045L5100k0734j23032
3799B79546L6270P3937j4077K6420o2970J2425j607l1192J07510N9195m9729P5911
3787E11639J18059j1429j480L5534j02028j01272K04364j29547L2963N5265j27423
3776D84645N60Q8517k842J25048j31871n5516j08474k2209R6789J67842N9978
3765G02467l7611k752p063o9351j16114M0561N4792q0520k4490k4932K3222K3298
3753D81507j05798L5411O6962q0472J44534M8043k0690P7586N0341R9805j54835
3742F42394k09264J3948K1265N1428K11129K0148m3903J0527m9464p6838J6000
$$ y = [308376, 366906, 302203, 357594, 389784, 433711, 364145, 411817, 406998, 496051, 569671, 483202, 444967, 492747, 401254, 252719, 380797, 458689, 224254, 327167, 388212, 423312, 402578, 279546, 315816, 389753, 375676, 402096, 339126, 351551, 349944, 318752, 426262, 485457, 435728, 511639, 629698, 618269, 616789, 652323, 550295, 449023, 653387, 523840, 556803, 612068, 484645, 485205, 573722, 570880, 695928, 564057, 508541, 400067, 377858, 474647, 642489, 702467, 664856, 662104, 655041, 585690, 469576, 510137, 564929, 484409, 459919, 434987, 458209, 481507, 375709, 411120, 478082, 397610, 542144, 590187, 569497, 647083, 697424, 797229, 642394, 433130, 447078, 468343, 519771, 730900, 751048, 707145, 717672, 668208, 591370, 607370]
3731F07370J07319J8460M368l4600j02757J65513M3359o0817M3650n9774j8406
3720G13685M4347M2922K1311j16029J25104P7985j05052j9475J56817r540j17296
3709H14779K5775M2174n3598n4693m4980R2206k1757m2349Q2238m9232m7033R9930
3697H43460J17871N2756o1688j28299q7830P0651K2365k6345n5422M0728k1734
3686G66513J07235o4541L4118N6748p5366r7525P0323J48374j39135J02455N9926
3675I69125n9935L6917l9761j80430Q2453N4070J9378o093O8895n4083p6128O8751
3663H83159l8252p428j1281j5854M8249k1451O6900L6151l4103K5981M2841M1160
3651A016072k7171k0990j0090N7284P9609o3557M5758k2396j26401P5543m4473
$$ y = [607370, 714689, 733149, 737517, 702917, 600160, 765673, 809032, 748215, 791865, 732091, 713685, 758032, 800954, 822265, 706236, 831340, 909325, 804273, 784798, 941615, 932075, 814779, 840554, 882728, 829130, 774437, 729457, 821663, 799906, 757557, 839795, 790563, 743530, 843460, 961331, 1014087, 952399, 824100, 736270, 806921, 829286, 802941, 747519, 788247, 766513, 873748, 809207, 843325, 900073, 824707, 727182, 797505, 945879, 806744, 909199, 969125, 909190, 946107, 906346, 725916, 808369, 862439, 881817, 875724, 944619, 890536, 814408, 883159, 844907, 837479, 826198, 810344, 858593, 837142, 904042, 940193, 906090, 932071, 974912, 1016072, 988901, 967911, 957821, 1015105, 1094714, 1031157, 1076915, 1054519, 928118, 1003661, 959188]
3640I59188m6441K2541O1450q6391n2775O1556l9175o5726K7859L1147N0081J6795
3628I40109o1611J01898o7587l7821O8062Q1592L3927L3452l3427j7597j27005
3617I13992N8574r1576q0667m5032R3462L9563r635J39058q0643l7118n544N2805
3605I47239L6474k4036M7595L496O8168K1735J9770J8250k7032k0836K6158J7805
3593A134786O8910K9878j09119J01687n9633J01121n7392j9356N9768P9801o4681
3582A265770K9992R46j400Q8266j10382j34549J26445J58070m1758M3233J9798
3571A444431k7356J48455N2580M4203j39295j14093J92607R2330O7062j70114
3561A590810m1037k6309J46806k0277j89047j386K02433l8718O1938J303J491
$$ y = [959188, 912747, 935288, 996738, 910347, 857572, 919128, 879953, 814227, 842086, 873233, 923314, 940109, 878498, 980396, 912809, 874988, 943050, 1024642, 1058569, 1092021, 1058594, 1040997, 913992, 972566, 880990, 800323, 755291, 848753, 888316, 878681, 1017739, 937096, 899978, 894434, 947239, 983713, 959677, 1007272, 1010768, 1078936, 1100671, 1120441, 1138691, 1111659, 1090823, 1116981, 1134786, 1203696, 1233574, 1124455, 1226142, 1166509, 1267630, 1210238, 1190882, 1250650, 1330451, 1265770, 1295762, 1296708, 1295308, 1383574, 1273192, 1138643, 1265088, 1423158, 1381400, 1424633, 1444431, 1417075, 1565530, 1618110, 1662313, 1523018, 1408925, 1601532, 1693862, 1760924, 1590810, 1549773, 1523464, 1670270, 1649993, 1460946, 1459560, 1661993, 1623275, 1685213, 1686516, 1688007]
3550A688007Q9194J1916K5446J39063R1510o6244Q0063R0617J30482R901K0809
3539B310764m0669j31842J30554K31347o0173j1103N7778P8701M1240J10247J37239
3528B854083R0705P9959K2504j52334J09495j7376J74041J45930J78033J07002
3518C592042J5314l5431M294K44983l749J57903J56540O6900J02256J81087O4237
3507D546376J11671R7960J56659J59638J50234K8534O0392J12448J16583K34569
3497E775064K29745J78907J85318J79012J76439L31693R9492K46765L39334J55119
3487G896888K32923J19752K27302K43126K30495K51409K61039K25496J31211J25262
3477I944903J64126J39602K72237L27067K31762L11818K45865K43891K38907L75730
$$ y = [1688007, 1777201, 1789117, 1814563, 1953626, 2045136, 1978892, 2058955, 2149572, 2280054, 2289955, 2310764, 2270095, 2138253, 2268807, 2500154, 2439981, 2428878, 2486656, 2565357, 2606597, 2716844, 2854083, 2944788, 3024747, 3047251, 2894917, 3004412, 2987036, 3161077, 3307007, 3485040, 3592042, 3607356, 3571925, 3576219, 3821202, 3817453, 3975356, 4131896, 4198796, 4301052, 4482139, 4546376, 4658047, 4756007, 4912666, 5072304, 5222538, 5251072, 5311464, 5423912, 5540495, 5775064, 6004809, 6183716, 6369034, 6548046, 6724485, 7056178, 7155670, 7402435, 7741769, 7896888, 8129811, 8249563, 8476865, 8719991, 8950486, 9201895, 9462934, 9688430, 9819641, 9944903, 10109029, 10248631, 10520868, 10847935, 11079697, 11391515, 11637380, 11881271, 12120178, 12495908]
3467A2495908M32618L64759M96353L30003M42062O15823N32009M45197M75281
3458A6630013N37719M73052O19362O73202O34231N07917N28796N97980O74602
3449B1876874N37003O03899Q66963N23770N43861P54496N49343N62554P10762
3440B7529525Q63591J058293R45051P75729J043523J133402J196634J249885J184034
3431C6979667J292949J363494J588509J329643J341978J568518J527300J625459
3423D8617517J846504J852449J887232K127906K137061K389594K544831K485096
3415F5888190K441009K610154K424026K230388K010190J336648P97741L96271
3407H0134617j9563o20125j231003j838005j864697j997165k423830k466830k569101
$$ y = [12495908, 12928526, 13293285, 13789638, 14119641, 14561703, 15177526, 15709535, 16154732, 16630013, 17167732, 17640784, 18260146, 18933348, 19567579, 20075496, 20604292, 21202272, 21876874, 22413877, 23017776, 23884739, 24408509, 24952370, 25706866, 26256209, 26818763, 27529525, 28393116, 29451409, 30396460, 31172189, 32215712, 33349114, 34545748, 35795633, 36979667, 38272616, 39636110, 41224619, 42554262, 43896240, 45464758, 46992058, 48617517, 50464021, 52316470, 54203702, 56331608, 58468669, 60858263, 63403094, 65888190, 68329199, 70939353, 73363379, 75593767, 77603957, 78940605, 79738346, 80134617, 80115054, 79494929, 78263926, 76425921, 74561224, 72564059, 70140229, 67673399, 65104298]
3398F5104298k475719k417444k410917k419755k355767k341130k251262k225527
3390D6206777k132405j975811j919413j928451j822526j719700j752993j714948
3382C1240530j613686j475953j375610j370716j335562j243634r58457r54212
3374B0912700j004731q35134q72853q15100p96871p46460n84879m69272o12377
3365A4175023o60338m39174m64446n98908l23579n32300n10995l91248l02381
3356I951654l31040l06755k32516l42313l28302j99896k75278k28691l48491k40417
3346G117955k79019k50306j74059j78213k52922l22577j94012j41524k7641j47050
3336E150632j27966l18682j70760j32476j04033j37406p567j44327j71861j52856
$$ y = [65104298, 62628579, 60211135, 57800218, 55380463, 53024696, 50683566, 48432304, 46206777, 44074372, 42098561, 40179148, 38250697, 36428171, 34708471, 32955478, 31240530, 29626844, 28150891, 26775281, 25404565, 24069003, 22825369, 21866912, 20912700, 19907969, 19072835, 18199982, 17384882, 16588011, 15841551, 15256672, 14787400, 14175023, 13514685, 13075511, 12611065, 12012157, 11688578, 11156278, 10645283, 10254035, 9951654, 9620614, 9313859, 9081343, 8739030, 8410728, 8210832, 7935554, 7706863, 7358372, 7117955, 6838936, 6588630, 6414571, 6236358, 5983436, 5660859, 5466847, 5325323, 5297682, 5150632, 5022666, 4703984, 4533224, 4400748, 4296715, 4159309, 4151742, 4007415, 3835554, 3682698]
3326C682698m0146q4666j77075k4408n8806j96814n8667K5918k3028j69344j70656
3315B705006n7307l1100J04423j09407l2032o0550M4476r1204j25692M7111j52423
3304B241301p4792k4178j2162J20105J2915j73326j36388m3012k979q9342l9391
3293A778751P1004n3814j1313L2914k5588j348r6483m8482J37163r1075L0586
3282A722315n5097j74363j6237J63300O6428j9471P4877J66026j74925j76484
3272A576369O8885Q4274q4646n801l1333j8821o5981o9487Q529p7552j5093p4064
3260A295279J52646J32443n0229k78272J45815j00474q6022J28695M1805R7563
3250A479249j46970l3617J511o1305J8091P3942o1135L4140P8056p9726J67229
$$ y = [3682698, 3642552, 3557886, 3380811, 3356403, 3297597, 3100783, 3042116, 3068034, 3045006, 2875662, 2705006, 2647699, 2616599, 2721022, 2611615, 2579583, 2519033, 2563509, 2472305, 2346613, 2393724, 2241301, 2166509, 2142331, 2130169, 2250274, 2263189, 2089863, 1953475, 1910463, 1907484, 1818142, 1778751, 1849755, 1795941, 1784628, 1817542, 1791954, 1790606, 1694123, 1645641, 1782804, 1691729, 1722315, 1667218, 1492855, 1476618, 1639918, 1706346, 1686875, 1761752, 1927778, 1752853, 1576369, 1645254, 1729528, 1644882, 1639081, 1607748, 1588927, 1522946, 1453459, 1461988, 1384436, 1369343, 1295279, 1447925, 1580368, 1530139, 1251867, 1397682, 1297208, 1211186, 1339881, 1381686, 1479249, 1332279, 1298662, 1300173, 1238868, 1256959, 1330901, 1269766, 1303906, 1381962, 1302236, 1469465]
3239A469465J61370J5243m3387K1494p6730l9233M3224J5189j00627p5878j5558
3228A374572K6523l2018n60n1866P5331L5372N6141q650j403j07250J01858R9673
3216A567723j19284p4364J31377J61611J5797p896p7625o6872J2617K0470m1281
3205A522273J58565j3563l5782J31285q5465m9644k105j35408l529J56421R8227
3194A741275n7416J36670k543M0301O6477k3218R2069N3913r8567k9857J9040
3183A938144r4031M588J23213N6282K1952P1389J50929j8257k3572O5996J05421
3172B402054M6781K6748N4457M1945n1561Q7548J41768K5773J70659m1707M7778
3161B952243K90323r3803R5072J35970l3522k3287J16520J09972K6570Q8812J66875
$$ y = [1469465, 1630835, 1646078, 1602691, 1624185, 1547455, 1508222, 1551446, 1566635, 1466008, 1390130, 1374572, 1401095, 1369077, 1368517, 1316651, 1391982, 1427354, 1483495, 1474845, 1473442, 1366192, 1468050, 1567723, 1448439, 1374075, 1505452, 1667063, 1682860, 1674964, 1597339, 1530467, 1543084, 1563554, 1522273, 1680838, 1667275, 1631493, 1762778, 1677313, 1627669, 1625564, 1490156, 1486627, 1643048, 1741275, 1683859, 1820529, 1817986, 1858287, 1924764, 1901546, 1993615, 2047528, 1948961, 1919104, 1938144, 1844113, 1848701, 1971914, 2028196, 2050148, 2121537, 2272466, 2254209, 2230637, 2296633, 2402054, 2448835, 2475583, 2530040, 2571985, 2520424, 2607972, 2749740, 2775513, 2946172, 2904465, 2952243, 3242566, 3148763, 3243835, 3379805, 3346283, 3322996, 3439516, 3549488, 3576058, 3664870, 3831745]
3150C831745k4019N6047O2528J97311J80764J25817J6556J79144J90998N6617
3140D873508J39899R8993O3771J82036J76736K49421L27911J73076O7692L03243
3130F656286K11438J65042L18114L56975M17170L56365K77937K28939L92286L58766
3120I739318L73800N60306N91625N85806N81421M49031O12826N98088Q01276Q10220
3110A5703717Q38227Q63660R18326R66729R53923R28468J134729J230036J189561
3101B4727376J215232J364878J132801R54497R64530R97798P46686O24939N12129
3092C3240866M06026N16582M34985N15506L54902M74955M65448M38371M64966
3083C7312607M60009N23967O33265O69642P11746Q25285R07479J029631J252606
$$ y = [3831745, 3807726, 3863773, 3926301, 4123612, 4304376, 4430193, 4446749, 4625893, 4816891, 4873508, 5013407, 5112400, 5176171, 5358207, 5534943, 5784364, 6112275, 6285351, 6353043, 6656286, 6867724, 7032766, 7350880, 7707855, 8125025, 8481390, 8759327, 8988266, 9380552, 9739318, 10113118, 10673424, 11265049, 11850855, 12432276, 12881307, 13494133, 14092221, 14893497, 15703717, 16541944, 17405604, 18323930, 19290659, 20244582, 21173050, 22307779, 23537815, 24727376, 25942608, 27307486, 28440287, 29394784, 30359314, 31357112, 32103798, 32728737, 33240866, 33646892, 34163474, 34598459, 35113965, 35468867, 35943822, 36409270, 36847641, 37312607, 37772616, 38296583, 38929848, 39599490, 40311236, 41136521, 42044000, 43073631, 44326237]
3074D4326237J516922J769524J874835J783794J760362J422467N71223j98772
3066E4826592p29899j606676k069675k113332k161550k161592k120182k070719
3058C9792967j727819j690240j529568j257423j160774j237925r44908q02398
3050B9441912p03892n67776k80021l51149k85243l07626j78549k8274L9162P0366
3040B6848910r8306l19813m25669k36754o28556q66188q98645r49956j029600
3031B1395423j099912j018666j108153r72135j055704r80676q50538q19988q79990
3022A2609661o08468n38620q52594o70621n98877l76961m35788m04896n24377
3013G598459l98089m39573k08976m49508k21699j29628l04002k78158j89951k29943
$$ y = [44326237, 45843159, 47612683, 49487518, 51271312, 53031674, 54454141, 55025364, 54826592, 54096693, 52490017, 50420342, 48307010, 46145460, 43983868, 41863686, 39792967, 38065148, 36374908, 34845340, 33587917, 32427143, 31189218, 30244310, 29441912, 28738020, 28170244, 27890223, 27539074, 27253831, 26946205, 26767656, 26739382, 26778544, 26848910, 26750604, 26430791, 26005122, 25768368, 25139812, 24273624, 23374979, 22425023, 21395423, 20295511, 19276845, 18168692, 17196557, 16140853, 15160177, 14309639, 13489651, 12609661, 12001193, 11462573, 10609979, 9939358, 9340481, 8963520, 8527732, 8122836, 7598459, 7200370, 6760797, 6551821, 6102313, 5880614, 5750986, 5446984, 5168826, 4978875, 4748932]
3003D748932j55975j37313k80168k26440j52375j32082q6137k01984k64141p5771
2993C036546r2807j7539q8475q4656p6482j08130q5781j08341p3836m811j11136
2982B184552j47228O8890j57342j36583j2576j50268m3218J978l1286j9021j45121
2971A412777P7721J9205j47538q2349L5491K5922j02032L565r7743O3511k7461
2960A181069n7136j16022q6283m0081j48774J32106L8863j77250J20653P7566
2950I24711j29610j26105k4515P8870K5486P9891m4998j65385m0181N1284N971
2939F35419R092L6043r0698m0006M994k6096j6406p0061k7054j05334P3419Q6316
2927D69628j29633O992j7538k749P870M4431m1655m3513J35934m8514j20249j4468
$$ y = [4748932, 4592957, 4455644, 4175476, 3949036, 3796661, 3664579, 3578442, 3376458, 3112317, 3036546, 2943739, 2926200, 2837725, 2753069, 2676587, 2568457, 2482676, 2374335, 2300499, 2295688, 2184552, 2037324, 2106214, 1948872, 1812289, 1799713, 1649445, 1606227, 1608205, 1576919, 1557898, 1412777, 1490498, 1509703, 1362165, 1279816, 1315307, 1341229, 1239197, 1242762, 1145019, 1208530, 1181069, 1123933, 1007911, 921628, 881547, 732773, 864879, 903742, 726492, 847145, 924711, 795101, 668996, 644481, 723351, 748837, 828728, 783730, 618345, 578164, 629448, 635419, 644511, 680554, 589856, 549850, 554844, 528748, 512342, 442281, 415227, 309893, 383312, 469628, 339995, 346987, 329449, 326700, 334570, 379001, 337346, 293833, 429767, 381253, 261004, 246536]
2915B46536o3562J2036N1214P9648P3452k10481l4200j13634k8592L9653M9883
2904A01953J66951J8661k729R2765j34788j68589L9717q2623J08688J5003N1699
2893B06708N533j06827j62297P6374N9711K6409p3541K1245j5242n9302q675j5230
2881d5134P2689o0090j14830N0704J32425P0364O7872n6163L8005Q7344j13151
2870A30035m590l0642k2195j13604k8818J08884M8344O7230j79124j02096J44048
2859A7472J981k1649J7405l0231l9881Q2384Q1985l183r7889Q391N4430q6896
2847a5681M0638J2703q5090K8199Q0316P1088M0382j53237j17343J7990N2071
2836b7964j25720J4001J08367j4838o45J13738r8089K5694p772J07371P1632j20685
$$ y = [246536, 182974, 195010, 246224, 325872, 399324, 188843, 154643, 41009, 12417, 52070, 101953, 268904, 287565, 284836, 377601, 242813, 74224, 113941, 31318, 140006, 155009, 206708, 212241, 105414, -56883, 19491, 79202, 105611, 32070, 53315, 38073, -21229, -29904, -45134, 27555, -32535, -147365, -96661, 35764, 106128, 174000, 117837, 155842, 243186, 130035, 125445, 94803, 72608, -40996, -69814, 39070, 87414, 154644, -24480, -126576, 17472, 19453, -2196, 15209, -15022, -54903, 27481, 109466, 106283, 8394, 16785, 71215, -15681, 24957, 37660, -47430, -19231, 61085, 132173, 172555, 19318, -98025, -80035, -27964, -153684, -139683, -31316, -46154, -46799, 66939, -31150, -5456, -13228, 94143, 165775, 45090]
2824D5090p9622K2856j0853Q8826P4952j7632o7034O7262J63021r0424K0010p9342
2812A37110j00176K5390r3649J68784P677p9979Q9824P183q7660l2152J13548
2801A55900m2646P6755J08427q3443n602q3174r0426q770P5049q5033J19478M5313
2789A81828k3655Q1966J8197R8358r0307L8673p9401l6901Q4437m0958n8945k4903
2777A48389M7283j657r2552j6430j7957J04057L5460k0972j16943O1111K0263
2766A50052j4376l4927j3989J1399N0690j08533N4009N8382L472j16126l1882
2755H171J06973K6682j0996m0155j71055J1607K6663k0464q4844J77417j3032
2744A6967j2021Q8404n6474l0086j38551q0428l706J49341j3089R1899L1010n4352
$$ y = [45090, -34532, -11676, -22529, 66297, 141249, 123617, 56583, 123845, 286866, 196442, 216452, 137110, 36934, 62324, -31325, 137459, 145136, 65157, 154981, 162164, 74504, 42352, 155900, 113254, 190009, 298436, 214993, 209391, 126217, 35791, 27021, 102070, 17037, 136515, 181828, 158173, 240139, 258336, 356694, 266387, 305060, 225659, 188758, 273195, 232237, 173292, 148389, 195672, 194015, 101463, 85033, 67076, 171133, 206593, 185621, 68678, 129789, 150052, 135676, 100749, 86760, 98159, 148849, 40316, 94325, 152707, 156179, 40053, 8171, 115144, 141826, 130830, 90675, -80380, -68773, -42110, -62574, -147418, 29999, 16967, 4946, 93350, 36876, 6790, -131761, -212189, -215895, -66554, -79643, 12256, 43266, -11086]
2732a1086M4059m5171j19645M3155j31837R8419m8878J18365q0832q6683P8179
2721a41955J86054j08954n4167o9476M7150O6405n2627N0762q9507M9203Q9723
2710b7389L0892j40793j12620J02443L6427k6654j5633K5095M0496M3380o4829
2699a09185n5746q0244M9616J91730j25748M0779q5018j48665J76748R426o0018
2688a96325o2541Q070N0972r2887Q8762k1881j6527J29206j1423l7726j17792
2677b80092k1016O8042o3989R5581P0522Q0611r1324J53197R470j03316p7841
2666a60155j2040O1929Q7452L5352j15313p7609m837J71060j29604q8704l1377
2655b63846j5831R1849N6405P4473n1836J381M4268J06422n0590n4210L999k6655
$$ y = [-11086, 32973, -12198, -131843, -88688, -220525, -122106, -170984, -52619, -133451, -220134, -141955, 44099, -64855, -119022, -188498, -141348, -74943, -127570, -76808, -166315, -117112, -27389, 3503, -137290, -249910, -147467, -111040, -137694, -153327, -128232, -87736, -44356, -109185, -164931, -245175, -195559, -3829, -129577, -88798, -173816, -322481, -145733, -136307, -196325, -258866, -250796, -199824, -292711, -203949, -225830, -242357, -113151, -124574, -162300, -280092, -301108, -233066, -297055, -201474, -130952, -50341, -141665, 11532, 21002, -82314, -160155, -172195, -110266, -22814, 12538, -102775, -180384, -185221, -14161, -143765, -232469, -263846, -279677, -187828, -131423, -56950, -108786, -107405, -63137, 43285, -7305, -61515, -57516, -84171]
2643h4171o8752p8075M1087k3250O6683J7782j477P766j5694p5406o658o9930
2631b90095J1113J28903l5453K6762m1946N4194m1550j05118q724L3544j12928
2620c81298m7159J04882J29996Q9985k9147j8211M3305p4082j32478O1290J3829
2609b39088j08M9295J7693l51J85465n07j86588k6972l5533K1302J11691L7505
2597f6196k6943o3717M8999J4837m6812j0338j6999L4759J08486j95237o963P7356
2585a48768N00K9078l7801l0075R3779L686j9447o8053r1516J77468K7701p0092
2573a33540K7697J1008k2785Q881n3156l4509r9801J1440Q5990M8233J0399k7850
2561a67993O2787q5762j81528R8559O8069J27686l4170L714J3138L7409j8834
$$ y = [-84171, -152923, -230998, -189911, -213161, -146478, -128696, -130173, -122407, -138101, -213507, -220165, -290095, -278982, -150079, -185532, -158770, -200716, -146522, -188072, -293190, -301914, -268370, -381298, -428457, -323575, -193579, -103594, -132741, -150952, -107647, -181729, -314207, -252917, -239088, -239196, -189901, -172208, -172559, 12906, 12399, -174189, -201161, -236694, -215392, -103701, -66196, -93139, -156856, -107857, -93020, -139832, -150170, -167169, -132410, -23924, -219161, -226124, -148768, -148268, -119190, -156991, -187066, -93287, -89601, -109048, -177101, -268617, -91149, -63448, -133540, -105843, -94835, -117620, -108739, -161895, -196404, -296205, -284765, -198775, -150542, -140143, -167993, -105206, -190968, -372496, -273937, -205868, -78182, -112352, -108638, -95500, -58091, -76925]
2550g6925m5351m9956J02606M6973l4974o6773r851j08924l2596J88395r228J6499
2538h0105j04918n8136K8402M6528P977q424L3114j6276l6795R2302J1581N0j01276
2525a85976M2523p1837l5459L0786J44137n3971l0207Q1124P3929o2919O6151
2514a719J5910j33687J6933L1014p2076j22538N6640k6259k0666M2088r7653J00465
2502b11548K541L1654j7294k4819M6577l3973N5963l5835k4612m600M249J51941
2490e9756N6399j08125r9690j12501J11013J1397O8867o1865O223M1959k5100
2479a71179j2704j24267K0581k224l5760J88432n1120K2838J4487O1670m7029
2468a36275l1482l7426R5376q8953p6888K4391J556k6958R7482R7949r2534n3812
$$ y = [-76925, -122276, -172232, -69626, -22653, -57627, -124400, -134251, -243175, -275771, -87376, -96604, -80105, -185023, -243159, -214757, -168229, -160252, -168676, -135562, -151838, -188633, -96331, -84750, -84700, -185976, -143453, -215290, -250749, -219963, -75826, -129797, -160004, -78880, -4951, -67870, -1719, 14191, -119496, -102563, -71549, -143625, -266163, -209523, -235782, -256448, -214360, -312013, -211548, -209007, -177353, -194647, -219466, -172889, -206862, -150899, -186734, -211346, -215946, -211697, -59756, -3357, -111482, -211172, -323673, -212660, -201263, -132396, -194261, -188038, -146079, -171179, -183883, -308150, -287569, -289793, -325553, -137121, -188241, -165403, -150916, -89246, -136275, -167757, -205183, -109807, -198760, -275648, -251257, -249701, -276659, -179177, -81228, -173762, -227574]
2456b27574M4358J8451J12626L6122l1041n0690j29931Q0095l2321j3844N1593
2445a42156J2873L1124q9320q0381l4034O3406R3883K1731N3090k3501R1444R734
2433G893j3857j68914n4617J0123Q6768m4Q7547Q340k03039K2298Q6640j3809
2421a44671N2963J595L1410k07203J5101J22823l5649J44598K725J0404J4287
2410H383r607k4784l5831j121q7201J2858K3992p7671Q0033J23746R5982l1476
$$ y = [-227574, -183216, -164765, -52139, -16017, -47058, -97748, -227679, -147584, -179905, -193749, -142156, -129283, -98159, -187479, -267860, -301894, -238488, -144605, -122874, -69784, -93285, -1841, 7893, -5964, -174878, -229495, -219372, -132604, -132648, -45101, -36761, -239800, -217502, -130862, -144671, -91708, -90113, -58703, -265906, -250805, -127982, -163631, -19033, -16308, -5904, 8383, -1224, -26008, -61839, -62960, -150161, -137303, -113311, -190982, -110949, 12797, 108779, 77303]
$$ [...]
##END NTUPLES=NMR SPECTRUM
##END=
