##TITLE=1H_CA-9334-1
 200.13MHz,DMSO-d6,
 8 sc
 
 29.4.2025
##JCAMPDX= 6.0         $$ Bruker NMR JCAMP-DX V2.0
##DATA TYPE= NMR SPECTRUM
##DATA CLASS= NTUPLES
##ORIGIN= UXNMR, Bruker Analytische Messtechnik GmbH
##OWNER= pz
$$ XWIN-NMR		Version 3.5
$$ Tue Apr 29 14:28:57 2025 Russian Standard Time (UT+4h)  she@DPX200
##.OBSERVE FREQUENCY= 200.1313
##.OBSERVE NUCLEUS= ^1H
##.ACQUISITION MODE= SIMULTANEOUS
##.ACQUISITION SCHEME= undefined
##.AVERAGES= 8
##.DIGITISER RES= 18
##SPECTROMETER/DATA SYSTEM= spect
##.PULSE SEQUENCE= zg30
##.SOLVENT NAME= CDCl3
##.SHIFT REFERENCE= (INTERNAL, CDCl3, 0, 15.5386)
##AUDIT TRAIL= $$ (NUMBER, WHEN, WHO, WHERE, WHAT)
$$ ##TITLE= Audit trail, XWIN-NMR		Version 3.5
$$ ##JCAMPDX= 5.01
$$ ##ORIGIN= Bruker BioSpin GmbH
$$ ##OWNER= she
$$ F:/spectra/data/she/nmr/H-C/1/pdata/1/auditp.txt
$$ ##AUDIT TRAIL=  $$ (NUMBER, WHEN, WHO, WHERE, WHAT)
(   1,<2025-04-29 14:27:31.25 +0400>,<she>,<DPX200>,
      <created by zg, POWCHK disabled, PULCHK disabled
       configuration hash MD5:
       00 E9 B6 7A A2 85 ED C7 34 08 36 98 17 FE 4E 26
       data hash MD5: 16K
       D6 C7 04 67 4A F7 3F 28 08 AE E8 F4 B8 D9 FB BC>)
(   2,<2025-04-29 14:27:33.92 +0400>,<she>,<DPX200>,
      <Start of raw data processing
       efp BC_mod = 2 LB = 0.25 FT_mod = 6 PKNL = 1 PHC0 = -1186.207 PHC1 = 9.592211 SI = 16K 
       data hash MD5: 16K
       B0 6E DD E6 AF 8D 22 F7 98 0E D4 70 76 70 E9 E6>)
(   3,<2025-04-29 14:27:55.29 +0400>,<she>,<DPX200>,
      <pk PHC0 = -6.475657 PHC1 = 2.2 
       data hash MD5: 16K
       55 FF A1 D5 E3 1D 6D F5 87 AA BA 1A 32 D2 48 93>)
(   4,<2025-04-29 14:28:02.32 +0400>,<she>,<DPX200>,
      <abs ABSG = 5 
       data hash MD5: 16K
       A9 C9 E0 ED 6B 66 03 E2 3E 8A 0D 7B FD D7 29 9F>)
$$ ##END=
$$ 
$$ hash MD5
$$ EB 98 2C 95 40 04 EA 4A C7 8C 85 B1 79 F1 B7 19
##$RELAX= 
##$RELAX= 
##$RELAX= 
##$RELAX= 
##$RELAX= 
##$RELAX= 
$$ Bruker specific parameters
$$ --------------------------
##$DU= <F:/spectra>
##$EXPNO= 1
##$NAME= <H-C>
##$PROCNO= 1
##$TYPE= <nmr>
##$USER= <she>
##$AMP= (0..31)
100 100 100 100 100 100 100 100 100 100 100 100 100 100 100 100 100 100 
100 100 100 100 100 100 100 100 100 100 100 100 100 100 
##$AQSEQ= 0
##$AQ_mod= 1
##$AUNM= <au_zg>
##$AUTOPOS= <>
##$BF1= 200.13
##$BF2= 200.13
##$BF3= 200.13
##$BF4= 200.13
##$BF5= 200.13
##$BF6= 200.13
##$BF7= 200.13
##$BF8= 200.13
##$BYTORDA= 1
##$CFDGTYP= 0
##$CFRGTYP= 5
##$CHEMSTR= <none>
##$CNST= (0..31)
1 1 145 1 1 1 1 1 1 1 1 1 1 1 1 1 1 1 1 1 1 1 1 1 1 1 1 1 1 1 1 1 
##$CPDPRG= <>
##$CPDPRG1= <>
##$CPDPRG2= <>
##$CPDPRG3= <>
##$CPDPRG4= <mlev>
##$CPDPRG5= <mlev>
##$CPDPRG6= <mlev>
##$CPDPRG7= <mlev>
##$CPDPRG8= <mlev>
##$CPDPRGB= <>
##$CPDPRGT= <>
##$D= (0..31)
0 0.7 0 0 0 0 0 0 0 0 0 0.03 0 0 0 0 0 0 0 0 0 0 0 0 0 0 0 0 0 0 0 0 
##$DATE= 1745922450
##$DBL= (0..7)
120 120 120 120 120 120 120 120 
##$DBP= (0..7)
150 150 150 150 150 150 150 150 
##$DBP07= 0
##$DBPNAM0= <>
##$DBPNAM1= <>
##$DBPNAM2= <>
##$DBPNAM3= <>
##$DBPNAM4= <>
$$ [...]
##$SUBNAM3= <"">
##$SUBNAM4= <"">
##$SUBNAM5= <"">
##$SUBNAM6= <"">
##$SUBNAM7= <"">
##$SUBNAM8= <"">
##$SUBNAM9= <"">
##$SW= 18.0517328524113
##$SWIBOX= (0..15)
0 0 2 0 0 0 0 0 0 0 0 0 0 0 0 0 
##$SW_h= 3612.71676300578
##$TD= 16384
##$TD0= 1
##$TE= 0
##$TE2= 300
##$TE3= 300
##$TEG= 300
##$TL= (0..7)
0 120 120 120 120 120 120 120 
##$TP= (0..7)
150 150 150 150 150 150 150 150 
##$TP07= 0
##$TPNAME0= <>
##$TPNAME1= <>
##$TPNAME2= <>
##$TPNAME3= <>
##$TPNAME4= <>
##$TPNAME5= <>
##$TPNAME6= <>
##$TPNAME7= <>
##$TPOAL= (0..7)
0.5 0.5 0.5 0.5 0.5 0.5 0.5 0.5 
##$TPOFFS= (0..7)
0 0 0 0 0 0 0 0 
##$TUNHIN= 0
##$TUNHOUT= 0
##$TUNXOUT= 0
##$USERA1= <user>
##$USERA2= <user>
##$USERA3= <user>
##$USERA4= <user>
##$USERA5= <user>
##$V9= 5
##$VALIST= <valist>
##$VCLIST= <CCCCCCCCCCCCCCC>
##$VD= 0
##$VDLIST= <DDDDDDDDDDDDDDD>
##$VPLIST= <PPPPPPPPPPPPPPP>
##$VTLIST= <TTTTTTTTTTTTTTT>
##$WBST= 1024
##$WBSW= 4
##$XGAIN= (0..3)
0 0 0 0 
##$XL= 0
##$YL= 0
##$YMAX_a= 224278
##$YMIN_a= -306796
##$ZGOPTNS= <>
##$ZL1= 120
##$ZL2= 120
##$ZL3= 120
##$ZL4= 120
##$ABSF1= 15.48136
##$ABSF2= -2.570489
##$ABSG= 5
##$ABSL= 3
##$ALPHA= 0
##$AQORDER= 0
##$ASSFAC= 0
##$ASSFACI= 0
##$ASSFACX= 0
##$ASSWID= 0
##$AUNMP= <proc_1d>
##$AZFE= 0.1
##$AZFW= 0.1
##$BCFW= 0
##$BC_mod= 2
##$BYTORDP= 0
##$COROFFS= 0
##$CY= -3
##$DATMOD= 1
##$DC= 0
##$DFILT= <>
##$DTYPP= 0
##$F1P= 0
##$F2P= 0
##$FCOR= 1
##$FTSIZE= 16384
##$FT_mod= 6
##$GAMMA= 0
##$GB= 0
##$INTBC= 1
##$INTSCL= 3.241238e-09
##$ISEN= 128
##$LB= 0.25
##$LEV0= 0
##$LPBIN= 0
##$MAXI= 10000
##$MC2= 0
##$MEAN= 0
##$ME_mod= 0
##$MI= 1.114404
##$NCOEF= 0
##$NC_proc= -7
##$NLEV= 6
##$NOISF1= 3.799351
##$NOISF2= 2.8
##$NSP= 0
##$NTH_PI= 0
##$NZP= 0
##$OFFSET= 15.53865
##$PC= 1
##$PHC0= -1192.683
##$PHC1= 11.79221
##$PH_mod= 1
##$PKNL= yes
##$PPARMOD= 0
##$PSCAL= 0
##$PSIGN= 0
##$REVERSE= no
##$SF= 200.129996608282
##$SI= 16384
##$SIGF1= 3
##$SIGF2= 2
##$SINO= 0.751879
##$SIOLD= 32768
##$SREGLST= <19F.Aceton>
##$SSB= 0
##$STSI= 16384
##$STSR= 0
##$SW_p= 3612.71676300578
##$SYMM= 0
##$S_DEV= 0
##$TDeff= 16384
##$TDoff= 0
##$TI= <>
##$TILT= no
##$TM1= 0
##$TM2= 0
##$TOPLEV= 0
##$USERP1= <user>
##$USERP2= <user>
##$USERP3= <user>
##$USERP4= <user>
##$USERP5= <user>
##$WDW= 1
##$XDIM= 16384
##$YMAX_p= 314748431
##$YMIN_p= -692543
$$ End of Bruker specific parameters
$$ ---------------------------------
##NTUPLES= NMR SPECTRUM
##VAR_NAME=  FREQUENCY,     SPECTRUM/REAL,   SPECTRUM/IMAG
##SYMBOL=    X,             R,               I
##VAR_TYPE=  INDEPENDENT,   DEPENDENT,       DEPENDENT
##VAR_FORM=  AFFN,          ASDF,            ASDF
##VAR_DIM=   16384,         16384,           16384
##UNITS=     HZ,            ARBITRARY UNITS, ARBITRARY UNITS
##FACTOR=    0.220516191357247, 1,           1
##FIRST=     3109.74988354415, 0,            0
##LAST=      -502.966879461625, 0,           0
##MIN=       -502.966879461625, -692543,     0
##MAX=       3109.74988354415, 314748431,    0
$$ Real data points
##PAGE= N=1
##DATA TABLE= (X++(R..R)), XYDATA
$$ [...]
$$ plain form
9579 6668775 6511176 6375999 6380252 5930020 5551950 5719307 5659838 5497448 5583023 5616970
9569 5616970 5602457 5613407 5324334 5127428 5105684 5039911 5349064 5357465 4930777 4878795 5052981
9558 5052981 4994540 4712186 4971620 5184575 5293249 5033363 5123700 4978819 4994500 5066546
9548 5066546 5174609 5191385 4893398 4804649 4667988 4923362 4753496 4935110 5145813 5221338
9538 5221338 5311115 5351525 5326615 5087971 5370333 5329127 5071027 5335686 5634409 5620365
9528 5620365 5794954 6119014 5939788 5688083 5848249 5965200 6006583 6147630 6113494 6104671
9518 6104671 5958832 6201397 6321705 5909638 5968925 5974390 5727715 5701358 5565209 5345950
9508 5345950 5458969 5362917 5498735 5531985 5464164 5569760 5654451 5605915 5839653 5757289 5892021
$$ packed form
9579F668775j57599j35177M253m50232l78070J67357n9469j62390Q5575L3947
9569E616970j4513J0950k89073j96906k1744o5773L09153Q401m26688n1982J74186
9558E052981n8441k82354K59434K12955J08674k59886R0337j44881J5681P2046
9548E066546J08063J6776k97987q8749j36661K55374j69866J81614K10703P5525
9538E221338Q9777M0410k4910k38644K82362m1206k58100K64659K98723j4044
9528E620365J74589L24060j79226k51705J60166J16951M1383J41047l4136q823
9518F104671j45839K42565J20308m12067N9287N465k46675k6357j36149k19259
9508E345950J13019r6052J35818L3250o7821J05596Q4691m8536K33738q2364J34732
$$ plain form
9497 5892021 5694207 5499791 5551892 5433888 5457884 5633755 5675757 5543876 5568934 5615890
9487 5615890 5574154 5540520 5705426 5702190 5628126 5647219 5687691 5867164 5682297 5557631 5678401
9476 5678401 5840526 5811366 5753089 5711689 5523642 5755919 5844902 5934611 5632868 5587939 5715500
9465 5715500 5711432 5742512 5947916 6099609 6018144 5830562 6077192 6370260 6425860 6350084 6129436
9454 6129436 6119284 5937659 5992983 5983277 6017027 5877476 5730432 5920939 6291949 6160381
9444 6160381 6057963 6193029 6344994 6296277 6078279 6396196 6194928 6214473 6407035 6542304
9434 6542304 6296257 6531463 6335126 6119131 6307984 6290710 6388177 6428671 6360093 6411825
9424 6411825 6463173 6665774 6722707 6809668 6770078 6559954 6618295 6567397 6427346 6519214 6717273
$$ packed form
9497E892021j97814j94416N2101j18004K3996J75871M2002j31881K5058M6956
9487E615890m1736l3634J64906l236p4064J9093M0472J79473j84867j24666J20770
9476E678401J62125k9160n8277m1400j88047K32277Q8983Q9709l01743m4929J27561
9465E715500m068L1080K05404J51693q1465j87582K46630K93068N5600p5776k20648
9454F129436j0152j81625N5324r706L3750j39551j47044J90507L71010j31568
9444F160381j02418J35066J51965m8717k17998L17917k01268J9545J92562J35269
9434F542304k46047K35206j96337k15995J88853j7274R7467M0494o8578N1732
9424F411825N1348K02601N6933Q6961l9590k10124N8341n0898j40051R1868J98059
$$ plain form
9413 6717273 6823420 6748753 6838895 6782045 6711295 6708360 6799033 6771243 6727283 6578208 6789728
9402 6789728 7058185 7066909 6884988 6854638 6622483 6639346 6779403 6752258 6962814 7161336
9392 7161336 7050065 6952074 6956297 6885542 6692362 6382962 6490110 6555406 6699283 6554238
9382 6554238 6188942 6104292 6276265 6352661 6227222 6372324 6598437 6660607 6668635 6699236 6645368
9371 6645368 6584811 6801358 6881852 6835265 6833181 6826249 6605532 6783280 6667392 6572800 6434011
9360 6434011 6537720 6485339 6698976 6822496 6900591 6800289 6871346 6943551 6771807 7196844
9350 7196844 7417473 7153771 7104867 7174873 7309751 7171561 7279316 7359024 7416378 7381281
9340 7381281 7200666 7436702 7518278 7730897 7512440 7321533 7159721 7076146 7382104 7518371
$$ packed form
9413F717273J06147p4667R0142n6850p0750k935R0673k7790m3960j49075K11520
9402F789728K68457Q724j81921l0350k32155J6863J40057k7145K10556J98522
9392G161336j11271r7991M223p0755j93180l09400J07148O5296J43877j45045
9382F554238l65296q4650J71973P6396j25439J45102K26113O2170Q028L0601n3868
9371F645368o0557K16547Q0494m6587k084o932k20717J77748j15888r4592j38789
9360F434011J03709n2381K13637J23520P8095j00302P1057P2205j71744M25037
9350G196844K20629k63702m8904P0006J34878j38190J07755P9708N7354l5097
9340G381281j80615K36036Q1576K12619k18457j90907j61812q3575L05958J36267
$$ plain form
9330 7518371 7621440 7415294 7713266 7735425 7604884 7923115 8141542 7938431 7943310 8133467
9320 8133467 8105057 8375000 8637314 8625229 8707997 8917990 8925578 9303746 9392598 9551898 9530786
9309 9530786 9492901 9623703 9566245 9405442 9352994 9365783 9411370 9451796 9413353 9255646 9080714
9298 9080714 9073897 9253409 9421834 9196456 9137327 9125006 9307195 9368266 9407313 9316534 9143917
9287 9143917 9283954 9573232 9325012 9492902 9443903 9476653 9616492 9567483 9510386 9757506
9277 9757506 9663460 9849431 10225848 10296207 10299732 9934693 10023722 9969105 9983417 10103479 9893897
9266 9893897 9713633 9462312 9640356 9763529 9764949 9645328 9354725 9516794 9552694 9818974
9256 9818974 9640987 9599698 9738773 9923919 9969177 9816409 9849092 9857608 9764819 9743581 9745341
$$ packed form
9330G518371J03069k06146K97972K2159j30541L18231K18427k03111M879J90157
9320H133467k8410K69943K62314j2085Q2768K09993P588L78168Q8852J59300k1112
9309I530786l7885J30802n7458j60803n2448J2789M5587M0426l8443j57707j74932
9298I080714o817J79512J68425k25378n9129j2321J82189O1071L9047r0779j72617
9287I143917J40037K89278k48220J67890m8999L2750J39839m9009n7097K47120
9277I757506r4046J85971L76417P0359L525l65039Q9029n4617J4312J20062k09582
9266I893897j80264k51321J78044J23173J420j19621k90603J62069L5900K66280
9256I818974j77987m1289J39075J85146M5258j52768L2683Q516r2789k1238J760
$$ plain form
9245 9745341 9846836 9756047 9907754 9720116 10090403 10377858 10635566 10560456 10346428 10309028
9235 10309028 10445564 10708340 10520840 10280299 10489612 10630565 10861200 11149000 11412109
9226 11412109 11538282 11230489 10867654 10599199 10618761 10558401 10540996 10710037 10323275 10252590
9216 10252590 10099872 10304566 10413446 10275000 10195113 10010206 10179513 10334513 10256501 10070125
9206 10070125 10192567 10215291 10216955 10284138 10405643 10428302 10334536 10654836 10553161 10476815 10406722
9195 10406722 10620272 10617487 10699427 10986575 11102795 11216430 11087290 11310797 11309549 11342925
9185 11342925 11390932 11594409 11592005 11598020 11380901 11584978 11688489 11588024 11533855 11373983
9175 11373983 11461887 11442611 11263686 11112542 10896842 10917643 10854320 10938853 10997134 11021066 10944778
$$ packed form
9245I745341J01495r0789J51707j87638L70287K87455K57708p5110k14028l7400
9235A0309028J36536K62776j87500k40541K09313J40953K30635K87800K63109
9226A1412109J26173l07793l62835k68455J9562o0360j7405J69041l86762p0685
9216A0252590j52718K04694J08880j38446p9887j84907J69307J55000p8012j86376
9206A0070125J22442K2724J664O7183J21505K2659r3766L20300j01675p6346p0093
9195A0406722K13550k785Q1940K87148J16220J13635j29140K23507j248L3376
9185A1342925M8007K03477k404O015k17119K04077J03511j00465n4169j59872
9175A1373983Q7904j9276j78925j51144k15700K0801o3323Q4533N8281K3932p6288
$$ plain form
9164 10944778 10896938 10908434 10909570 10815574 10722511 10769072 10663892 10563142 10688957 10599968 10684625
9153 10684625 10718931 10870645 10925818 10817122 10742990 10499097 10562867 10668021 10680727 10912239
9143 10912239 10718815 10600758 10695519 10717691 10694357 10664999 10784362 10847965 11001389 10594237
9133 10594237 10786896 11122058 10879188 11227263 11243214 11123941 10981232 11251634 11287892 11271474
9123 11271474 11253954 11245802 11075813 11129499 11349048 11340177 11219090 11272470 11139174 11058610 11042855
9112 11042855 11237546 11084086 11137743 11496778 11476944 11532039 11615132 11714438 11633511 11694836 11875059
9101 11875059 11620787 11579810 11514773 11516979 11668790 11577528 12033213 11941684 12003750 11981305 11978946
9090 11978946 11851264 11939457 11807273 11975148 12106064 12187882 12465251 12469370 12345533 12322936
$$ packed form
9164A0944778m7840J1496J136r3996r3063M6561j05180j00750J25815q8989Q4657
9153A0684625L4306J51714N5173j08696p4132k43893O3770J05154J2706K31512
9143A0912239j93424j18057R4761K2172k3334k9358J19363O3603J53424m07152
9133A0594237J92659L35162k42870L48075J5951j19273j42709K70402L6258j6418
9123A1271474j7520q152j69989N3686K19549q871j21087N3380j33296q0564j5755
9112A1042855J94691j53460N3657L59035j9834N5095Q3093R9306q0927O1325J80223
9101A1875059k54272m0977o5037K206J51811r1262M55685r1529O2066k2445k359
9090A1978946j27682Q8193j32184J67875J30916Q1818K77369M119j23837k2597
$$ plain form
9080 12322936 12381590 12334519 12479678 12616975 12513898 12537392 12579846 12592185 12796098 12747950
9070 12747950 12594587 12447193 12579992 12890682 12821287 12558508 12696922 12886640 12957716 13138527
9060 13138527 12966614 13003725 13119420 13179083 13004423 13144715 12820695 12639466 12788797 13082798
9050 13082798 13188939 13293751 13578427 13682519 13649847 13711271 13779144 13964542 14037935 13890288
9040 13890288 13899252 14001972 13979801 13975674 14310172 14042025 14275491 14289441 14382118 14549619 14546428
9029 14546428 14800328 14715446 14832847 14688665 14436492 14916958 15152716 15189145 15058741 15041594
9019 15041594 15282974 15545386 15577935 15419793 15457643 15567724 15612300 15956597 16124335 15987241
9009 15987241 16073331 16090277 16476264 16440918 16473689 16595233 16693767 16776802 16979462 17137283
$$ packed form
9080A2322936N8654m7071J45159J37297j03077K3494M2454J2339K03913m8148
9070A2747950j53363j47394J32799L10690o9395k62779J38414J89718P1076J80811
9060A3138527j71913L7111J15695N9663j74660J40292l24020j81229J49331K94001
9050A3082798J06141J04812K84676J04092l2672O1424O7873J85398P3393j47647
9040A3890288Q964J02720k2171m127L34498k68147K33466J3950R2677J67501l191
9029A4546428K53900q4882J17401j44182k52173M80466K35758L6429j30404j7147
9019A5041594K41380K62412L2549j58142L7850J10081M4576L44297J67738j37094
9009A5987241Q6090J6946L85987l5346L2771J21544R8534Q3035K02660J57821
$$ plain form
8999 17137283 17172031 16985956 17157406 17359401 17684011 17617331 17711565 18021989 18053290 18128899
8989 18128899 18034449 18332288 18638376 18735335 18923659 19083208 19190392 19567262 19805956 19810815
8979 19810815 19933471 20088273 19915232 20062001 20198606 20179134 20300182 20513888 20568514 20885518
8969 20885518 20828127 20887220 20823901 20900091 20532099 20544951 20980938 21296920 21446528 21597395
8959 21597395 21424128 21481119 21720877 21770330 21775971 21962636 22420599 22585001 22610041 22736230
8949 22736230 22774327 22963548 23027277 22824610 23064293 23230871 23219235 23623391 23713224 23769078
8939 23769078 24032911 24039887 24568190 24582610 24358199 24547284 24805866 24733327 25160990 25434518
8929 25434518 25982461 26030884 26202992 26426976 26590845 26895292 27081577 27132297 26973366 27553072
$$ packed form
8999A7137283L4748j86075J71450K01995L24610o6680R4234L10424L1301P5609
8989A8128899r4450K97839L06088R6959J88324J59549J07184L76870K38694M859
8979A9810815J22656J54802j73041J46769J36605j9472J21048K13706N4626L17004
8969B0885518n7391N9093o3319P6190l67992J2852M35987L15982J49608J50867
8959B1597395j73267N6991K39758M9453N641J86665M57963J64402K5040J26189
8949B2736230L8097J89221O3729k02667K39683J66578j1636M04156Q9833N5854
8939B3769078K63833O976N28303J4420k24411J89085K58582p2539M27663K73528
8929B5434518N47943M8423J72108K23984J63869L04447J86285N0720j58931N79706
$$ plain form
8919 27553072 28166850 28579801 28905837 29209140 29111149 29199646 29634106 30095057 30479587 30555975
8909 30555975 30657902 30960117 31169320 31206943 31529544 31827844 31873293 32205245 32631404 32818032
8899 32818032 32988753 33256350 33475599 33705678 34158791 34539781 34802183 34890593 35129878 35485218
8889 35485218 35401109 35763084 36024322 36588114 36830138 37077654 37474615 37736196 37853109 38080856
8879 38080856 38366278 38752730 39202633 39913413 40325073 40447404 40940278 41544366 41837001
8870 41837001 42189214 42807287 43373127 43758279 44266469 44697291 44959426 45653741 46438920
8861 46438920 46866413 47316508 48115935 48386631 48960272 49655817 50279304 50857560 51457796
8852 51457796 52003811 52700138 53436816 54118204 54850880 55424611 55880073 56736134 57707089
$$ packed form
8919B7553072O13778M12951L26036L03303r7991Q8497M34460M60951L84530P6388
8909C0555975J01927L02215K09203L7623L22601K98300M5449L31952M26159J86628
8899C2818032J70721K67597K19249K30079M53113L80990K62402Q8410K39285L55340
8889C5485218q4109L61975K61238N63792K42024K47516L96961K61581J16913K27747
8879C8080856K85422L86452M49903P10780M11660J22331M92874O04088K92635
8870D1837001L52213O18073N65840L85152N08190M30822K62135O94315P85179
8861D6438920M27493M50095P99427K70696N73641O95545O23487N78256O00236
8852E1457796N46015O96327P36678O81388P32676N73731M55462Q56061R70955
$$ plain form
8843 57707089 58752317 59528737 60192636 60966574 62003599 62764996 63361903 64453278 65404908
8834 65404908 66397798 67574443 68382261 69342223 70316531 71226936 72244666 73339547 74479553
8825 74479553 75678999 76963397 77920139 78990256 79925024 80875877 82228999 83186443 84355370
8816 84355370 85620776 86813461 87831231 88966684 90133310 91284604 92280086 93238302
8808 93238302 94283035 95288099 96501994 97443311 98269408 99296250 100319852 101179810 102087043
8799 102087043 103251208 104311937 104886143 105502692 106628544 107503113 108029036 108526849 109700047
8790 109700047 110681067 111248286 112028954 112804217 113731702 114186322 114505099 115292720 115811609
8781 115811609 115970898 116554391 117132615 117419588 117748279 118021416 118260885 118527459 118862635
$$ packed form
8843E7707089J045228P76420O63899P73938J037025P61397N96907J091375R51630
8834F5404908R92890J176645Q07818R59962R74308R10405J017730J094881J140006
8825G4479553J199446J284398R56742J070117R34768R50853J353122R57444J168927
8816H4355370J265406J192685J017770J135453J166626J151294R95482R58216
8808I3238302J044733J005064J213895R41317Q26097J026842J023602Q59958R07233
8799A02087043J164165J060729N74206O16549J125852Q74569N25923M97813J173198
8790A09700047R81020N67219P80668P75263R27485M54620L18777P87621N18889
8781A15811609J59289N83493N78224K86973L28691K73137K39469K66574L35176
$$ plain form
8772 118862635 119111182 119608992 119867423 119702201 120104868 120137724 120205303 120356242 120195495 120362419
8762 120362419 120393790 120324678 120349711 120061696 119636168 119238854 119008329 118721895 118448319 117959956
8752 117959956 117454147 117167977 116625462 116038667 115574400 114869619 114204094 113498382 112628841
8743 112628841 111652866 110790901 110197296 109341563 108533292 107626449 106808405 105713227 104784583
8734 104784583 103779447 102524954 101829001 100809250 99783386 98846184 98140965 96910703
8726 96910703 95760886 94959997 93791817 92755155 91989391 90754642 89891976 88947135 87866937
8717 87866937 86749715 86038499 85145175 83984191 83100053 82197004 81365796 80614291 79546786
8708 79546786 78726588 78080491 77138682 76198272 75558204 74794564 74253927 73610283 72851321
$$ packed form
8772A18862635K48547M97810K58431j65222M02667L2856O7579J50939j60747J66924
8762A20362419L1371o9112K5033k88015m25528l97314k30525k86434k73576m88363
8752A17959956n05809k86170n42515n86795m64267p04781o65525p05712q69541
8743A12628841r75975q61965n93605q55733q08271r06843q18044j095178r28644
8734A04784583j005136j254493o95953j019751j025864r37202p05219j230262
8726I6910703j149817q00889j168180j036662p65764j234749q62666r44841j080198
8717H7866937j117222p11216q93324j160984q84138r03049q31208p51505j067505
8708G9546786q20198o46097r41809r40410o40068p63640n40637o43644p58962
$$ plain form
8699 72851321 72012682 71244917 70660965 69723750 69067119 68198215 67610678 66947280 66061463
8690 66061463 65409379 64580742 63678048 62893042 62337495 61635457 61224378 60680897 59983477
8681 59983477 59095395 58392003 57846484 56934753 56367879 56198537 56065403 55208310 54468701
8672 54468701 54033201 53466079 52857097 52207601 51588287 51521929 50977108 50660718 50343040 49882208
8662 49882208 49485200 49095818 48916380 48430813 47871940 47628076 47423246 46975681 46508375
8653 46508375 46058075 45650046 45236188 44813651 44312450 43680002 43251924 42734882 42409735
8644 42409735 42207999 42007114 41521473 41282235 40950999 40331251 39913028 39640225 39274120
8635 39274120 38842723 38627425 38447238 38099301 37654827 37406520 37153629 36902982 36553558
$$ packed form
8699G2851321q38639p67765n83952r37215o56631q68904n87537o63398q85817
8690F6061463o52084q28637r02694p85006n55547p02038m11079n43481o97420
8681E9983477q88082p03392n45519r11731n66874j69342j33134q57093p39609
8672E4468701m35500n67122o08982o49496o19314o6358n44821l16390l17678m60832
8662D9882208l97008l89382j79438m85567n58873k43864k04830m47565m67306
8653D6508375m50300m08029m13858m22537n01201o32448m28078n17042l25147
8644D2409735k01736k00885m85641k39238l31236o19748m18223k72803l66105
8635C9274120m31397k15298j80187l47937m44474k48307k52891k50647l49424
$$ plain form
8626 36553558 36240602 36180287 35814878 35323189 35105979 35004744 34668012 34395522 34009069 33771547
8616 33771547 33655748 33621476 33446262 33327211 33123994 32958601 32381997 31895015 31677752 31614422
8606 31614422 31390372 31631931 31633679 30992165 30987845 30943882 30584094 30239602 29989573 29960446
8596 29960446 29637321 29220070 29319470 29354448 29031803 28829919 28738796 28695375 28611618 28581468
8586 28581468 28685519 28529162 28485266 28162431 28169412 28287681 28281653 28173323 27927477 28020159
8576 28020159 27881432 27547242 27343065 27502934 27668159 27355218 27008577 26728849 27002030
8567 27002030 26770630 26472564 26012596 25849734 25536313 25549216 25725437 25718158 25813145 25505798
8557 25505798 25196640 25297871 25461945 25220600 25271656 25422674 25256659 25058930 25018886 25235944
$$ packed form
8626C6553558l12956o0315l65409m91689k17210j01235l36732k72490l86453k37522
8616C3771547j15799l4272j75214j19051k03217j65393n76604m86982k17263o3330
8606C1614422k24050K41559J748o41514m320m3963l59788l44492k50029k9127
8596B9960446l23125m17251R9400L4978l22645k01884r1123m3421q3757l0150
8586B8581468J04051j56357m3896l22835O981J18269o028j08330k45846R2682
8576B8020159j38727l34190k04177J59869J65225l12941l46641k79728K73181
8567B7002030k31400k98066m59968j62862l13421J2903J76221p279R4987l07347
8557B5505798l09158J01231J64074k41345N1056J51018j66015j97729m0044K17058
$$ plain form
8547 25235944 25334769 25379381 25525320 25470183 25619193 25824570 25506277 25611110 25733870 25894979
8537 25894979 26066060 26206365 26173053 26173760 25959073 25694887 25524782 25239334 24870142 24689207
8527 24689207 24492647 24153340 23807659 23680858 23188853 22854769 22819014 22608195 22187698 21989378
8517 21989378 21706480 21259341 21150276 21043279 21156583 21089991 20687310 20584051 20790988 20770681
8507 20770681 20476738 20201892 20082397 20091029 20237538 20375707 20207497 20021995 19984426 19820465
8497 19820465 19760429 19567969 19760682 19679604 19539040 19352937 19282423 19103907 19219335 19201318
8487 19201318 19116664 18975257 19147289 19203346 19013147 19088633 19093708 18892909 18675489 18834013
8477 18834013 18936188 18824887 18603273 18373855 18184382 17987588 17961219 17890064 17838683 17656470
$$ packed form
8547B5235944R8825M4612J45939n5137J49010K05377l18293J04833J22760J61109
8537B5894979J71081J40305l3312P07k14687k64186j70105k85448l69192j80935
8527B4689207j96560l39307l45681j26801m92005l34084l5755k10819m20497j98320
8517B1989378k82898m47139j09065j06997J13304o6592m02681j03259K06937k0307
8507B0770681k93943k74846j19495Q632J46509J38169j68210j85502l7569j63961
8497A9820465o0036j92460J92713q1078j40564j86103p0514j78516J15428j8017
8487A9201318q4654j41407J72032N6057j90199P5486N075k00799k17420J58524
8477A8834013J02175j11301k21614k29418j89473j96794k6369p1155n1381j82213
$$ plain form
8467 17656470 17609957 17548473 17556738 17461691 17515195 17460789 17321106 17349549 17368302 17346964 17576205
8456 17576205 17635496 17637307 17706487 17509696 17399418 17314355 17158574 17197204 17308070 17447491
8446 17447491 17430200 16921834 17044586 17230202 17282360 17179450 16793971 16739633 16876619 16734488
8436 16734488 16594706 16550899 16628646 16592831 16356038 16282285 16416595 16347214 16123077 16316704
8426 16316704 16377478 16180900 16256427 16163528 15919836 15664088 15819475 15648408 15668136 15880218
8416 15880218 15907794 15898877 15720021 15710841 15808620 15780489 15783108 15619976 15643367 15630803 15449282
8405 15449282 15454592 15277498 15571476 15679314 15254203 15210464 15298580 15301401 14942365 14989074 15222054
8394 15222054 15372264 15291297 15124317 15261272 15270187 15199392 15093589 15015779 14917017 14856067 14630327
$$ packed form
8467A7656470m6513o1484Q265r5047N3504n4406j39683K8443J8753k1338K29241
8456A7576205N9291J811O9180j96791j10278q5063j55781L8630J10866J39421
8446A7447491j7291n08366J22752J85616N2158j02910l85479n4338J36986j42131
8436A6734488j39782m3807P7747l5815k36793p3753J34310o9381k24137J93627
8426A6316704O0774j96578P5527r2899k43692k55748J55387j71067J9728K12082
8416A5880218K7576q917j78856r180R7779k8131K619j63132K3391j2564j81521
8405A5449282N310j77094K93978J07838m25111m3739Q8116K821l59036M6709K32980
8394A5222054J50210q0967j66980J36955Q915p0795j05803p7810r8762o0950k25740
$$ plain form
8383 14630327 14971556 14914945 15031763 14814273 14797768 14794889 14696131 14746751 14673108 14656686 14731280
8372 14731280 14818278 14453350 14363473 14441218 14412391 14612879 14559374 14155590 14184331 14153711 13912625
8361 13912625 13952602 13975300 14124186 14495961 14527844 14387774 14287511 14234196 14312825 14220786
8351 14220786 14243391 14420648 14112464 13831983 13763216 13955756 13853220 13686603 13882265 13817687
8341 13817687 13778167 13653245 13455762 13484634 13707813 13646838 13251952 13505621 13476384 13448166
8331 13448166 13533754 13632441 13580960 13535608 13415250 13421967 13425539 13315654 13403413 13379492 13284021
8320 13284021 13330073 13229374 13241413 12953210 12745162 12923443 13085897 13182584 13038114 12956170
8310 12956170 12913368 13012199 12868027 12687094 12960790 13133541 13105744 12979437 12919690 12568016
$$ packed form
8383A4630327L41229n6611J16818k17490j6505k879r8758N0620p3643j6422P4594
8372A4731280Q6998l64928q9877P7745k8827K00488n3505m03784K8741l0620k41086
8361A3912625L9977K2698J48886L71775L1883j40070j00263n3315P8629r2039
8351A4220786K2605J77257l08184k80481o8767J92540j02536j66617J95662o4578
8341A3817687l9520j24922j97483K8872K23179o0975l94886K53669k9237k8218
8331A3448166Q5588R8687n1481m5352j20358O717L572j09885Q7759k3921r5471
8320A3284021M6052j00699J2039k88203k08048J78281J62454R6687j44470q1944
8310A2956170m2802R8831j44172j80933K73696J72751k7797j26307n9747l51674
$$ plain form
8300 12568016 12680536 12815158 12860948 12764739 12624964 12840941 12928244 12957094 12930034 12795369
8290 12795369 12727772 12807678 12702901 13006942 12936867 12612331 12575231 12673729 12654903 12681868 12564474
8279 12564474 12402902 12297605 12340358 12532130 12531709 12541946 12620786 12362034 12277410 12234358 12242655
8268 12242655 12412090 12642018 12526733 12559967 12492364 12153016 12142000 12322202 12300722 12149005
8258 12149005 12036876 11961733 11945558 11907720 11936149 12033984 12028726 12043801 11932385 11855975 11746293
8247 11746293 11625371 11714223 11846196 11811856 11694715 11845365 11815723 11829727 11877705 11828366
8237 11828366 11750674 11705493 11790662 11585680 11492761 11284455 11398368 11760494 11725246 11622081
8227 11622081 11678708 11951548 11650777 11626397 11605735 11563560 11445471 11421147 11324166 11234930 11170340
$$ packed form
8300A2568016J12520J34622M5790r6209j39775K15977Q7303K8850k7060j34665
8290A2795369o7597P9906j04777L04041p0075l24536l7100R8498j8826K6965j17394
8279A2564474j61572j05297M2753J91772m21J0237P8840k58752q4624m3052Q297
8268A2242655J69435K29928j15285L3234o7603l39348j1016J80202k1480j51717
8258A2149005j12129p5143j6175l7838K8429R7835n258J5075j11416p6410j09682
8247A1746293j20922Q8852J31973l4340j17141J50650k9642J4004M7978m9339
8237A1828366p7692m5181Q5169k04982r2919k08306J13913L62126l5248j03165
8227A1622081N6627K72840l00771k4380k0662m2175j18089k4324r6981q9236o4590
$$ plain form
8216 11170340 11162389 11328687 11318979 11128071 11190841 11140002 11367812 11423587 11415853 11542772 11353702
8205 11353702 11278455 11450128 11518501 11395054 11402102 11407248 11523561 11575011 11380064 11415499 11351933
8194 11351933 11081631 11365463 9366176 9297805 10318065 10442143 10772802 10677150 10747145 10831686
8184 10831686 10927047 10914047 10960466 10691917 10688514 10623516 10672586 10573047 10545690 10599768 10432824
8173 10432824 10200273 10536158 10742361 10525944 10404789 10362349 10107843 10291861 10604729 10774818
8163 10774818 10667772 10412208 10444542 10466984 10513119 10482327 10447045 10183680 10354757 10258276
8153 10258276 10227701 10383434 10255970 10264128 10322884 10324060 10359159 10554551 10361290 10348525 10456565
8142 10456565 10338066 10525206 10461480 10369057 10193717 10111523 10145790 10166309 10148204 10345609
$$ packed form
8216A1170340p951J66298r708j90908O2770n0839K27810N5775p734J26919j89070
8205A1353702p5247J71673O8373j23447P048N146J16313N1450j94947L5435o3566
8194A1351933k70302K83832j999287o8371J020260J24078L30659r5652O9995Q4541
8184A0831686R5361j3000M6419k68549l403o4998M9070r9539k7357N4078j66944
8173A0432824k32551L35885K06203k16417j21155m2440k54506J84018L12868J70089
8163A0774818j07046k55564L2334K2442M6135l0792l5282k63365J71077r6481
8153A0258276l0575J55733j27464Q158N8756J176L5099J95392j93261j2765J08040
8142A0456565j18499J87140o3726r2423j75340q2194L4267K0519j8105J97405
$$ plain form
8132 10345609 10355646 10121250 10109195 9815354 9438239 9801052 9757951 9610781 9700752 9556352
8122 9556352 9351391 9508502 9689359 9322809 9512532 9567660 9598555 9557547 9504084 9586335
8112 9586335 9589795 9900600 9986783 9821263 9788303 9622660 9684420 9804830 9871206 9682466 9541218
8101 9541218 9591792 9631573 9528316 9542337 9370956 9339516 9398011 9389965 9453089 9363259 9336761
8090 9336761 9286332 9381690 9225551 9229004 9481766 9202926 9002204 9180981 9023911 9145819
8080 9145819 9361810 9208173 9317379 9191576 9040745 9192560 9224228 9132607 9335600 9409064
8070 9409064 9257466 9204773 9306750 9296835 9024392 8743689 9103828 9355305 9278305 9134539
8060 9134539 8951567 8807960 8428717 8239574 8667788 8763519 8743075 8906767 8921317 8930520
$$ packed form
8132A0345609J0037k34396j2055k93841l77115L62813m3101j47170Q9971j44400
8122I556352k04961J57111J80857l66550J89723N5128L0895m1008n3463Q2251
8112I586335L460L10805Q6183j65520l2960j65643O1760J20410O6376j88740j41248
8101I541218N0574L9781j03257J4021j71381l1440N8495q046O3124q9830k6498
8090I336761n0429R5358j56139L453K52762k78840k00722J78777j57070J21908
8080I145819K15991j53637J09206j25803j50831J51815L1668r1621K02993P3464
8070I409064j51598n2693J01977r915k72443k80703L60139K51477p7000j43766
8060I134539j82972j43607l79243j89143M28214R5731k0444J63692J4550R203
$$ plain form
8050 8930520 8783286 8544888 8557890 8700222 8870147 8859894 8957606 8976342 8859890 8841275
8040 8841275 8593435 8553110 8627952 8536445 8518755 8462634 8557417 8617318 8344277 8350053 8426651
8029 8426651 8334841 8247388 8447610 8398200 8186171 8027724 8264601 8505623 8427670 8237397
8019 8237397 8192690 8446629 8243595 8084201 8093081 8314699 8261242 8318641 8458357 8331144
8009 8331144 8082565 8047852 7844284 7785548 7849619 7602593 7760442 7611024 7787912 7863443
7999 7863443 7912049 7868483 8020754 7914711 7768799 7839961 7958855 7961702 7861111 7712515
7989 7712515 7829506 7747105 7839918 7662460 7469922 7619767 7477394 7450527 7730503 7629820
7979 7629820 7504321 7545638 7566283 7218747 7098025 7415433 7579628 7568062 7579293 7714097
$$ packed form
8050H930520j47234k38398J3002J42332J69925j0253R7712J8736j16452j8615
8040H841275k47840m0325P4842r1507j7690n6121R4783N9901k73041N776P6598
8029H426651r1810q7453K00222m9410k12029j58447K36877K41022p7953j90273
8019H237397m4707K53939k03034j59394Q880K21618n3457N7399J39716j27213
8009H331144k48579l4713k03568n8736O4071k47026J57849j49418J76888P5531
7999G863443M8606m3566J52271j06043j45912P1162J18894K847j00591j48596
7989G712515J16991q2401R2813j77458j92538J49845j42373k6867K79976j00683
7979G629820j25499M1317K0645l47536j20722L17408J64195j1566J1231J34804
$$ plain form
7969 7714097 7602924 7778212 7446307 7283734 7436369 7311944 7470854 7599780 7710839 7611064
7959 7611064 7614008 7769826 7684448 7498439 7298181 7279214 7104424 7037251 7468634 7495748 7202548
7948 7202548 7010474 7172148 7087511 7181960 7321422 7376577 7480504 7029669 7062568 6979303
7938 6979303 7139705 7032425 7056301 7117732 7089883 7185805 7281309 7204505 6997875 7259412 7283427
7927 7283427 7252760 7284413 7308152 7017713 6889921 6845493 7052495 7072587 6895765 6833720 6657175
7916 6657175 6570044 6402403 6647415 6727179 6941401 6975649 7044625 7041798 6944035 6751432 6825481
7905 6825481 6739322 6663808 6860862 6912014 6760578 6570098 6643607 6777288 6622062 6634443
7895 6634443 6651085 6759161 6638250 6588139 6723739 6462085 6394973 6452126 6617602 6657553
$$ packed form
7969G714097j11173J75288l31905j62573J52635j24425J58910J28926J11059r9775
7959G611064K944J55818q5378j86009k00258j8967j74790o7173M31383K7114k93200
7948G202548j92074J61674q4637R4449J39462N5155J03927m50835L2899q3265
7938F979303J60402j07280K3876O1431k7849R5922R5504p6804k06630K61537K4015
7927G283427l0667L1653K3739k90439j27792m4428K07002K0092j76822o2045j76545
7916F657175q7131j67641K45012P9764K14222L4248O8976k827r7763j92603P4049
7905F825481q6159p5514J97054N1152j51436j90480P3509J33681j55226J2381
7895F634443J6642J08076j20911n0111J35600k61654o7112N7153J65476L9951
$$ plain form
7885 6657553 6465149 6411245 6569594 6541712 6543537 6829826 6673489 6555896 6587057 6461197
7875 6461197 6715702 6801131 6540195 6598668 6492076 6644640 6694715 6522977 6650607 6414101
7865 6414101 6489637 6480701 6412577 6517024 6273985 6171903 6289782 6020653 5933399 6225369
7855 6225369 6405323 6192179 6030891 6152412 6278821 6508387 6422045 6204415 6063798 5923492
7845 5923492 5931837 6176153 6374702 6214917 5999247 6117173 6082197 6098851 5991520 6093095
7835 6093095 6122832 5883712 6099564 6226791 6125125 5995993 5989776 5904122 5992675 5965904 5748288
7824 5748288 5891433 5982964 5894861 5986165 5942533 5822234 5475662 5443210 5577865 5632028 5478688
7813 5478688 5537495 5833669 5882446 5768333 6035721 5691269 5389583 5407261 5554501 5555372 5612801
$$ packed form
7885F657553j92404n3904J58349k7882J825K86289j56337j17593L1161j25860
7875F461197K54505Q5429k60936N8473j06592J52564N0075j71738J27630k36506
7865F414101P5536q936o8124J04447k43039j02082J17879k69129q7254K91970
7855F225369J79954k13144j61288J21521J26409K29566q6342k17630j40617j40306
7845E923492Q345K44316J98549j59785k15670J17926l4976J6654j07331J01575
7835F093095K9737k39120K15852J27227j01666j29132o217q5654Q8553k6771k17616
7824E748288J43145R1531q8103R1304m3632j20299l46572l2452J34655N4163j53340
7813E478688N8807K96174M8777j14113K67388l44452l01686J7678J47240Q71N7429
$$ plain form
7802 5612801 5845444 5714095 5801921 5718198 5527795 5632229 5797986 5761733 5756367 5704469 5726247
7791 5726247 5708572 5533765 5706356 5746229 5642883 5435822 5684637 5889332 5716161 5605925
7781 5605925 5322033 5245306 5431566 5552132 5386003 5458425 5546601 5327499 5199206 5463524
7771 5463524 5288777 5315979 5341032 5315015 5476268 5551000 5549881 5463405 5443227 5443757 5394113 5282362
7759 5282362 5486117 5397016 5213762 5371279 5322275 5400530 5344567 5043882 5052018 5162485 5250711
7748 5250711 5204167 5082424 4958153 5328437 5251282 5116617 5127590 4911719 5023538 5138422
7738 5138422 5113675 5316657 5324362 5252147 5174546 5198216 5129711 5006406 5100345 5255975 5344680
7727 5344680 5159596 5156694 5016788 4934241 5065009 4774524 4729327 4909181 4971847 4854787
$$ packed form
7802E612801K32643j31349Q7826q3723j90403J04434J65757l6253n366n1898K1778
7791E726247j7675j74807J72591L9873j03346k07061K48815K04695j73171j10236
7781E605925k83892p6727J86260J20566j66129P2422Q8176k19102j28293K64318
7771E463524j74747K7202K5053k6017J61253P4732j119q6476k0178N30m9644j11751
7759E282362K03755q9101j83254J57517m9004P8255n5963l00685Q136J10467Q8226
7748E250711m6544j21743j24271L70284p7155j34665J0973k15871J11819J14884
7738E138422k4747K02982P705p2215p7601K3670o8505j23305R3939J55630Q8705
7727E344680j85084k902j39906q2547J30768k90485m5197J79854O2666j17060
$$ plain form
7717 4854787 4823957 5012223 5155282 5232810 5024595 5089148 4899907 4938135 5093863 5125701
7707 5125701 5118262 5231963 5341081 5417389 5282455 5314871 5572173 5364845 5015142 5140076
7697 5140076 5186101 4996381 5008588 4948366 5094954 5482362 5524736 5614129 5573254 5635905 5590090
7686 5590090 5705457 5766922 6108974 6295529 6159693 5922346 5946761 6081824 5996085 5916826
7676 5916826 5976680 6073814 6012916 5691686 5617320 5600810 5564377 5471692 5553507 5785570 5553568
7665 5553568 5366314 4978916 5039506 5199525 5413186 5126635 5052701 5213584 5448516 5806452
7655 5806452 5746549 5538265 5343003 5224595 5306366 5318169 5491690 5338299 5495983 5401058
7645 5401058 5770969 5953487 5670092 5835361 6045526 5902654 5669484 5574734 5602311 5581481
$$ packed form
7717D854787l0830J88266J43059P7528k08215O4553j89241L8228J55728L1838
7707E125701p439J13701J09118P6308j34934L2416K57302k07328l49703J24934
7697E140076M6025j89720J2207o0222J46588L87408M2374Q9393m0875O2651m5815
7686E590090J15367O1465L42052J86555j35836k37347K4415J35063q5739p9259
7676E916826N9854R7134o0898l21230p4366j6510l6433r2685Q1815K32063k32002
7665E553568j87254l87398O0590J60019K13661k86551p3934J60883K34932L57936
7655E806452n9903k08284j95262j18408Q1771J1803J73521j53391J57684r4925
7645E401058L69911J82518k83395J65269K10165j42872k33170r4750K7577k0830
$$ plain form
7635 5581481 5473972 5232427 4936000 5148783 4973076 4828529 4735802 4645570 4482448 4737091
7625 4737091 4597745 4763352 4668117 4642181 4558526 4451233 4423581 4410881 4364052 4468574 4556967
7614 4556967 4312586 4468264 4333457 4461553 4432516 4338088 4300283 4137689 4176695 4203818
7604 4203818 4153639 4403268 4222655 4043147 4075253 3986022 4223440 4347742 4236703 4292119
7594 4292119 4270566 4341155 4136096 4041122 4310873 4257199 4014915 4118247 4166578 4107863 3976349
7583 3976349 4005932 4280555 4371765 4008266 4276808 4220131 4283971 4238910 4163224 4155985 4306802
7572 4306802 4291309 4208527 4331493 4119739 4259471 4454866 4440690 4325362 4456032 4362268
7562 4362268 4377269 4457261 4600765 4419754 4476660 4697621 4667885 4624976 4929758 5138540
$$ packed form
7635E581481j07509k41545k96427K12783j75707j44547r2727r0232j63122K54643
7625D737091j39346J65607r5235k5936q3655j07293k7652j2700m6829J04522Q8393
7614D556967k44381J55678j34807J28096k9037r4428l7805j62594L9006K7123
7604D203818n0179K49629j80613j79508L2106q9231K37418J24302j11039N5416
7594D292119k1553P0589k05059r4974K69751n3674k42284J03332M8331n8715j31514
7583C976349K9583K74623R1210l63499K68542n6677O3840m5061p5686p239J50817
7572D306802j5493q2782J22966k11754J39732J95395j4176j15328J30670r3764
7562D362268J5001P9992J43504j81011N6906K20961k9736m2909L04782K08782
$$ plain form
7552 5138540 5160645 5287221 5334183 5508297 5679490 5562643 5767055 6062169 6163978 6245320
7542 6245320 6700727 6859622 7039949 7322530 7628399 8026315 8558780 9228396 9791299 10713819
7532 10713819 11318052 11502986 11653288 11938131 11936132 11406492 10804766 10377702 9798299 9132572
7522 9132572 8610695 8153982 7696714 7444447 7327462 6790529 6448092 6153104 5904464 5749434
7512 5749434 5547086 5522584 5431985 4972415 4826677 4809485 4734181 4817732 4650089 4278400
7502 4278400 4161486 4158315 4516808 4378254 4389960 4248946 4228096 4282244 4116609 4055681 4103677
7491 4103677 4172249 3852134 3719894 3852765 3995365 4031762 4111776 4010628 3847973 3545847
7481 3545847 3737171 3711405 3574965 3515245 3795723 3649759 3673266 3611265 3433515 3611176
$$ packed form
7552E138540K2105J26576M6962J74114J71193j16847K04412K95114J01809Q1342
7542F245320M55407J58895J80327K82581L05869L97916N32465O69616N62903R22520
7532A0713819O04233J84934J50302K84843j999n29640o01726m27064n79403o65727
7522I132572n21877m56713m57268k52267j16985n36933l42437k94988k48640j55030
7512E749434k02348k4502r0599m59570j45738j7192p5304Q3551j67643l71689
7502D278400j16914l171L58493j38554J1706j41014k0850N4148j65635o0928M7996
7491D103677O8572l20115j32240J32871J42600L6397Q0014j01148j62655l02126
7481C545847J91324k5766j36440n9720K80478j45964K3507o2001j77750J77661
$$ plain form
7471 3611176 3707555 3606916 3540753 3371425 3110578 3098202 3448880 3470334 3353061 3340929
7461 3340929 3407661 3292393 3210718 3327926 3250274 3338639 3305012 3107836 3153134 3298837 3387009
7450 3387009 3307866 3412470 3286798 3165542 2973715 2947353 2872566 3011613 3176745 2916741
7440 2916741 2936659 3002254 3260985 3301148 3257356 3057425 3001908 3085269 3365742 3474390 3484649
7429 3484649 3294763 3327958 3142670 3301351 3374105 3184064 2906470 2888405 2943098 3067207
7419 3067207 3304074 3053211 3000466 3232958 3194578 2959971 3001258 3214287 3411140 3266029
7409 3266029 3268454 3407734 3410507 3157993 3307837 3054384 2955763 3206785 2915082 2875792 2803788
7398 2803788 2677422 2797924 3158926 3157139 2841495 2519928 2568381 2722758 2522971 2692106
$$ packed form
7471C611176R6379j00639o6163j69328k60847j2376L50678K1454j17273j2132
7461C340929O6732j15268q1675J17208p7652Q8365l3627j97176M5298J45703Q8172
7450C387009p9143J04604j25672j21256j91827k6362p4787J39047J65132k60004
7440B916741J9918O5595K58731M0163m3792j99931n5517Q3361K80473J08648J0259
7429C484649j89886L3195j85288J58681P2754j90041k77594j8065N4693J24109
7419C067207K36867k50863n2745K32492l8380k34607M1287K13029J96853j45111
7409C266029K425J39280K773k52514J49844k53453r8621K51022k91703l9290p2004
7398B803788j26366J20502L61002j787l15644l21567M8453J54377j99787J69135
$$ plain form
7388 2692106 2842533 3088482 3168223 3030924 3283854 3164724 2906465 2900817 2861720 2992464
7378 2992464 3369203 3253361 3183193 3055223 3015211 2954845 3066151 2901228 2614731 2659298
7368 2659298 2831244 3100162 3144488 3137179 3278688 3029002 2953402 3075702 3000780 2829200
7358 2829200 2615951 2806740 2521080 2897766 3043216 2991005 3022826 2796787 2855220 3015047
7348 3015047 3149144 2964030 2748972 2732765 2737960 2933418 2887343 2847457 2950577 2931502 2874353
7337 2874353 3019568 2965171 2810390 2950656 3116097 3174015 3087864 3189823 3174247 3019792
7327 3019792 2814145 3052095 3079821 2884189 3152414 3335706 3178652 3017652 3109949 3301026
7317 3301026 3088494 3012003 3055289 3040128 3136894 3070375 3071421 2891010 2695725 2875497 2762236
$$ packed form
7388B692106J50427K45949P9741j37299K52930j19130k58259n648l9097J30744
7378B992464L76739j15842p0168j27970m0012o0366J11306j64923k86497M4567
7368B659298J71946K68918M4326p309J41509k49686p5600J22300p4922j71580
7358B829200k13249J90789k85660L76686J45450n2211L1821k26039N8433J59827
7348C015047J34097j85114k15058j6207N195J95458m6075l9886J03120j9075n7149
7337B874353J45215n4397j54781J40266J65441N7918q6151J01959j5576j54455
7327C019792k05647K37950K7726j95632K68225J83292j57054j61000R2297J91077
7317C301026k12532p6491M3286j5161R6766o6519J046j80411j95285J79772j13261
$$ plain form
7306 2762236 2585625 2741680 2966413 2863642 2868831 3037134 3050066 3017967 2989703 2923217 2624140
7295 2624140 2701592 2623438 2596015 2864780 2892870 2962662 2979403 2838732 2997300 3018271 3055262
7284 3055262 2893392 2899401 3020517 3010122 2736724 2575301 2756781 3037229 3001615 2873907
7274 2873907 2791569 2889100 3184484 3108941 2716907 2823444 2835434 2954604 3072760 2952202
7264 2952202 2792525 2946563 2910240 2795867 2832107 2702035 2784535 2860712 2992671 3053333
7254 3053333 3067442 3270042 3187685 3071217 2978083 3041889 3021614 2670364 2644463 2668432 2753381
7243 2753381 2701338 2542938 2621375 2809306 2544010 2714897 2786659 3114875 3082714 3071277
7233 3071277 3085575 3006876 2922655 3044611 3227495 2944181 2990006 3234251 3051489 2860256
$$ packed form
7306B762236j76611J56055K24733j02771N189J68303J2932l2099k8264o6486k99077
7295B624140P7452p8154k7423K68765K8090O9792J6741j40671J58568K0971L6991
7284C055262j61870O009J21116j0395k73398j61423J81480K80448l5614j27708
7274B873907q2338R7531K95384p5543l92034J06537J1990J19170J18156j20558
7264B952202j59677J54038l6323j14373L6240j30072Q2500P6177J31959O0662
7254C053333J4109K02600q2357j16468r3134O3806k0275l51250k5901K3969Q4949
7243B753381n2043j58400P8437J87931k65296J70887P1762L28216l2161j1437
7233C071277J4298p8699q4221J21956J82884k83314M5825K44245j82762j91233
$$ plain form
7223 2860256 3042835 3370979 3065138 2920436 2733522 2771105 3107757 3101135 2862035 2812729
7213 2812729 3043695 3235299 2913911 2933222 3124114 3078206 2841049 2676949 3044378 3221273
7203 3221273 3283088 3502057 3460666 3307150 3149361 3247659 3255030 3263784 3137803 2918537 2869114
7192 2869114 3126016 3338254 3223593 3305355 3336250 3363999 3400467 3328804 3002720 3062962 3173777
7181 3173777 3358362 3185390 3159845 3078925 3014765 3087543 2972124 2839857 2842774 3087693 3212114
7170 3212114 3298316 3133666 3017690 3199848 3402850 3517015 3141630 3281447 3288659 3380708
7160 3380708 3422636 3374258 2941513 3051807 3460012 3552150 3518804 3341598 3356956 3305513 3600227
7149 3600227 3464621 3393508 3563159 3641223 3502705 3402483 3338645 3376231 3295137 3219091 3312540
$$ packed form
7223B860256J82579L28144l05841j44702j86914L7583L36652o622k39100m9306
7213B812729K30966J91604l21388J9311J90892m5908k37157j64100L67429J76895
7203C221273O1815K18969m1391j53516j57789R8298P371Q754j25981k19266m9423
7192B869114K56902K12238j14661Q1762L0895K7749L6468p1663l26084O0242J10815
7181C173777J84585j72972k5545q0920o4160P2778j15419j32267K917K44919J24421
7170C212114Q6202j64650j15976J82158K03002J14165l75385J39817P212R2049
7160C380708M1928m8378m32745J10294M08205R2138l3346j77206J5358n1443K94714
7149C600227j35606p1113J69651P8064j38518j00222o3838L7586q1094p6046R3449
$$ plain form
7138 3312540 3478319 3617552 3676550 3763318 3608417 3634067 3505799 3670077 3723504 3385724
7128 3385724 3407765 3447740 3515340 3601507 3438653 3311394 3244745 3402134 3426942 3441649 3578948
7117 3578948 3678397 3539856 3500867 3630763 3534457 3624918 3873987 3778521 3749842 3712634 3507652
7106 3507652 3543386 3443021 3653510 3707467 3481688 3696263 3801709 3655746 3800314 4052705
7096 4052705 4026901 4150948 3930258 3977919 3909126 3885728 3773695 3989564 3883652 3841060
7086 3841060 3962248 3833188 3897466 3937299 4140494 4568673 4520789 4249072 4035248 3832245
7076 3832245 4075740 3936492 3970674 3750261 3803824 3953586 4142395 3938242 3978100 3921349
7066 3921349 3738102 4035740 4302689 4269974 4325593 4300228 4249118 3996026 4247189 4358060
$$ packed form
7138C312540J65779J39233N8998Q6768j54901K5650j28268J64278N3427l37780
7128C385724K2041L9975O7600Q6167j62854j27259o6649J57389K4808J4707J37299
7117C578948R9449j38541l8989J29896r6306R0461K49069r5466k8679l7208k04982
7106C507652L5734j00365K10489N3957k25779K14575J05446j45963J44568K52391
7096D052705k5804J24047k20690M7661o8793k3398j12033K15869j05912m2592
7086C841060J21188j29060O4278L9833K03195M28179m7884k71717k13824k03003
7076C832245K43495j39248L4182k20413N3563J49762J88809k04153L9858n6751
7066C921349j83247K97638K66949l2715N5619k5365n1110k53092K51163J10871
$$ plain form
7056 4358060 4322230 4033135 3890495 3929714 4070201 4342717 4272733 4177338 4320706 4351762
7046 4351762 4472613 4413789 4405152 4285401 4014752 4032967 4009841 4118422 4251672 4441732
7036 4441732 4267965 4195805 4455984 4461084 4560702 4705393 4823810 4773570 4812307 4863363 4888855
7025 4888855 4952618 4843695 4804171 4945252 5013804 5061642 4814229 4744960 4863905 4991370
7015 4991370 4818911 4727514 4905205 4830254 5226895 5075186 4961432 5140997 5210820 5146546
7005 5146546 5086725 5058715 5026492 5123348 5180854 5098405 5314488 5229463 5215669 5380308 5501063
6994 5501063 5369391 5428857 5645202 5616102 5866667 5993908 5965370 5875228 5825943 5787616 5520607
6983 5520607 5760454 5969902 5913633 5900558 5987221 5975324 5920329 5739901 5949040 5904161 6085974
$$ packed form
7056D358060l5830k89095j42640L9219J40487K72516o9984r5395J43368L1056
7046D351762J20851n8824q637j19751k70649J8215k3126J08581J33250J90060
7036D441732j73767p2160K60179N100R9618J44691J18417n0240L8737N1056K5492
7025D888855O3763j08923l9524J41081O8552M7838k47413o9269J18945J27465
7015D991370j72459r1397J77691p4951L96641j51709j13754J79565O9823o4274
7005E146546n9821k8010l2223R6856N7506q2449K16083q5025j3794J64639J20755
6994E501063j31672N9466K16345k9100K50565J27241k8538r0142m9285l8327k67009
6983E520607K39847K09448n6269j3075Q6663j1897n4995j80428K09139m4879J81813
$$ plain form
6972 6085974 6154083 6311400 6255583 6474119 6372586 6414924 6320320 5958588 5960252 6142184 6310811
6961 6310811 6576555 6641837 6579114 6897595 6975396 7078939 6821058 6879055 6877324 6920014 6728788
6950 6728788 6886570 7075984 6993205 7049706 6941045 7210627 7128416 7020918 7114347 7134482
6940 7134482 7400737 7414391 7405838 7231933 7255630 7464959 7515241 7477230 7346312 7400029 7781409
6929 7781409 7672996 7544055 7734205 7862897 7699627 7854068 7850903 7783566 7990242 8220397
6919 8220397 8160743 8371368 8531136 8621227 8618767 8745507 8479548 8638882 8983226 8928497
6909 8928497 9165631 9333892 9202321 9476026 9603158 9488176 9324771 9401840 9609019 9678039
6899 9678039 9761502 9872837 9911964 10190764 10250734 10076220 10211114 10291365 10679918 10797377
$$ packed form
6972F085974O8109J57317n5817K18536j01533M2338r4604l61732J664J81932J68627
6961F310811K65744O5282o2723L18481P7801J03543k57881N7997j731M2690j91226
6950F728788J57782J89414q2779N6501j08661K69582q2211j07498R3429K0135
6940G134482K66255J3654q553j73905K3697K09329N0282l8011j30918N3717L81380
6929G781409j08413j28941J90150J28692j63270J54441l165o7337K06676K30155
6919H220397n9654K10625J59768R0091k460J26740k65959J59334L44344n4729
6909H928497K37134J68261j31571K73705J27132j14982j63405P7069K07179O9020
6899I678039Q3463J11335L9127K78800N9970j74514J34894Q0251L88553J17459
$$ plain form
6889 10797377 10928165 10691126 10682023 10819687 11108994 11265681 11391227 11249431 11393826 11378939
6879 11378939 11600469 11973882 12063838 12124874 12165465 12148314 11999474 12397928 12779579 12895210
6869 12895210 13070781 13159632 13136987 13150086 13250333 13490625 13513097 13801606 14174664 14137960
6859 14137960 14344490 14811571 14908666 15053482 15095215 15237186 15478526 15501986 15537022 15969645
6849 15969645 16072058 16281451 16481749 16494346 16891797 17150281 17079319 17219875 17640739 17613481
6839 17613481 17746034 18064294 18379712 18566290 18842336 19105858 19258658 19285387 19238071 19558877
6829 19558877 19905079 20194444 20635171 20865516 21218323 21554797 21842865 22281843 22694101
6820 22694101 22926856 23256136 23516187 23520656 23880625 24491453 24724711 25208967 25631119 25970276
$$ packed form
6889A0797377J30788k37039r103J37664K89307J56687J25546j41796J44395j4887
6879A1378939K21530L73413Q9956O1036M0591j7151j48840L98454L81651J15631
6869A2895210J75571Q8851k2645J3099J00247K40292K2472K88509L73058l6704
6859A4137960K06530M67081R7095J44816M1733J41971K41340K3460L5036M32623
6849A5969645J02413K09393K00298J2597L97451K58484p0962J40556M20864k7258
6839A7613481J32553L18260L15418J86578K76046K63522J52800K6729m7316L20806
6829A9558877L46202K89365M40727K30345L52807L36474K88068M38978M12258
6820B2694101K32755L29280K60051M469L59969O10828K33258M84256M22152L39157
$$ plain form
6810 25970276 26087151 26593988 27371215 27587410 27892584 28157023 28777807 29275635 29935973
6801 29935973 30462441 30647602 30956915 31589855 32114989 32540239 33111126 33519842 33981878
6792 33981878 34590481 35030033 35790670 36925923 37698814 38331985 38964626 39561773 40288674
6783 40288674 41227033 42069636 42681629 43304351 43855015 44791012 46199132 46983847 47908777
6774 47908777 48748209 49832201 50980614 51948940 53093186 54308527 55568766 56675040
6766 56675040 57895224 59285310 60787678 62096636 63178492 64390417 66101532 67888543
6758 67888543 69710924 71396757 73305804 74995111 76710793 78800871 81040635 82867085
6750 82867085 85038519 87603582 89819752 92093470 94578735 97310126 99952974 103035164
$$ packed form
6810B5970276J16875N06837P77227K16195L05174K64439O20784M97828O60338
6801B9935973N26468J85161L09313O32940N25134M25250N70887M08716M62036
6792C3981878O08603M39552P60637J135253P72891O33171O32641N97147P26901
6783D0288674R38359Q42603O11993O22722N50664R35997J408120P84715R24930
6774D7908777Q39432J083992J148413R68326J144246J215341J260239J106274
6766E6675040J220184J390086J502368J308958J081856J211925J711115J787011
6758F7888543J822381J685833J909047J689307J715682K090078K239764J826450
6750H2867085K171434K565063K216170K273718K485265K731391K642848L082190
$$ plain form
6742 103035164 105826777 108676588 112055468 114964050 118336590 121633950 125014113 128847427
6734 128847427 132835136 136845328 140787283 144746369 149360404 154025975 158697881 163656506
6726 163656506 168431388 173358307 178535033 184091086 189619955 195418413 201142487 206653155
6718 206653155 212503544 218573013 224639289 230577007 236758901 242952241 249118065 255096209
6710 255096209 260839397 266864869 272479089 278087399 283229743 288044805 292566872 296993789
6702 296993789 300744836 304575583 307574049 310013969 311862806 313258388 314486319 314748431
6694 314748431 314448671 313847180 312732666 310675700 308054885 305037496 301676903 297823793
6686 297823793 293722893 289224634 284366965 279248237 273831755 268135830 262370043 256338746
$$ packed form
6742A03035164K791613K849811L378880K908582L372540L297360L380163L833314
6734A28847427L987709M010192L941955L959086M614035M665571M671906M958625
6726A63656506M774882M926919N176726N556053N528869N798458N724074N510668
6718B06653155N850389O069469O066276N937718O181894O193340O165824N978144
6710B55096209N743188O025472N614220N608310N142344M815062M522067M426917
6702B96993789L751047L830747K998466K439920J848837J395582J227931K62112
6694C14748431k99760o01491j114514k056966k620815l017389l360593l853110
6686B97823793m100900m498259m857669n118728n416482n695925n765787o031297
$$ plain form
6678 256338746 250497422 244547781 238375064 232302504 226185231 220367555 214522705 208511804
6670 208511804 202638035 196918234 191611111 186303604 181142023 175821082 170625105 165828132
6662 165828132 161133326 156479981 151943333 147284901 143176662 139297754 135432004 131759717
6654 131759717 127989226 124390093 120728051 117324292 114122353 110753784 107752711 104912118
6646 104912118 102021364 98911714 96238934 93774663 91448182 88934113 86721982 84521552
6638 84521552 82414239 80216714 78210612 76274392 74167798 72275326 70603697 68727611
6630 68727611 67184398 65747432 64005786 62791594 61135767 59694544 58522256 57116784
6622 57116784 55694263 54484301 53111106 51855931 50710269 49898270 48740902 47562042
$$ packed form
6678B56338746n841324n949641o172717o072560o117273n817676n844850o010901
6670B08511804n873769n719801n307123n307507n161581n320941n195977m796973
6662A65828132m694806m653345m536648m658432m108239l878908l865750l672287
6654A31759717l770491l599133l662042l403759l201939l368569l001073k840593
6646A04912118k890754l109650k672780k464271k326481k514069k212131k200430
6638H4521552k107313k197525k006102j936220k106594j892472j671629j876086
6630F8727611j543213j436966j741646j214192j655827j441223j172288j405472
6622E7116784j422521j209962j373195j255175j145662q11999j157368j178860
$$ plain form
6614 47562042 46603872 45657594 44754358 43866635 42941091 42142119 41052871 40579402 39569607
6605 39569607 38675920 37991418 37070980 36388739 35716169 35144006 34428457 33599163 33035456
6596 33035456 32678582 31723794 31198119 30412313 29642839 29089205 28588794 28105747 27549507
6587 27549507 26941068 26432579 26065821 25681098 25360092 25026197 24589762 23953133 23528880
6578 23528880 23369693 23179910 22761542 22061575 21671854 21562880 21011291 20372736 20020373
6569 20020373 19747370 19647464 19453311 19055866 18891065 18580502 18161862 17978680 17865190 17509296
6559 17509296 17278406 17096452 16704419 16274299 15745208 15648297 15464628 15348156 15146056 14833555
6549 14833555 14563606 14483132 14216914 14271256 13986074 13892637 13842958 13345387 13102926 13136495
$$ packed form
6614D7562042r58170r46278r03236q87723r25544p98972j089248m73469j009795
6605C9569607q93687o84502r20438o82241o72570n72163p15549q29294n63707
6596C3035456l56874r54788n25675p85806p69474n53634n00411m83047n56240
6587B7549507o08439n08489l66758l84723l21006l33895m36435o36629m24253
6578B3528880j59187j89783m18368o99967l89721j08974n51589o38555l52363
6569B0020373k73003r9906j94153l97445j64801l10563m18640j83182j13490l55894
6559A7509296k30890j81954l92033m30120n29091r6911j83669j16472k02100l12501
6549A4833555k69949q0474k66218N4342k85182r3437m9679m97571k42461L3569
$$ plain form
6539 13136495 12984841 12461124 12188166 12186110 12288594 12202563 12014180 11549214 11405637 11381962
6529 11381962 11534868 11493196 11152199 10905455 10816925 10568845 10494102 10420431 10346150 10113486
6519 10113486 10088616 10009372 9861643 9784973 9723471 9631132 9537802 9301247 9333784 9169416 8711915
6508 8711915 8382355 8415379 8492060 8122352 8069584 8178332 7798734 8069139 8172220 8147833
6498 8147833 7916911 7547264 7766859 7537564 7213212 7354555 7029154 6915922 6830628 6553108
6488 6553108 6791349 6738986 6700653 6513971 6486344 6362089 6506031 6507195 6542880 6263087 6207017
6477 6207017 6229062 6352284 6385945 6063714 5764355 5591971 5676728 5725205 5478510 5612350
6467 5612350 5734691 5852320 5801767 5431352 5436574 5601003 5546530 5259307 5124363 5092023
$$ packed form
6539A3136495j51654n23717k72958k056J02484q6031j88383m64966j43577k3675
6529A1381962J52906m1672l40997k46744q8530k48080p4743p3671p4281k32664
6519A0113486k4870p9244j47729p6670o1502r2339r3330k36555L2537j64368m57501
6508H711915l29560L3024P6681l69708n2768J08748l79598K70405J03081k4387
6498H147833k30922l69647K19595k29295l24352J41343l25401j13232q5294k77520
6488F553108K38241n2363l8333j86682k7627j24255J43942J164L5685k79793n6070
6477F207017K2045J23222L3661l22231k99359j72384Q4757M8477k46695J33840
6467E612350J22341J17629n0553l70415N222J64429n4473k87223j34944l2340
$$ plain form
6457 5092023 5080054 5199929 5254506 5128537 5160151 5069010 4987097 5044464 5079137 4940666 4855091
6446 4855091 4793150 4775308 4537646 4478762 4379652 4356702 4333397 4307366 4481980 4442869 4247501
6435 4247501 4354690 4504532 4355784 4080188 3984374 3972927 4108926 4037146 3957852 3985170
6425 3985170 3653889 3635640 3803001 3807724 3645562 3629037 3559562 3636154 3664781 3508304 3534010
6414 3534010 3538977 3099086 2926196 2898685 2916800 2987206 3404255 3505156 3124442 2810009
6404 2810009 3017109 3035640 3041257 2970454 2933641 3035257 2813971 3036203 3306675 3090191
6394 3090191 3226569 3127652 2920697 2932775 2854790 2765243 2984988 3128509 3044106 2799223
6384 2799223 2477935 2386828 2465886 2839338 2829385 2777448 2781739 2494503 2427903 2736983 2562145
$$ packed form
6457E092023j1969J19875N4577j25969L1614r1141q1913N7367L4673j38471q5575
6446D855091o1941j7842k37662n8884r9110k2950k3305k6031J74614l9111j95368
6435D247501J07189J49842j48748k75596r5814j1447J35999p1780p9294K7318
6425C985170l31281j8249J67361M723j62162j6525o9475P6592K8627j56477K5706
6414C534010M967m39891j72890k7511J8115P0406M17049J00901l80714l14433
6404B810009K07100J8531N617p0803l6813J01616k21286K22232K70472k16484
6394C090191J36378r8917k06955J2078p7985q9547K19745J43521q4403k44883
6384B799223l21288r1107P9058L73452r953n1937M291k87236o6600L09080j74838
$$ plain form
6373 2562145 2508322 2426887 2387074 2531633 2456426 2215979 2440381 2607538 2449620 2209272
6363 2209272 2073484 1875276 2130562 2204327 2061776 2101012 1997035 1959095 1909858 1957868
6353 1957868 2273069 2152331 1945696 1748958 1706932 1545801 1692436 2070620 1924402 1768997
6343 1768997 1801259 1852934 1628346 1927474 2111761 2089525 2061583 1778433 1896853 2180090
6333 2180090 2145818 2084464 1941142 1836054 1665210 1592325 1843737 1776669 1880917 1642410
6323 1642410 1423430 1582484 1605198 1702167 1620768 1493714 1654346 1649325 1722129 1579763 1466083
6312 1466083 1458776 1660349 1684125 1682030 1464306 1275458 1350204 1376380 1572392 1430949 1260330
6301 1260330 1015883 1081436 956606 1044058 1244889 1363106 1456182 1266171 1203083 1131669
$$ packed form
6373B562145n3823q1435l9813J44559p5207k40447K24402J67157j57918k40348
6363B209272j35788j98208K55286P3765j42551L9236j03977l7940m9237M8010
6353A957868L15201j20738k06635j96738m2026j61131J46635L78184j46218j55405
6343A768997L2262N1675k24588K99128J84287k2236k7942k83150J18420K83237
6333B180090l4272o1354j43322j05088j70844p2885K51412o7068J04248k38507
6323A642410k18980J59054K2714R6969q1399j27054J60632n021P2804j42366j13680
6312A466083p307K01573K3776k095k17724j88848P4746K6176J96012j41443j70619
6301A260330k44447O5553j24830Q7452K00831J18217R3076j90011o3088p1414
$$ plain form
6291 1131669 1186008 1147003 1336708 1221869 1305364 1230525 928206 841337 949907 1035303 879436
6280 879436 1080842 1175624 1274493 1196664 1219766 1407059 1271561 1012831 1162821 1266638
6270 1266638 1365201 1108072 1143675 1404847 1302709 1207113 935666 949690 1078224 1126333
6260 1126333 1219633 1053472 1194251 1243159 1094992 882881 862830 812469 973719 1238515
6250 1238515 1134569 946992 1002770 1035741 1309577 1066396 1180011 848767 887642 971046
6240 971046 944707 755694 597061 860186 751466 631076 664262 762059 942867 905438
6230 905438 855234 1020370 783619 682319 509077 600144 631697 590890 896759 945034 628518
6219 628518 615523 423662 493622 660604 918292 915630 874218 745509 706962 688433 463266
$$ packed form
6291A131669N4339l9005J89705j14839Q3495p4839l02319q6869J08570Q5396j55867
6280H79436K01406R4782R8869p7829K3102J87293j35498k58730J49990J03817
6270A266638R8563k57129L5603K61172j02138r5596k71447J4024J28534M8109
6260A126333R3300j66161J40779M8908j48167k12111k0051n0361J61250K64796
6250A238515j03946j87577N5778L2971K73836k43181J13615l31244L8875Q3404
6240I71046k6339j89013j58633K63125j08720j20390L3186R7797J80808l7429
6230I05438n0204J65136k36751j01300j73242R1067L1553m0807L05869M8275l16516
6219F28518j2995j91861O9960J66982K57688k662m1412j28709l8547j8529k25167
$$ plain form
6208 463266 449214 645682 796888 998162 914413 679446 631534 899866 894407 554602 557460
6197 557460 607689 544445 652851 711618 709125 567585 506774 418630 501018 606474 458595
6186 458595 533408 621884 781559 699295 533354 618279 472105 494222 364121 601193 493896
6175 493896 632392 751662 631224 562312 587342 604513 477181 601284 804068 846134
6165 846134 953530 1022314 725659 602426 284528 522208 811789 952935 752118 404585
6155 404585 551727 345882 371091 685533 620554 701296 350509 255538 331179 403858 145111
6144 145111 232858 424938 269069 231285 493111 369433 441200 437480 386258 205889 366960
6133 366960 676466 358355 293383 421959 229697 41714 202674 476288 486664 283727
$$ packed form
6208D63266j4052J96468J51206K01274q3749k34967m7912K68332n459l39805K858
6197E57460N0229o3244J08406N8767k493j41540o0811q8144Q2388J05456j47879
6186D58595P4813Q8476J59675q2264j65941Q4925j46174K2117j30101K37072j07297
6175D93896J38496J19270j20438o8912K5030J7171j27332J24103K02784M2066
6165H46134J07396O8784k96655j23233l17898K37680K89581J41146k00817l47533
6155D04585J47142k05845K5209L14442o4979Q0742l50787r4971P5641P2679k58747
6144A45111Q7747J92080j55869l7784K61826j23678P1767l720n1222j80369J61071
6133C66960L09506l18111o4972J28576j92262j87983J60960K73614J0376k02937
$$ plain form
6123 283727 307052 416146 343858 425336 477795 617206 506091 398085 566894 334085
6113 334085 238903 386900 345894 185115 342661 126099 264231 343348 139531 -38367
6103 -38367 105705 91079 194874 111075 -145592 -34662 121847 -70656 292998 60469
6093 60469 46567 189763 255049 282750 405810 575861 494308 351766 435225 417907 269997
6082 269997 129984 18946 271961 333273 148606 -39210 359792 166915 -88134 -42328
6072 -42328 84019 173979 291026 482263 546081 300917 170754 134128 98430 118688 173394
6061 173394 230017 181523 84642 159905 240568 203004 363377 552129 191553 133886 419434
6050 419434 207758 79093 172450 20756 1583 -32517 69228 167328 333035 126777
$$ packed form
6123B83727K3325J09094p2288Q1478N2459J39411j11115j08006J68809k32809
6113C34085r5182J47997m1006j60779J57546k16562J38132P9117k03817j77898
6103c8367J44072j4626J03795q3799k56667J10930J56509j92503L63654k32529
6093F0469j3902J43196O5286K7701J23060J70051q1553j42542Q3459j7318j47910
6082B69997j40013j11038K53015O1312j84667j87816L99002j92877k55049M5806
6072d2328J26347Q9960J17047J91237O3818k45164j30163l6626l5698K0258N4706
6061A73394N6623m8494r6881P5263Q0663l7564J60373J88752l60576n7667K85548
6050D19434k11676j28665R3357j51694j9173l4100J01745R8100J65707k06258
$$ plain form
6040 126777 92296 145925 -116153 -54420 190606 357127 82448 187073 79176 122453
6030 122453 210429 109185 -46961 136534 69587 184494 208306 52028 240493 177721
6020 177721 74221 -23779 31187 10923 100673 144125 -6045 -6773 -54590 -321473 -206935
6009 -206935 -56531 103189 -157963 33248 -68049 -138010 -190204 -166880 30795 56150
5999 56150 155723 -74601 -268114 -269380 -96754 512 57360 113866 66883 292210 395548
5988 395548 276805 21038 129309 483333 462347 145149 85840 268911 233659 87629
5978 87629 290529 126384 218259 409634 217154 365116 439356 281127 108175 219027
5968 219027 545636 529252 494784 506630 80554 117715 317109 313656 350784 392647 75157
$$ packed form
6040A26777l4481N3629k62078O1733K45026J66521k74679J04625j07897M3277
6030A22453Q7976j01244j56146J83495o6947J14907K3812j56278J88465o2772
6020A77721j03500r8000N4966k0264Q9750M3452j50170p28m7817k66883J14538
6009b06935J50404J59720k61152J91211j01297o9961n2194K3324J97675K5355
5999E6150R9573k30324j93513j266J72626R7266N6848N6506m6983K25327J03338
5988C95548j18743k55767J08271L54024k0986l17198n9309J83071l5252j46030
5978H7629K02900j64145R1875J91375j92480J47962P4240j58229j72952J10852
5968B19027L26609j6384l4468J1846m26076L7161J99394l453L7128M1863l17490
$$ plain form
5957 75157 41948 130714 190836 188112 85600 225568 125859 174946 38161 44664 27313 -130782
5945 -130782 -235246 -2360 170785 103392 -14896 43759 93878 -112881 121380 396530
5935 396530 262433 293527 261128 214835 205671 273200 339707 9288 37973 61637 115556
5924 115556 -37480 197107 201822 6054 -95201 115867 324618 461831 301258 75707
5914 75707 1777 38860 -858 -117780 -214923 -23890 -70535 65305 149284 183499 294626
5903 294626 402088 307011 122332 -75191 179963 -8078 27650 157539 -57201 -36046
5893 -36046 -97603 -105560 -216790 -28370 -113893 -230575 -282079 -83085 -126433 -121993 -155646
5882 -155646 -138492 -14432 -169508 -175949 -249428 -133813 -127299 -177935 -21564 -104997 -34984
$$ packed form
5957G5157l3209Q8766O0122k724j02512J39968r9709M9087j36785O503j7351j58095
5945a30782j04464K32886J73145o7393j18288N8655N0119k06759K34261K75150
5935C96530j34097L1094l2399m6293r164O7529O6507l30419K8685K3664N3919
5924A15556j53036K34587M715j95768j01255K11068K08751J37213j60573k25551
5914G5707p3930L7083l9718j16922r7143J91033m6645J35840Q3979L4215J11127
5903B94626J07462r5077j84679j97523K55154j88041L5728J29889k14740K1155
5893c6046o1557p957j11230J88420q5523j16682n1504J98994m3348M440l3653
5882a55646J7154J24060j55076o441p3479J15615O514n0636J56371q3433P0013
$$ plain form
5871 -34984 62094 134997 38799 -253763 -68635 -161732 -277969 -415535 -449920 -134306 -224679
5860 -224679 -43430 64479 -232222 -200493 -365850 -285239 -57967 85474 161588 -56348
5850 -56348 -95812 -72363 -3260 -18858 41137 -164820 -49976 -134480 -101661 -249424 -388111
5839 -388111 -232206 -248680 -133450 -33388 -127043 -150182 17113 25122 -219681 -426292 -442952
5828 -442952 -72439 -189856 -94949 181303 49326 -183913 -355221 -177879 -24507 -182099
5818 -182099 -77309 16262 -34400 -168388 -12912 233414 14912 -129448 -58336 -4507
5808 -4507 -81096 -91884 -100593 -125671 -270547 -364849 -242704 -229078 -128983 -287045 -150605
5797 -150605 37866 -46083 -58964 -163788 -32104 -687 -33431 -183175 -149280 53692 92265
$$ packed form
5871c4984R7078P2903r6198k92562J85128r3097j16237j37566l4385L15614r0373
5860b24679J81249J07909k96701L1729j65357Q0611K27272J43441P6114k17936
5850e6348l9464K3449O9103j5598N9995k05957J14844q4504L2819j47763j38687
5839c88111J55905j6474J15230J00062r3655k3139J67295Q009k44803k06611j6660
5828d42952L70513j17417R4907K76252j31977k33239j71308J77342J53372j57592
5818a82099J04790R3571n0662j33988J55476K46326k18502j44360P1112N3829
5808d507p6589j0788q709k5078j44876r4302J22145J3626J00095j58062J36440
5797a50605J88471q3949j2881j04824J31684L1417l2744j49744L3895K02972L8573
$$ plain form
5786 92265 -212604 -345094 -420378 -241884 -128101 -159121 -5263 8122 44052 -31976 -7
5775 -7 -155412 -211676 -416711 -422150 -228616 53306 -112228 -221152 -310110 -315512 -414422 -421259
5763 -421259 -347892 -167725 -55150 -290779 -360567 -212010 -80201 -145659 -142081 -336408 -185120
5752 -185120 153784 77591 -107627 -93018 77199 -15808 -96149 -76367 33664 -234592 -269731
5741 -269731 46960 -116278 -45356 105930 -1078 -205721 -124232 -99985 -124814 -139423 47626
5730 47626 -150991 -176861 -175947 -26714 3921 60086 -43838 -37669 6370 167755 206695 305000
5718 305000 -17343 -13425 -20573 -92678 -185965 -354362 -317602 -445967 -329691 -155668 -130174
5707 -130174 7014 267964 304539 100215 40299 180107 273748 174672 70661 -89122
$$ packed form
5786I2265l04869j32490p5284J78494J13783l1020J53858J3385L5930p6028L1969
5775gj55405n6264k05035n439J93534K81922j65534j08924q8958n402r8910o837
5763d21259P3367J80167J12575k35629o9788J48557J31809o5458L578j94327J51288
5752a85120L38904p6193j85218J4609J70217r3007q0341J9782J10031k68256l5139
5741b69731L16691j63238P0922J51286j07008k04643Q1489K4247k4829j4609J87049
5730D7626j98617k5870R14J49233L0635N6165j03924O169M4039J61385L8940R8305
5718C05000l22343L918p148p2105r3287j68397L6760j28365J16276J74023K5494
5707a30174J37188K60950L6575k04324n9916J39808R3641r9076j04011j59783
$$ plain form
5697 -89122 8493 90867 -123403 -79692 -270135 -226274 -15198 111569 125879 -197897 30790
5686 30790 107969 136662 243506 83627 62158 -116885 -107808 26150 -118016 -126704 -260287
5675 -260287 -338230 -189117 -327577 -286430 -173464 -224369 -121734 50296 -33067 120400
5665 120400 81485 -233708 -147035 89518 129885 169881 -221942 -152137 54395 19467 -119491
5654 -119491 -243666 -612909 -562505 -283294 -361689 -289283 -263268 -168971 -193091 -182625 121214
5643 121214 129632 34179 -17302 177929 219507 174481 138707 214630 75501 -71465 -95425
5632 -95425 -95208 165880 138162 185277 156749 184436 73190 -151945 -61513 -15180 -112838 -89767
5620 -89767 182392 485522 220723 271075 163628 142531 404790 146341 -2946 -191638
$$ packed form
5697h9122R7615Q2374k14270M3711j90443M3861K11076J26767J4310l23776K28687
5686C0790P7179K8693J06844j59879k1469j79043R077J33958j44166q688j33583
5675b60287p7943J49113j38460M1147J12966n0905J02635J72030q3363J53467
5665A20400l8915l15193Q6673K36553M0367L9996l91823O9805K06532l4928j38958
5654a19491j24175l69243N0404K79211p8395P2406K6015R4297k4120J0466L03839
5643A21214Q418r5453n1481J95231M1578m5026l5774P5923j39129j46966k3960
5632i5425K17K61088k7718M7115k8528K7687j11246k25135R0432M6333r7658K3071
5620h9767K72159L03130k64799N0352j07447k1097K62259k58449j49287j88692
$$ plain form
5610 -191638 -130271 -204928 -5597 217093 137247 -4236 116509 13015 26964 29329 65154
5599 65154 -16014 -55065 -64442 -140685 -190015 -202585 -329346 -266603 -243911 -426030 -373848 -222048
5587 -222048 -209938 -211374 -41856 85605 8577 -153845 -147314 -335276 -122524 -185171 -364403
5576 -364403 -487891 -311036 -85205 -21557 -124101 -188945 -259652 -380656 -292366 -55211
5566 -55211 -135833 115414 99149 -71129 -47204 -90817 -249835 -222874 -62109 -102781 -155708
5555 -155708 -346201 -256287 -255710 -276350 -527312 -194029 -193208 -71718 -95353 -103129 40116 75625
5543 75625 -125792 -375061 -91883 -62624 -22128 -233352 -36236 -144265 -105807 -378951
5533 -378951 -577117 -646519 -455944 -328857 -136851 -206319 2427 360969 35808 63313
$$ packed form
5610a91638O1367p4657J99331K22690p9846j41483J20745j03494J3949K365L5825
5599F5154q1168l9051r377p6243m9330j2570j26761O2743K2692j82119N2182J51800
5587b22048J2110j436J69518J27461p7028j62422O531j87962K12752o2647j79232
5576c64403j23488J76855K25831O3648j02544o4844p0707j21004Q8290K37155
5566e5211q0622K51247j6265j70278K3925m3613j59018K6961J60765m0672n2927
5555a55708j90493Q9914N77k0640k50962L33283Q21J21490k3635p776J43245L5509
5543G5625k01417k49269K83178K9259M0496k11224J97116j08029L8458k73144
5533c78951j98166o9402J90575J27087J92006o9468K08746L58542l25161K7505
$$ plain form
5523 63313 76848 -101329 -152285 -149742 -386935 -145413 -215236 -429045 -423882 -313857 -187238
5512 -187238 -136845 -77777 -106874 -32766 -74674 -256122 -305101 -432696 -245387 -215873 -72932
5501 -72932 64581 -119731 -100965 41109 -10090 32000 144176 14823 89062 80957 -19601
5490 -19601 66315 -43604 132647 25411 -284849 -376745 -366363 -435961 -329521 12766 -294562
5479 -294562 -254224 25681 43584 -109330 -180777 -207841 -136686 -158615 -193961 -53288 -2378
5468 -2378 78473 36113 -73628 -93777 18026 52086 95788 177851 -77692 -106040 69490
5457 69490 1324 -93019 66665 124833 -184380 -288976 -127235 -130684 -91415 -78858 -19185
5446 -19185 72492 10886 -88612 -7024 86789 33907 184702 304181 -49159 -275249 -364520
$$ packed form
5523F3313J3535j78177n0956K543k37193K41522o9823k13809N163J10025J26619
5512a87238N0393N9068k9097P4108m1908j81448m8979j27595J87309K9514J42941
5501g2932J37513j84312J8766J42074n1199M2090J12176j29353P4239q105j00558
5490a9601Q5916j09919J76251j07236l10260r1896J0382o9598J06440L42287l07328
5479b94562M0338K79905J7903j52914p1447k7064P1155k1929l5346J40673N0910
5468b378Q0851m2360j09741k0149J11803L4060M3702Q2063k55543k8348J75530
5457F9490o8166r4343J59684N8168l09213j04596J61741l449L9269J2557N9673
5446a9185R1677o1606r9498Q1588R3813n2882J50795J19479l53340k26090q9271
$$ plain form
5435 -364520 -152651 -235344 -170739 -172239 -144811 13051 -312128 -227395 77367 167734 17528
5424 17528 -84792 -340643 -351466 -291000 -187131 -105559 -173788 -33399 -176743 -55950 42226
5413 42226 46267 -87508 -120250 -168475 -304853 -288536 -263166 -62546 -124622 -208972 -199912 -136475
5401 -136475 -225914 -90968 -11422 -19774 48996 -37861 13470 -41180 -99133 46596 242026
5390 242026 85603 -168884 20385 203071 49377 115095 229149 -169182 -33668 78102
5380 78102 -149611 -315204 -6471 22741 -84910 68328 94998 -81923 -96163 -168570 -4920
5369 -4920 101168 80702 34118 10504 40137 -22005 181348 219164 34404 103642 -169955
5358 -169955 -316027 -341519 -130331 -86502 -58785 -113098 -181396 -39674 -57126 -123026 -148710
$$ packed form
5435c64520K11869q2693O4605j500K7428J57862l25179Q4733L04762R0367j50206
5424A7528j02320k55851j0823O0466J03869Q1572o8229J40389j43344J20793R8176
5413D2226M041j33775l2742m8225j36378J6317K5370K00620o2076q4350R060O3437
5401a36475q9439J34946P9546q352O8770q6857N1331n4650n7953J45729J95430
5390B42026j56423k54487J89269J82686j53694O5718J14054l98331J35514J11770
5380G8102k27713j65593L08733K9212j07651J53238K6670j76921j4240p2407J63650
5369d920J06088k0466m6584k3614K9633o2142K03353L7816j84760O9238k73597
5358a69955j46072k5492K11188M3829K7717n4313o8298J41722j7452o5900k5684
$$ plain form
5347 -148710 -11370 119382 105689 233304 50051 -335245 -88635 17454 198841 72829
5337 72829 -4367 72460 -24569 -232077 -278892 -299094 -234647 -145875 -198069 -73201 -187532
5326 -187532 136751 133131 91746 91665 103934 207684 -37729 25835 27370 107091 -100170 -25693
5314 -25693 182324 62078 -261623 -159746 -100325 -94630 -111192 -224877 -216637 3802 3305
5303 3305 73878 -8374 -9603 -68651 -240739 -136185 -36983 -19100 -131474 -330542 -155867
5292 -155867 -19812 -7948 -105736 -143221 56016 194922 30215 -208084 -333303 -170631
5282 -170631 -109150 161184 139354 -172568 18683 87078 93314 -14420 -45793 39418 -309010
5271 -309010 -141970 -123492 -210935 155416 -23433 22887 165473 478971 201157 72064
$$ packed form
5347a48710J37340J30752j3693J27615j83253l85296K46610J06089J81387j26012
5337G2829p7196P6827r7029k07508m6815k0202O4447Q8772n2194J24868j14331
5326a87532L24283l620m1385q1J2269J03750k45413O3564J535P9721k07261P4477
5314b5693K08017j20246l23701J01877N9421N695j6562j13685Q240K20439m97
5303C305P0573q2252j229n9048j72088J04554R9202J7883j12374j99068J74675
5292a55867J36055J1864r7788l7485J99237J38906j64707k38299j25219J62672
5282a70631O1481K70334k1830l11922J91251O8395O236j07734l1373Q5211l48428
5271c09010J67040J8478q7443L66351j78849M6320J42586L13498k77814j29093
$$ plain form
5261 72064 114352 -234586 -36991 160204 -74512 -66609 159484 43876 280829 114632
5251 114632 257334 216857 26844 86713 218458 254046 -52090 -230235 -58843 -143374
5241 -143374 -6040 228124 91731 388943 511217 178699 -232592 -69510 -188188 -148125
5231 -148125 20806 528445 253591 134735 134741 77282 146102 19281 -52651 75127 -29427
5220 -29427 65447 -143388 38293 -44385 -244002 -101279 -64864 -104803 74278 -9467 -142602
5209 -142602 -149824 -113234 18319 -105518 -97201 2650 34728 11858 -193413 -295373 -33867
5198 -33867 36141 168667 -79405 -71396 -239460 -380142 -263879 -108511 -202637 -170671 9519
5187 9519 149779 151813 54680 -16347 196952 134161 128681 -58303 -135288 274867 456090
$$ packed form
5261G2064M2288l48938J97595J97195k34716P903K26093j15608K36953j66197
5251A14632J42702m0477j90013N9869J31745L5588l06136j78145J71392q4531
5241a43374J37334K34164j36393K97212J22274l32518m11291J63082j18678M0063
5231a48125J68931N07639k74854j18856On7459O8820j26821p1932J27778j04554
5220b9427R4874k08835J81681q2678j99617J42723L6415l9939J79081q3745j33135
5209a42602p222L6590J31553j23837Q317R9851L2078k2870k05271j01960K61506
5198c3867P0008J32526k48072Q009j68064j40682J16263J55368r4126L1966J80190
5187I519J40260K034r7133p1027K13299o2791n480j86984p6985M10155J81223
$$ plain form
5176 456090 388276 432962 389581 181958 157520 -12944 101789 149594 55648 171999 -27939
5165 -27939 -8620 6329 -21501 -106327 -15830 35233 41469 79793 108828 176773 155180 -50541
5153 -50541 324208 351938 190723 107975 -42558 -72985 48753 355871 381032 139489 106462
5142 106462 166871 242713 60095 40111 20364 248280 90769 -63276 -22835 -118144 28588
5131 28588 107368 335604 184915 297853 185262 324776 52144 75411 47337 57999 31426
5120 31426 124775 323352 241096 -130875 -55805 115350 94129 -15716 -137743 -175698 -198284
5109 -198284 -182867 -56432 9979 131527 102307 133108 347367 373611 115264 17395 359506
5098 359506 590041 426303 162581 50586 -146055 -203303 37399 53288 -115786 737
$$ packed form
5176D56090o7814M4686m3381k07623k4438j70464J14733M7805r3946J16351j99938
5165b7939J9319J4949k7830q4826R0497N1063O236L8324K9035O7945k1593k05721
5153e0541L74749K7730j61215q2748j50533l0427J21738L07118K5161k41543l3027
5142A06462O0409P5842j82618j9984j9747K27916j57511j54045M0441r5309J46732
5131B8588P8780K28236j50689J12938j12591J39514k72632K3267k8074J0662k6573
5120C1426R3349J98577q2256l71971P5070J71155k1221j09845j22027l7955k2586
5109a98284J5417J26435O6411J21548k9220L0801K14259K6244k58347r7869L42111
5098C59506K30535j63738k63722j11995j96641n7248K40702J5889j69074J16523
$$ plain form
5088 737 -5304 128594 23854 -227354 -174365 3194 -117137 -25216 120014 160529 317239
5077 317239 95448 -134103 -35975 98248 139108 159242 -228410 -209481 -216490 -269814 -260988
5066 -260988 6504 115055 -46390 163532 194612 125900 -84094 66877 181369 178202
5056 178202 219142 390278 -55213 100847 380412 490743 336200 270124 420756 692851
5046 692851 508215 299440 549121 436826 365154 423529 287620 204032 171013 204722 266264
5035 266264 321443 231858 272435 322134 365950 90854 152347 264683 81769 206469 316884
5024 316884 473285 399222 516042 337960 345123 258854 267845 239256 204281 155959 281007
5013 281007 77266 236512 422550 343612 363774 396466 681601 498699 609245 602698 702884
$$ packed form
5088G37o041J33898j04740k51208N2989J77559j20331R1921J45230M0515J56710
5077C17239k21791k29551R8128J34223M0860K0134l87652J8929p009n3324Q826
5066b60988K67492J08551j61445K09922L1080o8712k09994J50971J14492l167
5056A78202M0940J71136m45491J56060K79565J10331j54543o6076J50632K72095
5046F92851j84636k08775K49681j12295p1672N8375j35909q3588l3019L3709O1542
5035B66264N5179q9585M0577M9699M3816k75096O1493J12336j82914J24700J10415
5024C16884J56401p4063J16820j78082P163q6269Q991k8589l4975m8322J25048
5013B81007k03741J59246J86038p8938K0162L2692K85135j82902J10546o547J00186
$$ plain form
5002 702884 514472 316527 365366 324213 312062 127516 321469 242267 222083 312650 410533
4991 410533 522905 698909 534977 315726 258913 341537 561913 628138 580669 585341 652408
4980 652408 662910 441116 327049 559889 457603 280062 88649 161049 276769 197793
4970 197793 316930 133033 20551 422601 444094 430663 411251 392120 437406 517370 589311
4959 589311 655039 695713 594878 483223 521392 514553 419533 745688 956137 733155 702740
4948 702740 807000 749946 948469 932381 796653 819646 1010145 1225226 1272201 1420373
4938 1420373 1413913 1425021 1447248 1760159 1823158 1932301 2116448 2229535 2824094 3080195
4928 3080195 2988627 3446759 3773668 3985197 4413453 4666489 4857688 4924915 5353836 5284168
$$ packed form
5002G02884j88412j97945M8839m1153j2151j84546J93953p9202k0184R0567R7883
4991D10533J12372J76004j63932k19251n6813Q2624K20376O6225m7469M672O7067
4980F52408J0502k21794j14067K32840j02286j77541j91413P2400J15720p8976
4970A97793J19137j83897j12482M02050K1493j3431j9412j9131M5286P9964P1941
4959E89311O5728M0674j00835j11655L8169o839r5020L26155K10449k22982l0415
4948G02740J04260n7054J98523j6088j35728K2993J90499K15081M6975J48172
4938A420373o460J1108K2227L12911O2999J09143J84147J13087N94559K56101
4928C080195r1568M58132L26909K11529M28256K53036J91199O7227M28921o9668
$$ plain form
4918 5284168 5138452 5114540 4934755 4654753 4425598 4149356 3676046 3692795 3429403 2810393
4908 2810393 2486518 2455098 2538983 2520319 2489655 2186230 1987310 2163706 2117212 2031636 2079355
4897 2079355 1737926 1687733 1596462 1508279 1453556 1330962 1340181 1286050 1158770 1337597 1242418
4886 1242418 1082974 1023618 985334 941767 983491 1125698 955751 835646 934294 1008431 1009943
4875 1009943 1090918 953276 709849 855901 762159 657626 736422 521364 649588 781907
4865 781907 978110 917607 795176 672004 921380 842137 781152 567816 457164 697912
4855 697912 929305 937782 913497 705253 673477 679974 550983 437616 653815 790155 638957
4844 638957 586509 591649 697551 585311 407108 422639 579911 616660 568530 725544 688715
$$ packed form
4918E284168j45716k3912j79785k80002k29155k76242m73310J6749k63392o19010
4908B810393l23875l1420Q3885j8664l0664l03425j98920J76396m6494q5576M7719
4897B079355l41429n0193r1271q8183n4723j22594R219n4131j27280J78827r5179
4886A242418j59444n9356l8284m3567M1724J42207j69947j20105R8648P4137J512
4875A009943Q0975j37642k43427J46052r3742j04533P8796k15058J28224J32319
4865G81907J96203o0503j22431j23172K49376p9243o0985k13336j10652K40748
4855F97912K31393Q477k4285k08244l1776O497j28991j13367K16199J36340j51198
4844F38957n2448N140J05902j12240j78203J5531J57272L6749m8130J57014l6829
$$ plain form
4833 688715 594591 582504 470940 513598 441826 561776 837063 664783 340687 443037
4823 443037 344498 479122 551048 639210 793778 685609 561648 582547 692152 781320 585270
4812 585270 590897 577766 650028 737581 616061 858925 828769 794413 654671 991045 1295254
4801 1295254 1120987 1273378 1191267 1301990 1475590 1681743 1648883 1856325 1890627 2169547
4791 2169547 2151974 2265817 2584396 2604506 2864071 3055047 3014258 3294532 3672095 3968026
4781 3968026 4338976 4629921 5307401 5473463 5453566 5731179 5815998 5417682 5278405 4984024
4771 4984024 4448665 4078622 3913458 3499665 3369189 3208161 2827732 2863752 2602421 2571397
4761 2571397 2373127 2204220 2037590 1980602 1937126 1962985 1970680 1923815 1902147 1835298 1779059
$$ packed form
4833F88715r4124j2087j11564M2658p1772J19950K75287j72280l24096J02350
4823D43037r8539J34624P1926Q8162J54568j08169j23961K0899J09605Q9168j96050
4812E85270N627j3131P2262Q7553j21520K42864l0156l4356j39742L36374L04209
4801A295254j74267J52391q2111J10723J73600K06153l2860K07442L4302K78920
4791B169547j7573J13843L18579K0110K59565J90976m0789K80274L77563K95931
4781C968026L70950K90945O77480J66062j9897K77613Q4819l98316j39277k94381
4771D984024n35359l70043j65164m13793j30476j61028l80429L6020k61331l1024
4761B571397j98270j68907j66630n6988m3476K5859P695m6865k1668o6849n6239
$$ plain form
4750 1779059 1881380 1726507 1764276 1903174 1728925 1742568 1899699 2051441 2070383 2056630
4740 2056630 2244366 2005215 1814953 2115159 2099825 2241100 1985741 2110363 1994592 1959572
4730 1959572 1872581 1903350 2026347 2063026 1855359 1850675 1578914 1538027 1646832 1903818 1801793
4719 1801793 1783481 1794899 1776807 1910608 1916437 1992672 1855816 1814807 1570544 1579122 1800828
4708 1800828 2042806 2017324 1752607 1882648 2057519 2201107 2346481 2276304 2279050 2246327
4698 2246327 2290555 2382325 2343010 2339314 2499312 2361238 2572539 2761764 2692333 2486142 2625913
4687 2625913 2743891 3079719 3125819 3007642 2933480 2679237 2774801 2966007 3195021 3482922
4677 3482922 3598489 3688415 3406144 3634252 3772280 3855496 3729583 3629825 3728386 4174950
$$ packed form
4750A779059J02321j54873L7769J38898j74249J3643J57131J51742J8942j3753
4740B056630J87736k39151j90262L00206j5334J41275k55359J24622j15771l5020
4730A959572q6991L0769J22997L6679k07667m684k71761m0887J08805K56986j02025
4719A801793j8312J1418j8092J33801N829P6235j36856m1009k44263Q578K21706
4708A800828K41978k5482k64717J30041J74871J43588J45374p0177K746l2723
4698B246327M4228R1770l9315l696J59998j38074K11301J89225o9431k06191J39771
4687B625913J17978L35828M6100j18177p4162k54243R5564J91206K29014K87901
4677C482922J15567Q9926k82271K28108J38028Q3216j25913r9758R8561M46564
$$ plain form
4667 4174950 4487026 4671864 4891074 4763753 4767752 4811493 5165157 5212701 5462875 5722247
4657 5722247 6087045 6412142 6635945 6512022 6650810 7059282 7440145 7946335 8276597 8733214
4647 8733214 8713534 9114836 9704254 10008792 10813180 11444877 12247980 12691672 13195876 14148015
4637 14148015 14888531 15692380 16703751 18162523 19392384 20542834 21801230 23039174
4629 23039174 24538990 26540593 28543216 30732142 33224704 35900061 38756737 41444479
4621 41444479 43482775 45083875 45917328 46374957 46601292 46693538 46655933 46817477 47434509
4612 47434509 48036480 49104652 50085226 51606366 53316713 55509437 58058380 60913732
4604 60913732 64015837 67133943 70447771 73591150 76907635 80748671 84460364 88457316
$$ packed form
4667D174950L12076J84838K19210j27321L999M3741L53664M7544K50174K59372
4657E722247L64798L25097K23803j23923J38788M08472L80863N06190L30262M56617
4647H733214j9680M01302N89418L04538Q04388O31697Q03103M43692N04204R52139
4637A4148015P40516Q03849J011371J458772J229861J150450J258396J237944
4629B3039174J499816K001603K002623K188926K492562K675357K856676K687742
4621D1444479K038296J601100Q33453M57629K26335R2246l7605J61544O17032
4612D7434509O01971J068172R80574J521140J710347K192724K548943K855352
4604F0913732L102105L118106L313828L143379L316485L841036L711693L996952
$$ plain form
4596 88457316 92230120 95579523 98903174 102031397 104679880 107013243 109013506 111242744
4588 111242744 113294144 114804932 115629977 115880587 115650600 114732096 113343564 111375872 109274912
4579 109274912 106972064 104269114 101618510 98593399 94965053 91068989 87204252 83387100
4571 83387100 79192268 75082547 71020116 67075778 62967814 59102609 55373367 51800257
4563 51800257 48142426 44903389 41921048 39078130 36266043 34232938 31957081 29731665
4555 29731665 28037423 26244701 24634257 23354795 22298008 21002996 19667164 18745934
4547 18745934 17733496 16767533 16209040 15278684 14491727 13817282 13081882 12526119 12055128
4538 12055128 11567969 11014397 10588106 10095384 9853764 9419360 8690890 8656522 8424907 8086671
$$ packed form
4596H8457316L772804L349403L323651L128223K648483K333363K000263K229238
4588A11242744K051400J510788Q25045K50610k29987r18504j388532j967692k100960
4579A09274912k302848k702950k650604l025111l628346l896064l864737l817152
4571H3387100m194832m109721m062431l944338m107964l865205l729242l573110
4563E1800257l657831l239037k982341k842918k812087k033105k275857k225416
4555B9731665j694242j792722j610444j279462j056787j295012j335832r21230
4547A8745934j012438r65963n58493r30356p86957o74445p35400n55763m70991
4538A2055128m87159n53572m26291m92722k41620m34404p28470l4368k31615l38236
$$ plain form
4528 8086671 7607971 7288518 6874794 6618809 6537030 6458918 6061351 5853522 5903910 5767886
4518 5767886 5456574 5050371 5121851 5025004 4676109 4572787 4491653 4462018 4311372 4355894
4508 4355894 4181665 3976679 3694848 3277927 3152063 3155433 3052374 2947408 2981048 3050863
4498 3050863 3072509 2966409 3070743 2799193 2815355 2768683 2200442 2371931 2633176 2535790
4488 2535790 2620866 2487133 2315975 2205043 2180950 1906429 1705178 1913809 2125449 1947937
4478 1947937 1969881 2055641 1851930 1787369 1846137 1932351 1595547 1474717 1669024 1520788
4468 1520788 1479855 1430284 1393326 1624110 1555482 1651745 1649899 1436234 1639013 1562988 1349134
4457 1349134 1211880 1314622 1593354 1794343 1534623 1205793 1175570 1267134 1329933 1148560
$$ packed form
4528H086671m78700l19453m13724k55985q1779p8112l97567k07829N0388j36024
4518E767886l11312m06203P1480r6847l48895j03322q1134k9635j50646M4522
4508D355894j74229k04986k81831m16921j25864L370j03059j04966L3640O9815
4498C050863K1646j06100J04334k71550J6162m6672n68241J71489K61245r7386
4488B535790Q5076j33733j71158j10932k4093k74521k01251K08631K11640j77512
4478A947937K1944Q5760k03711o4561N8768Q6214l36804j20830J94307j48236
4468A520788m0933m9571l6958K30784o8628R6263j846k13665K02779p6025k13854
4457A349134j37254J02742K78732K00989k59720l28830l0223R1564O2799j81373
$$ plain form
4447 1148560 964112 920638 782885 691734 937052 803623 889499 860223 811416 1014548
4437 1014548 852394 834393 974027 914269 939829 993182 739740 532375 817366 955813
4427 955813 717982 462208 539989 373207 453710 684486 634294 462832 353384 517249
4417 517249 526450 406140 459344 515176 376234 316222 322391 397525 394120 538326 710156
4406 710156 633608 529169 509640 400653 413511 461206 661322 580540 516516 404316 471001
4395 471001 153759 275175 251317 -20662 253024 283846 277127 448579 311939 82497
4385 82497 357869 311229 9014 93201 -82656 18860 242322 175302 134665 -221852 -137010
4374 -137010 113693 200940 292435 214349 -54146 -30420 -185779 -38333 5763 164927 99863
$$ packed form
4447A148560j84448m3474j37753r1151K45318j33429Q5876k9276m8807K03132
4437A014548j62154j8001J39634n9758K5560N3353k53442k07365K84991J38447
4427I55813k37831k55774P7781j66782Q0503K30776n0192j71462j09448J63865
4417E17249R201j20310N3204N5832j38942o0012O169P5134l405J44206J71830
4406G10156p6548j04439j9529j08987J2858M7695K00116q0782o4024j12200O6685
4395D71001l17242J21416k3858k71979K73686L0822o719J71452j36640k29442
4385H2497K75372m6640l02215Q4187j75857J01516K23462o7020m0637l56517Q4842
4374a37010K50703Q7247R1495p8086k68495K3726j55359J47446M4096J59164o5064
$$ plain form
4363 99863 61948 79388 123858 330482 360832 443988 238494 159345 -55491 129625 351318
4352 351318 261425 52798 70897 85216 176498 -78055 -181744 227169 316738 192957 -108916
4341 -108916 -93306 -566 20669 -15540 -30412 22411 139929 128102 258759 381401 342384
4330 342384 261524 -27720 -51334 -76082 -175769 28457 172325 166314 201891 334074 535309
4319 535309 259700 109566 -79238 -195143 -72330 102412 244437 132358 130820 323011
4309 323011 450376 149054 146366 186457 225086 387834 374474 408254 473079 223109 72814
4298 72814 254179 178517 117358 149016 311002 369709 378842 433155 402254 395456 613501 781259
4286 781259 487503 720074 858308 618975 853565 1095475 877412 827330 934723 572303
$$ packed form
4363I9863l7915J7440M4470K06624L0350Q3156k05494p9149k14836J85116K21693
4352C51318q9893k08627J8099J4319R1282k54553j03689M08913Q9569j23781l01873
4341a08916J5610R2740K1235l6209j4872N2823J17518j1827J30657J22642l9017
4330C42384q0860k89244k3614k4748r9687K04226J43868o011L5577J32183K01235
4319E35309k75609j50134j88804j15905J22813J74742J42025j12079j538J92191
4309C23011J27365l01322k688M0091L8629J62748j3360L3780O4825k49970j50295
4298G2814J81365p5662o1159L1658J61986N8707R133N4313l0901o798K18045J67758
4286G81259k93756K32571J38234k39333K34590K41910k18063n0082J07393l62420
$$ plain form
4276 572303 675628 845392 747943 814391 883206 850268 776206 710098 628625 906200 762280
4265 762280 682234 457573 486636 474809 590030 408983 370638 367258 323750 380458 294422
4254 294422 379473 488061 348250 293883 369935 228404 237234 258112 -755 380048 522388
4243 522388 401154 428770 299663 132246 175516 153753 102847 320963 138487 90399 -72646
4232 -72646 110133 56721 111922 259804 239410 89516 220349 243594 148785 -206956 -271696
4221 -271696 -76447 169008 205152 147970 392930 275887 158444 93215 200939 182578
4211 182578 190765 165038 100513 48506 69937 121867 -85544 19397 -18175 228269 251220
4200 251220 266129 304019 335493 258766 148402 -99543 349 5232 178674 411024 585911
$$ packed form
4276E72303J03325J69764r7449O6448O8815l2938p4062o6108q1473K77575j43920
4265G62280q0046k24661K9063j1827J15221j81047l8345l380m3508N6708q6036
4254B94422Q5051J08588j39811n4367P6052j41531Q830K0878k58867L80803J42340
4243E22388j21234K7616j29107j67417M3270k1763n0906K18116j82476m8088j63045
4232g2646J82779n3412N5201J47882k0394j49894J30833K3245r4809l55741o4740
4221b71696J95249K45455L6144n7182K44960j17043j17443o5229J07724j8361
4211A82578Q187k5727o4525n2007K1431N1930k07411J04941l7572K46444K2951
4200B51220J4909L7890L1474p6727j10364k47945R9892M883J73442K32350J74887
$$ plain form
4189 585911 609016 266235 146411 238320 92374 -26619 225001 333044 264062 -5510
4179 -5510 -172751 -198528 65432 207430 28688 77930 254587 78469 6263 -37395 30091
4168 30091 340987 317865 161811 57604 48029 111880 234329 311363 313736 183089 116404
4157 116404 163223 245154 416114 547319 852619 892121 827345 706463 588188 574597 724804
4146 724804 787113 813871 778762 619224 407127 216655 145292 209586 298072 532599 571912
4135 571912 339331 181401 139968 10785 -41382 165280 191563 253679 398895 204560
4125 204560 73095 146754 253649 242457 198742 392242 638505 435431 558715 577689
4115 577689 391073 336452 354409 539537 563320 510582 413375 473680 336048 160914 28275
$$ packed form
4189E85911K3105l42781j19824R1909j45946j18993K51620J08043o8982k69572
4179e510j67241k5777K63960J41998j78742M9242J76657j76118p2206m3658O7486
4168C0091L10896k3122j56054j04207r575O3851J22449P7034K373j30647o6685
4157A16404M6819Q1931J70960J31205L05300L9502o4776j20882j18275j3591J50207
4146G24804O2309K6758l5109j59538k12097j90472p1363O4294Q8486K34527L9313
4135E71912k32581j57930m1433j29183n2167K06662K6283O2116J45216j94335
4125B04560j31465P3659J06895j1192m3715J93500K46263k03074J23284J8974
4115E77689j86616n4621J7957J85128K3783n2738r7207O0305j37632j75134j32639
$$ plain form
4104 28275 -661 272493 -12980 100634 315957 424199 385561 251751 327217 580888
4094 580888 805543 780487 773294 688186 710029 557669 512560 760005 848747 773792 745168
4083 745168 1048636 942559 975371 1046441 1108289 1246865 1279410 1372813 1556436 1649719 1430608
4072 1430608 1806515 2077617 2061559 2370710 2501406 2497989 2491448 2845334 3192791 3270641 3441118
4061 3441118 3922784 4106319 4523929 4749493 4973444 5502658 6098970 6311238 6967390 7696673
4051 7696673 8327859 8928761 9334420 10397106 11605102 12742004 13710277 14982076 15798915
4042 15798915 16907903 17644140 17910498 17447194 17039942 16321340 15319994 14331027 13319563
4033 13319563 12602557 12122586 11218179 10302309 9576023 9105444 8572301 7998715 7502290
$$ packed form
4104B8275k8936K73154k85473J13614K15323J08242l8638j33810P5466K53671
4094E80888K24655k5056p193q5108K1843j52360m5109K47445Q8742p4955k8624
4083G45168L03468j06077L2812P1070O1848J38576L2545R3403J83623R3283k19111
4072A430608L75907K71102j6058L09151J30696l417o541L53886L47457P7850J70477
4061C441118M81666J83535M17610K25564K23951N29214N96312K12268O56152P29283
4051G696673O31186O00902M05659J062686J207996J136902R68273J271799Q16839
4042A5798915J108988P36237K66358m63304m07252p18602j001346r88967j011464
4033A3319563p17006m79971r04407r15870p26286m70579n33143n73586m96425
$$ plain form
4024 7502290 7229066 6974525 6730937 6384475 6010735 5754609 5751593 5222886 4650368 4198664
4014 4198664 4038435 4098759 3783601 3519935 3251357 3072078 2845619 2608117 2361551 2431658
4004 2431658 2454242 2514912 2212407 1755475 1854296 1811640 1887404 1727634 1170729 1224152 1332306
3993 1332306 1284639 1343696 1260447 1253323 1179394 956964 977582 1021158 988073 750783 752689
3982 752689 866862 762322 1020073 1125431 918308 787996 724690 952759 777758 736697
3972 736697 704697 858391 652592 627678 539999 437612 330334 157249 493494 792133
3962 792133 700819 605021 520119 478535 417610 645280 567583 522897 432589 273353 336451
3951 336451 229900 245829 260931 327173 170028 170955 108445 304319 545495 465676 389166
$$ packed form
4024G502290k73224k54541k43588l46462l73740k56126l016n28707n72518m51704
4014D198664j60229O0324l15158k63666k68578j79279k26459k37502k46566P0107
4004B431658K2584O0670l02505m56932R8821m2656P5764j59770n56905N3423J08154
3993A332306m7667N9057q3249p124p3929k22430K0618M3576l3085k37290J906
3982G52689J14173j04540K57751J05358k07123j30312o3306K28069j75001m1061
3972G36697l2000J53694k05799k4914q7679j02387j07278j73085L36245K98639
3962G92133r1314r5798q4902m1584o0925K27670p7697m4686r0308j59236O3098
3951C36451j06551J5929J5102O6242j57145R27o2510J95874K41176p9819p6510
$$ plain form
3940 389166 612652 574364 657835 428634 177971 92480 -118974 5097 262878 310595
3930 310595 62380 265662 303769 110103 233477 77671 25709 121380 221480 317680
3920 317680 304249 330246 129232 39309 163368 197817 49804 120855 -194737 -245053 5312
3909 5312 -98001 -27671 -334430 -247330 -175287 -154686 -92303 -110142 -315024 -146736 207786
3898 207786 165735 199489 -22722 -377798 -169316 -78986 -126596 -33163 -58650 -133202 -68678
3887 -68678 40142 -228423 -259140 -294171 -67224 29281 24256 -188459 -118264 -15010 44610
3876 44610 18063 112755 360225 243268 -102071 -247678 -189449 -274758 -214634 -216392 -81971
3865 -81971 -317543 -259558 51086 -171802 110586 -114650 -256336 -127232 -113263 147194
$$ packed form
3940C89166K23486l8288Q3471k29201k50663q5491k11454J24071K57781M7717
3930C10595k48215K03282L8107j93666J23374j55806n1962R5671J00100R6200
3920C17680j3431K5997k01014q9923J24059L4449j48013P1051l15592n0316K50365
3909E312j03313P0330l06759Q7100P2043K0601O2383j7839k04882J68288L54522
3898B07786m2051L3754k22211l55076K08482R0330m7610R3433k5487p4552O4524
3887f8678J08820k68565l0717l5031K26947R6505n025k12715P0195J03254N9620
3876D4610k6547R4692K47470j16957l45339j45607N8229q5309O0124j758J34421
3865h1971k35572N7985L10644k22888K82388k25236j41686J29104J3969K60457
$$ plain form
3855 147194 175783 4274 -28892 -236740 -169099 -152133 -321900 -276498 -317198 5142 126843
3844 126843 -102158 -151269 -113476 -189402 -344056 -205574 -251590 -102859 -145195 -137264 50999
3833 50999 -48030 46182 1331 152572 -177319 -162613 -91224 -59663 -164829 -157083 -109641
3822 -109641 -134426 10611 -207965 -116567 27820 -322965 -494696 -379716 -394483 -348756
3812 -348756 -250520 -180206 -152173 -389221 -190180 -75846 -143091 -16065 91401 -17023
3802 -17023 83269 -16034 -101223 -34693 -148160 -159965 198610 101102 -344716 -237175 -150528
3791 -150528 -192966 -39115 2359 -55743 11327 -24530 -81351 83176 -46069 -215179 -52161
3780 -52161 157576 -50401 -45612 -343475 -347713 -165199 -321383 -83989 -79215 55146 228403
$$ packed form
3855A47194K8589j71509l3166k07848O7641J6966j69767M5402m0700L22340J21701
3844A26843k29001m9111L7793p5926j54654J38482m6016J48731m2336P931J88263
3833E0999r9029R4212m4851J51241l29891J4706P1389L1561j05166P746M7442
3822a09641k4785J45037k18576R1398J44387l50785j71731J14980j4767M5727
3812c48756R8236P0314K8033k37048J99041J14334o7245J27026J07466j08424
3802a7023J00292r9303q5189O6530j13467j1805L58575r7508m45818J07541Q6647
3791a50528m2438J53851M1474n8102O7070l5857n6821J64527j29245j69110J63018
3780e2161K09737k07977M789k97863m238J82514j56184K37394M774J34361J73257
$$ plain form
3769 228403 -48531 -183773 57916 -183854 -260498 -125450 82608 46292 -113061 -171497
3759 -171497 -339495 -301218 -187357 -388541 -381846 -240165 -81400 -135769 -100344 -37303 -38835
3748 -38835 -77509 -180083 -121981 69843 187563 -24699 -131570 -159117 -124130 -221269 -221257
3737 -221257 -162398 -190926 139378 -71766 -215158 -218505 -9632 -207060 -172986 -77199 -170148
3726 -170148 -21645 -47957 -219906 -291993 -3302 87553 45835 -140912 -382740 -383096 -225655
3715 -225655 -116241 -76136 95115 237207 -30459 -77456 -380319 -268503 36506 -118281
$$ packed form
3769B28403k76934j35242K41689k41770p6644J35048K08058l6316j59353n8436
3759a71497j67998L8277J13861k01184O695J41681J58765n4369L5425O3041j532
3748c8835l8674j02574N8102J91824J17720k12262j06871k7547L4987r7139J2
3737b21257N8859k8528L30304k11144j43392l347K08873j97428L4074R5787r2949
3726a70148J48503k6312j71949p2087K88691R0855m1718j86747k41828l56J57441
3715b25655J09414M0105J71251J42092k67666m6997l02863J11816L05009j54787
$$ [...]
##END NTUPLES=NMR SPECTRUM
##END=
