##TITLE=1H_CA-9319_5
 200.13MHz, CDCl3,
 8 sc
 
 14.2.2025
##JCAMPDX= 6.0         $$ Bruker NMR JCAMP-DX V2.0
##DATA TYPE= NMR SPECTRUM
##DATA CLASS= NTUPLES
##ORIGIN= UXNMR, Bruker Analytische Messtechnik GmbH
##OWNER= pz
$$ XWIN-NMR		Version 3.5
$$ Fri Feb 14 14:45:48 2025 Russian Standard Time (UT+4h)  she@DPX200
##.OBSERVE FREQUENCY= 200.1313
##.OBSERVE NUCLEUS= ^1H
##.ACQUISITION MODE= SIMULTANEOUS
##.ACQUISITION SCHEME= undefined
##.AVERAGES= 8
##.DIGITISER RES= 18
##SPECTROMETER/DATA SYSTEM= spect
##.PULSE SEQUENCE= zg30
##.SOLVENT NAME= D2O
##.SHIFT REFERENCE= (INTERNAL, D2O, 0, 15.5012)
##AUDIT TRAIL= $$ (NUMBER, WHEN, WHO, WHERE, WHAT)
$$ ##TITLE= Audit trail, XWIN-NMR		Version 3.5
$$ ##JCAMPDX= 5.01
$$ ##ORIGIN= Bruker BioSpin GmbH
$$ ##OWNER= she
$$ F:/spectra/data/she/nmr/H-C/1/pdata/1/auditp.txt
$$ ##AUDIT TRAIL=  $$ (NUMBER, WHEN, WHO, WHERE, WHAT)
(   1,<2025-02-14 14:44:23.76 +0400>,<she>,<DPX200>,
      <created by zg, POWCHK disabled, PULCHK disabled
       configuration hash MD5:
       00 E9 B6 7A A2 85 ED C7 34 08 36 98 17 FE 4E 26
       data hash MD5: 16K
       5C D5 75 37 06 EA 96 B8 D6 40 1F 79 E0 8E 65 40>)
(   2,<2025-02-14 14:44:26.17 +0400>,<she>,<DPX200>,
      <Start of raw data processing
       efp BC_mod = 2 LB = 0.25 FT_mod = 6 PKNL = 1 PHC0 = -478.729 PHC1 = 26.19221 SI = 16K 
       data hash MD5: 16K
       2E 36 B9 8D 4F 72 C3 FF 27 73 1C F3 A5 09 C1 4D>)
(   3,<2025-02-14 14:44:55.34 +0400>,<she>,<DPX200>,
      <pk PHC0 = -142.825 PHC1 = -19.99999 
       data hash MD5: 16K
       06 8A 27 CE 4E 1A FC 3D 96 98 07 34 5E 40 0B A2>)
(   4,<2025-02-14 14:44:59.21 +0400>,<she>,<DPX200>,
      <abs ABSG = 5 
       data hash MD5: 16K
       9B 2A C4 D7 B0 C7 DA 2D 49 36 F3 83 BD 93 40 AF>)
$$ ##END=
$$ 
$$ hash MD5
$$ 7A 69 13 9E D0 D8 0C 2D 0B 56 EA 69 B0 F1 2F CD
##$RELAX= 
##$RELAX= 
##$RELAX= 
##$RELAX= 
##$RELAX= 
##$RELAX= 
$$ Bruker specific parameters
$$ --------------------------
##$DU= <F:/spectra>
##$EXPNO= 1
##$NAME= <H-C>
##$PROCNO= 1
##$TYPE= <nmr>
##$USER= <she>
##$AMP= (0..31)
100 100 100 100 100 100 100 100 100 100 100 100 100 100 100 100 100 100 
100 100 100 100 100 100 100 100 100 100 100 100 100 100 
##$AQSEQ= 0
##$AQ_mod= 1
##$AUNM= <au_zg>
##$AUTOPOS= <>
##$BF1= 200.13
##$BF2= 200.13
##$BF3= 200.13
##$BF4= 200.13
##$BF5= 200.13
##$BF6= 200.13
##$BF7= 200.13
##$BF8= 200.13
##$BYTORDA= 1
##$CFDGTYP= 0
##$CFRGTYP= 5
##$CHEMSTR= <none>
##$CNST= (0..31)
1 1 145 1 1 1 1 1 1 1 1 1 1 1 1 1 1 1 1 1 1 1 1 1 1 1 1 1 1 1 1 1 
##$CPDPRG= <>
##$CPDPRG1= <>
##$CPDPRG2= <>
##$CPDPRG3= <>
##$CPDPRG4= <mlev>
##$CPDPRG5= <mlev>
##$CPDPRG6= <mlev>
##$CPDPRG7= <mlev>
##$CPDPRG8= <mlev>
##$CPDPRGB= <>
##$CPDPRGT= <>
##$D= (0..31)
0 0.7 0 0 0 0 0 0 0 0 0 0.03 0 0 0 0 0 0 0 0 0 0 0 0 0 0 0 0 0 0 0 0 
##$DATE= 1739529863
##$DBL= (0..7)
120 120 120 120 120 120 120 120 
##$DBP= (0..7)
150 150 150 150 150 150 150 150 
##$DBP07= 0
##$DBPNAM0= <>
##$DBPNAM1= <>
##$DBPNAM2= <>
##$DBPNAM3= <>
##$DBPNAM4= <>
$$ [...]
##$SUBNAM3= <"">
##$SUBNAM4= <"">
##$SUBNAM5= <"">
##$SUBNAM6= <"">
##$SUBNAM7= <"">
##$SUBNAM8= <"">
##$SUBNAM9= <"">
##$SW= 18.0517328524113
##$SWIBOX= (0..15)
0 0 2 0 0 0 0 0 0 0 0 0 0 0 0 0 
##$SW_h= 3612.71676300578
##$TD= 16384
##$TD0= 1
##$TE= 0
##$TE2= 300
##$TE3= 300
##$TEG= 300
##$TL= (0..7)
0 120 120 120 120 120 120 120 
##$TP= (0..7)
150 150 150 150 150 150 150 150 
##$TP07= 0
##$TPNAME0= <>
##$TPNAME1= <>
##$TPNAME2= <>
##$TPNAME3= <>
##$TPNAME4= <>
##$TPNAME5= <>
##$TPNAME6= <>
##$TPNAME7= <>
##$TPOAL= (0..7)
0.5 0.5 0.5 0.5 0.5 0.5 0.5 0.5 
##$TPOFFS= (0..7)
0 0 0 0 0 0 0 0 
##$TUNHIN= 0
##$TUNHOUT= 0
##$TUNXOUT= 0
##$USERA1= <user>
##$USERA2= <user>
##$USERA3= <user>
##$USERA4= <user>
##$USERA5= <user>
##$V9= 5
##$VALIST= <valist>
##$VCLIST= <CCCCCCCCCCCCCCC>
##$VD= 0
##$VDLIST= <DDDDDDDDDDDDDDD>
##$VPLIST= <PPPPPPPPPPPPPPP>
##$VTLIST= <TTTTTTTTTTTTTTT>
##$WBST= 1024
##$WBSW= 4
##$XGAIN= (0..3)
0 0 0 0 
##$XL= 0
##$YL= 0
##$YMAX_a= 440948
##$YMIN_a= -347291
##$ZGOPTNS= <>
##$ZL1= 120
##$ZL2= 120
##$ZL3= 120
##$ZL4= 120
##$ABSF1= 15.60312
##$ABSF2= -2.448731
##$ABSG= 5
##$ABSL= 3
##$ALPHA= 0
##$AQORDER= 0
##$ASSFAC= 0
##$ASSFACI= 0
##$ASSFACX= 0
##$ASSWID= 0
##$AUNMP= <proc_1d>
##$AZFE= 0.1
##$AZFW= 0.1
##$BCFW= 0
##$BC_mod= 2
##$BYTORDP= 0
##$COROFFS= 0
##$CY= -3
##$DATMOD= 1
##$DC= 0
##$DFILT= <>
##$DTYPP= 0
##$F1P= 0
##$F2P= 0
##$FCOR= 1
##$FTSIZE= 16384
##$FT_mod= 6
##$GAMMA= 0
##$GB= 0
##$INTBC= 1
##$INTSCL= 3.241238e-09
##$ISEN= 128
##$LB= 0.25
##$LEV0= 0
##$LPBIN= 0
##$MAXI= 10000
##$MC2= 0
##$MEAN= 0
##$ME_mod= 0
##$MI= 1.114404
##$NCOEF= 0
##$NC_proc= -6
##$NLEV= 6
##$NOISF1= 3.799351
##$NOISF2= 2.8
##$NSP= 0
##$NTH_PI= 0
##$NZP= 0
##$OFFSET= 15.50119
##$PC= 1
##$PHC0= -621.554
##$PHC1= 6.192219
##$PH_mod= 1
##$PKNL= yes
##$PPARMOD= 0
##$PSCAL= 0
##$PSIGN= 0
##$REVERSE= no
##$SF= 200.130004104578
##$SI= 16384
##$SIGF1= 3
##$SIGF2= 2
##$SINO= 0.751879
##$SIOLD= 32768
##$SREGLST= <19F.Aceton>
##$SSB= 0
##$STSI= 16384
##$STSR= 0
##$SW_p= 3612.71676300578
##$SYMM= 0
##$S_DEV= 0
##$TDeff= 16384
##$TDoff= 0
##$TI= <>
##$TILT= no
##$TM1= 0
##$TM2= 0
##$TOPLEV= 0
##$USERP1= <user>
##$USERP2= <user>
##$USERP3= <user>
##$USERP4= <user>
##$USERP5= <user>
##$WDW= 1
##$XDIM= 16384
##$YMAX_p= 357642491
##$YMIN_p= -415867
$$ End of Bruker specific parameters
$$ ---------------------------------
##NTUPLES= NMR SPECTRUM
##VAR_NAME=  FREQUENCY,     SPECTRUM/REAL,   SPECTRUM/IMAG
##SYMBOL=    X,             R,               I
##VAR_TYPE=  INDEPENDENT,   DEPENDENT,       DEPENDENT
##VAR_FORM=  AFFN,          ASDF,            ASDF
##VAR_DIM=   16384,         16384,           16384
##UNITS=     HZ,            ARBITRARY UNITS, ARBITRARY UNITS
##FACTOR=    0.220516191357247, 1,           1
##FIRST=     3102.25325545934, 0,            0
##LAST=      -510.46350754644, 0,            0
##MIN=       -510.46350754644, -415867,      0
##MAX=       3102.25325545934, 357642491,    0
$$ Real data points
##PAGE= N=1
##DATA TABLE= (X++(R..R)), XYDATA
$$ [...]
$$ plain form
7693 -78571 -81826 -86343 -73067 -98460 -101380 -106966 -83551 -77629 -96547 -110747 -99209 -79600 -106466
7680 -106466 -89312 -91468 -87779 -48860 -69922 -93167 -79878 -73848 -65133 -65684 -34562 -72932 -109886
7667 -109886 -92986 -68108 -65994 -73394 -92768 -55935 -87192 -96497 -64171 -69085 -69967 -45248 -38180
7654 -38180 -31876 5243 11039 34757 57744 29363 49593 79066 107851 72906 52989 31354
7642 31354 46322 -90 -17279 -717 -5355 -8111 -29184 -23322 -122 -16964 -45752 -34925
7630 -34925 -8765 -8751 -38583 -23315 -36918 -26350 -58366 -67367 -46938 -61902 -44032 -29228 -47935
7617 -47935 -39874 -43546 -52540 -44561 -71777 -63693 -23470 -29853 -42154 -61294 -27678 -54358 -60643
7604 -60643 -53370 -48049 -11140 3260 18010 54556 64226 36918 41936 55915 50397 23642 23828
$$ packed form
7693g8571l255m517J3276k5393k920n586K3415N922j8918j4200J1538J9609k6866
7680a06466J7154k156L689L8919k1062k3245J3289O030Q715n51L1122l8370l6954
7667a09886J6900K4878K114p400j9374L6833l1257r305L2326m914q82K4719P068
7654c8180O304L7119N796K3718K2987k8381K0230K9473K8785l4945j9917k1635
7642C1354J4968m6412j7189J6562m638k756k1073N862K3200j6842k8788J0827
7630c4925K6160J4k9832J5268j3603J0568l2016r001K0429j4964J7870J4804j8707
7617d7935Q061l672q994P979k7216Q084M0223o383j2301j9140L3616k6680o285
7604f0643P273N321L6909J4400J4750L6546R670k7308N018J3979n518k6755J86
$$ plain form
7591 23828 80218 77240 41881 37441 56224 57052 45287 46468 39599 40639 16923 23581 55046
7578 55046 30955 42604 66375 46551 44345 49011 73587 51512 28352 38978 68593 81875
7566 81875 88267 92269 90768 90348 82996 129217 102227 62310 52143 64351 64413 74363 39641 34824
7552 34824 35377 54333 71077 83159 112689 123668 81809 92012 122617 95148 71132 79213
7540 79213 86524 65419 41574 25285 68820 62928 55905 58530 20416 25545 25286 42514 62131
7527 62131 21918 26336 47026 28393 40630 81723 114815 112366 94113 93527 128328 145024 126075
7514 126075 136181 152441 135667 111722 110448 63952 51113 70080 88459 55409 70390 57411
7502 57411 22168 21760 39241 29917 -6181 -48854 -25505 -26562 -6854 -8757 -22759 -32378 -22748
$$ packed form
7591B3828N6390k978l5359m440J8783Q28j1765J181o869J040k3716O658L1465
7578E5046k4091J1649K3771j9824k206M666K4576k2075k3160J0626K9615J3282
7566H1875O392M002j501m20p352M6221k6990l9917j0167J2208O2R950l4722m817
7552C4824N53J8956J6744J2082K9530J0979m1859J0203L0605k7469k4016Q081
7540G9213P311k1105k3845j6289M3535n892p023K625l8114N129k59J7228J9617
7527F2131m0213M418K0690j8633J2237M1093L3092k449j8253n86L4801J6696j8949
7514A26075J0106J6260j6774k3945j274m6496j2839J8967J8379l3050J4981j2979
7502E7411l5243m08J7481r324l6098m2673K3349j057J9708j903j4002r619R630
$$ plain form
7489 -22748 11102 -3825 6105 4441 -41462 -43981 -37042 -23987 -7938 -17799 -21720 -6798 6245
7476 6245 -14181 866 -8922 -9114 12962 11320 55121 55994 62902 67576 74473 68480 44692 74339
7462 74339 89159 92567 60300 41508 3159 -19323 -32876 -25933 -24987 -54090 -54067 -26986 -24728
7449 -24728 -12608 -24406 -31996 -21684 -11683 -9827 5787 -27145 -26243 1221 15408 32794 41458
7436 41458 49214 69835 46011 32843 -6413 5969 4872 -8793 -22684 -58881 -32391 -39312
7424 -39312 -37939 -12325 -34400 -21148 -36295 -40160 -37614 -51534 -50884 -69608 -30093 -39152 -47171
7411 -47171 -87119 -89745 -86005 -66571 -61297 -75325 -108904 -86947 -91496 -94171 -66267 -89915 -96129
7398 -96129 -97229 -107101 -97640 -98578 -82066 -58365 -24719 -35719 -50354 -42656 -77263 -101330 -82169
$$ packed form
7489b2748L3850j4927R930j664m5903k519O939J3055J6049r861l921J4922J3043
7476F245k0426J5047r788j92K2076j642M3801Q73O908M674O897n993k3788K9647
7462G4339J4820L408l2267j8792l8349k2482j3553O943R46k9103K3K7081K258
7449b4728J2120j1798p590J0312J0001J856J5614l2932R02K7464J4187J7386Q664
7436D1458P756K0621k3824j3168l9256J2382j097j3665j3891l6197K6490o921
7424c9312J373K5614k2075J3252j5147l865K546j3920O50j8724L9515r059q019
7411d7171l9948k626L740J9434N274j4028l3579K1957m549k675K7904k3648o214
7398i6129j100r872R461r38J6512K3701L3646j1000j4635P698l4607k4067J9161
$$ plain form
7385 -82169 -64633 -82811 -81170 -63344 -71395 -47893 -61721 -67471 -46406 -62682 -73607 -103303
7373 -103303 -91716 -96276 -98347 -101084 -112016 -114435 -100938 -80417 -58304 -94915 -85706 -70606 -64038
7360 -64038 -91594 -119465 -81867 -78827 -90852 -86774 -78914 -88511 -49113 -49668 -64217 -54073 -43893
7347 -43893 -50474 -69924 -89881 -96211 -86345 -57249 -50483 -65595 -69282 -96622 -115171 -113473 -94112
7334 -94112 -84295 -87321 -89081 -81116 -82530 -87683 -80487 -74494 -87774 -97359 -108584 -68302 -48380 -52670
7320 -52670 -111057 -96451 -69275 -87837 -57502 -52319 -37548 -31307 -39770 -43590 -60893 -55512 -54133
7307 -54133 -77198 -56143 -58921 -36702 -60460 -60228 -71428 -61235 -39940 -39490 -44549 -55578 -49557
7294 -49557 -60493 -58102 -54228 -62014 -52926 -59757 -67863 -40169 -79618 -68828 -70929 -96969 -76494
$$ packed form
7385h2169J7536j8178J641J7826q051K3502j3828n750K1065j6276j0925k9696
7373a03303J1587m560k071k737j0932k419J3497K0521K2113l6611R209J5100O568
7360f4038k7556k7871L7598L040j2025M078P860r597L9398n55j4549J0144J0180
7347d3893o581j9450j9957o330R866K9096O766j5112l687k7340j8549J698J9361
7334i4112R817l026j760P965j414n153P196N993j3280r585j1225M0282J9922m290
7320e2670n8387J4606K7176j8562L0335N183J4771O241q463l820j7303N381J379
7307e4133k3065K1055k778K2219k3758K32j1200J0193K1295M50n059j1029O021
7294d9557j0936K391L874p786R088o831q106K7694l9449J0790k101k6040K0475
$$ plain form
7281 -76494 -51655 -64138 -60081 -49014 -41113 1644 723 -1862 -7679 9302 14081 56796 86472
7268 86472 42482 68988 79206 88599 88399 98513 108001 115211 83007 47267 70666 72781 57550
7255 57550 47595 16598 14770 25874 20201 -26192 -9736 24008 -23643 5587 34348 42252 3940
7242 3940 -10813 40722 22077 -7143 3870 20800 18398 8704 16797 30865 43630 86046 87017
7229 87017 47372 77287 100726 108503 116073 147630 141877 141751 174786 147729 131325 144870 142572
7216 142572 174331 191604 197723 184467 159643 131866 139466 114480 96937 88780 86027 92747 65370
7203 65370 27641 31204 44457 65876 97562 71111 73128 60105 58892 48320 51391 51556 43705
7190 43705 55648 65190 99910 74952 75466 117654 135782 146813 161201 187374 166317 162521 184097
$$ packed form
7281g6494K4839j2483M057J1067P901M2757r21k585n817J6981M779M2715K9676
7268H6472m3990K6506J0218R393k00J0114R488P210l2204l5740K3399K115j5231
7255E7550r955l0997j828J1104n673m6393J6456L3744m7651K9230K8761P904l8312
7242C940j4753N1535j8645k9220J1013J6930k402r694Q093J4068J2765M2416R71
7229H7017l9645K9915K3439P777P570L1557n753j26L3035k7057j6404J3545k298
7216A42572L1759J7273O119j3256k4824k7777P600k4986j7543q157k753O720k7377
7203F5370l7729L563J3253K1419L1686k6451K017j3023j213j0572L071J65p851
7190D3705J1943R542L4720k4958N14M2188J8128J1031J4388K6173k1057l796K1576
$$ plain form
7177 184097 192474 188379 177217 123299 90673 89211 122962 131326 165620 156191 129682 118832 115930
7164 115930 87945 75096 84027 51485 42809 55426 71403 99333 100677 70719 62585 98388
7152 98388 132229 118242 97448 120813 116376 121147 168635 156758 152447 143258 149458 163092 142748
7139 142748 113855 150142 156615 135303 144675 114912 83944 138962 137188 132808 100109 84520
7127 84520 93616 77569 60765 76076 78207 50874 57371 83948 65802 53922 36903 45060 33808
7114 33808 -3191 -6794 -28233 -9614 -20930 -9432 -4212 4247 46269 72317 59126 77563
7102 77563 92428 117199 117414 135937 129477 105306 95132 52274 80913 92643 61001 40719
7090 40719 11246 2780 -14937 -2819 -2247 7121 2494 -16807 -20725 1439 -4429 -13492 18828
$$ packed form
7177A84097Q377m095j1162n3918l2626j462L3751Q364L4294r429k6509j0850k902
7164A15930k7985j2849Q931l2542q676J2617J5977K7930J344k9958q134L5803
7152I8388L3841j3987k0794K3365m437M771M7488j1877m311r189O200J3634k0344
7139A42748k8893L6287O473k1312R372k9763l0968N5018j774m380l2699j5589
7127H4520R096j6047j6804J5311K131k7333O497K6577j8146j1880j7019Q157j1252
7114C3808l6999l603k1439J8619j1316J1498N220Q459M2022K6048j3191J8437
7102G7563J4865K4771K15J8523o460k4171j0174m2858K8639J1730l1642k0282
7090D0719k9473q466j7717J2118N72R368m627j9301l918K2164n868r063L2320
$$ plain form
7077 18828 -3747 -31790 -41163 -46414 -52359 -26354 -22465 -9931 -23053 -40759 -44208 -7362 -6813
7064 -6813 7692 -10204 -46064 -40553 -20838 -2104 -18697 -25108 -10965 -29093 -23693 -31917 -46210
7051 -46210 -40575 -675 19277 14827 -10912 -28265 -9534 1639 9289 15010 -13801 -39302 2076
7038 2076 26183 20084 8947 33469 -2967 -60299 -48144 -25486 -46709 -50139 -25967 2121
7026 2121 -25563 -31912 -4682 57365 69762 42162 23727 16289 30039 90356 74472 73592 91327
7013 91327 86934 90632 82472 74917 106134 112296 66736 17538 -17453 32250 48386 63525 67097
7000 67097 79192 90420 7215 -34067 -29678 -10650 24002 6514 -22983 -15571 8188 -11768
6988 -11768 -5511 24658 22061 24273 -6524 -38123 -69682 -84791 -89569 -53739 -32530 -45413 -23044
$$ packed form
7077A8828k2575k8043r373n251n945K6005L889J2534j3122j7706l449L6846N49
7064f813J4505j7896l5860N511J9715J8734j6593o411J4143j8128N400q224j4293
7051d6210N635L9900J9952m450k5739j7353J8731J1173P650N721k8811k5501M1378
7038B076K4107o099j1137K4522l6436n7332J2155K2658k1223l430K4172K8088
7026B121k7684o349K7230O2047J2397k7600j8435p438J3750O0317j5884q80J7735
7013I1327m393L698q160p555L1217O162m5560m9198l4991M9703J6136J5139L572
7000F7097J2095J1228q3205m1282M389J9028L4652j7488k9497P412K3759j9956
6988a1768O257L0169k597K212l0797l1599l1559j5109m778L5830K1209j2883K2369
$$ plain form
6975 -23044 -12161 4814 13886 24278 17592 -29830 -44281 -26940 -45084 -30526 1884 -6249
6963 -6249 -19790 -10405 -1601 -19379 4247 -20822 -63017 -66276 -53342 -34235 -51961 -66762 -70242
6950 -70242 -88282 -77238 -47883 -36147 -35586 -41795 -16089 -32268 -36595 -8011 -28289 -41957 -10328
6937 -10328 -18807 -27976 -30065 -34192 -28135 -1378 2575 -20266 -13977 15413 18000 4353 -14903
6924 -14903 -39066 -43166 -3615 -9092 -17126 -47481 -51991 -54453 -37335 -34030 11324 22458 -20108
6911 -20108 -41498 -69491 -70890 -79762 -73240 -58838 -55457 -91512 -83310 -77458 -40315 -14121 25320
6898 25320 7915 -30605 -20429 -23420 -40662 -59364 -82664 -65125 -45587 -68114 -64652 -28639
6886 -28639 -22828 -29770 -9065 -411 -30392 -62243 -79512 -72351 -83978 -89519 -54100 -70729 -84527
$$ packed form
6975b3044J0883J6975R072J0392o686m7422j4451J7341j8144J4558L2410q133
6963f249j3541R385Q804j7778K3626k5069m2195l259J2934J9107j7726j4801l480
6950g0242j8040J1044K9355J1736N61o209K5706j6179m327K8584k0278j3668L1629
6937a0328q479r169k089m127O057K6757L953k2841O289K9390K587j3647j9256
6924a4903k4163m100L9551n477q034l0355m510k462J7118L305M5354J1134m2566
6911b0108k1390k7993j399q872O522J4402L381l6055Q202N852L7143K6194L9441
6898B5320j7405l8520J0176k991j7242j8702k3300J7539J9538k2527L462L6013
6886b8639N811o942K0705Q654k9981l1851j7269P161j1627n541L5419j6629j3798
$$ plain form
6873 -84527 -61789 -25828 -22129 -26140 -42407 -54685 -28116 -10316 -47426 -13097 -50559 -49529
6861 -49529 -38057 -46448 -29604 -24306 -33009 -28910 -18587 -21334 -37327 -57092 -39063 -57173 -58242
6848 -58242 -36615 -33880 -23131 3192 -3403 -6405 -25936 -12410 -10391 -42420 -16315 5756 -19370
6835 -19370 -31217 -22498 -27432 -16425 7622 -23234 -24526 -18069 -12852 -26605 -41016 -46043 -17358
6822 -17358 -15020 -24655 -20322 6732 5612 -19319 13689 20127 32847 30732 12749 -4985 -22605
6809 -22605 -11815 -37299 -24065 6775 6541 -38324 -63810 -41551 -18139 -32948 -30638 -27044 -49204
6796 -49204 -57694 -40815 -19189 -40265 -68339 -45532 -25296 2486 5515 -3655 -6203 -14921 -31758
6783 -31758 5419 -23158 -40810 -36331 -28162 -7427 -27222 -11924 4400 11956 22299 14252 -43070
$$ packed form
6873h4527K2738L5961L699m011j6267j2278K6569J7800l7110L4329l7462J030
6861d9529J1472q391J6844N298q703M099J0323k747j5993j9765J8029j8110j069
6848e8242K1627K735J0749K6323o595l002j9531J3526K019l2029K6105K2071k5126
6835a9370j1847Q719m934J1007K4047l0856j292O457N217j3753j4411n027K8685
6822a7358K338r635M333K7054j120k4931L3008O438J2720k115j7983j7734j7620
6809b2605J0790k5484J3234L0840k34m4865k5486K2259K3412j4809K310L594k2160
6796d9204q490J6879K1626k1076k8074K2807K0236K7782L029r170k548q718j6837
6783c1758L7177k8577j7652M479Q169K0735j9795J5298J6324P556J0343q047n7322
$$ plain form
6770 -43070 -36886 -12015 6835 -257 -25120 -35519 -19063 11835 -526 -28606 -7549 -19938
6758 -19938 -53716 -36608 -46216 -16016 11631 1217 -256 -8237 -36704 -50037 -71595 -38331
6746 -38331 -39654 -82930 -69528 -52441 -42202 -37166 -35424 -46111 -13910 -16044 -1322 860 219
6733 219 7001 18677 17581 9980 10164 -15560 -18315 -14941 -27520 -4357 -5085 25163 46898 46564
6719 46564 37992 47448 41644 49851 33321 -2582 28044 31476 -22686 -16774 -4920 -6363 27536
6706 27536 12539 3869 35063 48308 44900 54093 67411 55290 39851 23137 44938 63487
6694 63487 66650 33008 32323 22994 52819 82882 39325 9253 -3402 -1452 -726 45971 66393
6681 66393 32616 17001 35114 43528 46798 54005 30153 23272 34815 48558 32053 12659 285
$$ packed form
6770d3070O184K4871J8850p092k4863j0399J6456L0898j2361k8080K1057j2389
6758a9938l3778J7108r608L0200K7647j0414j473p981k8467j3333k1558L3264
6746c8331j323m3276J3402J7087J0239N036J742j0687L2201k134J4722K182o41
6733B19O782J1676j096p601J84k5724k755L374j2579K3163p28L0248K1735l34
6719D6564q572R456n804Q207j6530l5903L0626L432n4162N912J1854j443L3899
6706B7536j4997q670L1194J3245l408R193J3318j2121j5439j6714K1801J8549
6694F3487L163l3642o85r329K9825L0063m3557l0072j2655J950P26M6697K0422
6681F6393l3777j5615J8113Q414L270P207k3852o881J1543J3743j6505j9394j2374
$$ plain form
6668 285 -11846 7551 10042 41830 31340 26687 62047 60722 24533 33904 34930 14725 15124 38235
6654 38235 29932 30941 37325 12376 5330 1365 41866 36933 21693 24190 43940 45687 43865 29886
6640 29886 -13941 -41163 -31540 2094 23958 49272 35272 33669 23403 20765 23330 29358 57434
6627 57434 56975 62758 80437 103405 96015 80092 83778 62194 90898 148420 127046 101246 100784
6614 100784 83881 67311 90095 117695 86940 89884 70779 70187 90179 110662 99681 87819
6602 87819 69724 97199 100992 101166 101462 110122 94442 112790 76451 89759 111252 95402 100857
6589 100857 69050 83333 100191 101075 69843 116986 145965 158179 143558 137833 145381 133812
6577 133812 78556 73309 71935 59744 67918 74950 115801 142894 111129 122302 144168 143346 134310
$$ packed form
6668B85j2131J9397K491L1788j0490m653L5360j325l6189R371J026k0205L99K3111
6654C8235q303J009O384k4949p046l965M0501m933j5240K497J9750J747j822j3979
6640B9886m3827k7222R623L3634K1864K5314j4000j603j0266k638K565O028K8076
6627E7434m59N783J7679K2968p390j5923L686k1584K8704N7522k1374k5800m62
6614A00784j6903j6570K2784K7600l0755K944j9105n92J9992K0483j0981j1862
6602H7819j8095K7475L793J74K96Q660j5680J8348l6339J3308K1493j5850N455
6589A00857l1807J4283J6858Q84l1232M7143K8979J2214j4621n725P548j1569
6577A33812n5256n247j374j2191Q174P032M0851K7093l1765J1173K1866q22r036
$$ plain form
6564 134310 105176 105433 130095 132203 107219 138637 168357 152381 128305 135854 140582 170352 171821
6551 171821 169654 146105 168014 172959 176730 162756 176576 189226 175249 181246 185722 188974 180330
6538 180330 180609 157997 139442 159489 168921 173175 169999 160364 181309 158953 164549 154152 152300
6525 152300 152696 127368 142498 180598 181488 185237 160502 168404 183500 197632 165673 173926 154312
6512 154312 136627 172654 153152 131610 123418 131659 150946 160317 170890 191199 227632 201129
6500 201129 208132 218858 207474 147355 160384 184640 163545 196505 226177 216906 218216 203094
6488 203094 198029 190522 197954 215722 211017 250618 252086 271326 239855 275551 270957 285262 292033
6475 292033 281273 259321 227658 232152 227552 263861 319100 353055 303342 320036 344466 340391
$$ packed form
6564A34310k9134K57K4662K108k4984L1418K9720j5976k4076P549M728K9770J469
6551A71821k167k3549K1909M945L771j3974J3820J2650j3977N997M476L252q644
6538A80330K79k2612j8555K0047R432M254l176r635K0945k2356N596j0397j852
6525A52300L96k5328J5130L8100Q90L749k4735P902J5096J4132l1959Q253j9614
6512A54312j7685L6027j9502k1542q192Q241J9287R371J0573K0309L6433k6503
6500B01129P003J0726j1384o0119J3029K4256k1095L2960K9672r271J310j5122
6488B03094n065p507P432J7768m705L9601J468J9240l1471L5696m594J4305O771
6475B92033j0760k1952l1663M494m600L6309N5239L3955m9713J6694K4430m075
$$ plain form
6463 340391 350630 390815 375956 402848 417919 412313 440115 454501 487724 495518 492262 462933
6451 462933 452630 490959 516871 533689 508590 463838 476382 477832 459507 432028 450596 450997
6439 450997 472021 455878 454545 500684 473327 444800 453248 481538 439887 449475 463947 439469
6427 439469 418499 407448 425424 395831 373083 370362 343747 359765 366965 399806 375192 362364
6415 362364 389758 387840 357970 365959 398822 378856 384129 354284 409182 423614 407372 415507
6403 415507 410599 398659 403289 404499 419293 436158 464014 465455 476725 463760 468624 482769 490566
6390 490566 500972 516741 494126 497015 535512 558871 562726 556616 599768 637730 626010 617558
6378 617558 640935 669722 675163 660324 660029 652882 675253 684748 663315 638749 646966 662503 667378
$$ packed form
6463C40391J0239M0185j4859K6892J5071n606K7802J4386L3223P794l256k9329
6451D62933j0303L8329K5912J6818k5099m4752J2544J450j8325k7479J8568M01
6439D50997K1024j6143j333M6139k7357k8527Q448K8290m1651R588J4472k4478
6427D39469k0970j1051J7976k9593k2748k721k6615J6018P200L2841k4614j2828
6415C62364K7394j918k9870P989L2863j9966N273k9845N4898J4432j6242Q135
6403D15507m908j1940M630J210J4794J6865K7856J441J1270j2965M864J4145P797
6390D90566J0406J5769k2615K889L8497K3359L855o110M3152L7962j1720q452
6378F17558K3377K8787N441j4839k95p147K2371R495k1433k4566Q217J5537M875
$$ plain form
6365 667378 629872 636296 654742 676784 687352 652962 645881 632840 696544 701782 715584 729090
6353 729090 759269 790785 814314 833335 846096 851188 847651 866105 837031 846948 840559 824427
6341 824427 785945 760835 772523 785883 778103 759071 740696 725381 714535 708059 693667 743905
6329 743905 758609 716221 708383 712971 727137 717725 706738 746684 769362 757524 738200 744912
6317 744912 774489 787019 770111 750297 735760 774216 779367 764726 759723 740145 722484 740018
6305 740018 707914 710468 728489 728949 721668 707897 681919 671487 675564 679650 719466 702177 699460
6292 699460 644209 647591 659531 645583 635863 647170 665302 658452 672772 676732 660464 649183
6280 649183 675337 671089 675450 678561 703120 706418 703562 691861 692069 723639 762441 745161 756867
$$ packed form
6365F67378l7506O424J8446K2042J0568l4390p081j3041O3704N238J3802J3506
6353G29090L0179L1516K3529J9021J2761N092l537J8454k9074R917o389j6132
6341H24427l8482k5110J1688J3360p780j9032j8375j5315j0846o476j4392N0238
6329G43905J4704m2388p838M588J4166r412j0987L9946K2678j1838j9324O712
6317G44912K9577J2530j6908j9814j4537L8456N151j4641n003j9578j7661J7534
6305G40018l2104K554J8021M60p281j3771k5978j0432M077M086L9816j7289k717
6292F99460n5251L382J1940j3948r720J1307J8132o850J4320L960j6268j1281
6280F49183K6154m248M361L111K4559L298k856j1701K08L1570L8802j7280J1706
$$ plain form
6267 756867 746633 728216 740347 744083 773848 734514 749611 794551 803630 806448 790910 796567
6255 796567 857880 838550 843056 867387 890719 870046 885798 893808 923424 942669 905098 929990
6243 929990 975678 987636 968183 997616 946489 912351 945170 922038 931868 963351 943002 917548
6231 917548 936330 973239 1018996 987829 957227 1006323 993635 1009327 1031770 1037818 1044207 1069755
6219 1069755 1095489 1101751 1112619 1138376 1142715 1155757 1202204 1226278 1232370 1239102 1216331 1213422
6207 1213422 1235206 1253637 1260065 1226645 1259517 1279509 1239608 1270179 1294793 1308142 1262488 1244621
6195 1244621 1276358 1306030 1345757 1389028 1382555 1388004 1477348 1505148 1521595 1521344 1540664 1596901
6183 1596901 1650179 1687360 1698037 1727135 1714164 1712225 1741249 1738983 1756133 1785706 1802783 1855975
$$ packed form
6267G56867j0234j8417J2131L736K9765l9334J5097M4940R079K818j5538N657
6255G96567O1313j9330M506K4331K3332k0673J5752Q010K9616J9245l7571K4892
6243I29990M5688J1958j9453K9433n1127l4138L2819k3132R830L1483k0349k5454
6231I17548J8782L6909M5757l1167l0602M9096j2688J5692K2443O048O389K5548
6219A069755K5734O262J0868K5757M339J3042M6447K4074O092O732k2771k909
6207A213422K1784J8431O428l3420L2872J9992l9901L0571K4614J3349m5654j7867
6195A244621L1737K9672L9727M3271o473N449Q9344K7800J6447k51J9320N6237
6183A596901N3278L7181J0677K9098j2971j939K9024k266J7150K9573J7077N3192
$$ plain form
6171 1855975 1871866 1913986 1954520 2010120 2075709 2156004 2252251 2288282 2349603 2417625 2513959
6160 2513959 2598933 2678112 2711104 2702882 2733915 2772596 2830117 2895434 2901285 2952225 2948616 2946703
6148 2946703 2950535 2956811 2953718 2948088 3007085 3030803 3054998 3086500 3131521 3209929 3281485 3415955
6136 3415955 3512235 3623272 3721639 3759162 3805401 3907644 3973031 4004905 4136554 4238685 4292476
6125 4292476 4365109 4457440 4531214 4591224 4635699 4675943 4765073 4842840 4880112 5011482 5135916
6114 5135916 5283722 5418827 5545549 5718457 5920265 6128408 6340453 6557882 6800700 7089909
6104 7089909 7399524 7723603 8085480 8539957 8997071 9462438 9967895 10526274 11033724 11566685
6094 11566685 12074400 12491256 12849959 13187052 13602043 14134756 14649891 15187456 15811046
$$ packed form
6171A855975J5891M2120M0534N5600O5589Q0295R6247L6031O1321O8022R6334
6160B513959Q4974P9179L2992q222L1033L8681N7521O5317N851N0940l609j913
6148B946703L832O276l093n630N8997K3718K4195L1502M5021P8408P1556J34470
6136C415955R6280J11037R8367L7523M6239J02243O5387L1874J31649J02131N3791
6125D292476P2633R2331P3774O0010M4475M0244Q9130P7767L7272J31370J24434
6114E135916J47806J35105J26722J72908K01808K08143K12045K17429K42818K89209
6104G089909L09615L24079L61877M54477M57114M65367N05457N58379N07450N32961
6094A1566685N07715M16856L58703L37093M14991N32713N15135N37565O23590
$$ plain form
6085 15811046 16546527 17351303 18185026 19125804 20142173 21275183 22540595 23894410 25389571
6076 25389571 27069315 28901205 30912250 33075734 35383578 37928904 40563143 43209886
6068 43209886 45869293 48391501 50565532 52235259 53286501 53668505 53452209 52734928 51704370
6059 51704370 50526584 49398432 48333687 47459136 46781709 46360584 46192363 46336834 46784108
6050 46784108 47432809 48428594 49771460 51388864 53365556 55683051 58355413 61428222
6042 61428222 64880711 68681122 72818984 77257466 81912144 86646651 91140716 95016996
6034 95016996 97912205 99304827 98919464 96749998 93032821 88261239 83050937 77779261
6026 77779261 72685875 67962460 63716603 59914452 56612679 53792294 51458776 49500701
$$ packed form
6085A5811046P35481Q04776Q33723R40778J016369J133010J265412J353815J495161
6076B5389571J679744J831890K011045K163484K307844K545326K634239K646743
6068D3209886K659407K522208K174031J669727J051242L82004k16296p17281j030558
6059E1704370j177786j128152j064745q74551o77427m21125j68221J44471M47274
6050D6784108O48701R95785J342866J617404J976692K317495K672362L072809
6042F1428222L452489L800411M137862M438482M654678M734507M494065L876280
6034I5016996K895209J392622l85363k169466l717177m771582n210302n271676
6026G7779261n093386m723415m245857l802151l301773k820385k333518j958075
$$ plain form
6018 49500701 47943256 46824125 45994594 45512673 45326623 45477316 45895168 46543539 47415509
6009 47415509 48491084 49765655 51121009 52523064 53879982 54987893 55678121 55699043 55017551
6000 55017551 53585717 51420131 48721581 45722472 42656244 39649473 36732802 34018610
5992 34018610 31515744 29218740 27112158 25190996 23514073 22019265 20589739 19358935
5984 19358935 18274435 17278520 16351514 15504056 14784670 14086976 13453325 12871416 12321552
5975 12321552 11814659 11371027 10874333 10453409 10087088 9707611 9334399 9002740 8748762
5966 8748762 8472422 8219336 8039482 7872420 7680007 7526362 7346705 7186322 7033081 6857874
5956 6857874 6752809 6663200 6532209 6417900 6265766 6120009 5993568 5848585 5728970 5594882
$$ packed form
6018D9500701j557445j119131q29531m81921j86050J50693M17852O48371Q71970
6009D7415509J075575J274571J355354J402055J356918J107911O90228K0922o81492
6000E5017551j431834k165586k698550k999109l066228l006771k916671k714192
5992C4018610k502866k297004k106582j921162j676923j494808j429526j230804
5984A9358935j084500r95915r27006q47458p19386o97694o33651n81909n49864
5975A2321552n06893m43632m96694m20924l66321l79477l73212l31659k53978
5966H748762k76340k53086j79854j67062j92413j53645j79657j60383j53241j75207
5956F857874j05065q9609j30991j14309j52134j45757j26441j44983j19615j34088
$$ plain form
5946 5594882 5416012 5259666 5152402 5045706 4948275 4900234 4879608 4796340 4764022 4700851 4608832
5935 4608832 4503265 4424218 4350517 4246326 4175499 4121969 4086419 4084258 3989656 3877729 3819396
5924 3819396 3742442 3722487 3671033 3655018 3605289 3532224 3455006 3417794 3365417 3329947 3318637
5913 3318637 3283084 3303158 3351400 3382266 3448198 3490545 3557777 3611723 3678181 3737128 3780168
5902 3780168 3826680 3865312 3893051 3980969 4096112 4186537 4273535 4388838 4468517 4530831 4635979
5891 4635979 4733622 4760789 4779564 4822779 4819467 4846532 4913469 4991760 5055583 5116718 5172988 5234592
5879 5234592 5284034 5321320 5321300 5356400 5409176 5432400 5400915 5411980 5469057 5528736 5553549 5541248
5867 5541248 5563056 5621051 5685240 5744203 5739683 5729181 5737118 5731326 5692543 5638760 5587258 5596306
$$ packed form
5946E594882j78870j56346j07264j06696r7431m8041k0626q3268l2318o3171r2019
5935D608832j05567p9047p3701j04191p0827n3530l5550k161r4602j11927n8333
5924C819396p6954j9955n1454j6015m9729p3065p7218l7212n2377l5470j1310
5913C318637l5553K0074M8242L0866O5932M2347O7232N3946O6458N8947M3040
5902C780168M6512L8632K7739Q7918J15143R0425Q6998J15303P9679O2314J05148
5891D635979R7643K7167J8775M3215l312K7065O6937P8291O3823O1135N6270O1604
5879E234592M9442L7286k0L5100N2776K3224l1485J1065N7077N9679K4813j2301
5867E541248K1808N7995O4189N8963m520j0502P937n792l8783n3783n1502R048
$$ plain form
5855 5596306 5641267 5649287 5677071 5735327 5778427 5840823 5905357 5955042 5987688 6005245 6059887 6122790
5843 6122790 6214773 6323923 6428702 6559769 6631976 6714941 6868969 7008572 7188482 7408613
5833 7408613 7608399 7838181 8067542 8387247 8718974 9021155 9397433 9781365 10116171 10517757
5823 10517757 10931579 11379884 11844863 12318656 12835017 13410911 14066645 14808608 15671320
5814 15671320 16685419 17801782 19050120 20389361 21849373 23485548 25220787 27063573
5806 27063573 28996319 31019733 33127743 35378183 37747896 40329483 43084143 45989961
5798 45989961 48920941 51714699 54549602 57683366 61197317 65143600 69436052 74020417
5790 74020417 78914839 84173019 89952648 96476052 103831089 112260890 121933180 132851145
$$ packed form
5855E596306M4961Q020K7784N8256M3100O2396O4534M9685L2646J7557N4642O2903
5843F122790R1983J09150J04779J31067P2207Q2965J54028J39603J79910K20131
5833G408613J99786K29782K29361L19705L31727L02181L76278L83932L34806M01586
5823A0517757M13822M48305M64979M73793N16361N75894O55734P41963Q62712
5814A5671320J014099J116363J248338J339241J460012J636175J735239J842786
5806B7063573J932746K023414K108010K250440K369713K581587K754660K905818
5798D5989961K930980K793758K834903L133764L513951L946283M292452M584365
5790G4020417M894422N258180N779629O523404P355037Q429801R672290J0917965
$$ plain form
5782 132851145 145044514 158876354 174900657 193612018 215597863 240816957 268174374
5775 268174374 297154707 325862786 348297711 357642491 349714569 324572289 289847354
5768 289847354 254546073 222531543 194763823 171130466 151196074 134198561 119529674
5761 119529674 106926684 96244466 87237734 79732914 73393352 68096252 63620646 59821247
5753 59821247 56541211 53739891 51382908 49407793 47811774 46553715 45550728 44753515
5745 44753515 44213550 43908509 43994863 44380381 45006467 45765086 46260935 46087192 44937928
5736 44937928 42781409 39994852 37111503 34478205 32131848 30001627 28096769 26428913
5728 26428913 24910483 23493776 22253318 21084191 20092942 19161858 18363390 17662116 17054489
$$ packed form
5782A32851145J2193369J3831840J6024303J8711361K1985845K5219094K7357417
5775B68174374K8980333K8708079K2434925R344780p927922k5142280l4724935
5768B89847354l5301281l2014530k7767720k3633357j9934392j6997513j4668887
5761A19529674j2602990j0682218r006732p504820o339562n297100m475606l799399
5753E9821247l280036k801320k356983j975115j596019j258059j002987p97213
5745D4753515n39965l05041Q6354L85518O26086P58619M95849j73743j149264
5736D4937928k156519k786557k883349k633298k346357k130221j904858j667856
5728B6428913j518430j416707j240458j169127r91249r31084p98468p01274o07627
$$ plain form
5719 17054489 16521564 16050164 15598157 15192925 14777563 14397769 14036935 13661289 13299511
5710 13299511 12919100 12571993 12216067 11890497 11602135 11313916 11043405 10716266 10455896
5701 10455896 10259646 9986333 9706102 9460065 9267478 9065711 8887008 8702867 8545058
5692 8545058 8409953 8279207 8174954 8076967 7964061 7838130 7695157 7590095 7446428 7288999
5682 7288999 7197305 7164077 7120049 7117283 7126852 7146353 7163356 7180011 7220849 7269517 7285111 7269053
5670 7269053 7257599 7241936 7181122 7177578 7144468 7123517 7103268 7143286 7163569 7134109 7145205 7121225
5658 7121225 7096596 7086018 7050555 7057870 7049497 7072789 7083007 7089140 7122058 7218069 7362803 7462709
5646 7462709 7566937 7683475 7824852 7942240 8052118 8184570 8356508 8581315 8780708 9017231
$$ packed form
5719A7054489n32925m71400m52007m05232m15362l79794l60834l75646l61778
5710A3299511l80411l47107l55926l25570k88362k88219k70511l27139k60370
5701A0455896j96250k73313k80231k46037j92587k01767j78703j84141j57809
5692H545058j35105j30746j04253r7987j12906j25931j42973j05062j43667j57429
5682G288999r1694l3228m4028k766R569J9501J7003J6655M0838M8668J5594j6058
5670G269053j1454j5663o0814l544l3110k0951k0249M0018K0283k9460J1096k3980
5658G121225k4629j0578l5463P315q373K3292J0218O133L2918R6011J44734R9906
5646G462709J04228J16538J41377J17388J09878J32452J71938K24807J99393K36523
$$ plain form
5636 9017231 9256713 9536748 9824836 10061733 10317670 10601998 10897661 11250748 11633261 12024236
5626 12024236 12420690 12867696 13376369 13907711 14489791 15170618 15854886 16627795 17514679
5617 17514679 18440617 19406685 20448289 21619427 22862633 24201953 25558843 26991108
5609 26991108 28530901 30187849 31951193 33864809 35904256 38099786 40443171 42925713
5601 42925713 45590380 48498995 51589365 54981762 58629139 62596001 66898116 71607465
5593 71607465 76769986 82377160 88403677 94864024 101617144 108589473 115646596 122681600
5585 122681600 129500385 136024308 142064403 147502919 152116348 155581923 157597768 157808012
5577 157808012 156159672 152719567 147885026 142084596 135626203 128753722 121615528 114290952
$$ packed form
5636I017231K39482K80035K88088K36897K55937K84328K95663L53087L82513L90975
5626A2024236L96454M47006N08673N31342N82080O80827O84268P72909Q86884
5617A7514679R25938R66068J041604J171138J243206J339320J356890J432265
5609B6991108J539793J656948J763344J913616K039447K195530K343385K482542
5601D2925713K664667K908615L090370L392397L647377L966862M302115M709349
5593G1607465N162521N607174O026517O460347O753120O972329P057123P035004
5585A22681600O818785O523923O040095N438516M613429L465575K015845K10244
5577A57808012j648340l440105m834541n800430o458393o872481p138194p324576
$$ plain form
5569 114290952 106872291 99537178 92443588 85691862 79364994 73462463 68002667 63029156
5561 63029156 58438168 54203220 50382592 46875723 43653024 40734325 38047648 35644374
5553 35644374 33484791 31483700 29700548 28070627 26576973 25194457 23972756 22811779
5545 22811779 21764808 20750472 19854435 19003108 18164042 17366162 16651002 16024405 15414975
5536 15414975 14826780 14283173 13786877 13299906 12849318 12437610 12022811 11637186 11224547
5527 11224547 10853751 10532069 10207618 9903990 9626025 9348002 9102314 8874296 8625844
5518 8625844 8396642 8195594 7998956 7793005 7617783 7414219 7202940 7000562 6804693 6542339
5508 6542339 6348565 6173758 5954805 5755588 5600050 5404410 5210313 5074696 4988801 4806369
$$ packed form
5569A14290952p418661p335113p093590o751726o326868n902531n459796m973511
5561F3029156m590988m234948l820628l506869l222699k918699k686677k403274
5553C5644374k159583k001091j783152j629921j493654j382516j221701j160977
5545B2811779j046971j014336q96037q51327q39066p97880p15160o26597o09430
5536A5414975n88195n43607m96296m86971m50588m11708m14799l85625m12639
5527A1224547l70796l21682l24451l03628k77965k78023k45688k28018k48452
5518H625844k29202k01048j96638k05951j75222k03564k11279k02378j95869k62354
5508F542339j93774j74807k18953j99217j55538j95640j94097j35617q5895j82432
$$ plain form
5498 4806369 4680507 4554527 4436479 4364012 4264829 4183351 4106136 4004404 3939171 3836865
5488 3836865 3759899 3673183 3602235 3544024 3510557 3525587 3475884 3436385 3372022 3338630 3283100
5477 3283100 3215848 3222074 3219593 3190755 3186366 3175742 3178568 3149486 3117922 3092656 3062568 3064843
5465 3064843 3068616 3087260 3068970 3057744 3095049 3126837 3147810 3167758 3196670 3195822 3255524 3320125
5453 3320125 3386579 3478955 3598501 3712597 3850611 3953392 4065661 4128654 4114515 4026618
5443 4026618 3914468 3704527 3503755 3341614 3171015 2995280 2896039 2776752 2669222 2596264
5433 2596264 2506415 2425134 2358990 2302025 2231648 2206732 2133602 2065898 2001947 1953368 1915190
5422 1915190 1859798 1842560 1806300 1764288 1711149 1712563 1653666 1613342 1626295 1632555 1620331 1635142
$$ packed form
5498D806369j25862j25980j18048p2467r9183q1478p7215j01732o5233j02306
5488C836865p6966q6716p0948n8211l3467J5030m9703l9499o4363l3392n5530
5477C283100o7252O226k481k8838m389j0624K826k9082l1564k5266l0088K275
5465C064843L773J8644j8290j1226L7305L1788K0973J9948K8912q48N9702O4601
5453C320125O6454R2376J19546J14096J38014J02781J12269O2993j4139q7897
5443D026618j12150k09941k00772j62141j70599j75735r9241j19287j07530p2958
5433B596264q9849q1281o6144n6965p0377k4916p3130o7704o3951m8579l8178
5422A915190n5392j7238l6260m2012n3139J414n8897m0324J2953O260j2224J4811
$$ plain form
5410 1635142 1616245 1590373 1555317 1531994 1500408 1451648 1430470 1437531 1427531 1405047 1393416 1416513
5398 1416513 1424770 1401026 1408019 1342897 1345369 1365656 1359139 1353208 1361487 1355222 1346760 1329925 1330579
5385 1330579 1324415 1297470 1293098 1298078 1245768 1238295 1206569 1157391 1133899 1150070 1125699 1132027
5373 1132027 1096822 1070548 1067463 1081532 1095763 1048044 1033577 1026193 995862 991374 1005662 965255
5361 965255 966024 1009308 1027212 1049786 1038481 1030877 1050191 1052629 1040897 1036121 1017138 1030320 1007282
5348 1007282 982980 999486 970181 968641 976704 960557 980355 1007391 1009466 986145 955095 952853
5336 952853 1002254 1000424 992703 993372 1008753 1014104 1028810 1011167 1006727 981260 999541 998874 1030487
5323 1030487 1049191 1028900 1023001 1027938 1012822 1017607 1011802 1009343 1049402 1067381 1087986 1084646 1097826
$$ packed form
5410A635142j8897k5872l5056k3323l1586m8760k1178P061j0000k2484j1631K3097
5398A416513Q257k3744O993o5122K472K0287o517n931Q279o265q462j6835O54
5385A330579o164k6945m372M980n2310p473l1726m9178k3492J6171k4371O328
5373A132027l5205k6274l085J4069J4231m7719j4467p384l0331m488J4288m0407
5361I65255P69M3284J7904K2574j1305p604J9314K438j1732m776j8983J3182k3038
5348A007282k4302J6506k9305j540Q063j6147J9798K7036K075k3321l1050k242
5336I52853M9401j830p721O69J5381N351J4706j7643m440k5467J8281o67L1613
5323A030487J8704k0291n899M937j5116M785n805k459M0059J7979K0605l340J3180
$$ plain form
5310 1097826 1079903 1071648 1076627 1094206 1136817 1166554 1161005 1161435 1180632 1188475 1188071 1238968 1221445
5297 1221445 1224234 1257195 1290571 1302493 1326784 1366364 1437271 1490227 1536708 1579655 1612575 1637206
5285 1637206 1681282 1706752 1741454 1813400 1842050 1884423 1889314 1890170 1933355 1938025 1929678 1944481
5273 1944481 1925111 1928515 1909779 1878535 1851547 1797207 1770729 1749665 1745848 1723045 1704330 1684998
5261 1684998 1654969 1622656 1611214 1579001 1561732 1535658 1540128 1528578 1528773 1534536 1533907 1526235 1522301
5248 1522301 1477675 1426920 1431847 1393755 1334211 1314138 1284254 1278307 1260623 1227173 1183444 1201844
5236 1201844 1196875 1194213 1152831 1128305 1145576 1158043 1124704 1142892 1138679 1104677 1136027 1135041
5224 1135041 1145365 1162977 1180210 1191086 1180928 1157987 1165579 1138035 1151257 1155103 1140259 1136479
$$ packed form
5310A097826j7923q255M979J7579M2611K9737n549M30J9197P843m04N0897j7523
5297A221445K789L2961L3376J1922K4291L9580P0907N2956M6481M2947L2920K4631
5285A637206M4076K5470L4702P1946K8650M2373M891Q56M3185M670q347J4803
5273A944481j9370L404j8736l1244k6988n4340k6478k1064l817k2803j8715j9332
5261A684998l0029l2313j1442l2213j7269k6074M470j1550J95N763o29p672l934
5248A522301m4626n0755M927l8092n9544k0073k9884n947j7684l3450m3729J8400
5236A201844m969k662m1382k4526J7271J2467l3339J8188m213l4002L1350r86
5224A135041J0324J7612J7233J0876j0158k2941P592k7544J3222L846j4844l780
$$ plain form
5212 1136479 1163294 1110533 1084141 1083983 1085362 1084460 1070603 1069267 1079845 1085316 1074647 1053694 1098824
5199 1098824 1147786 1157330 1114559 1098788 1095430 1091656 1109989 1111896 1118149 1102868 1115618 1126963
5187 1126963 1134684 1099824 1097136 1112476 1135785 1116765 1085403 1103819 1114097 1110509 1102241 1083968
5175 1083968 1065827 1109412 1148825 1147943 1167745 1196062 1194658 1189748 1198605 1208226 1205550 1237425 1218105
5162 1218105 1203689 1198294 1233500 1252816 1213334 1198940 1201392 1188789 1196131 1176771 1191468 1159382
5150 1159382 1166897 1220986 1246893 1275416 1293394 1309493 1317892 1349187 1319700 1342511 1385675 1378899
5138 1378899 1340368 1348433 1340084 1346258 1360476 1397631 1412921 1407179 1424893 1397502 1382888 1435887
5126 1435887 1459125 1478784 1514384 1518728 1522728 1516185 1557997 1554736 1561558 1618841 1630238 1635969 1647620
$$ packed form
5212A136479K6815n2761k6392j58J379r02j3857j336J0578N471j0669k0953M5130
5199A098824M8962R544m2771j5771l358l774J8333J907O253j5281J2750J1345
5187A126963P721l4860k688J5340K3309j9020l1362J8416J0278l588q268j8273
5175A083968j8141M3585L9413q82J9802K8317j404m910Q857R621k676L1875j9320
5162A218105j4416n395L5206J9316l9482j4394K452j2603P342j9360J4697l2086
5150A159382P515N4089K5907K8523J7978J6099Q399L1295k9487K2811M3164o776
5138A378899l8531Q065q349O174J4218L7155J5290n742J7714k7391j4614N2999
5126A435887K3238J9659L5600M344M000o543M1812l261O822N7283J1397N731J1651
$$ plain form
5113 1647620 1645793 1646198 1636488 1660865 1702815 1707276 1716444 1737844 1757465 1777304 1852113 1878156 1882455
5100 1882455 1904311 1918017 1930302 1913741 1944424 2023480 2051197 2081649 2165404 2190605 2237043
5089 2237043 2251407 2276638 2325514 2343668 2349665 2385442 2433064 2481208 2476973 2512714 2580226 2636369
5077 2636369 2683731 2703324 2753421 2820565 2865398 2899407 2934646 2981668 3054621 3096038 3161605
5066 3161605 3261941 3283856 3323375 3394012 3453775 3487080 3566262 3639683 3701246 3748340 3832061
5055 3832061 3921873 3950658 4019243 4122197 4221436 4356843 4446022 4529903 4624338 4704819 4848136
5044 4848136 4967573 5073155 5202649 5360583 5500796 5675697 5814210 5993673 6145654 6288358
5034 6288358 6391566 6583045 6803046 6984270 7195439 7439585 7721281 8021326 8361370 8707608
$$ packed form
5113A647620j827M05r710K4377M1950M461R168K1400J9621J9839P4809K6043M299
5100A882455K1856J3706J2285j6561L0683P9056K7717L0452Q3755K5201M6438
5089B237043J4364K5231M8876J8154N997L5777M7622M8144m235L5741O7512N6143
5077B636369M7362J9593N0097O7144M4833L4009L5239M7022P2953M1417O5567
5066C161605J00336K1915L9519P0637N9763L3305P9182P3421O1563M7094Q3721
5055C832061Q9812K8785O8585J02954R9239J35407Q9179Q3881R4435Q0481J43317
5044D848136J19437J05582J29494J57934J40213J74901J38513J79463J51981J42704
5034F288358J03208J91479K20001J81224K11169K44146K81696L00045L40044L46238
$$ plain form
5024 8707608 9081132 9481187 9898480 10360025 10866733 11394220 11921735 12474002 13099109 13727994
5014 13727994 14405680 15146478 15923181 16777442 17621076 18559040 19597843 20706120 21910617
5005 21910617 23211694 24619806 26150833 27812258 29668725 31684770 33852922 36205301
4997 36205301 38765962 41433586 44211106 46996422 49707609 52217889 54388386 56063263
4989 56063263 57116976 57655488 57590800 56984934 55988528 54814297 53539613 52338250 51293275
4980 51293275 50471883 49914854 49606876 49626018 49918856 50528215 51416240 52648194 54192453
4971 54192453 56070538 58289397 60868000 63811446 67163066 70903119 74972148 79335450
4963 79335450 83859514 88304531 92309017 95572416 97704354 98492952 97762729 95553411
$$ packed form
5024H707608L73524M00055M17293M61545N06708N27487N27515N52267O25107O28885
5014A3727994O77686P40798P76703Q54261Q43634R37964J038803J108277J204497
5005B1910617J301077J408112J531027J661425J856467K016045K168152K352379
4997C6205301K560661K667624K777520K785316K711187K510280K170497J674877
4989E6063263J053713N38512o4688o05866r96406j174231j274684j201363j044975
4980E1293275q21392n57029l07978J9142K92838O09359Q88025J231954J544259
4971E4192453J878085K218859K578603K943446L351620L740053M069029M363302
4963G9335450M524064M445017M004486L263399K131938P88598p30223k209318
$$ plain form
4955 95553411 92139789 87833363 82993447 77923544 72960206 68349283 64145244 60399821
4947 60399821 57139287 54273996 51872971 49845340 48226717 46981870 46012917 45326575
4939 45326575 44914914 44781983 44859837 45202453 45750704 46464226 47338923 48287302 49228637 50120877
4929 50120877 50741397 50973426 50780178 50018293 48688023 46901793 44708211 42241984 39583198
4920 39583198 36966767 34426872 32033848 29797864 27769021 25911051 24264224 22800795
4912 22800795 21452469 20232238 19147632 18166169 17221622 16349386 15558042 14853083 14202838
4903 14202838 13639429 13115035 12634801 12179182 11753853 11397793 11043968 10751255 10495295
4894 10495295 10301455 10078637 9850688 9647157 9444568 9285091 9157777 9008101 8920756 8825030
$$ packed form
4955I5553411l413622m306426m839916n069903m963338m610923m204039l745423
4947F0399821l260534k865291k401025k027631j618623j244847r68953o86342
4939D5326575m11661j32931P7854L42616N48251P13522Q74697R48379R41335Q92240
4929E0120877O20520K32029j93248p61885j330270j786230k193582k466227k658786
4920C9583198k616431k539895k393024k235984k028843j857970j646827j463429
4912B2800795j348326j220231j084606r81463r44547q72236p91344p04959o50245
4903A4202838n63409n24394m80234m55619m25329l56060l53825k92713k55960
4894A0495295j93840k22818k27949k03531k02589j59477j27314j49676q7345r5726
$$ plain form
4884 8825030 8685342 8570714 8465975 8356656 8295818 8241696 8146471 8058799 7943895 7768125
4874 7768125 7618839 7459859 7273728 7123003 6984325 6890669 6740147 6574980 6476020 6400197
4864 6400197 6357662 6309635 6238746 6197443 6172502 6137430 6105149 6087533 6069462 6097615 6095073 6083309
4852 6083309 6064744 6058986 6058794 6070457 6131499 6103612 6098209 6116900 6119102 6163168 6192769 6194056 6197099
4839 6197099 6238179 6292125 6349338 6389568 6461880 6524896 6591958 6682149 6768713 6846825 6954389
4828 6954389 7042353 7104885 7209276 7328231 7470882 7575474 7666310 7755542 7818569 7920653
4818 7920653 8014248 8133098 8197959 8269465 8356038 8437371 8480170 8546629 8653629 8761823 8894755
4807 8894755 9023760 9147989 9329259 9541217 9743493 9940583 10179376 10454954 10728018 11008284
$$ packed form
4884H825030j39688j14628j04739j09319o0838n4122r5225q7672j14904j75770
4874G768125j49286j58980j86131j50725j38678r3656j50522j65167r8960p5823
4864F400197m2535m8027p0889m1303k4941l5072l2281j7616j8071K8153k542j1764
4852F083309j8565n758j92J1663O1042k7887n403J8691K202M4066K9601J287L043
4839F197099M1080N3946N7213M0230P2312O3016O7062R0191Q6564P8112J07564
4828F954389Q7964O2532J04391J18955J42651J04592R0836Q9232O3027J02084
4818G920653R3595J18850O4861P1506Q6573Q1333M2799O6459J07000J08194J32932
4807H894755J29005J24229J81270K11958K02276J97090K38793K75578K73064K80266
$$ plain form
4797 11008284 11335380 11705993 12086790 12468978 12901095 13321638 13784207 14296280 14824727
4788 14824727 15399006 15983134 16555864 17201793 17903366 18632010 19367541 20155951 21021010
4779 21021010 21924225 22918594 24003834 25190143 26439922 27808772 29343327 31022953
4771 31022953 32828534 34798669 36948362 39245447 41598891 44084238 46678165 49232226
4763 49232226 51784099 54121363 56245864 58059504 59435464 60436708 61151692 61584489
4755 61584489 61822455 62016355 62231766 62589218 63156331 63985576 65112672 66568676 68370212
4746 68370212 70583468 73094431 75994748 79211257 82725832 86467456 90412727 94393391
4738 94393391 98327205 102004026 105160433 107622593 109117854 109345445 108168814 105750504
$$ packed form
4797A1008284L27096L70613L80797L82188M32117M20543M62569N12073N28447
4788A4824727N74279N84128N72730O45929P01573P28644P35531P88410Q65059
4779B1021010R03215R94369J085240J186309J249779J368850J534555J679626
4771C1022953J805581J970135K149693K297085K353444K485347K593927K554061
4763D9232226K551873K337264K124501J813640J375960J001244P14984M32797
4755F1584489K37966J93900K15411L57452N67113Q29245J127096J456004J801536
4746F8370212K213256K510963K900317L216509L514575L741624L945271L980664
4738I4393391L933814L676821L156407K462160J495261K27591j176631k418310
$$ plain form
4730 105750504 102299077 98245769 93895039 89596918 85604351 82030308 78903900 76304567
4722 76304567 74179436 72530292 71330385 70557334 70186736 70177183 70546611 71191802 72015970
4713 72015970 72919302 73752776 74287682 74494249 74124395 73063636 71326328 68888052 65932964
4704 65932964 62628929 59125693 55610489 52167810 48889492 45843890 42992705 40385439
4696 40385439 38024094 35912213 33965657 32185182 30617253 29163509 27852869 26682458
4688 26682458 25618959 24625818 23718607 22899401 22142275 21471810 20876197 20286137 19737195
4679 19737195 19218583 18750371 18367471 17997981 17655420 17314066 17009699 16744470 16512438
4670 16512438 16309745 16072678 15878745 15670499 15456185 15294840 15140561 14952370 14783729
$$ packed form
4730A05750504l451427m053308m350730m298121l992567l574043l126408k599333
4722G6304567k125131j649144j199907p73051l70598r553L69428O45191Q24168
4713G2015970R03332Q33474N34906K06567l69854j060759j737308k438276k955088
4704F5932964l304035l503236l515204l442679l278318l045602k851185k607266
4696D0385439k361345k111881j946556j780475j567929j453744j310640j170411
4688B6682458j063499r93141r07211q19206p57126o70465n95613n90060n48942
4679A9737195n18612m68212l82900l69490l42561l41354l04367k65229k32032
4670A6512438k02693k37067j93933k08246k14314j61345j54279j88191j68641
$$ plain form
4661 14783729 14619274 14471777 14359830 14236504 14141944 14064041 13971417 13912285 13884578 13855321
4651 13855321 13845029 13859901 13873413 13939681 14013651 14144114 14252865 14361020 14529605 14715014
4641 14715014 14876446 15058877 15252398 15479079 15736573 15980175 16252577 16587856 16941897
4632 16941897 17314377 17769907 18250848 18735620 19266284 19809867 20431167 21118805 21873452
4623 21873452 22682724 23560155 24509596 25566261 26789780 28096156 29473049 31027178 32749566
4614 32749566 34556291 36518343 38645875 40901250 43289511 45763661 48369159 51187934
4606 51187934 54131214 57333538 60727834 64291404 68027358 72034759 76255110 80891462
4598 80891462 85965961 91288175 96828612 102491740 108208258 114380486 121361864 129240355
$$ packed form
4661A4783729j64455j47497j11947j23326r4560p7903r2624n9132k7707k9257
4651A3855321j0292J4872J3512O6268P3970J30463J08751J08155J68585J85409
4641A4715014J61432J82431J93521K26681K57494K43602K72402L35279L54041
4632A6941897L72480M55530M80941M84772N30664N43583O21300O87638P54647
4623B1873452Q09272Q77431R49441J056665J223519J306376J376893J554129J722388
4614C2749566J806725J962052K127532K255375K388261K474150K605498K818775
4606E1187934K943280L202324L394296L563570L735954M007401M220351M636352
4598H0891462N074499N322214N540437N663128N716518O172228O981378P878491
$$ plain form
4590 129240355 138092668 148008110 159090518 171313458 184782031 199554168 215587516
4583 215587516 232794518 250785957 268976646 286539310 302082370 313408371 318219510
4576 318219510 314943576 303744579 286546856 266302309 245573461 225935206 208090104
4569 208090104 192388639 178748429 167026841 157089835 148741529 141794983 136019927 131321351
4561 131321351 127417592 124214907 121537953 119225855 117116649 115203807 113390803 111621301
4553 111621301 109768612 107888284 106020362 104192953 102465409 100903040 99527166 98398590
4545 98398590 97550994 96988671 96749184 96835301 97226048 97860676 98689357 99644925 100695364
4536 100695364 101755320 102761167 103611176 104231283 104485758 104333102 103663523 102461668 100766546
$$ packed form
4590A29240355Q852313R915442J1082408J2222940J3468573J4772137J6033348
4583B15587516J7207002J7991439J8190689J7562664J5543060J1326001M811139
4576C18219510l275934j1198997j7197723k0244547k0728848j9638255j7845102
4569B08090104j5701465j3640210j1721588r937006q348306o946546n775056m698576
4561A31321351l903759l202685k676954k312098k109206j912842j813004j769502
4553A11621301j852689j880328j867922j827409j727544j562369j375874j128576
4545I8398590q47596n62323k39487Q6117L90747O34628Q28681R55568J050439
4536A00695364J059956J005847Q50009O20107K54475j52656o69579j201855j695122
$$ plain form
4527 100766546 98631608 96126449 93365891 90448234 87385082 84243523 81176568 78108098
4519 78108098 75190896 72485606 69954926 67631780 65555622 63755783 62077552 60598321
4511 60598321 59286524 58090502 56909344 55758828 54622145 53414801 52165207 50843755
4503 50843755 49394924 47822779 46190240 44434397 42596866 40727546 38828027 36980985
4495 36980985 35134365 33312281 31561791 29868660 28247482 26693012 25245635 23896056
4487 23896056 22629395 21467491 20394152 19493376 18646786 17832376 17105647 16429980 15763801
4478 15763801 15205054 14648615 14137378 13676502 13236373 12820539 12393181 11974342 11635208
4469 11635208 11343554 11019565 10731748 10471434 10211081 9974521 9725446 9480954 9239524
$$ packed form
4527A00766546k134938k505159k760558k917657l063152l141559l066955l068470
4519G8108098k917202k705290k530680k323146k076158j799839j678231j479231
4511F0598321j311797j196022j181158j150516j136683j207344j249594j321452
4503E0843755j448831j572145j632539j755843j837531j869320j899519j847042
4495C6980985j846620j822084j750490j693131j621178j554470j447377j349579
4487B3896056j266661j161904j073339r00776q46590q14410p26729o75667o66179
4478A5763801n58747n56439n11237m60876m40129m15834m27358m18839l39134
4469A1635208k91654l23989k87817k60314k60353k36560k49075k44492k41430
$$ plain form
4460 9239524 9017934 8786570 8601453 8465198 8287466 8140426 7992333 7835969 7707881 7621824
4450 7621824 7507709 7422462 7291325 7186367 7046041 6954996 6859506 6738557 6639976 6494271
4440 6494271 6386518 6286234 6167347 6069443 5954289 5838322 5749105 5626582 5517842 5390390
4430 5390390 5318801 5207836 5109361 4978751 4895295 4770470 4716086 4659725 4527106 4434211 4313538
4419 4313538 4223083 4157708 4069240 3966176 3856515 3737864 3644038 3542178 3479525 3422117 3328568
4408 3328568 3305657 3267524 3246824 3192242 3130823 3059419 3013963 2947739 2873942 2844314 2803320
4397 2803320 2779485 2764035 2776105 2732966 2733010 2703323 2699798 2710072 2673467 2626995 2628863 2626339 2631895
4384 2631895 2631954 2595046 2545207 2483254 2407362 2383349 2298801 2254748 2192571 2099389 2014753 1943014
$$ packed form
4460I239524k21590k31364j85117j36255j77732j47040j48093j56364j28088q6057
4450G621824j14115q5247j31137j04958j40326r1045r5490j20949r8581j45705
4440F494271j07753j00284j18887r7904j15154j15967q9217j22523j08740j27452
4430E390390p1589j10965r8475j30610q3456j24825n4384n6361j32619r2895j20673
4419D313538r0455o5375q8468j03064j09661j18651r3826j01860o2653n7408r3549
4408C328568k2911l8133k0700n4582o1419p1404m5456o6224p3797k9628m0994
4397B803320k3835j5450J2070m3139M4k9687l525J0274l6605m6472J868k524N556
4384B631895N9l6908m9839o1953p5892k4013q4548m4053o2177r3182q4636p1739
$$ plain form
4372 1943014 1912824 1893646 1800819 1767358 1801016 1784939 1709877 1682786 1662590 1612375 1560530
4361 1560530 1547806 1546502 1517699 1513776 1513506 1493329 1500163 1486906 1440053 1450010 1435055 1436046 1413308
4348 1413308 1399229 1365546 1345548 1323718 1326555 1295444 1266114 1271587 1318791 1316855 1281181 1302072
4336 1302072 1334969 1341560 1323890 1309356 1273392 1275159 1225840 1186406 1143658 1159187 1133535 1145309
4324 1145309 1142087 1134297 1137535 1087407 1087435 1098084 1109557 1100340 1106039 1093423 1080842 1108567 1119981
4311 1119981 1103730 1118082 1100829 1118827 1122595 1112022 1115559 1089687 1112983 1142811 1169688 1215354
4299 1215354 1210442 1189871 1229063 1245763 1258547 1291809 1334298 1322757 1340420 1373422 1417633 1461637
4287 1461637 1500464 1564184 1607394 1684498 1713980 1804478 1888947 1937758 2028714 2119245 2211955
$$ packed form
4372A943014l0190j9178r2827l3461L3658j6077p5062k7091k0196n0215n1845
4361A560530j2724j304k8803l923k70k0177O834j3257m6853R957j4955R91k2738
4348A413308j4079l3683j9998k1830K837l1111k9330N473M7204j936l5674K0891
4336A302072L2897O591j7670j4534l5964J767m9319l9434m2748J5529k5652J1774
4324A145309l222p790L238n0128K8J0649J1473r217N699j2616j2581K7725J1414
4311A119981j6251J4352j7253J7998L768j0573L537k5872K3296K9828K6877M5666
4299A215354m912k0571L9192J6700J2784L3262M2489j1541J7663L3002M4211M4004
4287A461637L8827O3720M3210P7104K9482R0498Q4469M8811R0956R0531R2710
$$ plain form
4276 2211955 2281062 2338605 2355165 2371127 2355978 2248042 2186084 2101020 1973454 1906939 1838796
4265 1838796 1789872 1747150 1646452 1577898 1531005 1481898 1415172 1376857 1361136 1369841 1336978
4254 1336978 1285769 1252053 1269005 1298962 1226462 1187178 1230950 1192780 1195407 1209875 1193326 1154779
4242 1154779 1171403 1190980 1188930 1173965 1185438 1205998 1208843 1206494 1200277 1177566 1108606 1069804
4230 1069804 1060095 1030009 992489 956637 918582 885845 858790 887944 886898 913828 883148 867746
4218 867746 843331 868474 859909 801879 820432 816620 815142 785764 774243 743390 750441 720395
4206 720395 691243 685311 668681 634550 606835 597012 581195 552764 538845 534821 529149 536531 510150
4193 510150 476747 481492 484800 505876 512937 484029 483895 491928 496432 462396 469886 453177 438508
$$ packed form
4276B211955O9107N7543J6560J5962j5149j07936o1958q5064j27566o6515o8143
4265A838796m8924m2722j00698o8554m6893m9107o6726l8315j5721Q705l2863
4254A336978n1209l3716J6952K9957p2500l9284M3772l8170K627J4468j6549l8547
4242A154779J6624J9577k050j4965J1473K0560K845k349o217k2711o8960l8802
4230A069804r709l0086l7520l5852l8055l2737k7055K9154j046K6930l0680j5402
4218H67746k4415K5143q565n8030J8553l812j478k9378j1521l0853P051l0046
4206G20395k9152n932j6630l4131k7715r823j5817k8431j3919m024n672P382k6381
4193E10150l3403M745L308K1076P061k8908j34Q033M504l4036P490j6709j4669
$$ plain form
4180 438508 444675 469445 487758 433468 420804 438826 397447 399576 391037 393120 393427 379549 371901
4167 371901 376034 368116 373772 383214 375201 374562 384450 382243 404216 383700 361313 359621 342959 343145
4153 343145 325487 327855 338661 310919 319396 357714 325167 340531 313563 317841 290704 305431
4141 305431 352648 359177 331736 308315 300415 280766 328462 294051 279524 273951 280394 280337 266906
4128 266906 270983 278374 276467 277382 279450 269762 266947 297822 310425 305470 293634 267195 255170
4115 255170 259076 266927 279153 284123 280250 249933 231175 252200 257974 247413 243513 252643 238019
4102 238019 209931 190587 197921 178464 166163 232505 241386 227155 180642 145921 200527 229532
4090 229532 253230 249160 210173 222700 210419 219395 210863 187314 205125 214642 207471 190342 188466
$$ packed form
4180D38508O167K4770J8313n4290j2664J8022m1379K129q539K083L07j3878p648
4167C71901M133p918N656R442q013o39R888k207K1973k0516k2387j692j6662J86
4153C43145j7658K368J0806k7742Q477L8318l2547J5364k6968M278k7137J4727
4141C05431M7217O529k7441k3421p900j9649M7696l4411j4527n573O443n7j3431
4128B66906M077P391j907R15K068r688k815L0875J2603m955j1836k6439j2025
4115B55170L906P851J2226M970l873l0317j8758K1025N774j0561l900R130j4624
4102B38019k8088j9344P334j9457j2301O6342Q881j4231m6513l4721N4606K9005
4090B29532K3698m070l8987J2527j2281Q976q532k3549J7811R517p171j7129j876
$$ plain form
4077 188466 211896 235598 209450 176648 191940 219366 206166 207357 204684 172047 150233 152583
4065 152583 169660 153862 136354 152791 149233 132402 141977 178061 141845 150662 161059 144512
4053 144512 124306 126383 133823 131747 173157 145367 131579 129722 99254 150149 195805 174794
4041 174794 160484 142603 162094 142910 146082 148159 129711 131878 85761 84826 105892 144097 129798
4028 129798 103639 72279 55485 84966 130036 129336 134684 153150 183687 156705 135277 126337
4016 126337 104557 115380 128821 115482 125708 117297 119809 99010 102092 112559 115786 135359
4004 135359 129609 169301 156019 144565 130567 134765 119728 82243 88261 110635 112082 117751 118661
3991 118661 114385 118977 113067 89402 109408 118637 139865 126346 115451 102775 115018 119247 84015
$$ packed form
4077A88466K3430K3702k6148l2802J5292K7426j3200J191k673l2637k1814K350
4065A52583J7077j5798j7508J6437l558j6831R575L6084l6216Q817J0397j6547
4053A44512k0206K077P440k076M1410k7790j3788j857l0468N0895M5656k1011
4041A74794j4310j7881J9491j9184L172K077j8448K167m6117r35K1066L8205j4299
4028A29798k6159l1360j6794K9481M5070p00N348J8466L0537k6982k1428q940
4016A26337k1780J0823J3441j3339J0226q411K512k0799L082J0467L227J9573
4004A35359n750L9692j3282j1454j3998M198j5037l7485O018K2374J447N669R10
3991A18661m276M592n910k3665K0006R229K1228j3519j0895j2676J2243M229l5232
$$ plain form
3978 84015 103814 126467 139321 148045 148544 130741 121834 99878 107940 118193 85443 105805 145439
3965 145439 136542 121161 126658 129500 132098 126729 122740 160824 158589 146617 141331 158059 136431
3952 136431 130334 148334 160321 187685 168901 137424 143149 143674 158782 157967 170875 179289 158850
3939 158850 157385 165698 171915 189194 181046 195829 191388 161599 190784 206675 203014 207728 187344
3926 187344 156069 155377 114737 103249 101086 142307 153234 166629 158717 141984 138797 135770 137676
3913 137676 147287 146029 158356 154158 160670 156393 151897 199795 217386 230973 214970 207188 205849
3900 205849 215251 227267 190108 215375 238215 238007 245906 243698 237808 275736 269644 253565 269403
3887 269403 276056 259388 258394 279219 274655 254589 264372 311373 317872 310646 334437 330670 320883
$$ packed form
3978H4015J9799K2653J2854Q724M99j7803q907k1956Q062J0253l2750K0362L9634
3965A45439q897j5381N497K842K598n369l989L8084k235j1972n286J6728k1628
3952A36431o097J8000J1987K7364j8784l1477N725N25J5108q15J2908Q414k0439
3939A58850j465Q313O217J7279q148J4783m441k9789K9185J5891l661M714k0384
3926A87344l1275o92m0640j1488k163M1221J0927J3395p912j6733l187l027J906
3913A37676R611j258J2327m198O512m277m496M7898J7591J3587j6003p782j339
3900B05849R402J2016l7159K5267K2840k08P899k208n890L7928o092j6079J5838
3887B69403O653j6668r94K0825m564k0066R783M7001O499p226K3791l767r787
$$ plain form
3874 320883 367524 370149 377559 390818 408726 393988 392316 405025 364521 358882 387402 413842
3862 413842 426577 416648 426122 450128 441768 427924 403574 406832 420352 412756 421704 432337 459171
3849 459171 491337 485566 456425 477391 478122 491802 482454 505924 516374 484721 484456 467108 433008
3836 433008 442665 421408 438541 456032 419473 437819 436795 429271 439016 425480 398353 428771
3824 428771 425340 430737 451397 456150 455278 457375 433272 433483 472725 458776 458857 460435 429939 408791
3810 408791 417006 439124 411694 393925 434170 455937 384316 357118 346809 389199 413317 371481
3798 371481 348315 348783 366754 383330 384792 401971 426423 376073 384701 397473 409024 424861
3786 424861 407837 430862 414473 402494 417349 376145 374180 404915 416007 402610 413018 408375
$$ packed form
3874C20883M6641K625P410J3259J7908j4738j672J2709m0504n639K8520K6440
3862D13842J2735r929R474K4006q360j3844k4350L258J3520p596Q948J0633K6834
3849D59171L2166n771k9141K0966P31J3680r348K3470J0450l1653k65j7348l4100
3836D33008R657k1257J7133J7491l6559J8346j024p524R745j3536k7127L0418
3824D28771l431N397K0660M753q72K097k4103K11L9242j3949Q1J578l0496k1148
3810D08791Q215K2118k7430j7769M0245K1767p1621k7198j0309M2390K4118m1836
3798C71481k3166M68J7971J6576J462J7179K4452n0350Q628J2772J1551J5837
3786D24861j7024K3025j6389j1979J4855m1204j965L0735J1092j3397J0408m643
$$ plain form
3774 408375 414070 413619 379651 339271 418362 431404 437482 406289 399604 390294 371398 384435 389354
3761 389354 441169 416987 380849 413543 388849 419919 429449 386969 369564 332329 322220 315626
3749 315626 305045 294537 306562 306046 290210 302476 322277 316586 306548 282293 319545 304247
3737 304247 283857 290147 309398 329921 310300 338003 367466 359814 348176 366922 363715 321744
3725 321744 322602 316424 350289 370732 346356 320819 327356 337008 345754 365791 406298 370926 337192
3712 337192 348191 340943 323350 347730 350649 314737 312304 330456 365319 370826 373658 353588 318167
3699 318167 342631 346870 345474 333584 335437 359973 383081 360819 347500 353453 363789 354182 350875
3686 350875 333269 383067 373630 335791 317282 351912 378553 385040 385767 361703 405744 435325
$$ packed form
3774D08375N695m51l3968m0380P9091J3042O078l1193o685r310j8896J3037M919
3761C89354N1815k4182l6138L2694k4694L1070R530m2480j7405l7235j0109o594
3749C15626j0581j0508J2025n16j5836J2266J9801n691j0038k4255L7252j5298
3737C04247k0390O290J9251K0523j9621K7703K9463p652j1638J8746l207m1971
3725C21744Q58o178L3865K0443k4376k5537O537R652Q746K0037M0507l5372l3734
3712C37192J0999p248j7593K4380K919l5912k433J8152L4863N507K832k0070l5421
3699C18167K4464M239j396j1890J853K4536K3108k2262j3319N953J0336r607l307
3686C50875j7606M9798r437l7839j8509L4630K6641O487P27k4064M4041K9581
$$ plain form
3674 435325 421004 414871 416508 391473 405059 427063 438209 419275 459803 419253 415590 465665
3662 465665 458580 423899 448151 450304 451119 485120 489170 457523 446054 446262 484966 462099 471629
3649 471629 495575 476658 471574 482472 514390 545378 548071 540181 583163 600755 612944 584920
3637 584920 633530 628090 602874 619622 666337 704641 730992 725096 735384 773951 764263 727113
3625 727113 711974 723734 721877 720969 719644 682204 703259 713675 682161 665805 638995 668383
3613 668383 699896 741843 754060 769004 801330 788750 823675 847814 870402 898939 895209 934862
3601 934862 976592 999646 995348 1011282 1041115 1073326 1052790 1040535 1045906 1046005 1058731 1037783 1023347
3588 1023347 1019969 968153 963286 976571 946089 967409 1008193 974224 963354 951083 965317 993128
$$ packed form
3674D35325j4321o133J637k5035J3586K2004J1146j8934M0528m0550l663N0075
3662D65665p085l4681K4252K153Q15L4001M050l1647j1469K08L8704k2867R530
3649D71629K3946j8917n084J0898L1918L0988K693p890M2982J7592J2189k8024
3637E84920M8610n440k5216J6748M6715L8304K6351n896J0288L8567r688l7150
3625G27113j5139J1760j857r08j325l7440K1055J0416l1514j6356k6810K9388
3613F68383L1513M1947J2217J4944L2326j2580L4925K4139K2588K8537l730L9653
3601I34862M1730K3054m298J5934K9833L2211k0536j2255N371R9J2726k0948j4436
3588A023347l378n1816m867J3285l0482K1320M0784l3969j0870j2271J4234K7811
$$ plain form
3576 993128 1019794 1066613 1081674 1086141 1136728 1139419 1151043 1214620 1248251 1236928 1258978 1309446
3564 1309446 1354835 1386869 1403295 1410209 1411515 1391880 1407917 1435377 1436757 1426688 1440015 1445313
3552 1445313 1468038 1469700 1456588 1500303 1539803 1576201 1602374 1634310 1666729 1668820 1703063 1747909
3540 1747909 1811087 1854490 1925012 1973243 2007812 2036640 2105691 2146564 2149909 2207375 2268827 2330469
3528 2330469 2351312 2380571 2411497 2476645 2540245 2619550 2686624 2780232 2841684 2938841 2990289
3517 2990289 3081062 3138019 3185517 3198067 3218293 3251940 3263934 3268060 3261929 3208780 3222258 3210726
3505 3210726 3171713 3171747 3148192 3128467 3128533 3140486 3127645 3179077 3150327 3169687 3235603 3239164 3254781
3492 3254781 3298718 3338613 3359433 3368707 3420654 3501279 3567677 3609423 3645426 3726424 3805256 3917197
$$ packed form
3576I93128K6666M6819J5061M467N0587K691J1624O3577L3631j1323K2050N0468
3564A309446M5389L2034J6426O914J306j9635J6037K7460J380j0069J3327N298
3552A445313K2725J662j3112M3715L9500L6398K6173L1936L2419K091L4243M4846
3540A747909O3178M3403P0522M8231L4569K8828O9051M0873L345N7466O1452O1642
3528B330469K0843K9259L0926O5148O3600P9305O7074R3608O1452R7157N1448
3517B990289R0773N6957M7498J2550K0226L3647J1994M126o131n3149J3478j1532
3505C210726l9013L4k3555j9725O6J1953j2841N1432k8750J9360O5916L561J5617
3492C254781M3937L9895K0820R274N1947Q0625O6398M1746L6003Q0998P8832J11941
$$ plain form
3480 3917197 4020858 4102119 4207909 4343042 4445400 4565297 4692881 4861700 5017175 5192274
3470 5192274 5396200 5603314 5795368 6025288 6261688 6509525 6745242 7038949 7347282 7573863
3460 7573863 7873479 8089628 8296550 8532788 8667748 8728777 8706704 8635193 8472091 8174162
3450 8174162 7777225 7407915 7004594 6569683 6224240 5884275 5567373 5295770 5053613 4813511
3440 4813511 4621596 4433322 4242743 4071846 3931270 3766887 3628578 3507906 3401865 3298751
3430 3298751 3188325 3073474 2984065 2893003 2801165 2722268 2685940 2617112 2548302 2479957 2433930
3419 2433930 2349493 2261312 2227721 2177759 2100853 2053365 1993025 1935712 1902279 1889546 1837818
3408 1837818 1789067 1763937 1746878 1691010 1661976 1617927 1536799 1502188 1493499 1463345 1435640 1406678
$$ packed form
3480C917197J03661Q1261J05790J35133J02358J19897J27584J68819J55475J75099
3470E192274K03926K07114J92054K29920K36400K47837K35717K93707L08333K26581
3460G573863K99616K16149K06922K36238J34960O1029k2073p1511j63102k97929
3450H174162l96937l69310m03321m34911l45443l39965l16902k71603k42157k40102
3440D813511j91915j88274j90579j70897j40576j64383j38309j20672j06041j03114
3430C298751j10426j14851q9409r1062r1838p8897l6328o8828o8810o8345m6027
3419B433930q4437q8181l3591m9962p6906m7488o0340n7313l3433j2733n1728
3408A837818m8751k5130j7059n5868k9034m4049q1128l4611q689l0154k7705k8962
$$ plain form
3396 1406678 1395045 1365390 1368396 1330513 1355920 1340826 1298979 1282980 1255914 1240131 1260635 1222671
3384 1222671 1166031 1170225 1143144 1118455 1107940 1122594 1097361 1082635 1050576 1057381 1020445 1038994
3372 1038994 1037979 1028572 1015439 1021242 1046851 1064482 1103526 1151198 1180639 1210233 1212193 1254477
3360 1254477 1218392 1217863 1220348 1173691 1109501 1073998 1049770 1013559 1012690 1015903 972560 935144 932402
3347 932402 927220 902642 945308 930096 915687 930136 974561 1039921 1004564 981256 1000217 1032279
3335 1032279 1049627 1090600 1145066 1184009 1253137 1337281 1381229 1395979 1367426 1295642 1215973
3324 1215973 1133726 1059309 1038423 994743 935707 896340 860511 858199 864774 855697 813370 785234
3312 785234 820112 830390 826525 809537 812782 817796 822214 821835 805672 822506 869456 900333 924954
$$ packed form
3396A406678j1633k9655L006l7883K5407j5094m1847j5999k7066j5783K0504l7964
3384A222671n6640M194k7081k4689j0515J4654k5233j4726l2059O805l6936J8549
3372A038994j015r407j3133N803K5609J7631L9044M7672K9441K9594J960M2284
3360A254477l6085n29K485m6657o4190l5503k4228l6211q69L213m3343l7416k742
3347I32402n182k4578M2666j5212j4409J4449M4425O5360l5357k3308J8961L2062
3335A032279J7348M0973N4466L8943O9128Q4144M3948J4750k8553p1784p9669
3324A215973q2247p4417k0886m3680n9036l9367l5829k312O575r077m2327k8136
3312G85234L4878J0278l865j6988L245N014M418l79j6163J6834M6950L0877K4621
$$ plain form
3299 924954 934305 943535 971190 992102 980929 971338 954291 904287 850976 825114 808234 780469
3287 780469 766595 775477 746771 717293 683732 693563 738519 757428 718689 710472 742700 763217
3275 763217 797473 795232 795122 782219 791960 788344 840990 881129 862595 892324 945328 951487 984636
3262 984636 1003923 1014770 1037510 1091507 1093588 1077614 1116586 1141564 1198349 1215105 1248685 1307214
3250 1307214 1369305 1412578 1507118 1572607 1668008 1739750 1795972 1866612 1961588 2046095 2095435
3239 2095435 2163645 2219197 2256087 2272151 2263920 2278943 2299880 2292556 2324073 2295911 2277001 2316130
3227 2316130 2368602 2362105 2395520 2434498 2492947 2549145 2594073 2644927 2677326 2698132 2739079 2810769
3215 2810769 2870026 2954727 3003449 3103112 3196431 3318411 3429560 3534408 3713596 3928115
$$ packed form
3299I24954R351R230K7655K0912j1173r591j7047n0004n3311k5862j6880k7765
3287G80469j3874Q882k8706k9478l3561R831M4956J8909l8739q217L2228K0517
3275G63217L4256k241j10j2903R741l616N2646M0139j8534K9729N3004O159L3149
3262I84636J9287J0847K2740N3997K081j5974L8972K4978N6785J6756L3580N8529
3250A307214O2091M3273R4540O5489R5401P1742N6222P0640R4976Q4507M9340
3239B095435O8210N5552L6890J6064q231J5023K0937p324L1517k8162j8910L9129
3227B316130N2472o497L3415L8978N8449N6198M4928N0854L2399K0806M0947P1690
3215B810769N9257Q4701M8722R9663R3319J21980J11149J04848J79188K14519
$$ plain form
3205 3928115 4113363 4239569 4343105 4410815 4433483 4399629 4323785 4233334 4106501 4014500 3907823
3194 3907823 3805541 3752559 3726860 3703448 3721954 3771314 3802761 3849840 3893808 3915114 3931867
3183 3931867 3940330 3975670 3982139 3953243 3932546 3873889 3832498 3773576 3731491 3670627 3657031 3658342
3171 3658342 3682908 3738964 3773648 3823395 3839405 3817831 3779862 3753937 3697917 3662254 3587057
3160 3587057 3525351 3488216 3503003 3509425 3511528 3522859 3582770 3624655 3679275 3767498 3826623 3890664
3148 3890664 3944810 3974117 4015964 4023043 3923154 3832397 3694906 3565053 3415731 3298932 3177132
3137 3177132 3086459 3042944 2989007 2954107 2940955 2913196 2950708 2966345 3014095 3067732 3090069
3126 3090069 3110551 3127492 3117985 3099789 3074391 3062408 3062406 3031173 3036660 3040167 3054856 3092588 3107351
$$ packed form
3205C928115J85248J26206J03536O7710K2668l3854p5844r0451j26833r2001j06677
3194C907823j02282n2982k5699k3412J8506M9360L1447M7079M3968K1306J6753
3183C931867Q463L5340O469k8896k0697n8657m1391n8922m2085o0864j3596J311
3171C658342K4566N6056L4684M9747J6010k1574l7969k5925n6020l5663p5197
3160C587057o1706l7135J4787O422K103J1331N9911M1885N4620Q8223N9125O4041
3148C890664N4146K9307M1847P079r9889r0757j37491j29853j49322j16799j21800
3137C177132r0673m3515n3937l4900j3152k7759L7512J5637M7750N3637K2337
3126C090069K0482J6941r507j8196k5398j1983kl1233N487L507J4689L7732J4763
$$ plain form
3113 3107351 3145339 3142266 3145969 3140009 3062913 2968856 2860675 2790043 2751321 2662247 2632742 2587092
3101 2587092 2555419 2511911 2467332 2443169 2401951 2388137 2401606 2396907 2383280 2387918 2335831 2312870
3089 2312870 2293772 2230956 2163017 2081376 2040257 2020131 2001302 1971377 1924631 1892937 1810973
3078 1810973 1762329 1738091 1718220 1677492 1643577 1627698 1568627 1515089 1454734 1433160 1432773 1409146
3066 1409146 1355167 1323669 1282267 1257172 1241432 1209902 1188723 1141454 1103473 1063797 1022841
3055 1022841 958919 911970 859157 861976 799772 786102 774368 763440 750434 716854 703429 687816
3043 687816 683566 650747 654653 660989 631168 615523 624149 607680 577164 558335 549332 528987 468956
3030 468956 471800 491394 500588 463347 481119 479708 444078 405890 394705 382771 349022 350966
$$ packed form
3113C107351L7988l073L703n960p7096r4057j08181p0632l8722q9074k9505m5650
3101B587092l1673m3508m4579k4163m1218j3814J3469m699j3627M638n2087k2961
3089B312870j9098o2816o7939q1641m1119k0126j8829k9925m6746l1694q1964
3078A810973m8644k4238j9871m0728l3915j5879n9071n3538o0355k1574l87k3627
3066A409146n3979l1498m1402k5095j5740l1530k1179m7269l7981l9676m0956
3055A022841o3922m6949n2813K819o2204j3670j1734j0928j3006l3580j3425j5613
3043F87816m250l2819L906O336k9821j5645Q626j6469l0516j8829r003k0345o0031
3030D68956K844J9594R194l7241J7772j411l5630l8188j1185j1934l3749J944
$$ plain form
3018 350966 362858 335434 316887 350861 332170 292768 314168 302939 282827 292137 322009 312209
3006 312209 332194 282642 248787 255615 274614 272714 253632 247045 259332 295186 258665 242691
2994 242691 212123 207064 234763 221197 186085 233329 239806 225156 211183 213289 193648 201569
2982 201569 190763 199972 148297 132609 152851 125086 119152 158393 201601 175688 182742 163700
2970 163700 164829 172879 164104 178794 189376 185936 198518 187427 140888 177903 160973 161214 151097
2957 151097 109813 106903 133244 151554 136192 136237 141523 109841 96399 122712 119027 116091 109810
2944 109810 97385 98848 76737 119677 127872 147654 164767 151930 135567 122847 100451 146979
2932 146979 170472 148881 129892 152514 120962 73344 116282 124153 144665 158973 163022 191084
$$ packed form
3018C50966J1892k7424j8547L3974j8691l9402K1400j1229k0112R310K9872r800
3006C12209J9985m9552l3855O828J8999j900j9082o587J2287L5854l6521j5974
2994B42691l0568n059K7699j3566l5112M7244O477j4650j3973K106j9641P921
2982B01569j0806R209n1675j5688K0242k7765n934L9241M3208k5913P054j9042
2970A63700J129Q050q775J4690J0582l440J2582j1091m6539L7015j6930K41j0117
2957A51097m1284k910K6341J8310j5362M5N286l1682j3442K6313l685k936o281
2944A09810j2425J463k2111M2940Q195J9782J7113j2837j6363j2720k2396M6528
2932A46979K3493k1591j8989K2622l1552m7618M2938P871K0512J4308M049K8062
$$ plain form
2920 191084 210421 170011 199136 200456 215798 204082 205303 201963 213694 239451 234785 224542
2908 224542 250090 257606 257915 286703 264341 276586 299665 326024 291539 276442 314561 333161
2896 333161 327021 369199 394425 429889 480086 487065 508247 538629 534567 527516 532559 521995 560377
2883 560377 574843 610050 649898 661904 644641 657610 723921 788463 820850 846894 890529 914356
2871 914356 912917 921817 950518 991236 1051309 1066551 1068657 1098407 1135302 1164308 1180025 1207271
2859 1207271 1226284 1214892 1216981 1239725 1226053 1222803 1209225 1215373 1222370 1216435 1216606 1229829 1250706
2846 1250706 1302193 1313679 1356826 1433873 1476710 1531254 1611609 1622473 1620697 1717783 1735819 1765034
2834 1765034 1794194 1828939 1870870 1868582 1863946 1920617 1951599 1964413 2007109 2009934 1988503 1944675
$$ packed form
2920A91084J9337m0410K9125J320J5342j1716J221l340J1731K5757m666j0243
2908B24542K5548P516L09K8788k2362J2245K3079K6359l4485j5097L8119J8600
2896C33161o140M2178K5226L5464N0197O979K1182L0382m062p051N043j0564L8382
2883E60377J4466L5207L9848J2006j7263J2969O6311O4542L2387K6044M3635K3827
2871I14356j439Q900K8701M0718O0073J5242K106K9750L6895K9006J5717K7246
2859A207271J9013j1392K089K2744j3672l250j3578O148O997n935J71J3223K0877
2846A250706N1487J1486M3147P7047M2837N4544Q0355J0864j776R7086J8036K9215
2834A765034K9160L4745M1931k288m636N6671L0982J2814M2696K825k1431m3828
$$ plain form
2822 1944675 1903939 1848991 1800631 1746595 1716717 1653718 1583762 1540767 1486909 1435336 1421326
2811 1421326 1443329 1449386 1433455 1411064 1424354 1427086 1482202 1517820 1546742 1599621 1611149 1589136
2799 1589136 1592421 1595265 1595093 1617055 1632932 1631633 1638332 1646686 1653352 1609215 1550860 1521098 1457299
2786 1457299 1406632 1380225 1290741 1234353 1203386 1125912 1093662 979334 907987 849852 822081
2775 822081 797015 754865 725331 717335 703069 711369 696567 674264 693874 708483 725446 693901
2763 693901 693764 693453 684525 706422 711126 686088 647641 623173 575159 569268 558662 514498 488509
2750 488509 498579 467269 435256 437904 429589 387918 325356 296964 289857 257236 224419 208055
2738 208055 198875 198428 204510 203913 177479 168414 184390 198635 176465 134397 97854 103509 103773 122777
$$ packed form
2822A944675m0736n4948m8360n4036k9878o2999o9956m2995n3858n1573j4010
2811A421326K2003O057j5931k2391J3290K732N5116L5618K8922N2879J1528k2013
2799A589136L285K844j72K1962J5877j299O699Q354O666m4137n8355k9762o3799
2786A457299n0667k6407q9484n6388l0967p7474l2250j14328p1347n8135k7771
2775H22081k5066m2150k9534p996j4266Q300j4802k2303J9610J4609J6963l1545
2763F93901j37l11q928K1897M704k5038l8447k4468m8014n891j0606m4164k5989
2750D88509J0070l1310l2013K648q315m1671o2562k8392p107l2621l2817j6364
2738B08055r180m47O082n97k6434r065J5976J4245k2170m2068l6543N655K64J9004
$$ plain form
2724 122777 113526 108596 127100 148928 119401 83852 74517 51693 67236 41581 36260 59074
2712 59074 16173 30004 50253 54489 47573 65406 52103 6152 30413 4783 -12415 -9087
2700 -9087 -27499 17203 -1526 -40638 -42177 -23758 -35171 -25020 -21400 -5114 8576 12966 -16470
2687 -16470 -16008 -30570 -34371 -25522 -11313 -12770 -7266 -3001 -22751 -29130 -17586 -8739 -39012 -24404
2673 -24404 -52865 -65860 -70337 -32411 -38277 -14665 -7041 -45331 -24497 -48707 -45208 -58428 -52562
2660 -52562 -64395 -57305 -64070 -54560 -37100 -16011 -18539 -34982 -41337 -28621 -36745 -32718 -60011
2647 -60011 -58988 -31356 -44759 -60851 -59056 -35944 -17051 5873 -9309 -42154 -44265 -2924
2635 -2924 -1702 -17619 -45671 -21036 -42583 -44227 -45585 -8369 -20763 -57044 -70042 -53062 -33254
$$ packed form
2724A22777r251m930J8504K1828k9527l5549r335k2824J5543k5655n321K2814
2712E9074m2901J3831K0249M236o916J7833j3303m5951K4261k5630j7198L328
2700i087j8412M4702j8729l9112j539J8419j1413J0151L620J6286J3690M390k9436
2687a6470M62j4562l801Q849J4209j457N504M265j9750o379J1544Q847l0273J4608
2673b4404k8461j2995m477L7926n866K3612P624l8290K0834k4210L499j3220N866
2660e2562j1833P090o765R510J7460K1089k528j6443o355J2716q124M027k7293
2647f0011J023K7632j3403j6092J795K3112J8893K2924j5182l2845k111M1341
2635b924J222j5917k8052K4635k1547j644j358L7216j2394l6281j2998J6980J9808
$$ plain form
2622 -33254 -37551 -46026 -34865 -57739 -64832 -42913 -43573 -68397 -83964 -78771 -43773 -45837 -53287
2609 -53287 -32585 -53765 -83846 -52002 -37323 -18655 -11968 -38438 -40444 -25237 -54167 -48763
2597 -48763 -58398 -82903 -67957 -34219 -52414 -49221 -24581 706 -2861 -823 -62177 -78190 -36900
2584 -36900 -40991 -3488 -9789 -1519 -27208 -28822 -43621 -69508 -70822 -47317 -54073 -54191 -49140 -53758
2570 -53758 -60991 -41794 -49886 -67140 -53165 -18516 -29931 -33 -36475 -57676 -41646 -57710
2558 -57710 -54469 -62830 -59779 -74576 -79976 -72127 -64002 -30657 -17868 -52345 -39463 -77044 -93727
2545 -93727 -100329 -81506 -66825 -66315 -63064 -68236 -85011 -58509 -67611 -34048 -3069 -29350 -29800
2532 -29800 -15519 -35315 -50880 -26322 -13676 -20886 -37086 -32873 -44527 -40167 -49606 -46327 -56228
$$ packed form
2622c3254m297q475J1161k2874p093K1919o60k4824j5567N193L4998k064p450
2609e3287K0702k1180l0081L1844J4679J8668O687k6470k006J5207k8930N404
2597d8763r635k4505J4946L3738j8195L193K4640K5287l567K038o1354j6013M1290
2584c6900m091L7503o301Q270k5689j614j4799k5887j314K3505o756j18N051m618
2570e3758p233J9197q092j7254J3975L4649j1415K9898l6442k1201J6030j6064
2558e7710L241q361L051j4797n400P849Q125L3345J2789l4477J2882l7581j6683
2545i3727o602J8823J4681N10L251n172j6775K6502r102L3563L0979k6281m50
2532b9800J4281j9796j5565K4558J2646p210j6200M213j1654M360r439L279r901
$$ plain form
2519 -56228 -65265 -68871 -68146 -67528 -55877 -37879 -21780 -33179 -63088 -67633 -66794 -68248 -65172 -31212
2505 -31212 -13126 -34359 -55678 -57030 -76215 -55722 -20867 -45848 -68293 -115430 -98675 -83125
2493 -83125 -76594 -48998 -39597 -75945 -47655 -80775 -68646 -25988 -16390 -33941 -46372 -55973 -67213
2480 -67213 -86145 -67401 -42138 -38446 -9532 -14571 -47022 -40758 -42679 -50438 -36068 -38341 -25149
2467 -25149 -70385 -98571 -79049 -58534 -37313 -38396 -30880 -64564 -54012 -52696 -50436 -47402 -60004
2454 -60004 -56078 -17305 12993 6903 -28814 -37673 -53715 -32532 -18123 -16715 -14678 370 -38586
2441 -38586 -49798 -27567 -18478 -13016 -32320 -39307 -47776 -21038 -35851 6747 15647 10678 -33916
2428 -33916 -29288 -31738 3919 -19307 -33693 -19196 -351 2585 -16394 3078 19318 47537
$$ packed form
2519e6228r037l606P25O18J1651J7998J6099j1399k9909m545Q39j454L076L3960
2505c1212J8086k1233k1319j352j9185K0493L4855k4981k2445m7137J6755J5550
2493h3125O531K7596R401l6348K8290l3120J2129M2658R598j7551j2431r601j1240
2480f7213j8932J8744K5263L692K8914n039l2451O264j921p759J4370k273J3192
2467b5149m5236k8186J9522K0515K1221j083P516l3684J0552J316K260L034j2602
2454f0004L926L8773L0298o090l5717q859j6042K1183J4409J408K037J5048l8956
2441c8586j1212K2231R089N462j9304o987q469K6738j4813M2598Q900m969m4594
2428c3916M628k450L5657k3226j4386J4497J8845K936j8979J9472J6240K8219
$$ plain form
2416 47537 43960 5976 29908 33968 12659 22668 18599 15421 27280 8363 17992 10892 31751
2403 31751 5217 -16554 6726 7657 4904 7580 12679 25498 26741 6007 -32970 6894 7076
2390 7076 -4366 -3791 -24870 -30553 -4562 13203 22072 35179 20462 53937 22973 20074 30849
2377 30849 38811 24733 26275 51694 45037 41396 16468 8770 13352 49946 65264 77471 44616
2364 44616 61608 64650 93284 122054 69994 92843 150790 123712 111451 123528 120441 174410
2352 174410 242302 216076 262093 295452 285018 324350 395016 477229 442828 472410 514345 530370
2340 530370 564642 632764 654325 708196 790246 855661 917810 974966 1042775 1141439 1221511 1320616
2328 1320616 1419755 1550359 1695537 1823725 2013388 2277697 2521800 2869748 3260943 3662826
$$ packed form
2416D7537l577l7984K3932M060k1309J0009m069l178J1859j8917R629p100K0859
2403C1751k6534k1771K3280R31k753K676N099J2819J243k0734l8977L9864J82
2390G076j1442N75k1079n683K5991J7765Q869J3107j4717L3475l0964k899J0775
2377C0849P962j4078J542K5419o657l641k4928p698M582L6594J5318J2207l2855
2364D4616J6992L042K8634K8770n2060K2849N7947k7078j2261J2077l087N3969
2352A74410O7892k6226M6017L3359j0434L9332P0666Q2213l4401K9582M1935J6025
2340E30370L4272O8122K1561N3871Q2050O5415O2149N7156O7809R8664Q0072R9105
2328A320616R9139J30604J45178J28188J89663K64309K44103L47948L91195M01883
$$ plain form
2318 3662826 4112950 4529055 4732777 4680359 4296501 3694666 3137675 2716335 2306623 1965340
2308 1965340 1711152 1516473 1327953 1145713 1037548 936784 848127 776493 690110 625660
2298 625660 635463 571780 490470 475667 431041 389399 373528 366782 309936 298922 299749 262033
2286 262033 254699 242300 248411 234264 207867 189450 177560 185351 166758 172774 196756 143421
2274 143421 119088 101499 123769 118184 92851 91959 47292 51983 64471 86333 114513 89092
2262 89092 53750 38551 72978 72639 40259 63534 43960 17623 35198 29689 29985 31296 36800
2249 36800 59696 66290 18341 -9053 13297 10132 1758 3844 24377 65889 52349 -3760 1319
2236 1319 18131 30934 41583 -10932 -5973 -19832 29688 15055 -7958 4027 -2080 -35096
$$ packed form
2318C662826M50124M16105K03722n2418l83858o01835n56991m21340m09712l41283
2308A965340k54188j94679j88520j82240j08165j00764q8657p1634q6383o4450
2298F25660R803o3683q1310j4803m4626m1642j5871o746n6846j1014Q27l7716
2286B62033p334j2399O111j4147k6397j8417j1890P791j8593O016K3982n3335
2274A43421k4333j7589K2270n585k5333q92m4667M691J2488K1862K8180k5421
2262H9092l5342j5199L4427l39l2380K3275j9574k6337J7575n509K96J311N504
2249C6800K2896O594m7949k7394K2350l165q374K086K0533M1512j3540n6109N079
2236A319J6812J2803J0649n2515M959j3859M9520j4633k3013J1985o107l3016
$$ plain form
2224 -35096 -23242 -49264 -26340 -7295 -39803 -43529 -41979 -30893 -44628 -34907 -41491 -43897 -48443
2211 -48443 -26827 -12961 -9796 -5844 5790 22743 11504 -28410 -28248 -64761 -38592 -46863 -22824
2198 -22824 6396 -10792 -36716 -29137 -9516 -8583 -23812 -53361 -21516 -17743 -85547 -73364 -70416
2185 -70416 -28028 -28474 -48836 -28320 -32852 -22656 -28875 -26506 -30157 -25510 2251 10113 2581 -17947
2171 -17947 -32267 3151 23976 23454 5197 -11547 -29903 -52411 -33543 -37113 -23218 -455
2159 -455 -26613 -4157 -25932 -48176 -33612 487 8356 -13593 -44776 -47868 -62872 -28277 -37914
2146 -37914 -10948 23061 -21174 -40241 -10096 -44979 -52194 -87292 -80424 -71598 -42916 13154
2134 13154 -14708 -55122 -14604 -24452 -46137 -31435 -27678 1737 -19651 -34533 -22987 -11625
$$ packed form
2224c5096J1854k6022K2924J9045l2508l726J550J1086j3735R721o584k406m546
2211d8443K1616J3866L165L952J1634J6953j1239l9914J62l6513K6169q271K4039
2198b2824K9220j7188k5924P579J9621R33j5229k9549L1845L773o7804J2183K948
2185g0416M2388m46k0362K0516m532J0196o219K369l651M647K7761P862p532k0528
2171a7947j4320L5418K0825n22j8257j6744j8356k2508J8868l570J3895K2763
2159d55k6158K2456k1775k2244J4564L4099P869k1949l1183l092j5004L4595r637
2146c7914K6966L4009m4235j9067L0145l4883p215l5098O868Q826K8682N6070
2134A3154k7862m0414M0518r848k1685J4702L757K9415k1388j4882J1546J1362
$$ plain form
2122 -11625 -56851 -48975 -22576 -20736 -53395 -35753 -15717 -49472 -34326 -26720 -60869 -37910
2110 -37910 -7911 -23549 -40992 -45441 -32467 -45638 -21498 -37343 -51415 -41495 -41360 -45287 -25772
2097 -25772 5959 -8182 -15599 -33897 -32111 -48304 -36119 -55207 -48126 -43550 -59052 -28981 -16730
2084 -16730 -20087 -8368 -28796 -35841 -48114 -51297 -42960 -36850 -66133 -56187 -22149 -44590 -53404
2071 -53404 -28051 -41119 -37893 -48335 -31722 -49982 -52332 -40912 -59555 -24308 -60603 -63722
2059 -63722 -38309 -29789 -40256 -75301 -55897 -16551 18809 -19096 -17539 -55827 -65421 -24689
2047 -24689 -9765 -18089 12787 1192 -12505 -18251 -30428 -14749 -11627 -19253 -24610 -22327 -37143
2034 -37143 -24390 -25914 -7854 -39453 -34238 -32791 -19996 -40738 -22670 4132 -28184 -35923 -21203
$$ packed form
2122a1625m5226P876K6399J840l2659J7642K0036l3755J5146P606l4149K2959
2110c7910K9999j5638j7443m449J2974j3171K4140j5845j4072R920J35l927J9515
2097b5772L1731j4141p417j8298J786j6193J2185j9088P081M576j5502L0071J2251
2084a6730l357J1719k0428p045j2273l183Q337O110k9283R946L4038k2441q814
2071e3404K5353j3068L226j0442J6613j8260k350J1420j8643L5247l6295l119
2059f3722K5413Q520j0467l5045J9404L9346L5360l7905J557l8288r594M0732
2047b4689J4924q324L0876j1595j3697n746j2177J5679L122p626n357K283j4816
2034c7143J2753j524J8060l1599N215J447J2795k0742J8068K6802l2316p739J4720
$$ plain form
2021 -21203 -31744 -32583 -26367 -30671 -38598 -48744 -44201 -45603 -44851 -37965 -12021 -21250 -33534 -4210
2007 -4210 6041 -26347 -31934 -27506 -41704 -66999 -46923 -25632 -47351 -79893 -65622 -29927
1995 -29927 -27206 -60612 -62161 -29046 -24597 -19276 24849 10073 -13497 12894 -3334 -3724 -24110
1982 -24110 -58748 -39921 -24679 -43627 -74331 -93176 -41310 -454 -17404 -25470 -14970 -35587
1970 -35587 7346 7011 -18549 -38193 -34953 -18913 -39991 -35623 -36834 -41970 -43781 -13131 -24550
1957 -24550 -55155 -55258 -63052 -12201 -9693 -19981 -43990 -62448 -56348 -49434 -61314 -47078 -17219
1944 -17219 -33196 -26677 -16432 -47129 -55075 -48869 -32451 -23857 -43053 -72365 -64061 -22036 -15658
1931 -15658 -30160 -33752 -22301 -45215 -49576 -14023 -22403 -15610 -32491 -33765 -31928 -66305 -54592
$$ packed form
2021b1203j0541q39O216m304p927j0146M543j402P52O886K5944r229j2284K9324
2007d210J0251l2388n587M428j4198k5295K0076K1291k1719l2542J4271L5695
1995b9927K721l3406j549L3115M449N321M4125j4776k3570K6391j6228l90k0386
1982b4110l4638J8827J5242j8948l0704j8845N1866M0856j6950q066J0500k0617
1970c5587M2933l35k5560j9644L240J6040k1078M368j211n136j811L0650j1419
1957b4550l0605j03p794N0851K508j0288k4009j8458O100O914j1880J4236K9859
1944a7219j5977O519J0245l0697p946O206J6418Q594j9196k9312Q304M2025O378
1931a5658j4502l592J1451k2914m361L5553q380O793j6881j274J837l4377J1713
$$ plain form
1918 -54592 -11233 -9716 -41572 -27008 -26688 -26371 -19738 -26453 -32673 -8901 1776 -19733 -25880 -23856
1904 -23856 -22326 -16375 -17831 -32704 -13110 -27203 1211 -3286 5779 -1729 -28272 -3929 -8366
1891 -8366 -20123 -56665 -61726 -79243 -62870 -47222 -46505 -49779 -58961 -53924 -26299 -34663 -63563
1878 -63563 -73624 -88256 -87958 -47503 -46283 -56245 -66760 -39409 -13505 9098 41425 24702 -604
1865 -604 -11040 -34202 -20422 4215 -5541 -5551 -1664 -35576 -28511 -18452 -17509 -35333 -25152 4344
1851 4344 22748 -5188 -14724 -11153 6042 -5410 9179 -2435 -9320 10070 -6996 -3203 -20660
1838 -20660 -15931 -22792 -1928 -1701 -3591 9409 -5352 -35841 -29833 -30677 -370 -10138 -56851 -43459
1824 -43459 -66222 -55202 -29743 -39903 -36687 -7189 4996 -5210 9578 24032 9863 -17374
$$ packed form
1918e4592M3359J517l1856J4564L20L17O633o715o220K3772J0677k1509o147K024
1904b3856J530N951j456j4873J9594j4093K8414m497R065p508k6543K4343m437
1891h366j1757l6542n061j7517J6373J5648P17l274r182N037K7625q364k8900
1878f3563j0061j4632K98M0455J220r962j0515K7351K5904K2603L2327j6723k5306
1865f04j0436k3162J3780K4637r756j0L887l3912P065J0059R43j7824J0181K9496
1851D344J8404k7936r536L571J7195j1452J4589j1614o885J9390j7066L793j7457
1838b0660M729o861K0864K27j890J3000j4761l0489O008q44L0307r768m6713J3392
1824d3459k2763J1020K5459j0160L216K9498J2185j0206J4788J4454j4169k7237
$$ plain form
1812 -17374 -19185 21922 31648 23909 15088 61633 34415 21504 34006 47418 12609 -25737 4148
1799 4148 23750 28006 -21398 -17952 -10463 -8954 -18967 -11456 -38388 -39041 -85 2473 6469 2785
1785 2785 -17397 -13863 -2470 -32674 -53449 -36387 1116 2492 14846 25787 -13377 -23993
1773 -23993 -20857 20130 23393 -19714 -34632 -56875 -68975 -36217 -29054 -34605 -36813 13796 -14319
1760 -14319 -4000 -3245 -44600 -49364 -38740 -41989 -156 3139 1062 -3938 -16312 -15030 -4063
1747 -4063 -20919 -16693 23127 -3435 -13851 4521 -1949 -22317 -63180 -32049 -36219 -47385 -4735
1734 -4735 5558 9586 11436 45513 49548 14337 3646 -6287 -14761 -22639 -48400 -38717 -9992
1721 -9992 -2029 19219 -15365 1878 34626 30765 44363 20228 9371 -14963 20504 -11843
$$ packed form
1812a7374j811M1107R726p739q821M6545k7218j2911J2502J3412l4809l8346K9885
1799D148J9602M256m9404L446P489J509j0013P511k6932o53L8956K558L996l684
1785B785k0182L534J1393l0204k0775J7062L7503J376J2354J0941l9164j0616
1773b3993L136M0987L263m3107j4918k2243j2100L2758P163n551k208N0609k8115
1760a4319J0319P55m1355m764J0624l249M1833L295k077n000j2374J282J0967
1747d063j6856M226L9820k6562j0416J8372o470k0368m0863L1131m170j1166M2650
1734d735J0293M028J850L4077M035l5211j0691r933q474p878k5761R683K8725
1721i992P963K1248l4584J7243L2748l861J3598k4135j0857k4334L5467l2347
$$ plain form
1709 -11843 -16429 410 3503 -2228 -6035 3069 18725 5378 5464 234 7224 5487 -14924 -65129
1695 -65129 -64806 -69045 -38384 -170 22970 -26615 -5473 36913 39950 35104 -9048 -28542 -49121
1682 -49121 -50980 -53588 -26611 -24760 -11928 -26255 -7110 -4280 -1661 4099 5436 -1664 -30718
1669 -30718 -10130 -10194 -18648 -28314 -22710 -10352 -24292 26328 9646 -16600 -8765 -9981 -30754
1656 -30754 -30249 784 -9929 -14868 -25290 -40730 -26628 -43348 -33863 -21743 -42494 -37164 -52762
1643 -52762 -15534 11558 -11772 -38128 -28860 15923 758 -34989 -23945 10729 43962 33713
1631 33713 30604 -24359 -82411 -42398 -30421 -29699 -43790 -56934 -42148 -11800 -13192 -5447 1547
1618 1547 -373 -17259 642 1164 8575 -7772 -20527 -17223 -20257 -41133 -43252 -18321 -37657
$$ packed form
1709a1843m586J6839L093n731l807R104J5656j3347Q6n230O990j737k0411n0205
1695f5129L23m239L0661L8214K3140m9585K1142M2386L037m846m4152j9494k0579
1682d9121j859k608K6977J851J2832j4327J9145K830K619N760J337p100k9054
1669c0718K0588o4q454r666N604J2358j3940N0620j6682k6246P835j216k0773
1656c0754N05L1033j0713m939j0422j5440J4102j6720R485J2120k0751N330j5598
1643e2762L7228K7092k3330k6356R268M4783j5165l5747J1044L4674L3233j0249
1631C3713l109n4963n8052M0013J1977P22j4091j3144J4786L0348j392P745O994
1618A547j920j6886J7901N22P411j6347j2755L304l034k0876k119K4931j9336
$$ plain form
1605 -37657 -13254 29658 -3276 -43378 -27898 -19711 9007 25175 -10149 -1625 31920 2286
1593 2286 -11301 3616 13048 15474 16738 4938 20263 22006 -5637 -43405 -30200 -23212 -11854
1580 -11854 -22267 11998 -6318 24652 20087 -13914 -19866 -17967 -15415 -8885 -28209 7813 11918
1567 11918 17965 20023 13362 17576 -20330 -38475 -31389 -5164 -16509 -14467 -70006 -44508 -39864
1554 -39864 -33352 -4530 -21276 5492 16219 -30371 -16080 -44887 -53250 -61316 -39911 12091
1542 12091 5883 -19509 -23839 -33792 3083 12036 3998 35954 58157 36188 7086 7696 19167
1529 19167 13698 13475 -9903 -29880 -59742 -42702 -50473 -41868 -32512 -23093 -22463 -18476 -20347 -2280
1515 -2280 43044 30356 2086 -5015 -26976 -30016 -7964 -2448 9567 -25394 10133 5827 31974
$$ packed form
1605c7657K4403M2912l2934m0102J5480Q187K8718J6168l5324Q524L3545k9634
1593B286j3587J4917R432K426J264j1800J5325J743k7643l7768J3205O988J1358
1580a1854j0413L4265j8316L0970m565l4001n952J899K552O530j9324L6022M105
1567A1918O047K058o661M214l7906j8145P086K6225j1345K042n5539K5498M644
1554c9864O512K8822j6746K6768J0727m6590J4291k8807q363q066K1405N2002
1542A2091o208k5392m330r953L6875Q953q038L1956K2203k1969k9102O10J1471
1529A9167n469k23k3378j9977k9862J7040p771Q605R356R419O30L987j871J8067
1515b280M5324j2688k8270p101k1961l040K2052N516J2015l4961L5527m306K6147
$$ plain form
1502 31974 46520 24179 1794 -23232 -1869 -751 -24560 -16129 35 17940 -10542 17451
1490 17451 35901 13944 -21543 -21976 -21827 -43208 -7019 -37530 -18262 -3689 -17245 -12224 -4672
1477 -4672 38383 8120 29771 25186 -7702 18651 -15979 -11255 -6654 -17326 -14610 -45334 -24091
1464 -24091 21798 -5772 4618 -5207 -14510 -17653 13581 18514 870 -9179 -11777 12999 9131
1451 9131 6774 -6571 -7960 4023 8717 1058 22990 28818 -9216 -26063 -27837 -15890 -10452
1438 -10452 13420 -9949 -19412 7685 26365 35516 30787 31887 22831 40472 28773 16925 -9800
1425 -9800 -18694 -7614 11236 12101 54645 39513 22057 -20163 -54694 -22777 1203 -12574 -22743
1412 -22743 4267 -23255 -54294 -5072 -929 -15821 -12585 -32498 -25736 -11154 7829 34573
$$ packed form
1502C1974J4546k2341k2385k5026K1363J118k3809Q431J6164J7905k8482K7993
1490A7451J8450k1957l5487m33J49k1381L6189l0511J9268J4573j3556N021P552
1477d672M3055l0263K1651m585l2888K6353l4630M724M601j0672K716l0724K1243
1464b4091M5889k7570J0390r825r303l143L1234M933j7644j0049k598K4776l868
1451I131k357j3345j389J1983M694p659K1932N828l8034j6847j774J1947N438
1438a0452K3872k3369r463K7097J8680R151m729J100r056J7641j1699j1848k6725
1425i800q894J1080J8850Q65M2544j5132j7456m2220l4531L1917K3980j3777j0169
1412b2743K7010k7522l1039M9222M143j4892L236j9913O762J4582J8983K6744
$$ plain form
1400 34573 27897 19599 51451 59969 23111 25421 13784 15634 54334 24637 9817 22102 -7595
1387 -7595 -7006 33911 35369 9951 4747 -10777 -49422 -14864 9701 22400 37707 35276 44533
1374 44533 58601 8413 -7988 37654 3210 3221 -7189 -6445 6288 14432 6908 31309 37621
1361 37621 -21655 -11890 -5004 20990 19405 34492 39553 40181 13941 -13167 10873 -9256 -33549
1348 -33549 -36768 -8739 288 1911 4731 3346 15619 -13487 22734 25769 -33122 -40430 -12787
1335 -12787 516 14155 2455 18161 11375 -28265 6989 21877 -3989 -5686 5426 32275
1323 32275 -43 -26746 -43021 -48716 -9156 -22822 -52303 -34864 -33494 -14783 364 -38737
1311 -38737 -22954 23956 21664 -5341 -26804 -34239 -51412 -21363 17952 4118 -4547 -21053
$$ packed form
1400C4573o676q298L1852Q518l6858K310j1637J850L8700k9697j4820J2285k9697
1387g595N89M0917J458k5418n204j5524l8645L4558K4565J2699J5307k431R257
1374D4533J4068n0188j6401M5642l4444J1j0410P44J2733Q144p524K4401O312
1361C7621n9276R765O886K5994j585J5087N061O28k6240k7108K4040k0129k4293
1348c3549l219K8029R027J623K820j385J2273k9106L6221L035n8891p308K7643
1335a2787J3303J3639j1700J5706o786l9640L5254J4888k5866j697J1112K6849
1323C2275l2318k6703j6275n695L9560j3666k9481J7439J370J8711J5147l9101
1311c8737J5783M6910k292k7005k1463p435j7173L0049L9315j3834q665j6506
$$ plain form
1299 -21053 -6975 29348 27465 3998 47055 18452 -5031 13612 21229 10218 7927 33506
1287 33506 17156 7441 1437 28536 60515 27122 10365 -1837 -2735 7015 22607 16096 -5750
1274 -5750 -920 -10834 5433 2817 -4389 -10102 7503 4118 -1102 -20338 -10020 16494 11842 23452
1260 23452 4055 6838 14537 8182 -17166 -13577 -10310 -14592 -5679 -27846 -26968 16660 38348 30213
1246 30213 -7185 -9382 18163 61062 44068 11662 26461 28475 12728 2375 12562 20175
1234 20175 24045 -8569 17527 35581 22747 46847 66543 33516 5248 -27145 -16546 -8504
1222 -8504 -29967 -11712 -8568 -3609 -11836 -9577 -45705 -2363 13166 -10973 -5892 41804 48857
1209 48857 11679 -1826 -9488 3553 -2284 -13839 -28594 -34772 -21331 2269 16933 13472 -14835
$$ packed form
1299b1053J4078L6323j883k3467M3057k8603k3483J8643P617j1011k291K5579
1287C3506j6350r715o004K7099L1979l3393j6757j2202q98R750J5592o511k1846
1274e750M830r914J6267k616p206n713J7605l385n220j9236J0318K6514m652J1610
1260B3452j9397K783P699o355k5348L589L267m282Q913k2167Q78M3628K1688q135
1246C0213l7398k197K7545M2899j6994l2406J4799K014j5747j0353J0187P613
1234B0175L870l2614K6096J8054j2834K4100J9696l3027k8268l2393J0599Q042
1222h504k1463J8255L144M959q227K259l6128M3342J5529k4139N081M7696P053
1209D8857l7178j3505p662J3041n837j1555j4755o178J3441K3600J4664l461k8307
$$ plain form
1196 -14835 -16513 -12159 3554 25145 17212 -5487 25789 12993 32894 22327 -8499 -13701 30703
1183 30703 20932 9963 -1105 -6609 -1332 -13629 24250 20869 45234 20280 -24457 -32758 -43594
1170 -43594 -22270 25048 -16550 16776 23490 -15877 -19487 -2786 38833 25727 35367 37891 6151
1157 6151 22882 30969 46406 42591 27950 18083 -9654 -15266 6577 11420 2539 21571 -23856
1144 -23856 -53640 -6789 11303 -15580 -16973 -14630 -32483 -7579 -10892 -80 20682 -27068
$$ packed form
1196a4835j678M354J5713K1591p933k2699L1276j2796J9901j0567l0826n202M4404
1183C0703r771j0969j1068n504N277j2297L7879l381K4365k4954m4737q301j0836
1170d3594K1324M7318m1598L3326O714l9367l610J6701M1619j3106R640K524l1740
1157F151J6731Q087J5437l815j4641r867k7737n612K1843M843q881J9032m5427
1144b3856k9784M6851J8092k6883j393K343j7853K4904l313J0812K0762m7750
$$ [...]
##END NTUPLES=NMR SPECTRUM
##END=
