##TITLE=1H_CA-9319-4
 200.13MHz, CDCl3,
 8 sc
 
 13.2.2025
##JCAMPDX= 6.0         $$ Bruker NMR JCAMP-DX V2.0
##DATA TYPE= NMR SPECTRUM
##DATA CLASS= NTUPLES
##ORIGIN= UXNMR, Bruker Analytische Messtechnik GmbH
##OWNER= pz
$$ XWIN-NMR		Version 3.5
$$ Thu Feb 13 14:36:18 2025 Russian Standard Time (UT+4h)  she@DPX200
##.OBSERVE FREQUENCY= 200.1313
##.OBSERVE NUCLEUS= ^1H
##.ACQUISITION MODE= SIMULTANEOUS
##.ACQUISITION SCHEME= undefined
##.AVERAGES= 8
##.DIGITISER RES= 18
##SPECTROMETER/DATA SYSTEM= spect
##.PULSE SEQUENCE= zg30
##.SOLVENT NAME= CDCl3
##.SHIFT REFERENCE= (INTERNAL, CDCl3, 0, 15.4803)
##AUDIT TRAIL= $$ (NUMBER, WHEN, WHO, WHERE, WHAT)
$$ ##TITLE= Audit trail, XWIN-NMR		Version 3.5
$$ ##JCAMPDX= 5.01
$$ ##ORIGIN= Bruker BioSpin GmbH
$$ ##OWNER= she
$$ F:/spectra/data/she/nmr/H-C/1/pdata/1/auditp.txt
$$ ##AUDIT TRAIL=  $$ (NUMBER, WHEN, WHO, WHERE, WHAT)
(   1,<2025-02-13 14:32:36.81 +0400>,<she>,<DPX200>,
      <created by zg, POWCHK disabled, PULCHK disabled
       configuration hash MD5:
       00 E9 B6 7A A2 85 ED C7 34 08 36 98 17 FE 4E 26
       data hash MD5: 16K
       EC 24 34 2E D6 69 DF 20 CF 9E 36 2E DE 7C 59 58>)
(   2,<2025-02-13 14:32:52.15 +0400>,<she>,<DPX200>,
      <Start of raw data processing
       efp BC_mod = 2 LB = 0.25 FT_mod = 6 PKNL = 1 PHC0 = -470.5685 PHC1 = 16.59221 SI = 16K 
       data hash MD5: 16K
       EA 46 8D 1D 7D AF A5 BB 98 23 0A 9B 78 BE 47 B4>)
(   3,<2025-02-13 14:33:28.20 +0400>,<she>,<DPX200>,
      <pk PHC0 = -153.0618 PHC1 = -7.200003 
       data hash MD5: 16K
       D1 DE B2 B7 74 92 8A 3A FA 11 79 FF 7D 1F A0 52>)
(   4,<2025-02-13 14:33:35.01 +0400>,<she>,<DPX200>,
      <abs ABSG = 5 
       data hash MD5: 16K
       3A 97 B6 F4 96 0F C5 94 06 FF EE 44 EE CA 0E B0>)
(   5,<2025-02-13 14:35:10.78 +0400>,<she>,<DPX200>,
      <abs ABSG = 5 
       data hash MD5: 16K
       D6 91 98 76 BB 67 6D 31 86 BD C7 A6 32 AF 14 D1>)
(   6,<2025-02-13 14:35:43.31 +0400>,<she>,<DPX200>,
      <abs ABSG = 5 
       data hash MD5: 16K
       15 4D 1E 53 EE 8A 3B AD 55 2E F0 46 4F 93 C8 F6>)
$$ ##END=
$$ 
$$ hash MD5
$$ 84 13 5D 64 D7 07 AC AD DA FC CB 6A 88 98 00 44
##$RELAX= 
##$RELAX= 
##$RELAX= 
##$RELAX= 
##$RELAX= 
##$RELAX= 
$$ Bruker specific parameters
$$ --------------------------
##$DU= <F:/spectra>
##$EXPNO= 1
##$NAME= <H-C>
##$PROCNO= 1
##$TYPE= <nmr>
##$USER= <she>
##$AMP= (0..31)
100 100 100 100 100 100 100 100 100 100 100 100 100 100 100 100 100 100 
100 100 100 100 100 100 100 100 100 100 100 100 100 100 
##$AQSEQ= 0
##$AQ_mod= 1
##$AUNM= <au_zg>
##$AUTOPOS= <>
##$BF1= 200.13
##$BF2= 200.13
##$BF3= 200.13
##$BF4= 200.13
##$BF5= 200.13
##$BF6= 200.13
##$BF7= 200.13
##$BF8= 200.13
##$BYTORDA= 1
##$CFDGTYP= 0
##$CFRGTYP= 5
##$CHEMSTR= <none>
##$CNST= (0..31)
1 1 145 1 1 1 1 1 1 1 1 1 1 1 1 1 1 1 1 1 1 1 1 1 1 1 1 1 1 1 1 1 
##$CPDPRG= <>
##$CPDPRG1= <>
##$CPDPRG2= <>
##$CPDPRG3= <>
##$CPDPRG4= <mlev>
##$CPDPRG5= <mlev>
##$CPDPRG6= <mlev>
##$CPDPRG7= <mlev>
##$CPDPRG8= <mlev>
$$ [...]
##$SUBNAM3= <"">
##$SUBNAM4= <"">
##$SUBNAM5= <"">
##$SUBNAM6= <"">
##$SUBNAM7= <"">
##$SUBNAM8= <"">
##$SUBNAM9= <"">
##$SW= 18.0517328524113
##$SWIBOX= (0..15)
0 0 2 0 0 0 0 0 0 0 0 0 0 0 0 0 
##$SW_h= 3612.71676300578
##$TD= 16384
##$TD0= 1
##$TE= 0
##$TE2= 300
##$TE3= 300
##$TEG= 300
##$TL= (0..7)
0 120 120 120 120 120 120 120 
##$TP= (0..7)
150 150 150 150 150 150 150 150 
##$TP07= 0
##$TPNAME0= <>
##$TPNAME1= <>
##$TPNAME2= <>
##$TPNAME3= <>
##$TPNAME4= <>
##$TPNAME5= <>
##$TPNAME6= <>
##$TPNAME7= <>
##$TPOAL= (0..7)
0.5 0.5 0.5 0.5 0.5 0.5 0.5 0.5 
##$TPOFFS= (0..7)
0 0 0 0 0 0 0 0 
##$TUNHIN= 0
##$TUNHOUT= 0
##$TUNXOUT= 0
##$USERA1= <user>
##$USERA2= <user>
##$USERA3= <user>
##$USERA4= <user>
##$USERA5= <user>
##$V9= 5
##$VALIST= <valist>
##$VCLIST= <CCCCCCCCCCCCCCC>
##$VD= 0
##$VDLIST= <DDDDDDDDDDDDDDD>
##$VPLIST= <PPPPPPPPPPPPPPP>
##$VTLIST= <TTTTTTTTTTTTTTT>
##$WBST= 1024
##$WBSW= 4
##$XGAIN= (0..3)
0 0 0 0 
##$XL= 0
##$YL= 0
##$YMAX_a= 433523
##$YMIN_a= -358744
##$ZGOPTNS= <>
##$ZL1= 120
##$ZL2= 120
##$ZL3= 120
##$ZL4= 120
##$ABSF1= 15.48025
##$ABSF2= -2.571599
##$ABSG= 5
##$ABSL= 3
##$ALPHA= 0
##$AQORDER= 0
##$ASSFAC= 0
##$ASSFACI= 0
##$ASSFACX= 0
##$ASSWID= 0
##$AUNMP= <proc_1d>
##$AZFE= 0.1
##$AZFW= 0.1
##$BCFW= 0
##$BC_mod= 2
##$BYTORDP= 0
##$COROFFS= 0
##$CY= -3
##$DATMOD= 1
##$DC= 0
##$DFILT= <>
##$DTYPP= 0
##$F1P= 0
##$F2P= 0
##$FCOR= 1
##$FTSIZE= 16384
##$FT_mod= 6
##$GAMMA= 0
##$GB= 0
##$INTBC= 1
##$INTSCL= 3.241238e-09
##$ISEN= 128
##$LB= 0.25
##$LEV0= 0
##$LPBIN= 0
##$MAXI= 10000
##$MC2= 0
##$MEAN= 0
##$ME_mod= 0
##$MI= 1.114404
##$NCOEF= 0
##$NC_proc= -6
##$NLEV= 6
##$NOISF1= 3.799351
##$NOISF2= 2.8
##$NSP= 0
##$NTH_PI= 0
##$NZP= 0
##$OFFSET= 15.48025
##$PC= 1
##$PHC0= -623.6303
##$PHC1= 9.392208
##$PH_mod= 1
##$PKNL= yes
##$PPARMOD= 0
##$PSCAL= 0
##$PSIGN= 0
##$REVERSE= no
##$SF= 200.130008293954
##$SI= 16384
##$SIGF1= 3
##$SIGF2= 2
##$SINO= 0.751879
##$SIOLD= 32768
##$SREGLST= <19F.Aceton>
##$SSB= 0
##$STSI= 16384
##$STSR= 0
##$SW_p= 3612.71676300578
##$SYMM= 0
##$S_DEV= 0
##$TDeff= 16384
##$TDoff= 0
##$TI= <>
##$TILT= no
##$TM1= 0
##$TM2= 0
##$TOPLEV= 0
##$USERP1= <user>
##$USERP2= <user>
##$USERP3= <user>
##$USERP4= <user>
##$USERP5= <user>
##$WDW= 1
##$XDIM= 16384
##$YMAX_p= 317771761
##$YMIN_p= -238064
$$ End of Bruker specific parameters
$$ ---------------------------------
##NTUPLES= NMR SPECTRUM
##VAR_NAME=  FREQUENCY,     SPECTRUM/REAL,   SPECTRUM/IMAG
##SYMBOL=    X,             R,               I
##VAR_TYPE=  INDEPENDENT,   DEPENDENT,       DEPENDENT
##VAR_FORM=  AFFN,          ASDF,            ASDF
##VAR_DIM=   16384,         16384,           16384
##UNITS=     HZ,            ARBITRARY UNITS, ARBITRARY UNITS
##FACTOR=    0.220516191357247, 1,           1
##FIRST=     3098.06263265541, 0,            0
##LAST=      -514.654130350371, 0,           0
##MIN=       -514.654130350371, -238064,     0
##MAX=       3098.06263265541, 317771761,    0
$$ Real data points
##PAGE= N=1
##DATA TABLE= (X++(R..R)), XYDATA
$$ [...]
9902 3463729 3613476 3819875 4047538 4307466 4567619 4859354 5198535 5506845 5896300 6279431
9892 6279431 6680548 7113247 7642801 8201680 8775150 9386250 9969640 10558079 11212403 11832999
9882 11832999 12547324 13312487 14130804 15038177 15930186 17004702 18196348 19532593 21000482
9873 21000482 22681550 24643513 26995685 29901043 33309474 37414507 42157782 47361347
9865 47361347 52776704 57639622 61126626 62591120 61913081 59786222 57103922 54720016
9857 54720016 53162152 52662029 53254711 54863869 57162146 59623699 61251537 61055413 58642558
9848 58642558 54369071 49032812 43460098 38137357 33394708 29322374 25862450 22934635
9840 22934635 20524899 18546248 16875554 15440293 14166537 13087789 12122280 11235850
9832 11235850 10473200 9808731 9267749 8798491 8381726 7960867 7607542 7300577 6970810
9823 6970810 6641734 6288284 5958088 5668872 5407185 5153520 4943409 4719878 4526498 4324554
9813 4324554 4106247 3925152 3796940 3606803 3457157 3340635 3208655 3087763 3006966 2912888
9803 2912888 2800644 2724603 2656393 2568486 2530091 2453086 2393459 2347808 2317204 2275269 2236877
9792 2236877 2207337 2184590 2127115 2067114 2040775 2031150 1958344 1942625 1936093 1928456 1930365 1914949
9780 1914949 1873630 1842365 1845197 1820392 1795658 1751952 1719423 1660117 1657629 1651776 1627458 1598721
9768 1598721 1541490 1515247 1525899 1552323 1553600 1490181 1507467 1522770 1517462 1510860 1496395 1497877
9756 1497877 1506916 1478077 1511047 1545525 1547107 1512429 1491013 1490785 1535039 1528233 1482696 1465299
9744 1465299 1462652 1479100 1475886 1515062 1516477 1539354 1534094 1524603 1502447 1502431 1511866 1549249 1555760
9731 1555760 1559635 1582311 1611141 1645782 1685449 1656963 1683031 1732233 1756686 1788210 1799308 1824922
9719 1824922 1886265 1917779 1929252 1963014 1970954 2006967 2052584 2112972 2160362 2185986 2231415 2265799
9707 2265799 2331052 2386281 2429241 2532023 2620641 2693524 2742778 2833156 2905935 2952923 3037757
9696 3037757 3103795 3176558 3287155 3394195 3534390 3685848 3819331 4003790 4210811 4383248
9686 4383248 4611441 4855356 5061728 5294709 5590348 5891944 6253020 6635555 7038931 7482191
9676 7482191 7924833 8458844 9019557 9575703 10171794 10816472 11487410 12244134 13036805 13859769
9666 13859769 14724551 15606640 16534585 17633560 18825581 20138601 21672153 23371514 25293999
9657 25293999 27537162 30160352 33148203 36546030 40241936 44116159 47808074 51083858
9649 51083858 53884619 56427157 58921506 61656856 64550559 67256073 69131957 69562617
9641 69562617 68430527 66094979 63035199 59936548 56958833 54103548 51182982 47836013
9633 47836013 44060843 40007424 35918162 32021007 28484233 25396096 22687029 20357641
9625 20357641 18426543 16758346 15338689 14164066 13134219 12213326 11416367 10682211 10047180
9616 10047180 9449911 8910469 8409000 7926471 7497499 7104068 6721432 6381504 6047969
9607 6047969 5764054 5469510 5216816 4948227 4698296 4480711 4288333 4077287 3875519 3731905
9597 3731905 3573876 3404096 3278176 3126945 3007353 2863874 2726345 2630306 2560914 2478896
9587 2478896 2349831 2270661 2240895 2168112 2074434 1970963 1887325 1831751 1760163 1733688 1709212
9576 1709212 1652320 1621138 1610282 1549094 1511980 1500062 1448380 1413496 1361805 1349648 1338596
9565 1338596 1277305 1241951 1229159 1201982 1199541 1216347 1190071 1189353 1152411 1133211 1113940 1106186
9553 1106186 1109258 1083157 1090514 1084580 1103105 1125482 1168117 1167389 1154860 1174478 1169734 1167719 1128373
9540 1128373 1128350 1099097 1077342 1059086 1035331 1012293 962121 902328 845626 791503 760250 752889
9528 752889 710142 693463 657631 643842 640357 620937 603334 567820 526685 486769 525233 537741
9516 537741 506706 504839 515635 490055 473144 482705 445918 461197 478349 472385 436938 412567
9504 412567 452862 451488 434982 434545 463809 460209 404713 374358 367024 334129 323689 366113 313588
9491 313588 325715 344473 372480 377046 343938 360606 336869 321373 364218 347488 323477 322112
9479 322112 318326 326257 329619 317801 320624 325766 315460 324484 337012 351232 326985 307674 325358
9466 325358 357672 344065 349074 367897 374824 389702 382205 367087 358804 368199 410211 457424 468703
9453 468703 445410 457469 465780 482019 508541 517858 533387 599685 609719 570673 596152 571204
9441 571204 573931 549410 533943 555096 546247 562659 539667 539457 534765 562190 569855 526427 523735
9428 523735 515764 486725 471098 446446 434587 411070 386766 377864 350534 343594 326599 311661
9416 311661 293792 300430 283864 264495 281614 260674 281429 274424 270211 283308 328590 308407
9404 308407 346066 387996 385655 384000 412878 469488 541973 551761 525525 495424 469967 393440
9392 393440 364847 352032 311321 276275 246409 225235 241229 252238 237108 214909 193474 252308
9380 252308 261668 224135 216819 211090 200694 211000 240119 241219 240920 226263 181161 210546 197828
9367 197828 187697 188693 190871 177174 191703 206381 211559 213266 208791 201997 215066 201177 206516
9354 206516 224538 196585 216761 227684 219757 216326 227246 245652 262060 287066 285320 272490
9342 272490 253322 238615 264321 271482 262144 276693 295484 348450 328359 288596 284064 306596
9330 306596 279865 300463 317582 357105 356192 346398 316709 315175 320417 350615 392448 386293 378185
9317 378185 385403 350384 329614 372042 374382 369955 359755 370771 371258 348749 323082 349174 395310
9304 395310 393447 353156 343725 333302 337277 336282 355412 376564 390839 399976 370017 362473 371359
9291 371359 367737 329551 343836 326929 339233 342427 327761 363990 379227 355801 349151 344012
9279 344012 346992 355378 320875 308114 290430 292004 298007 290748 279650 294387 266182 236693 241431
9266 241431 253813 269995 247405 198040 183505 199461 221141 219819 218518 240156 260157 283793
9254 283793 258581 234889 237548 257385 284809 295401 323895 374187 369202 366608 351482 352874
9242 352874 369988 417980 446141 417457 434452 434923 445045 459223 462986 468016 437128 405824
9230 405824 401176 400006 369821 327618 313572 297456 295717 302394 301995 260628 246053 201180 210566
9217 210566 202788 222746 244799 243282 203247 187894 188956 203195 177739 170655 181827 177360 174097
9204 174097 159365 143754 153898 130582 133659 150102 148591 147847 150626 130884 148670 167869 180842
9191 180842 169574 138264 131125 152684 179503 137212 109277 109277 166962 148545 113690 114321 114208
9178 114208 148234 155177 154625 132500 156286 147425 155111 139700 138213 128337 122076 197233 191607
9165 191607 178857 139994 156880 174303 184225 212549 229340 248404 241894 266586 276184 249423
9153 249423 258494 230764 230484 244712 286028 306788 283295 269117 293910 305667 271569 264106
9141 264106 257256 294229 332264 325652 348192 308801 299541 290620 274859 305055 334784 308695
9129 308695 296285 317420 326704 325128 364761 379149 377898 373668 363313 322089 332345 363978
9117 363978 377587 405140 419250 394715 383989 413436 431277 397275 340091 342421 377812 338217
9105 338217 377212 396355 372061 393643 417302 474037 490479 494674 515146 527621 518416 543746
9093 543746 583262 556765 542359 540759 491473 494960 502988 484713 446167 443664 463647 443233
9081 443233 413313 428317 469367 435206 424435 437562 431919 416275 449978 428491 457226 428310
9069 428310 440977 466651 445424 469283 498567 506678 506852 471897 469567 511191 542507 537682 566473
9056 566473 628634 637915 614242 599093 631567 644794 633898 635742 659807 611526 607271 611779
9044 611779 601490 590521 582620 577415 568922 539278 545599 587851 573741 581290 574204 529521 559650
9031 559650 578473 560271 524021 532459 541709 557522 574087 590564 587145 625263 652766 685017
9019 685017 667612 671302 669577 689012 706702 737950 750031 764242 754197 798295 811611 843305
9007 843305 868331 891784 899826 882427 907864 931483 960983 990978 969207 994669 1021750 1048291
8995 1048291 1065342 1065039 1092158 1111485 1149131 1168073 1207199 1277536 1310048 1298534 1329039 1380660
8983 1380660 1454340 1524837 1551477 1565763 1613982 1635683 1648014 1680238 1694447 1752788 1774907
8972 1774907 1827546 1909841 2008459 2084817 2206527 2326459 2441139 2605852 2770677 2890906
8962 2890906 3089850 3286354 3499646 3742835 3987581 4230449 4463671 4774925 5089931 5425377
8952 5425377 5802830 6166230 6584646 7074471 7762263 8297449 8635244 9068867 9576233 10236723
8942 10236723 10926108 11666187 12384878 13121898 13821465 14618928 15519641 16728366 18138599
8933 18138599 19861345 21836465 24327868 27592649 31945039 37219292 43303933 50665474
8925 50665474 59548764 66536847 69791537 67443367 60394311 52517573 44706497 37779790
8917 37779790 32154913 27572167 23488358 20241173 17711963 15688525 14040959 12675143
8909 12675143 11442929 10408531 9500845 8747023 8116991 7585771 7144224 6736880 6405343
8900 6405343 6107899 5767630 5529847 5298332 5036080 4828216 4624370 4394796 4227763 4020743
8890 4020743 3888780 3754744 3652150 3539078 3419657 3345988 3241806 3169115 3078968 3004037
8880 3004037 2928035 2836183 2795012 2768574 2736980 2710100 2642525 2576806 2511090 2431300 2356726
8869 2356726 2305277 2230162 2155089 2115471 2085739 2048785 2004471 1945197 1879125 1877645 1851154 1821326
8857 1821326 1804074 1779650 1786209 1775275 1763122 1777008 1778478 1790697 1741312 1745507 1752028 1751585 1759616
8844 1759616 1766368 1802554 1788548 1802353 1804928 1822022 1839454 1880887 1924429 1989440 2002325 1974219
8832 1974219 2011307 2051447 2052486 2032526 2052623 2047091 2041382 2063492 2063688 2047455 2050072 2004960 1984425
8819 1984425 1987933 1951646 1952933 1933653 1894479 1888816 1916588 1926332 1920798 1968164 1977587 1950780 1922678
8806 1922678 1954904 1971512 1976812 1954214 1992324 1997782 1978123 2029309 2102179 2098662 2162194 2215589
8794 2215589 2258308 2301638 2321992 2342826 2390101 2444495 2500586 2540671 2552372 2623830 2664365
8783 2664365 2741213 2855838 2902573 2973219 3084467 3200148 3317308 3437469 3595733 3740673
8773 3740673 3952181 4138061 4317124 4498331 4721687 4949645 5195198 5465843 5746281 6080645
8763 6080645 6483216 6858972 7252374 7678393 8103691 8563812 9068277 9584020 10096461 10606593
8753 10606593 11153301 11735974 12387084 13144173 14012091 15008056 16197654 17645230 19401861
8744 19401861 21523484 24106332 27211366 30780564 34710925 38621398 41863479 43923842
8736 43923842 44307733 43109280 40538875 37120302 33521492 30077181 27059202 24515212
8728 24515212 22365216 20676427 19379895 18412972 17683445 17183375 16870868 16661604 16601990
8719 16601990 16641926 16752523 16915953 17220157 17583907 18014966 18526044 19076997 19776477 20567288
8709 20567288 21552273 22794683 24336653 26241260 28582856 31489923 35046670 39268314
8701 39268314 44046653 49246897 54141965 57921478 59813990 59421783 56857901 52475101
8693 52475101 47192914 41760244 36701154 32163311 28203149 24929380 22152433 19875659
8685 19875659 17983134 16427963 15081749 13942579 12950563 12091701 11331441 10700005 10148357
8676 10148357 9684224 9229954 8841206 8471132 8130867 7830995 7511677 7254423 6997629
8667 6997629 6741008 6521886 6372394 6202723 6051536 5916397 5828108 5707557 5609702 5513279
8657 5513279 5397969 5342334 5318312 5231528 5177948 5159293 5116522 5068124 5047981 5055604 5028212
8646 5028212 5001623 4968852 4960127 4968845 4971063 4954521 4993213 5042861 5017699 5073838 5167238 5218172
8634 5218172 5280430 5342699 5367430 5357230 5408011 5409529 5411353 5474471 5536867 5599004 5684761 5807275
8622 5807275 5893313 6028723 6165696 6357315 6497628 6644671 6848717 7075346 7294482 7554567
8612 7554567 7839906 8113684 8460807 8810838 9161545 9521725 9930743 10369969 10859423 11373625
8602 11373625 11951882 12520559 13180318 13931662 14645666 15403211 16236738 17165107 18133647
8593 18133647 19129397 20220378 21369160 22607081 23990897 25572484 27300713 29246806
8585 29246806 31543237 34204769 37304812 40876653 44951647 49590414 54471887 59324688
8577 59324688 63780262 67152678 69113586 69884829 69821872 69575359 69780636 70811525 72895722
8568 72895722 75776836 78975817 81657734 83057312 82815528 80854436 77352177 72747318
8560 72747318 67486457 61991215 56498164 51223680 46518344 42481985 39024609 36208142
8552 36208142 33940754 32053926 30587380 29484444 28636297 28041185 27640805 27420600 27413899
8543 27413899 27550864 27799490 28209771 28737236 29369034 30134553 31043564 32108280 33264664
8534 33264664 34527387 35985005 37681601 39631104 41942912 44648731 47842615 51603141
8526 51603141 55967929 60903828 66350015 72005384 77482243 82298711 86048850 88706238
8518 88706238 90338460 91563365 92858772 94510338 96790350 99781338 103032250 105721398
8510 105721398 107059777 106411368 103963875 100487723 96668569 92978058 89675330 86730283
8502 86730283 84362862 82398596 80473979 78222156 75302136 71669901 67565521 63228014
8494 63228014 58889647 54832025 51212651 48071199 45511641 43457884 41834041 40683502
8486 40683502 39872606 39430016 39368577 39619241 40218829 41276293 42724888 44636419 46961587
8477 46961587 49650563 52540868 55456977 58241137 60855934 63154197 64854638 65739491
8469 65739491 65805571 65279140 64448316 63550660 62717502 62025730 61420588 60787033 59954528 58609751
8459 58609751 56601624 53982103 51009196 47942280 44790020 41540845 38201206 34889709
8451 34889709 31755346 28904496 26362816 24148342 22247303 20557750 19136403 17885409
8443 17885409 16769710 15804379 14918624 14133290 13385416 12686013 12104347 11598937 11119402
8434 11119402 10692058 10288477 9943529 9617101 9313477 9044883 8783672 8526279 8295895
8425 8295895 8083720 7859543 7693257 7524475 7358726 7193939 7068474 6947746 6828129 6785685
8415 6785685 6682893 6626013 6613088 6610552 6594747 6589403 6613604 6679721 6720260 6730650 6803047 6893977
8403 6893977 7007385 7116805 7223545 7394923 7556539 7770857 8044522 8317991 8609906 8964582
8393 8964582 9441046 9984766 10609510 11433777 12422754 13544169 14858159 16249429 17613547
8384 17613547 18667461 19165077 19066748 18529926 17864452 17239492 16786159 16609556 16615279 16869804
8374 16869804 17184420 17437169 17428839 16918646 15968150 14830077 13705703 12577206 11594158
8365 11594158 10759057 10046931 9507641 9073112 8755586 8477342 8272424 8165139 8065981 8063371
8355 8063371 8104115 8201508 8369930 8611577 8970430 9452422 10043377 10705925 11462130 12255818
8345 12255818 12859150 13173205 13142854 12846181 12387935 11926613 11584012 11406182 11432678 11584739
8335 11584739 11838221 12068918 12088110 11793592 11124977 10271232 9403970 8547524 7773368 7151736
8325 7151736 6615351 6128880 5719161 5448394 5168908 4945899 4746289 4552658 4398894 4222186
8315 4222186 4076486 3917640 3781325 3625344 3465608 3331754 3242135 3142310 3058328 3002416
8305 3002416 2928651 2843208 2750367 2639271 2537982 2468599 2413547 2334017 2281303 2246418 2203924
8294 2203924 2140654 2108131 2111950 2047494 2023396 1988621 1922056 1914050 1887887 1885884 1855315 1813227
8282 1813227 1791638 1815557 1786830 1751174 1735847 1722783 1751510 1740445 1761664 1760510 1786885 1814553
8270 1814553 1845648 1901854 1908381 1893531 1873757 1856041 1783065 1683992 1643336 1569358 1528382 1479254
8258 1479254 1443044 1403703 1308216 1291368 1250233 1214260 1193534 1145799 1091199 1075456 1068090 1069407
8246 1069407 1080907 1069711 1057577 1039839 1046064 1057796 1065368 1057330 1012431 1015919 1004682 1001675
8234 1001675 1024591 1040404 1026868 992881 972673 990250 1002808 968138 968691 984487 987884 962383
8222 962383 957774 960994 964600 979278 988549 1000673 968978 929117 910753 928018 935519 884252 882172
8209 882172 886253 859190 831515 870469 875299 843098 828529 791944 785112 763586 787109 776504
8197 776504 728242 735637 740218 735322 836877 903734 786349 719219 638837 624403 641339 579918
8185 579918 544531 543158 521101 534944 510537 520673 513767 474908 499222 476020 476550 470778 496418
8172 496418 475094 467342 494754 516429 539674 542598 572321 607767 577912 575994 579912 570671 611573
8159 611573 659109 647735 645723 627404 658604 646586 652280 685843 662461 649579 674523 676499
8147 676499 650604 675667 646216 621478 613851 642563 624267 604871 632722 636324 634320 626021
8135 626021 608557 620789 614628 572077 574481 602443 571121 542550 534570 541098 528444 472962
8123 472962 494965 509985 497874 506955 519240 516468 499840 499523 532378 559578 538999 550843
8111 550843 566902 556376 558613 545129 565564 618038 647087 639412 600852 599335 595764 662581
8099 662581 691621 689796 665499 695601 711274 722710 738071 742662 740179 757255 819001 821145
8087 821145 818827 833377 875755 918528 977663 991410 1019870 1055494 1113175 1164425 1266983 1433700
8075 1433700 1623514 1790442 1989846 2199774 2373609 2443037 2366115 2204471 2013200 1795989
8065 1795989 1566382 1355108 1189036 1024095 934732 816828 753651 727756 645552 608327
8055 608327 558417 529943 492981 464176 411807 392213 402326 396260 329333 354688 339411 296150
8043 296150 266708 271821 245696 255097 241737 214312 238230 226939 218802 225257 234585 197908 203356
8030 203356 184416 158072 145772 183610 196071 171320 184560 167230 188660 201811 165956 176013
8018 176013 155794 182925 223635 173656 130126 149824 138689 122332 128728 125316 126768 80677
8006 80677 93046 107682 157989 144436 108763 76132 62648 81571 49731 44527 75416 100361
7994 100361 96360 55690 17066 36380 41337 59355 39951 81929 109195 110461 104184 94141
7982 94141 88706 101823 73747 79804 76451 61053 59588 74353 79156 54805 54299 71280 35393
7969 35393 14051 22729 44326 41469 17470 -8680 -20992 19406 13760 12302 -23899 -35131 -37273
7956 -37273 -19678 -12073 6229 6519 -21352 -37348 -19754 -15801 -1609 25802 -4949 -30418 -28092
7943 -28092 -17754 -10797 33381 39821 20899 16640 -7718 -47602 -30594 -15335 -31936 -47545
7931 -47545 -42031 -14621 -52454 -59997 -45298 -73197 -29538 -21164 -33845 -13703 -5014 -52383 -35686
7918 -35686 -23610 -44642 -49654 -38129 -50704 -50084 -32664 -85337 -32931 2082 -16280 -36809
7906 -36809 -37844 -36873 -40892 -36987 -40370 -42741 -37611 -13136 -37143 -76963 -25550 -16067 -14411 -22512
7892 -22512 -23222 -14771 -40257 -18147 -16297 -38569 -36500 -26096 -34110 -57054 -50748 -77440 -71863
7879 -71863 -52160 -29161 -57140 -49215 -34369 -42908 -61199 -68926 -57329 -81620 -59282 -52218 -48721
7866 -48721 -58054 -62221 -59668 -51635 -54635 -60603 -86146 -89599 -105446 -110937 -63994 -62574 -52738 -63682
7852 -63682 -61603 -46505 -75303 -57755 -59395 -67726 -75947 -61506 -24912 -25202 -48842 -67222 -72499
7839 -72499 -62092 -79701 -81525 -74684 -69951 -72373 -75052 -53546 -50876 -50147 -45762 -18789 -18586 -17054
7825 -17054 -30242 -62634 -73331 -73040 -97960 -49033 -37002 -55669 -59251 -37682 -12899 -17253 -10200
7812 -10200 8352 38134 63031 58567 59458 -166640 -238064 -112335 -141944 -143621 -133613 -136032
7800 -136032 -121610 -116356 -107080 -101400 -119626 -107036 -89414 -66847 -58432 -77949 -87989 -96927 -118735
7787 -118735 -119665 -100520 -107970 -124315 -81863 -105575 -114076 -112716 -86878 -111989 -94472 -75105 -112653
7774 -112653 -114383 -88399 -92381 -76926 -115796 -128188 -109248 -114578 -122522 -138290 -97086 -101087 -120369
7761 -120369 -125917 -135327 -127766 -93347 -66905 -96960 -121002 -146740 -144926 -132852 -139715 -118759 -92277
7748 -92277 -93032 -125870 -119397 -94932 -103609 -98099 -120849 -105945 -78949 -104184 -107004 -71612 -49480
7735 -49480 -42500 -26171 -64709 -89136 -101857 -83022 -44091 -80683 -60425 -57022 -84762 -88020
7723 -88020 -100269 -87699 -109899 -141355 -134489 -140165 -133139 -128426 -143579 -147375 -138138 -89595 -51813
7710 -51813 -72319 -118833 -113187 -68343 -78976 -95068 -130891 -133262 -124587 -139989 -84593 -90604 -68725
7697 -68725 -67989 -95925 -92884 -116671 -111276 -50173 -27702 -49340 -94717 -104350 -94607 -77245 -55679
7684 -55679 -50863 -58541 -64032 -81197 -133135 -89572 -55309 -97265 -83462 -88740 -93293 -80448 -54498
7671 -54498 -81292 -73543 -42770 -31852 -14283 -13616 -46796 -42822 -40808 -77036 -57301 -29039 -38104
7658 -38104 -17798 -51529 -61788 5808 6903 27975 42668 43385 31087 -518 -1607 -4628 -23217
7645 -23217 2090 -11822 -52768 -69518 -34244 -19184 -23941 -67206 -83724 -51816 -72152 -64158
7633 -64158 -53810 -35603 -26612 -41704 -43092 -54900 -60797 -70481 -70041 -68091 -38183 -19428 -75287
7620 -75287 -51621 -50817 -27525 -14135 -33353 -30939 -53420 -32284 -23465 -40642 -47261 -30469 -37512
7607 -37512 -62911 -60051 -46491 -18048 -33552 -40347 -36215 -39573 -4499 12970 -28703 -29457 -28855
7594 -28855 -19160 -47487 -70127 -62753 -44744 -24170 -22542 -32538 -44069 -55877 -14226 5020 31007
7581 31007 21034 7433 10787 555 24447 9424 49161 52175 85165 73835 74156 99965 121170
7568 121170 109306 107402 124839 125816 140000 169772 127309 103331 96158 66753 68817 50334 13648
7555 13648 22370 31300 19811 -12402 14238 10560 7174 2575 4722 4126 6152 11946 -9415 8712
7541 8712 -7894 19427 60485 24422 58086 63623 91608 97550 89875 111863 116642 98966 63627
7528 63627 79204 91922 75044 35287 3014 3351 16036 -6115 -15484 -24945 -24353 -24257 -23645 -20792
7514 -20792 -26180 -5383 3837 2592 -17710 -12723 -27908 -38687 -19306 -28804 -32345 -20799 -24031
7501 -24031 -26070 -29657 -11271 15421 -13692 -24879 -1250 8676 -29560 -36380 -49133 -65584 -51361
7488 -51361 -20129 -16097 49689 73871 55554 45572 47011 36292 42525 27558 10385 -1282 1860
7475 1860 3951 -46773 -55912 -60017 -74724 -74863 -56261 -21671 -56312 -50180 -63768 -65565 -77672
7462 -77672 -61784 -41002 -71089 -62434 -29155 4718 -15966 -19301 17977 43346 21557 18050
7450 18050 5735 -22163 -55310 -61550 -45233 -65222 -44065 -40915 -95657 -91960 -59155 -100616
7438 -100616 -79961 -80823 -68947 -89649 -109702 -78598 -84018 -93025 -80785 -83124 -94587 -99039 -87306
7425 -87306 -91191 -93124 -80147 -88792 -106441 -120364 -124221 -137563 -118062 -166233 -146990 -119495 -87705
7412 -87705 -59394 -102598 -121087 -132489 -130164 -91029 -79036 -47259 -63245 -102254 -115922 -140127
7400 -140127 -130972 -110347 -113755 -90130 -68091 -81567 -80792 -87997 -115392 -133148 -116734 -127918 -151346
7387 -151346 -129187 -118757 -113478 -84847 -78749 -76527 -73897 -79327 -71457 -73098 -78232 -78782 -57520 -61145
7373 -61145 -85275 -96659 -94632 -102915 -74949 -54542 -63311 -73333 -71727 -55828 -68964 -110031 -99615
7360 -99615 -106666 -101215 -78883 -103688 -90403 -102381 -113643 -82889 -74064 -108243 -135799 -83370
7348 -83370 -78741 -91388 -85462 -54961 -81325 -77268 -62079 -106788 -77768 -63867 -104219 -80604
7336 -80604 -65595 -61100 -56421 -54500 -48794 -84735 -57995 -44787 -51369 -52178 -46008 -55286 -75054 -96946
7322 -96946 -66637 -36796 -53833 -41229 -44005 -64802 -46404 -71537 -67199 -26844 -41138 -36327
7310 -36327 -18568 -14478 -45875 -59967 -72609 -76957 -91014 -52619 -45990 -94807 -95764 -90604 -96474
7297 -96474 -97052 -107518 -89369 -85675 -70958 -68004 -67843 -72003 -76765 -22638 -51387 -84913 -52968
7284 -52968 -43673 -8500 22413 9474 41014 81095 95374 51626 17733 14378 24332 19579 4016
7271 4016 10375 -3653 -4954 -11037 -14728 722 -38851 -42801 -46626 -20480 -61 18665 -18758
7258 -18758 -37235 -23711 5802 46075 57782 82190 54645 9374 41975 20773 30472 8861
7246 8861 -1447 25349 18888 50633 86783 96307 129055 89342 85021 102622 119886 136425 108257
7233 108257 112266 158832 121483 103613 157161 135522 139910 108009 96249 94877 90108 104060
7221 104060 70034 32071 32668 20324 24140 15296 24157 12816 28906 12744 -22237 -14188 13040
7208 13040 37397 70904 79167 87526 88155 78362 97520 117001 174292 169919 145294 152955 154818
7195 154818 142964 117895 104967 101694 132880 139948 136988 103920 100528 105123 64089 36709 77710
7182 77710 83754 74627 57802 27276 30063 59396 20925 18056 38973 40569 34777 23874 69473
7169 69473 97727 97814 97743 91821 89152 112500 108110 66270 52314 58968 44063 64410 87378 89190
7155 89190 89744 93174 85918 104815 120534 128523 123404 105970 85526 65845 72492 78218 51283
7142 51283 42053 6563 -8141 -40980 -65948 -58476 -33465 34733 5614 -18564 -24553 -36671
7130 -36671 -42596 -51382 -39773 -19189 -15694 -296 1543 12786 10711 -10495 -24773 2454 52985
7117 52985 68103 52152 71564 91921 88509 29471 -1265 -2032 -27277 -16966 -24083 4321 20899
7104 20899 8521 -14797 -25574 -23034 -35553 -7899 8953 5209 -9088 -41854 -6113 -5248 -39726
7091 -39726 -63799 -77350 -81332 -42001 -1447 -40061 -47361 -26864 -4166 -6208 -47776 -8774
7079 -8774 -26635 -47372 -29648 1784 -52731 -40685 8164 -6126 29103 33158 7764 -1403
7067 -1403 44364 -1847 -15318 1008 -19677 -48263 -15949 12722 50452 16141 -15832 1719
7055 1719 -27903 -38488 -7842 15902 5712 -35323 -24823 -9017 -18804 -20176 -28131 -15958 -4181
7042 -4181 2264 -15704 -13273 -32179 -14519 9048 25402 24131 -10382 -12802 7876 17285 35921
7029 35921 25521 80835 88623 73117 79853 88058 82425 80124 69901 76154 75817 66756 19714 2912
7015 2912 25732 30657 -7749 -19740 -38926 -31111 -32220 -83336 -62051 -47951 -48472 -56303 -59476
7002 -59476 -40111 -41820 -38163 -48604 -40062 -34079 -20939 7699 -12306 -24133 -31158 -381 -372 4734
6988 4734 -6451 15651 21175 2804 -4273 -26347 -34713 -49491 -82631 -68751 -46234 -56691 -47699
6975 -47699 -43454 -28210 -40296 -120923 -86946 -72150 -69291 -84525 -82384 -73226 -91927 -63925 -86440
6962 -86440 -89239 -30048 -32844 -63328 -75556 -42134 -74591 -87884 -57817 -48559 -22408 -10944
6950 -10944 -15934 -39222 -54886 -73535 -109233 -72677 -66180 -73331 -39035 -21364 -39924 -27258
6938 -27258 5840 -30736 -50949 -45576 -16802 10697 7288 -3084 -7172 -32522 3126 -2284 -24482
6925 -24482 -69665 -61967 -31967 -41428 -32439 -53401 -51044 -51549 -54984 -52654 -63310 -72768 -70073 -52575
6911 -52575 -8052 5113 -22434 -29407 -21463 -34561 -19948 -4940 -25577 -42131 -17100 -26031
6899 -26031 -72517 -80136 -86493 -78812 -46016 -58025 -68555 -52316 -80905 -84716 -98565 -97337 -60743
6886 -60743 -61423 -82187 -70803 -28247 -8138 -916 2490 9086 996 -8158 -37981 -51862 -36999
6873 -36999 -72401 -90021 -75968 -26465 -34486 -70413 -30887 -29850 -9672 -31051 -39333 -6401
6861 -6401 -26579 -57435 -71798 -61531 -52089 -64669 -61811 -57621 -77094 -55041 -74516 -73096 -61785
6848 -61785 -55427 -54044 -35008 -18770 4975 -38021 -27056 -31331 -33767 -12021 -36570 -17993 -31928
6835 -31928 -46737 -43935 -36628 -35230 -35558 -49966 -73798 -41374 -48728 -63122 -57362 -80393 -65432
6822 -65432 -81313 -99157 -77272 -43571 -25973 -57553 -48495 -45362 -10607 26568 -10004 -28626
6810 -28626 12462 -18986 -25394 8146 -11267 -31236 -30661 -25050 -50026 -22362 27940 30878 2702
6797 2702 -22817 -37353 -16893 6080 705 -14898 -14871 -45696 -12394 23268 -6125 -33662 -10792
6784 -10792 31253 13076 -8743 -34149 -35400 -20271 -33381 8110 -26567 -22421 -37155 -22044
6772 -22044 -15695 -24420 -26876 -37059 -32361 -14665 -12450 -20394 -10854 -35228 -36737 -20821 -31737
6759 -31737 -10681 6026 -23217 -56498 -55964 -44111 -76207 -69872 -43152 -54901 -44608 -19477
6747 -19477 -27325 -37197 -24168 -33739 -55800 -28313 -20588 -20396 -45680 -18322 -15165 -13541 -45042
6734 -45042 -12144 -20115 -48176 -43200 -72680 -46186 -46962 -26772 -48408 -21309 -17571 967 13520
6721 13520 14988 2738 -16850 -9421 -19997 -33659 -984 -21602 -40320 -33210 -33627 -25616 -46505
6708 -46505 -22317 35724 32642 22933 11309 12273 39967 34282 27132 21578 45859 44295 23575
6695 23575 15284 37461 1468 35293 27255 15909 9491 18430 22626 6706 -7818 -9550 -5234
6682 -5234 -12170 21965 7452 3945 11740 8948 28829 -15791 -35136 4648 24084 33109 34456
6669 34456 43352 20125 4514 -5156 -8168 18221 -13697 7315 12022 6887 -14597 -821 21552
6656 21552 17203 36133 25574 35100 30461 43764 27047 -12069 25760 16368 13028 27651 20812
6643 20812 35950 17937 12376 -4074 21966 17145 43720 49872 39913 -1329 -14693 10680 13399
6630 13399 44057 40653 38638 35527 57914 19218 7515 38696 35706 31211 14047 13034 35329
6617 35329 42460 26979 28009 15626 53176 72261 89808 59801 48715 65511 74378 59426
6605 59426 26849 48935 46409 39061 58429 67584 80804 61010 51652 75509 78969 52418 28328
6592 28328 49973 60831 45973 73064 25059 12943 37689 17533 27498 30678 38922 32918 25832
6579 25832 28603 49610 74986 73519 65482 83445 63902 47350 75126 108717 95433 72596
6567 72596 61083 100910 57995 78360 105748 94973 122055 101098 93253 98506 121917 127200
6555 127200 144571 140203 117487 110210 110924 134030 128165 113479 110932 125925 140176 122201 134148
6542 134148 155426 138110 129255 143808 144444 141214 141051 154369 134579 103677 121477 106865 97225
6529 97225 109358 111623 134808 152668 142724 166464 179822 187031 194323 187423 191732 153712 153867
6516 153867 165305 173097 190791 205194 189130 151698 151761 177977 182317 183430 184020 169728 146245
6503 146245 163287 205045 196843 201680 188139 187318 168680 168907 208721 199561 183508 209294 225731
6490 225731 212584 212733 218379 221436 223658 223995 201430 217077 193043 214828 246870 214703 218045
6477 218045 277480 291688 275379 274118 299763 320720 324102 311210 319845 332368 306876 323262
6465 323262 339093 303396 268540 263671 279053 297811 272165 283187 265338 229956 236039 265262
6453 265262 263185 289015 301411 298619 298274 317437 333633 352704 393607 392940 409452 389372 369310
6440 369310 382110 366287 327511 354248 339438 296740 301722 307404 320681 319193 292098 302320
6428 302320 287653 262782 262445 269697 258771 261767 282220 261956 261995 269159 302552 297767 272137
6415 272137 292203 302168 279846 246420 279459 321632 304193 286931 264711 292874 350772 380267
6403 380267 393256 373967 371062 388928 345745 337830 342526 323092 325498 370802 374420 368132 389037
6390 389037 420118 424211 429291 401568 400780 439803 445425 460104 460777 439028 462481 467733 457706
6377 457706 481660 514425 514314 537970 556699 529090 539937 504428 439771 445598 473528 494102
6365 494102 489450 477108 491038 525696 531895 504048 530135 501561 524058 564587 574285 588098
6353 588098 609482 593296 590178 639649 662706 636311 680270 692038 654578 668279 668487 644357
6341 644357 618010 578623 596528 577216 589094 592691 564248 550816 547622 547017 532014 553071
6329 553071 569252 536518 504862 533457 534215 519297 496215 484294 506013 499739 475394 477723
6317 477723 453789 442960 453403 467691 491247 466680 442097 466128 491265 499809 475266 471434
6305 471434 502823 501266 464335 471701 472639 467814 454580 486028 506467 466194 438263 461642 481138
6292 481138 470875 508180 527644 487657 471111 453551 460704 429877 423197 473899 477183 490683
6280 490683 496093 517690 519470 495338 529199 553190 540227 525524 523150 538366 546060 551318 550265
6267 550265 574947 578610 552019 555348 594368 549103 551765 562309 592786 608058 616909 628577
6255 628577 629465 617869 602358 620152 620928 623968 617845 668632 641821 639332 651604 644463 653333
6242 653333 667737 657379 678529 689387 703612 672674 697632 715062 719724 741467 766961 735568
6230 735568 719154 754156 774153 787427 793958 809330 819507 816778 826463 850087 885126 854632
6218 854632 817839 850266 869742 909219 926604 901108 876994 881029 886542 936067 938391 990537
6206 990537 989238 1040387 1084231 1114286 1134648 1149504 1131452 1139197 1184062 1187663 1207969 1224005
6194 1224005 1218738 1236678 1288562 1310925 1326619 1309361 1347112 1378283 1389798 1443009 1497922 1516084
6182 1516084 1545721 1560029 1598390 1661376 1692048 1705275 1731154 1779554 1798207 1835601 1835420 1895804
6170 1895804 1914126 1927912 1923548 1928966 1958914 1949062 1953557 1968353 2005145 2017346 2095795 2129144
6158 2129144 2128163 2192555 2246600 2274237 2340253 2440540 2544248 2552803 2565891 2614254 2660926 2693924
6146 2693924 2718611 2777471 2808290 2844201 2868986 2907963 2972321 3022961 3059219 3062079 3138192 3196206
6134 3196206 3251502 3301114 3387461 3483715 3549504 3671988 3747725 3897710 4043462 4216563 4376642
6123 4376642 4496325 4684996 4886701 5141743 5409108 5614255 5775260 5830752 5842553 5835096
6113 5835096 5797759 5759189 5783206 5830165 5838463 5949747 6071952 6222056 6377780 6541604 6719822
6102 6719822 6946714 7223686 7504816 7750217 8019464 8336476 8702538 9111251 9512947 9923060
6092 9923060 10386830 10845687 11350494 11902853 12499389 13116863 13805198 14538798 15339691 16130606
6082 16130606 16930507 17797726 18729906 19744642 20870420 22151932 23610326 25275315 27060745
6073 27060745 29015644 31131174 33400967 35706214 37993470 40138241 41936586 43271038
6065 43271038 44037320 44223121 43883819 43155428 42232101 41240528 40293002 39422679 38674321
6056 38674321 38105086 37767705 37605120 37655889 37948765 38424943 39143638 40119293 41337043
6047 41337043 42805674 44596171 46758220 49278580 52196846 55485833 59175244 63196347
6039 63196347 67530767 71873618 75958480 79419829 81843707 82761798 82037174 79781458
6031 79781458 76361112 72233386 67772519 63339627 59075431 55149863 51639675 48532753
6023 48532753 45862234 43581421 41711271 40121918 38860945 37899884 37193370 36789156 36636538
6014 36636538 36723321 37004279 37536093 38329674 39336663 40506392 41780146 43112482 44356831
6005 44356831 45325113 45869474 45768030 44996478 43541280 41568469 39269027 36752117 34159465
5996 34159465 31644370 29239852 27016267 24936965 23074139 21364894 19808900 18484248
5988 18484248 17282808 16170627 15193525 14299221 13499315 12759330 12130239 11535487 10981664
5979 10981664 10464546 10027568 9620309 9231556 8872540 8500666 8172886 7906595 7646738
5970 7646738 7386665 7132333 6963578 6783065 6632673 6462185 6282213 6128695 5983325 5907163
5960 5907163 5760371 5582141 5470303 5394627 5331952 5226765 5062846 5052630 4975349 4880660
5950 4880660 4784428 4723339 4674064 4560563 4533001 4471770 4442876 4407389 4365794 4320555 4294450
5939 4294450 4245853 4217941 4223473 4185879 4191981 4209336 4208498 4185600 4174854 4184518 4210752 4212749 4235280
5926 4235280 4226420 4232514 4219162 4245427 4332955 4366057 4398182 4435095 4510221 4570170 4581137 4601862
5914 4601862 4626614 4675248 4702723 4696262 4666008 4661189 4668379 4673574 4688360 4702938 4702069 4712312 4680306
5901 4680306 4707064 4680450 4658536 4643728 4690121 4750520 4774521 4800706 4893969 4949532 5021509
5890 5021509 5070865 5117791 5201527 5242338 5302629 5310683 5339125 5394014 5469389 5495820 5599478
5879 5599478 5679188 5720393 5774942 5831240 5927871 6029089 6067017 6154238 6253808 6372803 6493789
5868 6493789 6615285 6726200 6823608 6912024 7033972 7145442 7284132 7421023 7563479 7775288
5858 7775288 8000966 8240759 8435662 8641025 8846380 9053960 9307934 9526302 9699733 9885358
5848 9885358 10126730 10370932 10624983 10937178 11266989 11616617 12048038 12548882 13082092 13685815
5838 13685815 14365758 15048257 15798044 16658345 17602135 18637367 19735224 20922457 22146465
5829 22146465 23444123 24799355 26233488 27809857 29498040 31301028 33249039 35381894
5821 35381894 37826004 40563932 43461634 46166996 48660364 51340127 54365237 57767920
5813 57767920 61511672 65441893 69516591 73751295 78342750 83531270 89597998 96745902
5805 96745902 105140450 114917406 126633322 141013629 158908675 180595734 205841200
5798 205841200 234508387 265901812 295253277 314587628 317771761 303279192 277341477
5791 277341477 247518253 218056630 191425612 168508125 148962416 132577857 119296408
5784 119296408 108569524 99795434 92616801 86765241 81978924 78169499 75207369 72891386
5776 72891386 71051919 69692112 68871208 68674278 69135739 70212432 72001998 74687259 78470752
5767 78470752 83630114 90365828 98588977 108239434 119180737 129749746 136866396 137970212
5759 137970212 132087781 121482237 109170186 96815976 85479363 75571051 67018215
5752 67018215 59675466 53512331 48421749 44182740 40581362 37463993 34682020 32190692
5744 32190692 30030774 28146571 26477474 25013877 23722941 22624221 21621342 20695004
5736 20695004 19807385 18999810 18249484 17549176 16904063 16337828 15809958 15259559 14726126
5727 14726126 14287980 13850150 13409574 13035761 12664251 12325457 12034046 11699158 11425845
5718 11425845 11157069 10896476 10706730 10480294 10282896 10075850 9857900 9677407 9513368
5709 9513368 9375268 9217037 9107151 8971311 8876535 8737513 8671902 8626803 8587543 8570235
5699 8570235 8577348 8535777 8576332 8627170 8648638 8709068 8744011 8758708 8791511 8774452 8742662 8745451
5687 8745451 8721455 8751638 8780084 8837917 8835089 8855147 8848220 8859211 8878548 8888390 8937594 8951124
5675 8951124 8985413 9048582 9130318 9251482 9329135 9434253 9567890 9741583 9892721 10086860
5665 10086860 10298003 10479469 10701890 10923577 11165550 11447762 11722430 12051038 12418861
5656 12418861 12764818 13165230 13588864 14032897 14539276 15049843 15675979 16363246 17025999
5647 17025999 17782487 18623340 19491251 20455007 21465461 22570153 23742342 24967153 26272987
5638 26272987 27683040 29182891 30848295 32589272 34463214 36452129 38558213 40849225
5630 40849225 43320726 46008302 48884873 51996096 55387206 59102701 63145621 67600957
5622 67600957 72451545 77729033 83428696 89514311 95946816 102618378 109373447 116139729
5614 116139729 122769471 129158249 135206334 140651749 145192307 148541183 150448134 150806091
5606 150806091 149785587 147732905 144898923 141541271 137853167 133861670 129606979 125221145
5598 125221145 120838745 116425111 111969469 107436548 102760521 97893738 92941965 87889531
5590 87889531 82790885 77780096 72850709 68037924 63450815 59103414 54950322 51072153
5582 51072153 47476753 44208190 41183731 38400933 35901980 33660607 31585558 29691450
5574 29691450 27951387 26407697 25000165 23699598 22491032 21364186 20346476 19387890
5566 19387890 18508369 17702682 16939873 16241623 15595037 14994977 14397819 13797079 13206213
5557 13206213 12694279 12193962 11689564 11217650 10779192 10407275 10020941 9658233 9343131
5548 9343131 9011866 8696554 8424317 8173002 7902835 7655171 7472501 7303604 7088471 6902385
5538 6902385 6729945 6567779 6403992 6254767 6132969 6016478 5924702 5836310 5783002 5697952
5528 5697952 5604996 5449852 5314020 5171203 5035230 4911816 4821142 4720310 4629441 4538162
5518 4538162 4443280 4401758 4331115 4247765 4233913 4182132 4107105 4028844 3959815 3928035 3848432
5507 3848432 3803155 3784213 3739855 3684857 3629697 3633197 3605536 3568818 3536678 3498308 3476998 3457253
5495 3457253 3410548 3368815 3303602 3204947 3165742 3154164 3140632 3080595 3039892 3035557 3011866 2965646
5483 2965646 2939008 2947331 2948923 2947943 2983319 2999133 3011916 3038648 3076925 3142820 3213322 3314557
5471 3314557 3448778 3536635 3617532 3678897 3626863 3482273 3339159 3151508 2977460 2846857
5461 2846857 2721306 2602469 2498038 2382293 2307929 2266785 2218541 2166245 2112878 2078780 2052858
5450 2052858 2052124 2047559 2032310 1990293 1956516 1981345 1987828 2035558 2028887 2019055 2053204 2101778 2130293
5437 2130293 2172551 2194844 2178601 2196939 2170039 2124994 2060756 2010597 1943015 1895317 1825663
5426 1825663 1784288 1729417 1687418 1635114 1609847 1603986 1593317 1579124 1543821 1546294 1501133 1497097
5414 1497097 1464330 1439648 1440990 1392494 1390445 1413958 1407277 1397115 1404140 1372554 1383086 1401786
5402 1401786 1361397 1325559 1311239 1286541 1293990 1290802 1256516 1244968 1252553 1228769 1205792 1210640
5390 1210640 1173289 1168902 1178095 1155264 1151380 1163982 1169673 1150975 1105943 1090292 1084496 1120446
5378 1120446 1110202 1087683 1100512 1111527 1078074 1082171 1089530 1083962 1047043 1044166 1101974 1086908
5366 1086908 1068112 1117429 1140692 1121286 1082203 1063366 1086251 1101856 1108329 1089683 1091612 1081466
5354 1081466 1074473 1084508 1131148 1117491 1121952 1102926 1096709 1096699 1085471 1098557 1085107 1061263 1080496
5341 1080496 1061193 1030257 1031542 1073036 1065058 1030510 1073730 1059018 1070447 1119069 1116925 1116567
5329 1116567 1120731 1143841 1144966 1160260 1157065 1174600 1172701 1193082 1239792 1275684 1269385 1260330 1297607
5316 1297607 1315575 1348288 1369909 1397484 1406092 1396340 1438702 1500476 1512916 1555984 1615399 1678121
5304 1678121 1697901 1670703 1701122 1740948 1784112 1814677 1836414 1893165 1933849 1970469 2011318
5293 2011318 1980077 1936038 1884251 1823160 1786678 1712167 1674639 1613002 1577299 1537391 1494804
5282 1494804 1430845 1369342 1328887 1301881 1292204 1280525 1212296 1214807 1212788 1149577 1148429 1144057
5270 1144057 1099949 1084358 1077832 1080518 1047651 1035003 1055204 1064829 1075387 1053824 1066052 1090798
5258 1090798 1087950 1090704 1097988 1102992 1114896 1136710 1144096 1169584 1148082 1152582 1142587 1072026 1087803
5245 1087803 1096906 1079871 1077009 1023703 1025219 1009044 981651 986409 979048 1003913 979368 979729 967688
5232 967688 936899 917553 932741 935438 933853 918863 882794 927959 928979 916616 910976 917703 940593
5219 940593 943827 950593 915101 900322 904923 860534 828856 813953 811849 805420 778676 779631 772654
5206 772654 746867 738185 778878 768103 791005 800016 801890 827377 803683 817172 862853 841192
5194 841192 854091 864877 869087 882606 874227 867591 847505 865993 912130 910843 859458 857489 862440
5181 862440 834999 856724 840235 834197 840209 838585 850206 848649 821523 801819 799484 827454 847715
5168 847715 857924 891602 904398 892597 866927 886506 911260 872657 901273 892464 905206 932613
5156 932613 930440 909886 898360 922037 882025 896923 923535 924753 927394 961134 962076 962266 1003092
5143 1003092 1007575 1024322 1029524 1050683 1082917 1108300 1136368 1100827 1102419 1139810 1151743 1155753
5131 1155753 1135266 1168206 1193792 1223344 1281762 1268790 1278386 1309532 1335047 1337959 1340486 1377733
5119 1377733 1375763 1408739 1452885 1473452 1497698 1507915 1531139 1529452 1531334 1560506 1606463 1647974
5107 1647974 1658838 1676973 1689972 1709605 1752006 1780698 1808791 1830534 1859739 1900947 1950067
5096 1950067 1971668 2003294 2002808 2046486 2098948 2142565 2181710 2208294 2244764 2302782 2376447 2407758
5084 2407758 2419870 2450506 2467778 2525465 2578489 2627268 2674596 2727661 2749713 2768964 2820252
5073 2820252 2851994 2892981 2965116 3001521 3045305 3086151 3134272 3172808 3216045 3255522 3318232
5062 3318232 3407245 3429880 3459341 3518544 3543307 3606230 3663264 3720971 3769471 3802597 3849866
5051 3849866 3894125 3947212 3993237 4050238 4101114 4202750 4302827 4395785 4472372 4527247 4643383
5040 4643383 4733967 4810124 4920034 5038732 5182533 5283884 5432499 5612034 5777418 5959166
5030 5959166 6150544 6379560 6599642 6822112 7083005 7337505 7646744 7960155 8342907 8698781
5020 8698781 9059071 9488209 9924407 10346276 10820503 11329897 11838735 12417773 13063477 13720081
5010 13720081 14402448 15181610 16003935 16874992 17839716 18821960 19954610 21185136 22564950
5001 22564950 24060193 25689523 27535445 29532986 31671203 33949642 36357197 38805697
4993 38805697 41144542 43269681 45093044 46418640 47270025 47551019 47336333 46733229 45819147
4984 45819147 44765742 43718787 42733216 41870194 41188411 40695896 40461427 40416993 40633934
4975 40633934 41109414 41786373 42688195 43892820 45356322 47114352 49249049 51799944 54750778
4966 54750778 58081017 61806260 65827608 70010688 74047434 77612156 80366948 82006965
4958 82006965 82326678 81284084 79037200 75792207 71919287 67695695 63404727 59268049
4950 59268049 55480349 52076767 49059397 46399280 44121721 42248503 40657808 39333804
4942 39333804 38290078 37538440 36992560 36686259 36615382 36768092 37117381 37696467 38441110
4933 38441110 39333995 40277777 41176641 41958941 42518509 42689850 42369732 41608216 40368911
4924 40368911 38726639 36774666 34675222 32501713 30337638 28284033 26376854 24627043
4916 24627043 23025645 21599649 20322628 19219541 18240701 17373646 16602947 15895682 15236499
4907 15236499 14667285 14124871 13611494 13156271 12774912 12353525 11984917 11639782 11319950
4898 11319950 10956305 10617603 10274712 9952820 9667935 9377403 9107100 8811810 8562009
4889 8562009 8379139 8184408 7976168 7796383 7661129 7511797 7368969 7260040 7158593 7085023
4879 7085023 7001812 6925812 6868059 6833259 6802872 6776036 6667766 6631681 6637415 6634044 6611787 6591206
4867 6591206 6580392 6562734 6588974 6588295 6603645 6637422 6671101 6741848 6763182 6808871 6865773 6886580
4855 6886580 6974165 7083542 7177408 7264259 7341937 7424840 7543093 7678899 7767601 7885690 8032240
4844 8032240 8185853 8343636 8503521 8643991 8824323 8978807 9104811 9244294 9441474 9626706
4834 9626706 9851462 10064687 10272926 10499692 10771431 11064367 11314636 11637743 11980469 12318249
4824 12318249 12652101 13063585 13485091 13937526 14465847 15036113 15598174 16200747 16895829
4815 16895829 17583371 18329531 19149060 20040488 20974011 21987773 22983279 24031148 25073111
4806 25073111 26150008 27277800 28379202 29538591 30709773 31929805 33232024 34599308
4798 34599308 36009660 37517490 39170348 40935333 42812573 44888965 47144991 49470771
4790 49470771 51888221 54416741 56902215 59270354 61434114 63365862 65045402 66467675
4782 66467675 67657550 68722461 69719645 70724634 71812563 72915551 74007934 75093753
4774 75093753 76142859 77123005 77976528 78842576 79833842 81065286 82665894 84693903 87104279
4765 87104279 89880897 93038930 96372802 99653184 102646087 105055726 106621559 107048235
4757 107048235 106339620 104584205 102002241 98870115 95480263 91980670 88481093 85128089
4749 85128089 81992984 79118732 76509255 74194457 72217877 70597630 69373547 68555740
4741 68555740 68113841 67962667 68074233 68357312 68658276 68765655 68571560 67968484 66837138
4732 66837138 65203166 63057294 60609414 57861399 55059743 52273562 49580961 47126943
4724 47126943 44846505 42793005 41006928 39451931 38106811 36941083 35919266 35128345
4716 35128345 34511032 34044674 33719498 33527962 33469085 33551740 33726845 33972036 34315076 34702099
4706 34702099 35103779 35493445 35929964 36292503 36599034 36880107 37034701 37109389 37130601 37102275
4696 37102275 36954842 36774786 36555968 36297263 36036468 35830789 35700606 35636178 35673898 35732375
4686 35732375 35876728 36085476 36325045 36632539 36951804 37218375 37490183 37733976 37923577
4677 37923577 37978893 37924445 37757431 37515845 37237699 36882269 36444693 35965861 35458923 34935399
4667 34935399 34441203 33940394 33489194 33049207 32606919 32230125 31829436 31551257 31309018
4658 31309018 31071740 30957788 30894188 30852144 30852284 30917209 31042938 31244769 31462723 31804709
4648 31804709 32209492 32686142 33236515 33859269 34529722 35266306 36070573 36980947 37965865
4639 37965865 39043812 40251044 41607603 43134479 44709189 46431762 48368689 50517676
4631 50517676 52839310 55305418 57984625 60892069 64010314 67466596 71179521 75149354
4623 75149354 79294906 83645070 88343067 93469049 99136116 105363292 112274768 119890884
4615 119890884 128320132 137805676 148513828 160509274 173908078 188522332 204068485
4608 204068485 220069753 235800953 250732280 264718530 277959752 290413674 301329890
4601 301329890 308878507 310885096 305975875 294008659 276533864 255951818 234408211
4594 234408211 213310686 193659879 175861412 160048417 146202083 134208168 123940063
4587 123940063 115098818 107427575 100799513 95029123 90045772 85798609 82165115 79154644
4579 79154644 76660274 74580588 72902106 71620752 70646148 69964800 69575081 69407816 69411265
4570 69411265 69644722 70027904 70519395 71102471 71708111 72348433 72950234 73419263 73777487
4561 73777487 73985274 74006864 73820113 73470706 73014935 72441885 71831779 71208515 70659685 70240228
4551 70240228 69915590 69801755 69877645 70154318 70678384 71432739 72344085 73463017 74659248
4542 74659248 75915657 77218521 78462511 79544291 80405333 80913944 80980996 80607656 79770137
4533 79770137 78505854 76888048 74975140 72778459 70445720 68045599 65557985 63095902
4525 63095902 60747188 58516120 56429433 54530174 52852215 51355944 50007430 48837370
4517 48837370 47835033 46910405 46066894 45304065 44559480 43784702 42934412 41983609 40951692
4508 40951692 39833819 38659832 37347691 35962111 34532030 33014658 31510220 30015505
4500 30015505 28564218 27122394 25694788 24326760 23034686 21836067 20742675 19698716
4492 19698716 18694858 17768522 16950568 16182291 15472982 14826325 14189115 13671133 13143134
4483 13143134 12641271 12166923 11725634 11317100 10956811 10665615 10344267 10056923 9791859
4474 9791859 9530376 9258409 9018225 8819396 8588445 8364295 8169775 7988946 7812714 7622147
4464 7622147 7424298 7284376 7117825 6929664 6788124 6668399 6546555 6325571 6159784 6073594
4454 6073594 5958293 5832050 5719125 5620536 5527624 5448677 5333460 5258837 5134659 5027630
4444 5027630 4928157 4841335 4767495 4702193 4629086 4584215 4520939 4430187 4391892 4323294 4255710
4433 4255710 4211342 4143927 4081531 4028957 3989681 3968624 3956757 3904818 3828236 3829604 3803494 3763587
4421 3763587 3716054 3710916 3683232 3589982 3567895 3551672 3501021 3469283 3435809 3404599 3363766 3314148
4409 3314148 3253935 3210409 3162893 3123546 3084211 3005102 2956238 2925161 2875807 2852074 2844725 2843478
4397 2843478 2763426 2721019 2680222 2704781 2661292 2617557 2642073 2609259 2560282 2542191 2547826 2536956
4385 2536956 2475051 2425009 2395642 2361034 2373337 2334611 2294796 2292721 2274118 2229367 2182528 2163254
4373 2163254 2157805 2116140 2095273 2058284 2042911 2022278 2001758 2006324 2029892 2003840 1996651 1976564
4361 1976564 1988380 1989860 1984192 1984203 1981305 1996701 2004798 1991539 1951952 1897146 1867921 1864379 1855702
4348 1855702 1842370 1805100 1838724 1821033 1788618 1786532 1788553 1799853 1790275 1745614 1745176 1768037
4336 1768037 1763705 1739678 1721907 1758646 1741092 1748733 1741228 1724084 1710744 1682529 1714606 1727722
4324 1727722 1722525 1737209 1729661 1718443 1744760 1758653 1759422 1789213 1777683 1770756 1811168 1820307 1878975
4311 1878975 1905410 1901630 1945003 2011124 2035091 2102453 2154206 2198580 2302309 2350971 2417094
4300 2417094 2475655 2484612 2533922 2588452 2568468 2555550 2522512 2422931 2329505 2227595 2123549
4289 2123549 2034675 1939760 1858948 1786186 1699440 1650804 1614813 1594142 1560155 1535504 1488460
4278 1488460 1426473 1395523 1388881 1364089 1327597 1334668 1337632 1319471 1280381 1313787 1307671 1296828
4266 1296828 1279118 1243014 1277376 1268734 1260471 1249244 1226101 1189497 1155348 1177726 1182835 1170579
4254 1170579 1175891 1189023 1177702 1169356 1206635 1200264 1155258 1197131 1206368 1170635 1154560 1165505
4242 1165505 1164593 1153584 1139104 1088165 1095374 1095562 1066826 1046471 1055459 1060508 1017364 993914 974061
4229 974061 940056 960366 912063 922248 918621 894483 929672 909262 881246 885862 923643 869989
4217 869989 838034 853013 838044 822883 777328 765862 775425 764644 785879 759541 786201 763055
4205 763055 750320 699255 688109 697582 699932 672253 682158 667058 659705 685719 625222 628876 625522
4192 625522 622915 613684 609850 601548 614815 594775 573269 570018 592190 574572 544985 538541 518668
4179 518668 534451 528642 489195 514922 558993 578000 557201 539108 536253 533310 489894 478916
4167 478916 495900 526978 543764 520007 502503 513836 521931 519975 496537 493363 515112 506417
4155 506417 519407 525349 454952 417142 443370 438545 443789 422021 399188 431372 450777 430993
4143 430993 431826 429346 417516 367434 367556 381484 370065 401489 389258 403755 365334 352586 370384
4130 370384 372051 377983 394708 410117 408269 411362 416859 394945 402757 404450 399591 398533 370598
4117 370598 391272 389655 366187 366875 372572 371252 386357 366345 371147 403574 373746 364673 374972
4104 374972 371981 362927 367138 372050 349582 347615 356697 357272 342644 366746 360359 328009 318302 343506
4090 343506 356547 379788 387483 386889 363889 348079 339605 349780 338954 343108 371004 373452 358473
4077 358473 338034 335531 335847 320034 329431 297801 309904 391307 345555 344360 339075 328445 340564
4064 340564 354245 333752 309817 320622 321905 362015 325098 298533 311748 344442 376929 352166
4052 352166 317387 306609 316182 321152 302159 313654 309146 272382 257892 263013 284207 291864 296940
4039 296940 292887 314934 315064 332087 340836 340136 322599 294948 312780 278462 239646 254439 261369
4026 261369 259410 244225 254911 267437 251801 263439 284293 263346 262077 243057 243243 257361
4014 257361 242756 265393 270939 261538 250708 234786 234507 235556 232112 213013 214407 260762 280316
4001 280316 273079 270825 246435 228779 222328 248983 248517 269296 253528 270999 277072 246634 238777
3988 238777 230080 245906 242249 232215 232596 250473 236569 216500 210560 227836 217890 200994 210592
3975 210592 238657 229362 223470 195571 230435 254163 228610 232451 244671 202587 236109 266613
3963 266613 229727 233367 231278 243771 238293 239336 210678 210330 224759 216772 245101 224786 195432
3950 195432 220006 225199 226387 238351 246990 232071 266748 244320 236961 258559 257777 280693 258034
3937 258034 211375 230235 281331 274314 278042 290333 262258 241809 251003 264230 287683 300239
3925 300239 281214 236831 232326 227024 226908 207405 240644 277921 251816 280739 273195 261154 249222
3912 249222 231824 277162 280359 265060 271001 285112 276813 297802 288966 294769 302383 262533 280793
3899 280793 286490 262532 274284 288370 272061 280437 287245 307820 313453 325453 323112 337242 362098
3886 362098 359113 324282 322657 309553 293852 299692 333016 350356 338100 335497 322716 316290 321159
3873 321159 327259 336314 349867 363560 352213 345457 314341 334203 356694 333593 344113 346480
3861 346480 389958 377854 354134 366343 374035 352513 349439 357703 385173 355256 335835 330278
3849 330278 354467 372492 345186 364181 373958 354750 367152 346103 320318 328656 338563 325908
3837 325908 336783 365542 352573 316532 290503 304871 350031 330557 333973 315772 318457 322268
3825 322268 289995 325771 310626 301364 322464 326216 316061 291807 286189 282301 261869 287501
3813 287501 294771 312486 308381 306501 296832 271778 281483 322216 338306 326952 284790 258387 284824
3800 284824 317362 316044 325222 326706 329590 328414 324782 305313 282353 321141 316677 300798 278120
3787 278120 290702 296054 291634 325195 329191 335150 344204 318649 272485 258184 263803 295230 328540
3774 328540 311210 309017 317758 294573 305002 300530 318101 303644 264366 261338 267257 259139 279598
3761 279598 274720 279891 286693 293104 289997 270199 263519 284969 300111 293085 250469 265750 287840
3748 287840 256407 258290 274909 275788 250074 242173 291284 316585 275335 258108 236452 217519
3736 217519 234781 245611 266010 292858 267765 242974 233008 273178 278991 236768 218698 232328
3724 232328 245132 236488 266520 270927 243112 229133 232563 261187 213168 240805 247621 229533
3712 229533 259679 257721 230074 215338 259768 257506 244128 236840 268596 267839 242966 286599 281121
3699 281121 277258 264407 279271 302376 301762 264999 268064 302072 322421 298973 265782 287052
3687 287052 325346 312302 261354 246041 290939 293657 299474 303554 308253 290664 287819 311942 327802
3674 327802 357458 338573 326141 360795 355073 313044 315114 322279 345565 339227 328455 309855
3662 309855 315142 321252 349017 389824 369506 352126 366019 425341 428162 386271 367153 379036
3650 379036 362525 435004 459651 422710 425661 448056 477716 483166 487047 488886 461835 440771
3638 440771 436127 425695 415954 429812 430716 434183 460290 460834 467865 446596 462811 446004 479225
3625 479225 507633 522616 512862 530864 540238 566377 589411 605294 620136 643308 672887 701124
3613 701124 700504 705568 699656 696381 681955 673968 657694 641640 623314 614314 652991 633735 582006
3600 582006 589245 598230 590374 601072 618552 645633 650146 667398 686367 666991 662329 670432 680765
3587 680765 719079 703220 722897 770972 796172 838440 790124 761678 810427 834287 850850 834769
3575 834769 856404 854263 833352 845560 837061 867637 876201 896912 896565 898200 911934 895971 913069
3562 913069 969518 1023001 1007959 1015968 998036 1019024 1073285 1120193 1148189 1170406 1216981 1216866
3550 1216866 1243960 1263480 1275063 1326353 1326139 1331757 1355215 1366405 1377756 1430484 1543135 1548648
3538 1548648 1576396 1617624 1638308 1705334 1728884 1780339 1820125 1862955 1906517 1934084 1949314
3527 1949314 1923428 1931667 1944122 1894048 1899514 1903243 1893871 1883260 1840242 1842350 1882736 1910035
3515 1910035 1928844 1878428 1868781 1866448 1881914 1907235 1934516 1951693 1940784 1957988 2011638 2041073
3503 2041073 2071357 2120945 2177543 2213280 2255250 2324012 2341335 2387367 2428911 2522439 2621286
3492 2621286 2704678 2797669 2916611 3031836 3127981 3250783 3382265 3505871 3642997 3808408
3482 3808408 3946726 4089702 4260526 4439907 4601114 4764344 4958724 5081360 5102218 5105465
3472 5105465 5076628 4976479 4800639 4595728 4352551 4108717 3890332 3664720 3454043 3293585
3462 3293585 3121338 2946575 2816830 2684198 2532714 2411707 2355301 2257050 2171439 2107307
3452 2107307 2011373 1976812 1914969 1864721 1836166 1776299 1716987 1660383 1599188 1566165 1561116 1503756
3440 1503756 1440872 1419623 1378159 1315431 1289679 1252257 1201553 1153645 1131014 1111680 1104029 1093103
3428 1093103 1036911 997121 1014758 1031712 979707 930146 920122 895278 896666 872932 883367 891047
3416 891047 865882 859446 840705 823514 809190 832487 833521 807115 771733 761673 740611 726053
3404 726053 735438 730614 720967 743728 724905 668400 660313 650495 666591 662781 642301 644177 684498
3391 684498 724271 714321 687583 692157 673198 713217 713855 693548 681813 753772 787241 801473
3379 801473 831547 812316 873378 959288 1018002 1034737 1023453 1002697 969337 959535 909040 869971
3367 869971 863469 796435 774667 775328 764945 762193 749895 741394 735191 719540 711440 742017 752491
3354 752491 737479 767990 797836 821413 849663 948659 980218 1048700 1121721 1212159 1330351
3343 1330351 1442995 1477432 1429956 1359575 1247997 1166977 1066619 1002053 937229 888095 813741
3332 813741 786718 785995 735463 707129 708588 682772 662723 646301 652415 657476 670648 688369 693319
3319 693319 655639 663479 690251 738451 780138 817509 847498 875324 920950 933141 942382 933267
3307 933267 905431 782103 714371 693250 630482 628796 625099 598455 603760 604721 612282 582620 597722
3294 597722 586226 567596 587247 581613 562704 592458 605879 613668 631195 645607 663512 648754
3282 648754 637899 655109 672676 708789 714186 729586 766155 807951 803539 857197 880153 867242
3270 867242 904717 959137 1008172 1052468 1070738 1104631 1181309 1209088 1245142 1328295 1433506
3259 1433506 1516799 1534965 1587830 1629318 1688243 1709179 1713045 1739764 1764808 1762426 1709140 1685425
3247 1685425 1671265 1636326 1681387 1747463 1758695 1775731 1836781 1880755 1913380 1907381 1895788 1965790
3235 1965790 2005719 2004336 2020524 2054979 2091744 2146531 2179696 2275028 2352679 2472719 2597304
3224 2597304 2718717 2854063 3002061 3149987 3284906 3323051 3318216 3297472 3195633 3123166
3214 3123166 3046295 2929547 2847562 2781047 2728540 2683744 2689008 2702315 2762543 2773202 2778840 2799737
3202 2799737 2806519 2781001 2778109 2772295 2728806 2697108 2644294 2599271 2548108 2502986 2507790 2490374
3190 2490374 2503807 2535885 2544969 2599483 2654446 2690260 2701811 2684833 2667915 2618234 2554480 2488665
3178 2488665 2405042 2362408 2359877 2301114 2289126 2321452 2327200 2354967 2374870 2400415 2431564 2475810
3166 2475810 2474801 2500451 2545217 2562232 2533280 2433988 2356511 2266692 2165167 2063505 1957602
3155 1957602 1868205 1830770 1814291 1787936 1793620 1757639 1733502 1780149 1810295 1779850 1802372 1833873
3143 1833873 1827732 1808595 1788777 1802478 1796363 1762756 1736593 1733609 1750509 1781553 1794381 1794269
3131 1794269 1806740 1820147 1805673 1819129 1774007 1713598 1665821 1635992 1595523 1557533 1525302
3120 1525302 1526336 1496875 1449326 1447336 1414882 1437556 1429592 1425175 1383553 1374646 1339269 1323139
3108 1323139 1320935 1298624 1295601 1253267 1226059 1231960 1172834 1147896 1172587 1119540 1096986 1092651
3096 1092651 1066834 1076178 1048195 990600 950265 947963 942289 925936 919183 910104 871680 847107
3084 847107 841705 814156 752974 707890 666535 659649 646724 645000 651834 613437 582324 615048
3072 615048 597495 563000 508011 475011 487202 480572 469116 450650 453879 464573 446897 406023
3060 406023 396442 414232 427643 408735 370391 362387 371684 369255 389928 376415 376156 386685 347984
3047 347984 319502 313159 310709 282860 275712 274710 289134 313060 291126 278337 252231 233336
3035 233336 205833 222580 221643 225075 234575 257344 262866 231794 182751 163396 194942 187236 181855
3022 181855 179230 171052 197922 223184 186751 163461 154979 160081 130600 145151 154023 146760 143040
3009 143040 166824 192205 159025 129961 124438 140584 142149 122898 113828 128667 101574 83707
2997 83707 74392 97153 125922 117993 91466 131516 122735 140767 126158 118450 116983 142438 137782
2984 137782 114588 139781 128522 124594 128445 117147 121111 145478 126190 128435 135541 118951 162464
2971 162464 139690 100266 123758 136555 159357 136537 127903 122209 122304 126648 107004 110424 118039
2958 118039 125654 108117 102134 115729 101451 80755 47947 77809 110904 110468 118097 123023 127071
2945 127071 131958 140642 145405 184308 204671 184820 188397 176344 168396 167522 127252 135245 142970
2932 142970 196753 181765 176721 216085 180182 173993 183610 207559 241265 220391 205533 213738
2920 213738 225205 236240 229170 249244 264551 255784 304945 362224 356587 352843 321689 363088
2908 363088 376626 356084 373062 383796 411452 421249 447490 480134 503469 486345 514009 541186
2896 541186 550773 537932 530991 575900 608214 634095 647843 686902 726556 736439 758176 770052
2884 770052 763900 801517 810875 815920 819175 861635 876176 902719 957956 992671 1006286 986479
2872 986479 956158 976803 965384 952395 925042 935658 912446 968469 987830 988831 1004008 1021322
2860 1021322 1058911 1078297 1136813 1192618 1241266 1281117 1309929 1335892 1375941 1383316 1374305 1381927
2848 1381927 1418086 1468024 1459705 1489446 1536602 1558290 1559512 1537345 1495999 1450821 1421804 1434075
2836 1434075 1413949 1352113 1277057 1210137 1158779 1132149 1111233 1086795 1077635 1061816 1086114 1097991
2824 1097991 1099083 1090056 1127844 1147277 1172405 1196043 1206287 1222384 1206320 1189851 1205256 1199963
2812 1199963 1226603 1239135 1245969 1245560 1244448 1251532 1225893 1163429 1127824 1077428 1045192 1031171
2800 1031171 966661 933531 881303 786670 766877 745523 685531 640460 642523 630906 605521 596396
2788 596396 621429 577026 565199 581048 589735 583543 600927 614002 589748 575059 538957 496268
2776 496268 477152 483379 489489 445341 432100 438097 391815 387946 374594 363620 370653 337845 332629
2763 332629 302458 257538 233717 206999 162843 162374 178569 183675 170633 166024 160116 150855 147979
2750 147979 130764 95863 106798 130360 143551 143895 129768 134166 109163 91425 100264 102710 71525
2737 71525 51440 30911 51793 66584 77195 89372 49302 20403 1912 21415 44842 45046
2725 45046 34771 51575 63135 50075 59742 40798 33149 81629 63167 33466 36473 85804
2713 85804 118310 90118 23784 -9843 24107 11921 16082 8518 -14837 334 9368 -3073
2701 -3073 2839 14763 34474 27019 63425 33620 33202 12963 -15785 -7865 2776 -29296 -43465
2688 -43465 -44660 -42577 -4147 16294 -5981 14916 -212 -5000 -45575 -12546 6391 -14181
2676 -14181 -15029 -47639 -15471 3390 19453 30763 29339 3356 -17707 -3697 14267 12788 3417
2663 3417 8628 -4448 -1409 9267 -9790 -42468 -53446 -29212 1498 8930 -5630 2139 -5659
2650 -5659 -9752 -1653 -6670 -29724 254 32279 -11237 -20259 -1454 854 -12083 -22065 15077
2637 15077 2937 460 -11765 -12768 1601 -27393 -38760 -16625 -32207 -10486 -13808 -31925
2625 -31925 -17985 -19523 -15627 -25033 -22891 -30948 -29640 -27809 -314 9447 4208 16218 23486 12897
2611 12897 18740 -15872 -3276 -2550 -17008 -34402 -51822 -18218 13650 32935 9729 -12140
2599 -12140 -2740 -3529 -42055 -17843 769 -11879 17873 24656 1805 -4057 -23573 -37130 -56778
2586 -56778 -31848 -42042 -17401 -25624 -587 -16396 7684 24764 -12851 -2333 4312 23428
2574 23428 25825 -16282 -24805 19155 26859 -32459 -50317 -24406 -19071 -7856 -4840 -5286 -10599
2561 -10599 -43640 -27683 -2468 5598 -13627 1743 10650 -26466 -34629 -9457 -3410 -41370 -26937
2548 -26937 -28721 -28026 -25895 -24919 -23463 -26814 -25048 -33895 -53801 -42220 -36793 -4746 24308 19751
2534 19751 3696 -28654 -23522 -20931 -36633 -47203 -27999 -16977 -3020 17049 15507 8298 -20948
2521 -20948 -30728 -10297 -6874 1155 -10426 -269 -13280 -51275 -45819 -50263 -9915 -28700 -23177
2508 -23177 -19447 -27382 -28063 -20645 1213 -42738 -40835 -21480 -32135 -25723 -31450 -20669 -10449
2495 -10449 -11996 -23785 -50467 -50588 -46402 -29044 -42768 -49761 -28097 -29439 9397 -17792 -11375
2482 -11375 14393 2863 1490 -6815 8470 -11697 -19128 23400 -2473 -5582 12764 -23849 -16335
2469 -16335 -8097 -25990 -41265 -31905 -24396 10573 9969 6326 5739 -25774 -41394 -42951 -22345 -33064
2455 -33064 -900 6770 -5032 255 4262 -6782 -24418 -26535 -20081 -3446 9971 28027 27613
2442 27613 -6006 6951 14813 -17125 7416 13651 -13967 18984 6389 5511 20313 34625 14850
2429 14850 36037 51561 39148 21536 5197 -5775 -2336 28245 10073 -5953 5307 41986
2417 41986 10339 24427 23073 32705 43817 14803 -1062 27322 69395 35610 -2915 32560
2405 32560 33057 15341 52800 63851 78054 45724 78517 71333 82490 92898 68146 28124
2393 28124 -5113 18934 22504 42285 70364 81190 55280 69711 82355 115289 108071 94487
2381 94487 94022 121175 131398 130892 111140 117098 122903 128225 175425 199387 204492 223386 213596 222464
2367 222464 264394 293829 311066 342521 389343 381804 423043 485858 512405 572039 594803 626670
2355 626670 717282 762037 780132 853630 917179 957690 1042498 1080371 1173975 1277113 1317120
2344 1317120 1409176 1589947 1812189 2062630 2419925 2822236 3280852 3844630 4390459 4750837
2334 4750837 4770190 4405215 3864980 3353939 2842898 2377288 2074051 1770133 1537163 1350267
2324 1350267 1198530 1076420 997808 908369 849366 781923 697992 638310 574629 528778 488377
2313 488377 432248 387125 375903 363855 355254 313446 266525 271466 257914 231847 214416 167923
2301 167923 187077 207579 184428 192903 190219 190950 161884 155268 122280 138116 153491 102739 91391
2288 91391 98997 103598 108451 106892 41803 72889 111621 73301 71803 94534 85124 56946 54497
2275 54497 59319 58127 71467 55491 51575 24298 33419 25557 28260 44178 53277 1542 1508 45089
2261 45089 31309 -4022 -36910 -21354 30198 42271 7269 17903 21564 2039 -17395 -33808
2249 -33808 -13978 -2130 31032 37111 8681 5374 5575 -6365 28578 -4839 -14057 4020 19625
2236 19625 48223 5439 -10731 -59863 -57817 -26228 -8204 11048 -20253 -8879 -40168 -6051
2224 -6051 -20004 -30298 1585 2087 4700 10963 18476 -1141 8722 24842 15799 4479 -36280
2211 -36280 -11090 -4059 -5086 -6870 3003 30710 944 -7286 -17990 6592 35365 12768 -7659
2198 -7659 -16109 -25016 821 40081 21018 94 6930 -22121 -37930 -26141 -29725 -30540 -7305
2185 -7305 -12973 -22179 18794 28991 9046 26252 31438 -11184 -27601 -30589 -13175 -6252 35290
2172 35290 25679 5670 30018 -8024 2796 -5112 2421 -1524 -7748 -5364 22870 4523 1803
2159 1803 4351 14475 2269 22905 17773 -12292 -10398 17524 6871 7650 -17148 711 6772
2146 6772 -1109 -16183 -21710 -22082 -28935 -29763 -21548 -41018 -32775 15107 -10485 -9521 22431 -3179
2132 -3179 38687 36301 1940 3191 -16348 -11606 2187 -13723 -24949 -40012 -42447 -31965 -26563
2119 -26563 -36633 -27059 -18487 -33952 -27296 1666 -13040 -30168 -30898 -48622 -34448 -48967 -35289
2106 -35289 -41028 -19726 -31700 -40508 -21863 -43081 -56098 -67843 -83295 -69159 -37215 -38875
2094 -38875 -66344 -44930 -23289 -45135 -26697 -9856 -39017 -44728 -40394 -39203 -77980 -52421
2082 -52421 -50585 -48120 -23740 -17278 -12944 -20290 -49400 -44569 -2288 -14074 -51142 -20143 -36451
2069 -36451 -47794 -12876 24226 2510 7208 23972 14480 20416 14974 -1551 -3794 1187 -28599
2056 -28599 -44049 -34280 -28970 -26252 -19952 -26707 -1890 -34181 -23652 -21274 -41729 -44126 -1708
2043 -1708 32398 19882 5628 -7886 5589 1730 8550 788 8238 -4356 10445 -36211 -37787
2030 -37787 -42288 -29307 -18022 -31682 -29577 -33782 -33193 -33602 -49248 -28770 -7714 -13024 -26948
2017 -26948 -10069 13185 -5601 -7248 -925 -13531 -10046 -29982 -52898 -31854 -43853 -55346
2005 -55346 -51542 -59591 -49864 -59695 -45791 -16036 -42532 -22758 17119 -5056 -10041 -28622 -63454
1992 -63454 -48837 -29861 -52028 -67086 -39429 -40822 -34366 -5825 31368 -6529 -3328 -504 -34568
1979 -34568 -36744 -24210 -16483 273 17282 -12721 -11399 -5487 3320 500 -4701 -40753 -38528
1966 -38528 -23291 -19041 15687 -7609 3784 -18464 -12883 -8337 -15854 -35126 -19122 -18991 -6919
1953 -6919 8659 -45878 -35411 1795 -22837 -34669 -37188 -36668 -53881 -8050 -8199 3917 5492
1940 5492 -12512 -33797 -20138 -26278 -26103 -40182 -45640 -22932 -12209 -8354 -11853 11534 11234 -7764
1926 -7764 -29598 -31084 -23930 -23474 -5784 -918 -22999 -39103 -36243 -29925 -38129 -30990 -62146 -51916
1912 -51916 -69576 -51777 -49785 -47188 -26108 -37587 -43796 -38649 -45858 -79390 -61762 -45531 -31164
1899 -31164 -50879 -65185 -19451 1050 -13617 -31324 -14498 -6753 -7739 -29467 -30559 -32276 -23805
1886 -23805 -15564 -16364 22239 -395 34727 41956 18875 27896 35580 11352 12835 11544 12784 -8192
1872 -8192 -22901 -16373 -32668 -36086 -33612 -17219 -14509 -18663 -38537 -8498 -50869 -37756 -32937
1859 -32937 -45076 -18015 -1360 -19951 -31495 -17189 -15030 -11490 11604 -24842 -14377 -31958
1847 -31958 -60951 -28264 -20861 -10134 12498 -19829 -20600 -13381 21649 29209 -40897 -43453 -23634
1834 -23634 -18206 -10251 -37249 -42030 -48899 -47160 -10915 20574 30635 17023 39348 68325 31051
1821 31051 8538 7128 -35360 -16920 -22908 -18583 -10470 -28480 -4507 -7462 -15719 -25246 -18658
1808 -18658 -48839 -73493 -70703 -34943 -29152 -39103 -9430 4446 -1790 -25136 -29147 -36007 -6767
1795 -6767 -30118 -44848 -24362 -22384 -28521 -33728 -30796 -32190 -10976 -15832 -41096 -4091 29303
1782 29303 -4176 -3494 -9545 -4645 -9727 1639 11924 -21785 -30443 -11314 -8658 -32494 -31052
1769 -31052 -30624 -48705 -52565 -57219 -40182 -20264 -10358 30232 32541 58095 24866 378 -7546
1756 -7546 -19215 -27320 -14586 -15578 -31644 -22439 7557 -31448 -19096 9982 12228 11044 -4270
1743 -4270 -7294 7557 26376 37671 13994 -33782 -35960 -34438 -35140 -28949 -38871 -17026 16797
1730 16797 617 -35694 -17892 -1169 -60209 -65186 -14712 -11193 4990 -5892 -13717 -18039 -11137
1717 -11137 -9978 -823 -13644 -46860 -63745 -41909 -25395 -26781 -17243 -35632 -47175 -24481 19963
1704 19963 3470 11163 3885 499 6900 6008 30164 29891 15384 3718 -3400 16305 3382 -24162
1690 -24162 -29714 -56979 -27800 -36788 -36907 -1908 -11258 -16165 -41932 -54012 -45469 1693 15003
1677 15003 -11090 -29602 -14850 -9519 -31013 -68958 -65236 -25684 -39386 -58000 -18423 1380
1665 1380 11431 -40790 -36908 -5298 -20437 -43341 -40241 -33005 -45539 -11532 -36716 -34495 -27303
1652 -27303 -44807 -29232 -21051 4901 -18786 -15162 8204 -5803 -14126 -42883 -39017 -9501 -10883
1639 -10883 -44872 -44430 -27670 -1458 -1007 -17070 -4433 -24916 -37118 1837 6287 -7969 -21376
1626 -21376 -53653 -64380 -28187 25010 3577 1808 -12417 -10772 -22723 -25979 -18465 -12339 -15702
1613 -15702 -36355 -22431 14362 31122 19688 -16155 184 35322 50009 26706 -12465 -25610
1601 -25610 4881 -9821 -8173 -24207 -31413 -54189 -31142 1597 6991 22921 -25718 -24417 -12297
1588 -12297 -660 -20325 -2829 -40328 -42564 -14456 -2941 7984 -14898 -37150 -29070 -6013
1576 -6013 -16105 -41000 -2027 788 1858 11687 26491 -14644 -41369 -4662 1057 -19 -1384
1563 -1384 9238 14669 -15319 -24669 -31275 -35038 -27083 -13975 -28392 -44971 -27874 8675 3577
1550 3577 -19358 11387 -10899 -29559 -15705 605 19126 -25064 -11318 -26557 -24461 -36914
1538 -36914 -12969 21043 8064 6011 -10877 -3809 20161 -8779 -24870 -30269 -38778 -44822 -27886
1525 -27886 -17801 -23321 -3458 -19752 2921 -2005 2474 12432 -505 -17559 -49601 -45533 -43882
1512 -43882 -48193 -21721 -25978 -9016 -25344 26763 10264 -9427 -24750 -2071 -12821 -6039
1500 -6039 -2898 -29833 -17996 1155 6797 -22699 -20965 -22747 27638 7624 -26561 -29177 -13973
1487 -13973 21513 10150 -41136 696 -2640 -37211 -33176 -26608 -16986 -30553 -16875 14265 10841
1474 10841 4505 -10026 -27180 -43552 -8821 8123 -19865 4534 -1930 27508 64881 46329
1462 46329 12106 4583 384 -13366 -31511 -28715 -7637 499 22199 10376 6122 18143 32688
1449 32688 12162 3219 10870 -40936 -41932 2243 -2031 -36489 -14012 -8064 -11484 -22077 -25442
1436 -25442 16789 13547 12613 8694 -9268 -16550 19150 16845 21382 47754 36686 25389 -4271
1423 -4271 -6294 15597 34724 15005 18132 25016 37538 40549 1354 -9250 5310 -4033 3244
1410 3244 28276 38399 43787 41186 59394 -13697 -22416 7049 3141 -15251 -28406 -26842 -41372
1397 -41372 -3561 -5946 -25290 -16245 -19358 -314 9350 4418 7428 12699 -32766 -22274 -10811
1384 -10811 -3998 24083 10310 35604 46852 26115 1032 -24922 -16832 2542 -12133 -32410
1372 -32410 -20710 40565 31381 -4811 -5010 18666 25976 8552 -17893 -19972 -29653 -14802 -30822
1359 -30822 1691 11893 9720 33323 30232 -6303 290 29062 -28339 -25612 31200 42494 29396
1346 29396 17047 10125 -3140 27596 20466 6776 30022 13227 -20 -10960 -10491 -38795 -24091
1333 -24091 -15947 -22354 -17496 -37933 -45074 -34102 -18574 -25734 -5447 3734 -1537 -22177 -20437
1320 -20437 -10854 -3486 38699 20957 11039 28850 22145 28028 33736 1230 -14543 -25659 -23201
1307 -23201 -40794 -34905 -11778 4406 10186 12483 12978 -2680 1333 8535 12084 16145 12647 -8612
1293 -8612 -26552 12202 17182 -8736 -29455 -8836 -50028 -37670 -20474 -17947 -2275 -9508 -7619
1280 -7619 -8453 23481 -14363 -30950 -14551 -8297 -19428 -19249 3504 -5723 -2776 11254 6408 -258
1266 -258 6658 18610 2256 41647 61231 50417 11610 4314 20335 24664 17222 -16642 4829
1253 4829 23719 35894 -263 -17287 -7610 -16112 18079 27226 30908 19133 -30836 -30064 -2315
1240 -2315 -20080 -29411 -36022 -7159 -9856 -30545 -16989 -1726 17123 1844 -6283 -3182 10955
1227 10955 1386 -10061 -9401 32258 26044 -5673 21710 10738 11921 34113 19710 32958 16367
1214 16367 26302 29574 49749 54372 9161 -1332 -1646 -12909 -24150 -42594 -21865 -291 -10107
1201 -10107 -10115 -7171 9865 -3602 -26462 -12713 12438 6170 36511 23231 -33768 -20821 10206
1188 10206 22871 27805 -16951 -12786 -2618 -3163 -9971 -16780 -15619 -62171 -54168 -36251 -6957
1175 -6957 -111 -8443 31497 24852 18313 -14535 -795 25433 19537 13653 9964 -1986 2198 38278
1161 38278 22666 -7635 8795 25309 27123 10860 -17665 -23391 -9603 -12220 5042 4426 -44248
1148 -44248 -26009 19247 5541 9308 4349 -11768 -10928 -12363 -5731 -31757 -53128 -8610 16483
1135 16483 14529 -5666 -40280 -63849 -51372 -53649 -38684 -35870 -20914 -15885 -3945 31251 -3872
1122 -3872 -30354 -13648 -11356 -22986 -38071 -30817 -16111 1078 13757 -11518 2740 24818
1110 24818 24368 13812 2049 13767 33557 7714 -4753 8424 25104 3734 -5201 -17047
1098 -17047 13652 11549 -16191 1817 6327 3982 20453 20645 7601 10043 26539 32444 26976
1085 26976 7172 6923 10237 23779 -288 -15664 -16556 -24039 1241 7586 10604 31434 22914 23312
1071 23312 40246 21884 24418 11773 9867 14042 -12686 -10361 -12618 -6040 41300 31811 35740
1058 35740 42670 50072 58837 7020 15111 26291 24732 10754 -6634 -18567 -9334 -29014 -41839
1045 -41839 3039 17352 2889 11783 15985 -4870 7527 10663 7948 1038 23914 8854 -19335
1032 -19335 -1609 8983 33986 -17169 -33898 10639 22212 20696 19216 19757 -33058 -65512 -63261
1019 -63261 -22324 -42495 -50457 -42551 -24162 14887 21697 21652 -27378 -15866 -15762 -11171 -32792 -37856
1005 -37856 -4819 -22600 19454 -2222 -10760 5044 -13315 -13976 11536 4775 -13091 21504 5625
992 5625 -18459 -561 4295 14319 -1723 2087 18608 -19141 -5078 19956 6402 -10085 -34671
979 -34671 -6389 1781 4190 45335 11841 8583 -19156 -19704 1967 -23563 11830 14684 -1742
966 -1742 18400 18555 -11039 13626 28041 38557 -5000 -3746 16577 24022 33620 14575 6404
953 6404 -14055 -711 4775 -5211 -13827 13867 35680 27370 5069 12208 1926 -25375 -12315
940 -12315 3261 -28050 -3459 36999 13619 10777 14783 -1622 -14785 16937 22887 38488 35722
927 35722 -410 9778 17082 -13378 22182 32689 -18533 -2260 6916 20475 13098 51438 32673
914 32673 14418 30280 34008 4213 -12936 261 -14918 -20719 -11053 26339 15582 -2889 15077
901 15077 43761 25307 25537 20713 13645 -5117 -15424 -6350 435 -3518 -11369 -7308 -12625 -43256
887 -43256 -22840 11700 -22757 -6532 -14560 -12839 -674 -10690 -8347 -7239 11269 -1367 4858
874 4858 25437 36237 -5294 8474 -5262 -21631 4057 2295 -16922 -18860 9770 4928 15844
861 15844 13602 -37623 -27444 -7604 -26872 -19090 -43334 -8077 19179 2127 8637 3271 -19164
848 -19164 18445 21604 5324 1996 -12107 -14747 22759 27912 36236 40508 38817 6697 -6170
835 -6170 15600 9051 -4277 11655 22021 -4734 -11496 -26841 -12886 -18661 -17982 -28718 -15547
822 -15547 3605 7174 16931 25061 4249 -10518 -3487 8870 11113 23913 36870 49810 32729
809 32729 -2332 24223 45916 -6315 -24767 -792 19446 44237 18685 -44996 -40934 -26639
797 -26639 -2611 12046 5270 -1635 4438 23332 25550 27068 19831 3255 3927 7191 10280 32930
783 32930 43348 59137 26351 36162 17693 30861 -13795 -17287 7449 27179 25538 50838 44545
770 44545 31236 48445 4555 10462 -11095 -21065 -21908 6443 -13245 -9562 14527 9101 8290 163
756 163 23446 28571 42623 51188 50204 56327 60451 52287 26985 25998 14876 25258 23083 -11140
742 -11140 -8500 9904 -2543 -32653 -36988 -16482 10714 16599 15105 7953 -6876 -14625 -200
729 -200 38619 37899 19678 16465 10268 16741 8349 -21509 7272 -8971 25 20515 -7494 -15476
715 -15476 -4592 -19415 -6805 -18288 15436 35207 22350 13735 -941 -17426 -15379 -28538
703 -28538 -17745 -19886 -2845 -287 20912 59477 15161 4510 33901 54711 33779 36701 11571
690 11571 15633 775 -1475 -2445 18749 17535 1672 33443 -1032 -27960 -26197 -27057 -13001 -11912
676 -11912 24531 -1609 -32089 -17307 -4371 18967 54360 60013 32287 -10002 21777 39291
664 39291 14098 -27493 -21393 7992 -6417 6202 9081 -29503 -51613 6781 2699 13881 23908
651 23908 17998 5666 4603 -32607 -26438 18295 24801 34926 21886 10248 13003 33794 21435
638 21435 28568 23240 -8954 -5760 33552 30313 17703 -468 -28348 -16399 -5458 2308 15929
625 15929 1732 -33395 -10976 8418 30851 37762 -3241 13157 21865 20958 37525 22509 -10464
612 -10464 -4261 23684 6906 26923 55084 23444 22835 -10913 4288 -2344 -22209 -7132 -9393
599 -9393 33723 31718 17454 28808 17687 36 16821 37071 28794 6688 -17289 3507 -12435
586 -12435 14055 16750 -6319 -5724 -2616 5111 8987 11671 29308 42747 34975 56215 32715 13267
572 13267 -10266 -2703 -28947 -13703 35181 38493 17554 41617 49430 54788 45641 59179 21233
559 21233 8158 -10447 6925 -1838 -21007 24229 -11848 -15423 -33041 11911 24834 -5761
547 -5761 -46891 -42346 -22697 -30543 5079 31984 20302 20437 31754 17907 28403 -3578 -16927
534 -16927 3082 -10372 -18173 -18266 -14589 5043 13454 16649 39797 12736 -2015 -10604 750 -3565
520 -3565 -7687 -3038 -19281 -5173 1167 -22101 -2200 27086 39584 41576 66480 49514 32561
507 32561 37821 23468 4999 -22743 -5349 47691 40777 25777 -1980 15787 27643 1566
495 1566 30342 45240 12213 710 16568 10074 53495 53021 38839 18042 1839 -1076 27496
482 27496 41339 28612 25663 3122 24571 919 14927 -1733 4214 17740 -5633 4992
470 4992 27762 17503 -1070 29717 63869 57294 22281 -2985 -26285 -27064 -32297 -14737 2177
457 2177 7459 13067 28642 11792 -675 -10578 -8930 1088 30502 27816 6929 4486 19820
444 19820 14867 17704 20516 45268 31800 16310 -4320 -12175 46911 67715 19719 37270 45035
431 45035 -34257 -23512 20390 30019 58862 39186 21663 6858 7014 16120 23323 2776 27180
418 27180 15048 16550 41327 32131 10152 8755 1930 -8055 -29752 -16716 20797 7729 5238
405 5238 -14637 18227 17512 38651 30949 51176 36809 1332 -19035 -48500 -29963 11560 -4008
392 -4008 -47397 -54245 -16264 -10543 4050 -27191 -27625 -24786 -19698 4344 -6266 11155 1781 -5465
378 -5465 -6 13586 -6123 -22409 -26407 -15174 13900 37061 45664 18768 3023 5420 14130
365 14130 -2884 -28516 9315 14937 -339 19535 22255 25509 -16326 5903 32971 28414 -16984
352 -16984 -29518 -7807 54536 55459 14383 -10842 -5673 12173 4997 -7391 -10319 4221 37488
339 37488 50503 34851 22658 15057 36761 29546 7460 -10736 3097 -6382 -1476 1278 7566
326 7566 -952 6211 -223 -2846 -28363 -45557 -56423 -21963 -10503 -21527 -19242 -3422 3556
313 3556 -26028 -18104 -991 35999 30333 -5492 -22078 -12450 4786 23452 -4839 3617 30447
300 30447 277 14251 7485 4774 8900 6434 -5239 6641 20004 24280 26620 8169 17011
287 17011 17774 13395 33628 45584 -3038 -10820 -10239 -31673 4757 19859 -12755 -16703 18045
274 18045 -4237 -30511 -61105 -34023 -2058 -25480 16673 -10934 -5283 -14710 -42495 8093
262 8093 -3395 -12359 9548 8606 8153 17556 21265 38272 22031 5910 -26027 11157 29135 -3367
248 -3367 -3879 -17406 -8551 4987 51526 34854 2271 -14349 1191 -2487 -10875 4530 8777
235 8777 16919 -7467 -24801 2682 560 215 6508 -14124 -33684 -49507 -3150 -4211 8013
222 8013 -20817 3030 -3051 5975 6128 -3963 -22848 29290 39501 14946 36677 11026 -9104
209 -9104 409 27971 15431 28507 -12062 -15982 -26219 -3126 -8718 1687 -18502 -42581 -20696
196 -20696 -9329 16579 8857 -621 5946 -11675 -2760 5199 16424 1325 -3760 13764 6827
183 6827 -12383 7931 13287 5770 -10145 -5069 24427 32579 16397 -1851 19544 32995 29673
170 29673 15401 22320 40860 52110 19822 -10658 10543 17567 39428 39449 31411 14786 -6343
157 -6343 19104 31094 12143 -18150 -15903 -23007 -31811 2012 37836 16924 5354 10023 -15896
144 -15896 -4414 7882 -12716 13510 32187 2954 11537 -15771 -19970 -20138 -3991 1612 -5334
131 -5334 -8951 -6377 16351 10120 -10044 15841 -10766 -9864 -11874 -17872 -13294 -2575 27651 12439
117 12439 17676 16708 16241 -3652 8246 7310 -24822 -10762 16995 627 2948 -30249 -33067 -8377
103 -8377 -4392 -10010 -2639 -26037 -30687 -22598 12617 11872 6238 12758 9874 48114 30328 11357
89 11357 16952 21778 15050 2395 26556 14046 -3936 3775 43881 28396 17139 2956 12362
76 12362 -2730 12374 -5207 -29017 -13532 -12166 -3588 6929 5084 4976 403 4398 17022 25285
62 25285 23690 19433 11891 11931 13311 -14473 -5748 -23696 -26696 7917 26719 18336 12955 7993 9678
47 9678 14999 22846 17270 -3009 -9425 13548 3371 16864 7205 -904 -5161 -2674 -3655 12996
33 12996 4023 -17484 -11539 -15102 -40954 -16028 -8038 -4655 94 -2214 2471 -9976 -9728 11971
19 11971 17303 13728 6188 8779 13961 23537 23257 116 -3828 18865 11921 9235 -2912 22629
5 22629 11710 12622 8429 3421 1043
0 1043
$$ Imaginary data points
##PAGE= N=2
##DATA TABLE= (X++(I..I)), XYDATA
16383 -741120 -714100 -722079 -718994 -672446 -646923 -619688 -587369 -567610 -563975 -521756 -486097 -475620
16371 -475620 -460132 -454844 -434209 -408100 -409345 -379520 -375079 -354595 -323914 -297925 -293774 -270279
16359 -270279 -230513 -209275 -189128 -185127 -181898 -155481 -129707 -127125 -122145 -108073 -77651 -40602
16347 -40602 -11993 21312 29993 69672 90712 84760 86803 131387 155068 172492 201096 215087
16335 215087 226451 220426 255118 305881 305953 322828 343202 367059 374941 396899 413763 455365
16323 455365 475926 476270 493517 492669 533082 543555 571380 563208 586637 634791 667309 667455 693225
16310 693225 678068 714543 724505 713015 723588 728741 776876 789656 794455 813470 823898 862874
16298 862874 860201 904967 912493 902437 912359 930030 977896 992911 1010418 1044206 1029924 1053882
16286 1053882 1065879 1096526 1129900 1135125 1159843 1167432 1176817 1158411 1181321 1214423 1233498 1220096
16274 1220096 1222674 1243526 1238065 1295136 1306569 1312463 1327279 1326611 1340058 1370329 1387560 1362698
16262 1362698 1388585 1408047 1436336 1475598 1492066 1521589 1535598 1519333 1488011 1498867 1528463
16251 1528463 1553176 1580378 1596321 1591751 1608706 1641650 1632684 1645371 1678795 1684453 1659207 1667929
16239 1667929 1716531 1731128 1739449 1729787 1723688 1735191 1771468 1810203 1814066 1797423 1805531 1816294
16227 1816294 1817079 1842571 1865103 1884540 1889079 1868945 1875995 1889163 1878140 1921221 1899250 1881953
16215 1881953 1896499 1921491 1938199 1934037 1928939 1947922 1966408 1998180 2007324 2025138 2019700 2039268
16203 2039268 2045033 2017987 2017988 2030580 2035194 2063562 2092498 2096837 2098145 2133124 2113040 2112693 2145483
16190 2145483 2142435 2134615 2147246 2135795 2107548 2086556 2144392 2157948 2166656 2151506 2166113 2156218
16178 2156218 2158295 2217228 2190356 2219141 2213584 2213181 2242679 2232052 2267568 2272190 2240175 2232868
16166 2232868 2238940 2245779 2269377 2250853 2256099 2278593 2284433 2289996 2263115 2292421 2276103 2281146
16154 2281146 2310807 2325008 2301082 2336471 2351338 2358118 2345359 2323824 2339333 2364099 2376723
16143 2376723 2397483 2385942 2424910 2419315 2399523 2387394 2399242 2405873 2407547 2408695 2387217 2379164
16131 2379164 2387175 2385987 2399775 2400875 2385920 2416058 2420392 2404635 2418884 2441218 2445020 2437601
16119 2437601 2431934 2433361 2468204 2454977 2442991 2448559 2450706 2469904 2471794 2452216 2446607 2459190
16107 2459190 2501015 2480811 2470201 2477983 2436938 2435599 2473042 2473893 2486827 2510541 2500306 2475473
16095 2475473 2467653 2484364 2474921 2506475 2509618 2514788 2515516 2483772 2470464 2515185 2552986 2529486
16083 2529486 2513332 2514331 2516528 2536030 2530197 2513158 2512798 2521029 2519472 2541438 2529478 2527417 2519678
16070 2519678 2504349 2509121 2506358 2479536 2516855 2495408 2485674 2477962 2501014 2466179 2490293 2513034
16058 2513034 2489405 2504582 2516228 2507680 2488427 2504654 2510641 2540331 2524614 2528778 2530793 2545748
16046 2545748 2536463 2558851 2549508 2538625 2540032 2501923 2506218 2526155 2497934 2485760 2513718 2502823
16034 2502823 2513574 2555439 2540534 2560579 2589925 2597840 2569472 2579826 2587450 2583231 2555662 2548648
16022 2548648 2558946 2581397 2567110 2567320 2543523 2545908 2547458 2549815 2562791 2519682 2512361 2528392
16010 2528392 2547780 2541485 2528331 2492373 2474613 2498761 2554711 2558277 2544410 2508150 2492724 2545165
15998 2545165 2559294 2544591 2525317 2521814 2530796 2490162 2532816 2534088 2542727 2534786 2549001 2531185
15986 2531185 2510562 2555988 2556908 2542796 2513440 2521590 2536428 2536971 2568273 2570791 2591571 2584733 2585779
15973 2585779 2563472 2554572 2570870 2573839 2569103 2564417 2584114 2559136 2556889 2574041 2586975 2562391
15961 2562391 2558368 2542691 2511663 2536500 2564053 2554511 2529456 2537025 2566841 2559807 2542805 2555767
15949 2555767 2572934 2582375 2579958 2576255 2555012 2555634 2601036 2593223 2571300 2571596 2575381 2561272 2579632
15936 2579632 2555252 2570469 2548721 2524127 2556976 2530753 2516248 2537660 2571673 2547267 2552821
15925 2552821 2558684 2559780 2563075 2552778 2574047 2569946 2575738 2585344 2588230 2593432 2580801 2580045 2578378
15912 2578378 2617461 2608822 2613912 2618183 2554970 2541746 2541782 2566788 2597449 2621035 2603469 2568413
15900 2568413 2570088 2583978 2616763 2623468 2623275 2636159 2591397 2574923 2559462 2557557 2574644 2608669
15888 2608669 2604839 2595225 2593382 2583504 2594459 2588578 2617393 2609945 2617588 2596413 2600251 2600947 2602881
15875 2602881 2562448 2565509 2594975 2595156 2604839 2600724 2599022 2575374 2590201 2595698 2622254 2616911 2611569
15862 2611569 2605830 2621113 2613646 2625292 2589855 2608291 2624597 2612100 2610510 2597303 2596726 2595086
15850 2595086 2573582 2604235 2603424 2612562 2619194 2584460 2574724 2586457 2577629 2580561 2567433 2563688 2582897
15837 2582897 2599245 2585902 2582995 2616271 2607066 2618526 2617879 2639459 2627093 2599563 2608367 2630786
15825 2630786 2624396 2636894 2641756 2627830 2603383 2594840 2571893 2565013 2563388 2576726 2596237 2602694
15813 2602694 2616031 2624208 2604619 2607851 2593332 2613204 2657047 2653384 2630744 2631850 2629264 2625588
15801 2625588 2637104 2639888 2659807 2639723 2590908 2618828 2653362 2627962 2595090 2622444 2589475
15790 2589475 2574967 2573571 2588914 2614160 2613210 2594251 2602608 2615678 2605591 2596536 2602935 2616653
15778 2616653 2619788 2610665 2620820 2632722 2643456 2633231 2653620 2675645 2667814 2651156 2652080 2657264
15766 2657264 2615912 2605862 2608979 2632213 2640340 2640989 2615398 2614258 2609944 2621573 2608358 2627229
15754 2627229 2622595 2599643 2633458 2633746 2616027 2603437 2603378 2623625 2605117 2631251 2664836 2655881 2624842
15741 2624842 2631971 2646851 2621221 2631170 2650465 2628252 2606750 2608003 2599479 2590105 2579696 2611195
15729 2611195 2649524 2658485 2632979 2608176 2637912 2650299 2626086 2615029 2628154 2669018 2640561
15718 2640561 2644497 2652261 2662946 2678021 2639363 2619442 2675811 2649954 2643723 2667091 2646898 2619873
15706 2619873 2628287 2625247 2622823 2640250 2635074 2625711 2620247 2668169 2668925 2665222 2623002 2647909 2670292
15693 2670292 2629917 2642259 2646841 2653813 2648854 2615523 2631695 2643287 2660006 2633483 2630217 2635366
15681 2635366 2640412 2625538 2611169 2627931 2674823 2679854 2674655 2693115 2689626 2633718 2622386 2636308
15669 2636308 2636079 2635010 2650745 2662860 2675187 2674556 2671003 2642631 2623968 2634285 2653251 2681763
15657 2681763 2671938 2631176 2596470 2622695 2644565 2654462 2651223 2669904 2690427 2684606 2668888 2681497
15645 2681497 2681012 2681141 2666200 2653984 2667403 2662968 2664969 2652489 2663725 2669775 2647900 2645152 2651147
15632 2651147 2662571 2658604 2648879 2649314 2651187 2654870 2656834 2684890 2676027 2651875 2677703 2657391 2620602
15619 2620602 2651243 2641310 2654597 2672250 2666019 2694736 2659945 2664966 2676682 2658050 2646527 2682729
15607 2682729 2696214 2673351 2657076 2666719 2655697 2653431 2693518 2722662 2696713 2688423 2701453 2700770
15595 2700770 2651671 2650958 2650457 2675873 2687589 2675949 2680534 2691533 2704276 2720066 2721104 2687231
15583 2687231 2661057 2631977 2663611 2672568 2686417 2683678 2660585 2686949 2713299 2687220 2680207 2662748
15571 2662748 2671041 2715781 2719437 2702354 2693033 2694444 2689489 2700724 2690839 2663333 2657508 2707441 2709029
15558 2709029 2709054 2690232 2695843 2699577 2677582 2685489 2695709 2693989 2691809 2682426 2696561 2716890 2697011
15545 2697011 2687584 2642484 2675054 2707442 2669517 2693817 2704247 2685783 2688764 2669836 2646363 2670531
15533 2670531 2672626 2669905 2693268 2681897 2685587 2703910 2714050 2693496 2680482 2688626 2679842 2725276
15521 2725276 2727805 2712196 2721014 2723298 2694831 2681670 2693354 2692467 2718542 2684005 2705745 2727048
15509 2727048 2700587 2687436 2689889 2694901 2699887 2697952 2695265 2699910 2694601 2673821 2710514 2698238 2713036
15496 2713036 2706193 2726241 2696236 2685201 2691340 2678962 2705394 2685402 2671245 2709509 2707856 2713676
15484 2713676 2722866 2697064 2684367 2694620 2717923 2717457 2714513 2735679 2733446 2707843 2721604 2726238
15472 2726238 2710860 2715459 2707199 2704141 2709951 2726772 2713385 2712672 2707271 2717067 2721762 2703728 2745677
15459 2745677 2751150 2747613 2725373 2755543 2737015 2753019 2731521 2757143 2769793 2739471 2742180 2733392
15447 2733392 2703708 2730290 2733111 2711320 2701190 2727223 2754817 2756158 2730484 2730655 2741012 2735685
15435 2735685 2719523 2705107 2699939 2705371 2718531 2684711 2707511 2761367 2755310 2763245 2778446 2768530
15423 2768530 2751930 2746926 2740780 2715593 2715132 2696676 2707604 2717975 2725029 2737709 2763275 2749720
15411 2749720 2717073 2709515 2723702 2718371 2719225 2709031 2753397 2723332 2696001 2721197 2731178 2747774
15399 2747774 2764704 2769080 2764138 2759714 2741083 2718172 2718434 2748106 2786706 2800122 2782790 2781498
15387 2781498 2738002 2764327 2737563 2693787 2702456 2758744 2789603 2759397 2713896 2705004 2759793 2721435
15375 2721435 2686421 2687219 2715695 2730095 2732309 2747095 2749426 2765336 2751974 2747345 2752258 2775268
15363 2775268 2775782 2710475 2705013 2719562 2725994 2746274 2751670 2758616 2769687 2763618 2755005 2751789 2761472
15350 2761472 2767646 2753190 2752766 2757523 2745090 2739311 2763035 2751499 2747765 2747292 2774232 2729669 2722555
15337 2722555 2741506 2739046 2763169 2781138 2795072 2785052 2762945 2740948 2750420 2740309 2773428 2782412
15325 2782412 2787105 2794061 2825756 2814524 2787466 2762933 2765198 2754277 2756662 2770781 2809882 2811045
15313 2811045 2795948 2786959 2778347 2784314 2789262 2784912 2759853 2793700 2770679 2741135 2739571 2760356
15301 2760356 2785374 2801219 2788905 2784138 2753117 2736722 2727321 2728066 2747910 2766349 2771442 2758458
15289 2758458 2750193 2747960 2763193 2798885 2791346 2783402 2785633 2785575 2785955 2765909 2781375 2794385 2809421
15276 2809421 2771957 2748316 2756391 2750905 2781001 2737160 2752699 2783507 2768478 2746510 2762832 2795305
15264 2795305 2789731 2779928 2763079 2769042 2787488 2771539 2781480 2768794 2742804 2753111 2760902 2773323
15252 2773323 2758610 2765941 2788716 2785942 2764073 2778159 2759084 2779646 2822950 2783746 2743275 2759101
15240 2759101 2787299 2792517 2785127 2773305 2778837 2796850 2794254 2798672 2811777 2820966 2838768 2808882
15228 2808882 2812557 2795439 2796087 2806605 2830534 2836803 2830235 2828377 2814828 2825119 2804404 2823933
15216 2823933 2784203 2767900 2807283 2825945 2784428 2792268 2774410 2790586 2800194 2781926 2781564 2773459
15204 2773459 2772177 2789111 2802021 2833710 2848133 2833643 2816935 2821279 2787031 2760842 2789257 2781922
15192 2781922 2792224 2826211 2816387 2816827 2793151 2790200 2785011 2827247 2853354 2810326 2813904 2801234
15180 2801234 2793856 2771767 2799759 2801159 2800203 2776800 2796660 2807099 2813278 2819314 2834065 2814871
15168 2814871 2821615 2854641 2829068 2794324 2802879 2804471 2803383 2831335 2831360 2830149 2840140 2823088 2824386
15155 2824386 2812189 2832175 2837769 2845241 2880963 2866336 2853392 2826490 2832563 2848677 2838642 2837175
15143 2837175 2837984 2856459 2859141 2844813 2842052 2838370 2820308 2815025 2832248 2841614 2861069 2834544 2849397
15130 2849397 2843895 2850627 2863080 2835677 2837745 2861643 2839429 2824601 2819777 2828256 2845830 2847542
15118 2847542 2848292 2862553 2874932 2854873 2869820 2850518 2842430 2848196 2871241 2858894 2866187 2870184
15106 2870184 2858634 2832096 2809529 2797960 2819488 2827059 2811798 2853576 2878124 2883447 2864810 2862192
15094 2862192 2836782 2818012 2832473 2837521 2846898 2824663 2826501 2858952 2837754 2846700 2869896 2820376
15082 2820376 2806407 2849226 2857402 2855932 2828675 2834098 2847659 2844036 2865830 2867175 2835433 2832554
$$ [...]
##END NTUPLES=NMR SPECTRUM
##END=
