##TITLE=1H_CA-9319-3
 200.13MHz, CDCl3,
 8 sc
 
 12.2.2025
##JCAMPDX= 6.0         $$ Bruker NMR JCAMP-DX V2.0
##DATA TYPE= NMR SPECTRUM
##DATA CLASS= NTUPLES
##ORIGIN= UXNMR, Bruker Analytische Messtechnik GmbH
##OWNER= pz
$$ XWIN-NMR		Version 3.5
$$ Wed Feb 12 13:51:05 2025 Russian Standard Time (UT+4h)  she@DPX200
##.OBSERVE FREQUENCY= 200.1313
##.OBSERVE NUCLEUS= ^1H
##.ACQUISITION MODE= SIMULTANEOUS
##.ACQUISITION SCHEME= undefined
##.AVERAGES= 8
##.DIGITISER RES= 18
##SPECTROMETER/DATA SYSTEM= spect
##.PULSE SEQUENCE= zg30
##.SOLVENT NAME= CDCl3
##.SHIFT REFERENCE= (INTERNAL, CDCl3, 0, 15.4461)
##AUDIT TRAIL= $$ (NUMBER, WHEN, WHO, WHERE, WHAT)
$$ ##TITLE= Audit trail, XWIN-NMR		Version 3.5
$$ ##JCAMPDX= 5.01
$$ ##ORIGIN= Bruker BioSpin GmbH
$$ ##OWNER= she
$$ F:/spectra/data/she/nmr/H-C/1/pdata/1/auditp.txt
$$ ##AUDIT TRAIL=  $$ (NUMBER, WHEN, WHO, WHERE, WHAT)
(   1,<2025-02-12 13:46:30.07 +0400>,<she>,<DPX200>,
      <created by zg, POWCHK disabled, PULCHK disabled
       configuration hash MD5:
       00 E9 B6 7A A2 85 ED C7 34 08 36 98 17 FE 4E 26
       data hash MD5: 16K
       F2 E6 6F 62 5E 5E 27 B1 A2 33 AD 27 11 96 7B 07>)
(   2,<2025-02-12 13:46:43.18 +0400>,<she>,<DPX200>,
      <Start of raw data processing
       efp BC_mod = 2 LB = 0.25 FT_mod = 6 PKNL = 1 PHC0 = -463.0458 PHC1 = 6.99221 SI = 16K 
       data hash MD5: 16K
       F0 0D 1E C4 68 86 CD 17 54 26 BC 90 72 15 30 27>)
(   3,<2025-02-12 13:48:57.81 +0400>,<she>,<DPX200>,
      <pk PHC0 = -1.925301 PHC1 = 5.600001 
       data hash MD5: 16K
       85 0E EF 61 27 53 02 69 9E 07 D2 8A 0C 8D 0E 3A>)
(   4,<2025-02-12 13:49:17.51 +0400>,<she>,<DPX200>,
      <abs ABSG = 5 
       data hash MD5: 16K
       FB B5 00 8C 7E C2 A4 75 61 D9 11 5E 60 7A F2 3F>)
$$ ##END=
$$ 
$$ hash MD5
$$ B1 72 8B DD 47 76 54 8F 9A C5 14 93 C6 3F 39 FA
##$RELAX= 
##$RELAX= 
##$RELAX= 
##$RELAX= 
##$RELAX= 
##$RELAX= 
$$ Bruker specific parameters
$$ --------------------------
##$DU= <F:/spectra>
##$EXPNO= 1
##$NAME= <H-C>
##$PROCNO= 1
##$TYPE= <nmr>
##$USER= <she>
##$AMP= (0..31)
100 100 100 100 100 100 100 100 100 100 100 100 100 100 100 100 100 100 
100 100 100 100 100 100 100 100 100 100 100 100 100 100 
##$AQSEQ= 0
##$AQ_mod= 1
##$AUNM= <au_zg>
##$AUTOPOS= <>
##$BF1= 200.13
##$BF2= 200.13
##$BF3= 200.13
##$BF4= 200.13
##$BF5= 200.13
##$BF6= 200.13
##$BF7= 200.13
##$BF8= 200.13
##$BYTORDA= 1
##$CFDGTYP= 0
##$CFRGTYP= 5
##$CHEMSTR= <none>
##$CNST= (0..31)
1 1 145 1 1 1 1 1 1 1 1 1 1 1 1 1 1 1 1 1 1 1 1 1 1 1 1 1 1 1 1 1 
##$CPDPRG= <>
##$CPDPRG1= <>
##$CPDPRG2= <>
##$CPDPRG3= <>
##$CPDPRG4= <mlev>
##$CPDPRG5= <mlev>
##$CPDPRG6= <mlev>
##$CPDPRG7= <mlev>
##$CPDPRG8= <mlev>
##$CPDPRGB= <>
##$CPDPRGT= <>
##$D= (0..31)
0 0.7 0 0 0 0 0 0 0 0 0 0.03 0 0 0 0 0 0 0 0 0 0 0 0 0 0 0 0 0 0 0 0 
##$DATE= 1739353589
##$DBL= (0..7)
120 120 120 120 120 120 120 120 
##$DBP= (0..7)
150 150 150 150 150 150 150 150 
##$DBP07= 0
##$DBPNAM0= <>
##$DBPNAM1= <>
##$DBPNAM2= <>
##$DBPNAM3= <>
##$DBPNAM4= <>
$$ [...]
##$SUBNAM3= <"">
##$SUBNAM4= <"">
##$SUBNAM5= <"">
##$SUBNAM6= <"">
##$SUBNAM7= <"">
##$SUBNAM8= <"">
##$SUBNAM9= <"">
##$SW= 18.0517328524113
##$SWIBOX= (0..15)
0 0 2 0 0 0 0 0 0 0 0 0 0 0 0 0 
##$SW_h= 3612.71676300578
##$TD= 16384
##$TD0= 1
##$TE= 0
##$TE2= 300
##$TE3= 300
##$TEG= 300
##$TL= (0..7)
0 120 120 120 120 120 120 120 
##$TP= (0..7)
150 150 150 150 150 150 150 150 
##$TP07= 0
##$TPNAME0= <>
##$TPNAME1= <>
##$TPNAME2= <>
##$TPNAME3= <>
##$TPNAME4= <>
##$TPNAME5= <>
##$TPNAME6= <>
##$TPNAME7= <>
##$TPOAL= (0..7)
0.5 0.5 0.5 0.5 0.5 0.5 0.5 0.5 
##$TPOFFS= (0..7)
0 0 0 0 0 0 0 0 
##$TUNHIN= 0
##$TUNHOUT= 0
##$TUNXOUT= 0
##$USERA1= <user>
##$USERA2= <user>
##$USERA3= <user>
##$USERA4= <user>
##$USERA5= <user>
##$V9= 5
##$VALIST= <valist>
##$VCLIST= <CCCCCCCCCCCCCCC>
##$VD= 0
##$VDLIST= <DDDDDDDDDDDDDDD>
##$VPLIST= <PPPPPPPPPPPPPPP>
##$VTLIST= <TTTTTTTTTTTTTTT>
##$WBST= 1024
##$WBSW= 4
##$XGAIN= (0..3)
0 0 0 0 
##$XL= 0
##$YL= 0
##$YMAX_a= 580341
##$YMIN_a= -662144
##$ZGOPTNS= <>
##$ZL1= 120
##$ZL2= 120
##$ZL3= 120
##$ZL4= 120
##$ABSF1= 15.51331
##$ABSF2= -2.538539
##$ABSG= 5
##$ABSL= 3
##$ALPHA= 0
##$AQORDER= 0
##$ASSFAC= 0
##$ASSFACI= 0
##$ASSFACX= 0
##$ASSWID= 0
##$AUNMP= <proc_1d>
##$AZFE= 0.1
##$AZFW= 0.1
##$BCFW= 0
##$BC_mod= 2
##$BYTORDP= 0
##$COROFFS= 0
##$CY= -3
##$DATMOD= 1
##$DC= 0
##$DFILT= <>
##$DTYPP= 0
##$F1P= 0
##$F2P= 0
##$FCOR= 1
##$FTSIZE= 16384
##$FT_mod= 6
##$GAMMA= 0
##$GB= 0
##$INTBC= 1
##$INTSCL= 3.241238e-09
##$ISEN= 128
##$LB= 0.25
##$LEV0= 0
##$LPBIN= 0
##$MAXI= 10000
##$MC2= 0
##$MEAN= 0
##$ME_mod= 0
##$MI= 1.114404
##$NCOEF= 0
##$NC_proc= -5
##$NLEV= 6
##$NOISF1= 3.799351
##$NOISF2= 2.8
##$NSP= 0
##$NTH_PI= 0
##$NZP= 0
##$OFFSET= 15.4461
##$PC= 1
##$PHC0= -464.9711
##$PHC1= 12.59221
##$PH_mod= 1
##$PKNL= yes
##$PPARMOD= 0
##$PSCAL= 0
##$PSIGN= 0
##$REVERSE= no
##$SF= 200.130015130253
##$SI= 16384
##$SIGF1= 3
##$SIGF2= 2
##$SINO= 0.751879
##$SIOLD= 32768
##$SREGLST= <19F.Aceton>
##$SSB= 0
##$STSI= 16384
##$STSR= 0
##$SW_p= 3612.71676300578
##$SYMM= 0
##$S_DEV= 0
##$TDeff= 16384
##$TDoff= 0
##$TI= <>
##$TILT= no
##$TM1= 0
##$TM2= 0
##$TOPLEV= 0
##$USERP1= <user>
##$USERP2= <user>
##$USERP3= <user>
##$USERP4= <user>
##$USERP5= <user>
##$WDW= 1
##$XDIM= 16384
##$YMAX_p= 482616190
##$YMIN_p= -201639
$$ End of Bruker specific parameters
$$ ---------------------------------
##NTUPLES= NMR SPECTRUM
##VAR_NAME=  FREQUENCY,     SPECTRUM/REAL,   SPECTRUM/IMAG
##SYMBOL=    X,             R,               I
##VAR_TYPE=  INDEPENDENT,   DEPENDENT,       DEPENDENT
##VAR_FORM=  AFFN,          ASDF,            ASDF
##VAR_DIM=   16384,         16384,           16384
##UNITS=     HZ,            ARBITRARY UNITS, ARBITRARY UNITS
##FACTOR=    0.220516191357247, 1,           1
##FIRST=     3091.22827373102, 0,            0
##LAST=      -521.488489274757, 0,           0
##MIN=       -521.488489274757, -201639,     0
##MAX=       3091.22827373102, 482616190,    0
$$ Real data points
##PAGE= N=1
##DATA TABLE= (X++(R..R)), XYDATA
$$ [...]
9042A90982j5808J9144n624l626J7567j3607L0543qR879p295j095K3149J8207
9029B62408K0588J0261J5234M1736l8586J8691L3731Q007j1007J4356N3268q0604
9017C48083n9823Q6606K3133j4807P122Q8682N0070N0863O0362n6566k2096J6954
9005E78583N531q315R009j1402k7923l2707k8454O799N8432m9210N6565j5707
8993E41201j8528J0365m469O3370K4947L5624L7569n1871P1994j6614n723K757
8981F90622N248M6735N3386J06814K0072L0584K0396K2555L5946J07597k5512
8970A114443M1615Q6596Q9218M7323j7661K1590O6495O8047J04059J09432R4098
8959A825255R5348L3347J14915J42877K24003J72320O4497J98385K63560K39203
$$ plain form
9042 190982 175174 194318 188694 185068 202635 189028 219571 219563 229442 222147 221052 244201 262408
9029 262408 282996 293257 308491 350227 311641 330332 364063 372070 361063 375419 428687 348083
9017 348083 288260 374866 397999 383192 390314 478996 529066 579929 640291 583725 561629 578583
9005 578583 584114 575799 584808 573406 545483 512776 484322 491121 549553 500343 556908 541201
8993 541201 522673 533038 528569 591939 616886 652510 690079 638208 710202 693588 687865 690622
8981 690622 695870 742605 795991 902805 922877 953461 973857 996412 1032358 1139955 1114443
8970 1114443 1156058 1242654 1331872 1379195 1361534 1383124 1449619 1517666 1621725 1731157 1825255
8959 1825255 1920603 1953950 2068865 2211742 2435745 2608065 2672562 2870947 3134507 3373710
8949C373710K56529K40881L08029K37941K04034J92655L21311K94870M63928L01761
8939F195649M20026N80862N95698O27279O39116Q06722J022106J149065J420517
8930A3457040J786217K340670K955581L647232M074104M392495L677929J160232
8922C7491500j607884m081721m636836m006553l486081l136754k537503j929393
8914A2068775j592696j214098r54914p38599o52984p21081n48673m05400m20204
8905D820126l37694k81591k40889j44472k24513k03925j71280j86206j48965q5991
8895B794600j94108j40051p0057q3282r3943o2800m7742m0535j28333n3768p1765
8884A808216p3390k1036m9017m3588r1591q235J244l1597r2646q4746K1326k5128
$$ plain form
8949 3373710 3630239 3871120 4179149 4417090 4621124 4813779 5135090 5429960 5893888 6195649
8939 6195649 6615675 7196537 7792235 8419514 9058630 9865352 10887458 12036523 13457040
8930 13457040 15243257 17583927 20539508 24186740 28260844 32653339 36331268 37491500
8922 37491500 35883616 31801895 27165059 23158506 19672425 16535671 13998168 12068775
8914 12068775 10476079 9261981 8307067 7568468 6915484 6194403 5645730 5240330 4820126
8905 4820126 4482432 4200841 3959952 3815480 3590967 3387042 3215762 3029556 2880591 2794600
8895 2794600 2600492 2460441 2390384 2307102 2213159 2150359 2102617 2062082 1933749 1879981 1808216
8884 1808216 1734826 1713790 1664773 1621185 1529594 1521359 1522603 1491006 1398360 1313614 1334940 1309812
8872A309812k9255J0720p0031j10703o4290j250K7160k028j9989o445m2001r4929
8860I06771j342O1047j4825l7716P8866J3940l7247j1467o135J6981L5596k4763
8848I79706j4864n3499K9070m9599o4318L9718P528J7114o6570j3507P5740m9270
8836H37249n6747J3447k6271J0487M6755k4659l332l7875O0139j9620L9958M9577
8824H89108j5127M7231o4266O0575r795k5444J0419M5670L5456N7323N6037k1931
8812A065256l6531j4258j5735J01253M7450k5829j7292n497O0366J24108m6350
8801A236941k4429j5326O4205J4539r003L7307P2321j359L095m3186R268m311
8789A340062k0115j248Q552M3100m7324k6285L110M2061n186J3351M4134N0962
$$ plain form
8872 1309812 1280557 1291277 1221246 1110543 1046253 1045003 1072163 1070135 1050146 1043701 1001700 906771
8860 906771 905429 966476 951651 913935 992801 1006741 969494 958027 951892 968873 1004469 979706
8848 979706 964842 911343 940413 890814 826496 866214 873742 890856 824286 810779 886519 837249
8836 837249 780502 793949 767678 778165 824920 800261 796929 759054 819193 799573 839531 889108
8824 889108 873981 921212 856946 917521 907726 882282 892701 938371 973827 1031150 1087187 1065256
8812 1065256 1028725 1014467 998732 1099985 1147435 1121606 1104314 1098817 1159183 1283291 1236941
8801 1236941 1212512 1197186 1261391 1275930 1266927 1304234 1376555 1375196 1378291 1335105 1344373 1340062
8789 1340062 1319947 1318699 1327251 1370351 1323027 1296742 1299852 1341913 1336727 1350078 1394212 1445174
8777A445174K2218O0126M0389L0830R7806K5958r08O2427L7890J05005J5097L3704
8765A975716N49O0875P9307O8621M6761L5088P4139M2664L9862O493k3999L3990
8753B440066o6298j11383K9202l3133q3644K051r3808r2844k125j20691q9475
8742A777918j29M6436m1877n0250J4030K8821O7616L3179r4488J2693L3979k0763
8730A807165M714J26406j628m3817O0722L3345J09314O9956O3522J34288Q1927
8719B445914L9886j5485P3276R610Q633k8638P620J18162L7864J0302R611L6342
8707B753097K1388K8972J47898P8316l780K7593k3336P8526R5107Q4722J22828
8696C411331J12862J11381J63020J60655K11376J84740K66067K21347L12051K43133
$$ plain form
8777 1445174 1467392 1527518 1567907 1598737 1696543 1722501 1721593 1784020 1821910 1926915 1942012 1975716
8765 1975716 1976265 2037140 2116447 2185068 2231829 2266917 2341056 2383720 2423582 2430075 2406076 2440066
8753 2440066 2373768 2262385 2291587 2258454 2174810 2176861 2083053 1990209 1988084 1867393 1777918
8742 1777918 1777789 1824225 1782348 1732098 1746128 1774949 1842565 1875744 1781256 1793949 1827928 1807165
8730 1807165 1811879 1938285 1936657 1892840 1953562 1986907 2096221 2166177 2229699 2363987 2445914
8719 2445914 2485800 2470315 2543591 2553201 2561834 2533196 2540816 2658978 2696842 2707144 2716755 2753097
8707 2753097 2774485 2803457 2951355 3029671 3025891 3053484 3030148 3108674 3203781 3288503 3411331
8696 3411331 3524193 3635574 3798594 3959249 4170625 4355365 4621432 4842779 5154830 5397963
8686E397963K35582M18516L81927M11535M85865M80019M11458M58155M61194M37395
8676I579609M60367N31929N62432N80036N50192O25590O92300P30247Q48120P71304
8666A5932126Q57131R93043J107095J193464J486052J720243K038624K381783
8658B7709561K975223L661835M466427N361220O131358O460099N805949M106951
8650F6678623J677661j194079l687226n285374o019213n773448m980356m229696
8642C7186892l350681k516508j959853j492740j011855p16923m54697k82971j11360
8633B5289304K4056J99362L93581N09903O62964P64328Q91117R88363J198239
8624C0921217J364066J708679K066114K389251K884082L654451M571143N551622
$$ plain form
8686 5397963 5633545 6052061 6433988 6845523 7331388 7811407 8222865 8681020 9142214 9579609
8676 9579609 10039976 10571905 11134337 11714373 12264565 12890155 13582455 14312702 15160822 15932126
8666 15932126 16789257 17782300 18889395 20082859 21568911 23289154 25327778 27709561
8658 27709561 30684784 34346619 38813046 44174266 50305624 56765723 62571672 66678623
8650 66678623 68356284 67162205 63474979 58189605 52170392 46396944 41416588 37186892
8642 37186892 33836211 31319703 29359850 27867110 26855255 26138332 25683635 25400664 25289304
8633 25289304 25313360 25512722 25906303 26416206 27079170 27843498 28734615 29722978 30921217
8624 30921217 32285283 33993962 36060076 38449327 41333409 44987860 49559003 55110625
8616E5110625O792728Q074557Q869005Q805638P065758M191549J90389l865445
8608I5234804o827615q768967r069627q095729o935660n795822m762692l762052
8600D1216640k817582k092323j662400j207989r36504o34865m93284j71896J8999
8591C1218796J78905L78999N55520O26616P50705Q71701J019838J227153J470256
8582C8298489J769618K180360K452191K877018L588428M119331M977184N775853
8574F6038472O478816O867177O682612O001265M663736K902464J052868l77567
8566A00309843j090489j031827j56814O96758J583643J888756J307354o7403k213374
8557A01226447m357753o333683p705451q308784q134949p406721o578248n736473
$$ plain form
8616 55110625 61903353 69977910 78846915 87652553 94718311 98909860 99100249 95234804
8608 95234804 88407189 79638222 70568595 62472866 55537206 49741384 44978692 41216640
8600 41216640 38399058 36306735 34644335 33436346 32499842 31864977 31371693 31199797 31218796
8591 31218796 31397701 31776700 32332220 32958836 33709541 34581242 35601080 36828233 38298489
8582 38298489 40068107 42248467 44700658 47577676 51166104 55285435 60262619 66038472
8574 66038472 72517288 79384465 86067077 92068342 96732078 99634542 100687410 100309843
8566 100309843 99219354 98187527 98030713 98727471 100311114 102199870 103507224 103439821 101226447
8557 101226447 96868694 90535011 82829560 74520776 66385827 58979106 52400858 46664385
8549D6664385m857436l986782l460949k928086k465803k120467j919175j633802
8541B3291885j424064j231603j135135r34005q64996q50296p37870o12127o70560
8532A4831229n75693m73306m41949l82988m17548k72575j77929j21054k08361
8523A1759826k63156k87905k29538l04784k91246k39252l07283k50112k40434
8514I346116j70456j52446o8796j86511k26575j69563k10967j04617j01837j11777
8504G842571j14351n0522k5304q1332J1662n8270m9200m0404k9886k6571n9984
8493G318409O5104P2692j7509N3439Q9915L4574R6287J14693J08155J19430J23303
8482H178492J30903K25877K80442K83540K88797L33757K88762L29797M24110M86436
$$ plain form
8549 46664385 41806949 37820167 34359218 31431132 28965329 26844862 24925687 23291885
8541 23291885 21867821 20636218 19501083 18567078 17702082 16851786 16113916 15501789 14831229
8532 14831229 14255536 13782230 13340281 12957293 12539745 12267170 12089241 11968187 11759826
8523 11759826 11496670 11208765 10979227 10674443 10383197 10143945 9836662 9586550 9346116
8514 9346116 9175660 9023214 8954418 8767907 8541332 8371769 8160802 8056185 7954348 7842571
8504 7842571 7728220 7677698 7652394 7571062 7582724 7524454 7475254 7434850 7404964 7378393 7318409
8493 7318409 7383513 7456205 7438696 7492135 7582050 7616624 7712911 7827604 7935759 8055189 8178492
8482 8178492 8309395 8535272 8815714 9099254 9388051 9721808 10010570 10340367 10764477 11250913
8472A1250913M38264N18159M99153M56127O21624O96981O86480P14404Q53513
8463A6735618R50369J082697J252670J346099J384986J618137J843113K229077
8455B8442766K650798L076114L617690M486830N256997N677523N618661M701632
8447F3529011K782664M36413j643151k751088k683759j956091q64365Q4722J085826
8438E8020182J493337J275348R9672j621225l369349m526288m666943m444217
8430D2260517l946693l285158k685538j984337j611623j167730r05440o68866
8422B6005132m47856k06784J187J91228N41641Q23129J019899J358078J821528
8413C1107182K387360K878254L241455L479106L170016K244439O78287q20018
$$ plain form
8472 11250913 11689177 12207336 12706489 13162616 13784240 14481221 15167701 15882105 16735618
8463 16735618 17685987 18768684 20021354 21367453 22752439 24370576 26213689 28442766
8455 28442766 31093564 34169678 37787368 42274198 47531195 53208718 58827379 63529011
8447 63529011 66311675 66748088 65104937 62353849 59670090 57713999 56849634 56934356 58020182
8438 58020182 59513519 60788867 60888539 59267314 55897965 51371677 46704734 42260517
8430 42260517 38313824 35028666 32343128 30358791 28747168 27579438 26673998 26005132
8422 26005132 25557276 25350492 25351679 25542907 26084548 26907677 27927576 29285654 31107182
8413 31107182 33494542 36372796 39614251 43093357 46263373 48507812 49186099 48366081
8405D8366081j870409k152026j812828j146652m10796K58440O89253Q36130L61954
8396D3119147q13676k173604l335494l831900l676190l263254k891523k439096
8388B0694410k035300j708714j425119j206992j067964r31971q20742p61750n95473
8379A0140385n64552m35297m47286k76498l10743l40152l03219k94514k36598
8370F931526k40332k19327k28819j36907j55806j51577j29746r7162p0393j30190
8360E371267j36444j14466j02199k4370m3996l5440l8887j04899j45449j19824
8350D505293l8741j24313j30521k02336j20728q3729r9121o4760o5267q1856r0418
8339C403503j32631o0935p9169j33697j03116j21767q0098j9136o3701k4412l6204
$$ plain form
8405 48366081 46495672 44343646 42530818 41384166 40973370 41231810 41921063 42757193 43119147
8396 43119147 42305471 40131867 36796373 32964473 29288283 26025029 23133506 20694410
8388 20694410 18659110 16950396 15525277 14318285 13250321 12318350 11497608 10735858 10140385
8379 10140385 9575833 9140536 8693250 8416752 8106009 7765857 7462638 7168124 6931526
8370 6931526 6691194 6471867 6243048 6106141 5950335 5798758 5669012 5571850 5501457 5371267
8360 5371267 5234823 5120357 5018158 4993788 4949792 4914352 4875465 4770566 4625117 4505293
8350 4505293 4466552 4342239 4211718 4009382 3888654 3804925 3705804 3641044 3575777 3493921 3403503
8339 3403503 3270872 3209937 3130768 2997071 2893955 2772188 2692090 2672954 2609253 2584841 2548637
8328B548637j8301K1111j7060n3068K6906k535r016M9260N8303l3039p1756P8836
8316B578278J06438P2784j5125J0565m3185m9212l0912j43614j52835m8491m3288
8305B241403n8219n2778j30320m6690k2756p3827q947J8233K9218l4547k2929
8294A837841p1363o1295Q354n8924L9730N1914n5465J03875J5812N1114r172M1230
8282A893651r578l7544K2512n985m7682l8469m0253J4363m2792N7370O2041O3988
8270A891622O8893j7156O7597O4623Q8910M2311m999n8999k7331k5821j00897
8259A988753o7475p7634j41888p4768j5446l4958m2239q6174l0654M124K3238
8248A444879J5151j7922q509j0056K9060k2667n9627j3720M3916n9093J607r214
$$ plain form
8328 2548637 2530336 2551447 2534387 2481319 2508225 2505690 2496674 2545934 2604237 2571198 2499442 2578278
8316 2578278 2684716 2757500 2742375 2752940 2709755 2660543 2629631 2486017 2333182 2284691 2241403
8305 2241403 2183184 2130406 2000086 1953396 1930640 1856813 1847866 1866099 1895317 1860770 1837841
8294 1837841 1766478 1705183 1713537 1654613 1694343 1746257 1690792 1794667 1810479 1861593 1852421 1893651
8282 1893651 1884073 1846529 1869041 1863056 1815374 1776905 1736652 1751015 1708223 1765593 1827634 1891622
8270 1891622 1960515 1943359 2010956 2075579 2164489 2206800 2201801 2142802 2115471 2089650 1988753
8259 1988753 1921278 1843644 1701756 1626988 1611542 1576584 1534345 1448171 1417517 1421641 1444879
8248 1444879 1460030 1442108 1433599 1423543 1452603 1429936 1370309 1356589 1400505 1341412 1343019 1333805
8236A333805k9968L776l4475j2927O6722K9839m5220L0124M8043Q695J12592M3337
8224A554343k8916Q6307o358r7077J7660m8712l7072l5435K6238L4965o8469n33
8212A396941J1421L7231M6453q2060n3778j0596k0207k4167l6170o674P32L7262
8200A296388K6227q6658j8371j8211j05423k9882l0506j1946J15219q1693j13577
8189I41567l8450m6524M1629J3087k3591l9202m5698q2068Q700l0774j9717j8095
8177F60864k5603l7857L3312k8451k2046L6510j00105n1060M4151M2611j7100
8166E35226j1457N4809l9962m1698j7326j53N9529k5465N5802k837n0565O2049
8154E77952P169o9108p4341j3846P5201r8M283l6541m8673O3086j00k65p5207
$$ plain form
8236 1333805 1303837 1307613 1273138 1260211 1326933 1356772 1311552 1341676 1389719 1398414 1511006 1554343
8224 1554343 1525427 1611734 1605376 1508299 1525959 1477247 1440175 1404740 1430978 1465943 1397474 1396941
8212 1396941 1408362 1445593 1492046 1409986 1356208 1345612 1325405 1301238 1265068 1258394 1259126 1296388
8200 1296388 1322615 1235957 1217586 1199375 1093952 1064070 1033564 1021618 1136837 1055144 941567
8189 941567 903117 856593 898222 911309 887718 848516 802818 720750 729450 698676 678959 660864
8177 660864 635261 597404 630716 602265 580219 616729 516624 465564 509715 552326 535226
8166 535226 523769 578578 538616 496918 479592 479439 538968 513503 569305 566468 515903 577952
8154 577952 585121 516013 441672 427826 503027 502929 507212 470671 421998 485084 484984 484719 409512
8141D09512j4115O0688k925o3322k1239L1467l6633l6208J2427K0415m995R928
8129C65000o5948K5302M0211p969J4911K6119q7209m845N4396j615N1114M5048
8117D54515m8530l3272p109j0445k2989j7129J2600J7916J4850l2694J5096N710
8105C48519L1329J6870n1638J92j7304n8126N3054O7888n402m3026O489K4617
8093C73462K5335P6357L0685n5461L6919k8111M3223l7779k2032P8584K4032N75
8081E45789o8103O808l634k679J7007j1831J9607J0277j9170k5616l2n319p4498
8068C88606j6003P54m6740J4074K1741P547j6789j4245j2527l4307O8171J33437
8056D93719K8059N046k6650n864K7520j6028N5856O751O0820L4786K3604q825
$$ plain form
8141 409512 395397 456085 453160 389838 368599 400066 363433 327225 339652 360067 355072 365000
8129 365000 299052 324354 364565 356596 371507 397626 310417 305572 359968 358353 409467 454515
8117 454515 405985 372713 365604 355159 332170 315041 327641 345557 360407 327713 342809 348519
8105 348519 379848 396718 345080 345272 327968 269842 322896 390784 385382 342356 348845 373462
8093 373462 398797 475154 505839 450378 487297 459186 502409 464630 442598 521182 545214 545789
8081 545789 477686 484494 480860 478181 495188 483357 502964 513241 494071 468455 468423 463104 388606
8068 388606 372603 373357 326617 340691 362432 369979 353190 338945 326418 292111 360282 493719
8056 493719 521778 526824 500174 494310 521830 505802 561658 568409 629229 664015 687619 678794
8044F78794J8344K3496K161J6967k9813M27O6082J7014q631L499L318L4743K9212
8031H55613N2371O0092L291J2606k5981r6452o8657r2207m2772r7045j04589l0165
8019D26105n1302j6350n1215N122L4127k1900q338r5472m976j2688K5858L7472
8007B66443k1753o479l4729N912M0798n5888m2723m914P095O1398J887n1707J7858
7994A83198J5413k7992m3990l686k9327L371k2714O7631N5992n3348k5484l0200
7982H8864K2103K6596k4762L8833J2327r2801L3250j2146n7656L0895N8403l1874
7970I2032J3596r0522m7573N6741R8263L6875j4903n0520j6201j2856k3295P0458
7958A12095m6039p000J715l3469O502K1153K6627o646k4985k0322M2104O2809
$$ plain form
8044 678794 697138 720634 722795 739762 709949 710376 776458 793472 784841 788340 791658 826401 855613
8031 855613 907984 968076 971367 983973 957992 861540 792883 700676 657904 560859 456270 426105
8019 426105 374803 358453 307238 312360 346487 324587 316249 220777 215801 203113 228971 266443
8007 266443 244690 238211 203482 209394 250192 194304 151581 146667 153762 215160 217047 165340 183198
7994 183198 198611 170619 126629 122943 93616 96987 74273 141904 197896 144548 119064 88864
7982 88864 110967 137563 112801 151634 163961 71160 104410 92264 34608 65503 123906 92032
7970 92032 105628 15106 -32467 24274 122537 159412 144509 93989 77788 64932 41637 112095
7958 112095 66056 59056 60771 27302 33804 54957 81584 74938 49953 29631 71735 134544
7946A34544k8094n2874J0904P0468M1424j9856n1097l6935L7298J9789L5073q9754
7934G0890l5662M3517k2898k1710l5535K6441k7416M7158l5510j7938P339k0256
7922b1580J5050M8241J7929m2462m0980L4324J9960l2657M2634j8320J4746o093
7910C0792M4939J1745n817N2604l8318j02153k112L1631k4180J4511q281Q0178
7898H5539l2332Q301P688k687j4152m8802J9574l346K8687j8615J3715R5614M114
7885A43298j37019J2851j9804N741K6390l720M2896l3630p1946R379M021L7701
7873A6158L1251J3997m018j5193k3817J2218r736J5655k3616J3720O5231n4119
7861C7731l8753j2394J3940L7039L2136r9608l7457O0327L5208m6260M5837K5387
$$ plain form
7946 134544 106450 53576 64480 134948 176372 156516 105419 68484 105782 125571 160644 70890
7934 70890 35228 78745 55847 34137 -1398 25043 -2373 44785 9275 -8663 -1324 -21580
7922 -21580 -6530 41711 59640 17178 -23802 10522 30482 -2175 40459 22139 36885 30792
7910 30792 75731 87476 81659 134263 95945 -6208 -8320 23311 -869 13642 5361 85539
7898 85539 53207 61508 69196 66509 52357 3555 23129 19783 48470 29855 43570 139184 143298
7885 143298 6279 19130 -674 5067 31457 27737 70633 37003 -34943 -25564 -21543 16158
7873 16158 47409 61406 57388 42195 18378 30596 20860 36515 12899 26619 91850 37731
7861 37731 -1022 -13416 524 37563 69699 -29909 -67366 -7039 28169 -18091 27746 53133
7849E3133o3691M5391m8355L2085o2319j8169N7451L9537N0469m3442k1935k5737
7837e582j154R253k3637j4216j699K2628K4986n5079M3681K3898l9331R6027o2887
7824A6888R121L453o881J4362p7460j9945L5363Q391l1342J1044k0446Q3892o2686
7811c6246L4517P2758j5053m2427j3717m9938l6264l1250p1824P0312R7572n365
7799b6925K0475n6885N0695L685L2614k6781k9662N947K5857k7262j8432j9023
7787f5697M1610N9411J5412p2168J4006J6671j7196L672L8451j6725j1329K0230
7775B6348k9864K6305k029l1475q416L9923l1109j3541m4434M0650K4198J9298
7763A5854o5679J657J15536o057j03215j1246j5429J8045K1362K680J3406J0395
$$ plain form
7849 53133 -10558 34833 -13522 18563 -43756 -61925 -4474 35063 85532 42090 20155 -5582
7837 -5582 -6736 2517 -21120 -35336 -37035 -14407 10579 -44500 -819 23079 -16252 79775 16888
7824 16888 26009 29462 22581 36943 -40517 -60462 -25099 -16708 -48050 -37006 -57452 26440 -36246
7811 -36246 -1729 71029 55976 13549 -168 -50106 -86370 -117620 -189444 -119132 -21560 -26925
7799 -26925 -6450 -63335 -12640 -8955 23659 -3122 -32784 -26837 -980 -28242 -46674 -65697
7787 -65697 -24087 35324 50736 -21432 -7426 9245 -7951 -4279 34172 17447 6118 26348
7775 26348 -3516 22789 20760 -10715 -19131 20792 -10317 -23858 -68292 -27642 -3444 15854
7763 15854 -49825 -48168 67368 61311 -41904 -53150 -68579 -50534 -29172 -26492 -13086 -2691
7751b691j9643J2141n4981L1241l5926J8350o074L573M8538K5670M198r092l8464
7738b3160L7596l5638j6411J4401n277j7285K6907M2044p9137j1564M2169Q4503
7726E9148J5196o6006k2463l360o0577N7599N6605r1073m6192Q4441M3866o2947
7714c5763p2711K3418N9471P065k0494n7749L7705J4753N904N270O7649o101o4986
7701c6569L2753n822l1134J127n8n880j2471Q2264k3290o6187L6031l1135J6892
7688d3479K8931j1190m7069L1480j7790j8606j5151j1144P6042J5416J505K4521
7676A3466Q359M9494N401m004n9922p3449j3953J5242L2704P9151o6708R950o2465
7663f6734M503Q75L075K9421k5084k018l9300L0258O426J324P8569k2288n3940
$$ plain form
7751 -2691 -22334 -10193 -65174 -33933 -69859 -51509 -57583 -54010 -5472 20198 24396 15304 -23160
7738 -23160 14436 -21202 -37613 -23212 -28489 -45774 -18867 23177 -55960 -67524 -25355 59148
7726 59148 74344 8338 -14125 -17485 -78062 -20463 36142 -54931 -101123 -16682 27184 -35763
7714 -35763 -108474 -85056 -25585 -18520 -39014 -96763 -59058 -44305 -38401 -33131 34518 28417 -36569
7701 -36569 -3816 -9638 -40772 -39645 -39703 -45583 -58054 24210 920 -65267 -29236 -60371 -43479
7688 -43479 -14548 -25738 -72807 -41327 -59117 -77723 -92874 -104018 -27976 -12560 -11055 13466
7676 13466 21825 71319 76720 72716 12794 -60655 -74608 -59366 -26662 52489 -14219 -4269 -66734
7663 -66734 -62231 -61356 -58281 -28860 -53944 -55962 -95262 -65004 -58578 -57254 21315 -973 -54913
7650e4913L8759l2023K6713L840q79l0117o8516L2257M4870n819L9251R700k2969
7637a9846M813L027q2733o5295N3751p202N4092m2877L1554K3623k9251m316M4087
7624c6573L268m2068P7468P288r2616M001K8114j449K3475J5881K2933O115J812
7611A7649j4357K0536l8493K0590k9949r007K3902k9199j3940k0967R522Q4263
7599B0550p2172k53O9818k9015l0256P0217l5527o7369N2377m1159M2584n32l9455
7586f0192n077R617L0000n5614J3340P0274Q157m3601K0672J5661r5698n7591
7574a50052M2206N379Q5K9707J2010K80n764j5327j7209J8750m9977L7834K1933
7561g0145j7279L4965l3162j2026m5408k0001K8674N8072k1868k7818K3122j4856
$$ plain form
7650 -54913 -16154 -48177 -21464 -17624 -18503 -48620 -117136 -84879 -40009 -45828 -6577 3123 -19846
7637 -19846 -15033 -12006 -94739 -160034 -106283 -113485 -59393 -102270 -70716 -47093 -76344 -80660 -36573
7624 -36573 -33305 -75373 2095 9383 -83233 -79232 -51118 -52567 -29092 -13211 9722 15837 17649
7611 17649 3292 23828 -14665 5925 -24024 -33031 -9129 -38328 -52268 -73235 -63713 20550
7599 20550 -51622 -51875 17943 -11072 -41328 28889 -6638 -74007 -21630 -62789 -20205 -20737 -60192
7586 -60192 -65269 -55652 -25652 -81266 -67926 2348 10505 -33096 -12424 3237 -92461 -150052
7574 -150052 -107846 -102467 -102382 -72675 -60665 -60385 -66149 -81476 -98685 -79935 -129912 -92078 -70145
7561 -70145 -87424 -52459 -85621 -97647 -143055 -163056 -134382 -76310 -98178 -125996 -102874 -117730
7549a17730K3378K7726K7468m0149l6472n994J4997L0057l151m9378Q959k3218
7537a43507J3415J9385l5575n1013N2114P6837n0563K8641j9244L2839O9239k8501
7525c5933O847M0107K2575L6653m4625n3312j6071K3216M0019j1802r6626m7652
7513a36604L0118R3172m1552R820n513o7658J9199M5323J7631j6277j1148m9490
7501a12979L9364L3251L305L3824J5624l5212L2567r0001k9892r294J0870K3206
7489h5367m4448J0445K4207K8347k7739r288J9304N7550j397k2959j8958k4175
7477i4478l2302p49M9118k2955m3176Q5925l8031j0329m871J8586k9292l8063
7465a60617M8124L1568k6608k5479N6037L9808K1555j8417j1732q3853N7013O809
$$ plain form
7549 -117730 -94352 -66626 -39158 -79307 -115779 -121773 -106776 -76719 -79870 -129248 -120289 -143507
7537 -143507 -130092 -110707 -146282 -197295 -145181 -68344 -118907 -90266 -109510 -76671 -7432 -35933
7525 -35933 -29086 11021 33596 70249 25624 -27688 -43759 -20543 19476 7674 -88952 -136604
7513 -136604 -106486 -13314 -54866 -45046 -50559 -118217 -99018 -53695 -36064 -52341 -63489 -112979
7501 -112979 -73615 -40364 -37059 -3235 12389 -22823 9744 -80257 -110149 -119443 -108573 -85367
7489 -85367 -129815 -119370 -95163 -66816 -94555 -103843 -84539 -26989 -28386 -51345 -70303 -94478
7477 -94478 -126780 -127529 -78411 -101366 -144542 -58617 -96648 -106977 -111848 -93262 -122554 -160617
7465 -160617 -112493 -80925 -107533 -133012 -76975 -37167 -15612 -34029 -45761 -129614 -72601 -65792
7453f5792M2007P718M1136n4012k1044j1818j660m8613K7522O5350J0281p307
7441a6232r2257q6280M8614P4111K6910P747j0458L5510l0789j4315p875K8246
7429c7068m5827L7066k0715K6558P897L91l9803j30031O4733m186r706K4352K0502
7416a05837R891L3391K7613l1715n2727k6382J3264K6680M0686k5862K1737j1092
7404h0353n5588J0791L2410j9422K0293J3220k2053N677N7667j6442j5857n2418
7392a22075J1324J11720k1064q5764o83P7457j5721M1974l2265n6683k1773J2574
7380a00979N5900k9289N4438O993M9948m2179r1812J4448M1025J2743K0152r8301
7368a06913J2605P2485o926k6736j0985l4209K2204L094m4360L9817L600p812
$$ plain form
7453 -65792 -23785 -16067 25069 -28943 -49987 -61805 -63465 -112078 -84556 -19206 -8925 -16232
7441 -16232 -108489 -194769 -146155 -72044 -45134 -37387 -47845 -12335 -43124 -57439 -65314 -37068
7429 -37068 -82895 -45829 -66544 -39986 -32089 -31698 -71501 -201532 -136799 -140985 -150691 -126339 -105837
7416 -105837 -95946 -62555 -34942 -66657 -119384 -145766 -132502 -105822 -65136 -90998 -69261 -80353
7404 -80353 -135941 -125150 -92740 -112162 -91869 -78649 -100702 -95025 -37358 -53800 -69657 -122075
7392 -122075 -110751 969 -20095 -105859 -106542 -29085 -44806 -2832 -35097 -91780 -113553 -100979
7380 -100979 -45079 -74368 -19930 -12937 37011 -5168 -96980 -82532 -41507 -28764 -8612 -106913
7368 -106913 -94308 -21823 -28749 -55485 -66470 -100679 -78475 -75381 -119741 -79924 -76324 -84136
7356h4136N5984M4067o5296k2305n7536n7676N0286j178K6281J4922l498J9230
7344h0855K2497k4632k2674n4662l668K2728M2459O3306q032J9005L0608q729
7332b649L903k2541l6267P7563n4647K7819J000n1717l2739j5355R93q440M9308
7319f3769O3800p495m196O807q5840k2744P0921m1599k4794K9326L8527q951l6614
7306h6621r989P9410m0520j9651L0454j9793K0891K8833l8883R328l7009L4062
7294d9488J1730J0774l358n2601O6342M543J5317q014P854O558n89Q679m5661
7281b7914n2293Q053Q0382N8131n0470m8129K7770O4551r4475o7311Q0419K3417
7269B131m1798N671j5102m895j4265J934J627n3439O2078K5147J3395L1919j5453
$$ plain form
7356 -84136 -28152 15915 -49381 -71686 -129222 -186898 -136612 -137790 -111509 -96587 -100085 -80855
7344 -80855 -58358 -82990 -105664 -160326 -163994 -141266 -98807 -35501 -43533 -24528 6080 -2649
7332 -2649 1254 -21287 -57554 20009 -34638 -6819 -5819 -57536 -90275 -105630 -104637 -113077 -63769
7319 -63769 31 -7464 -11660 -4853 -90693 -113437 -42516 -84115 -108909 -79583 -41056 -50007 -86621
7306 -86621 -96610 -17200 -57720 -77371 -46917 -66710 -45819 -16986 -55869 -46541 -83550 -49488
7294 -49488 -37758 -26984 -30342 -82943 -16601 -12058 3259 -4755 3099 9657 9068 17747 -27914
7281 -27914 -80207 -72154 8228 66359 15889 -32240 -4470 60081 -34394 -101705 -21286 2131
7269 2131 -39667 -33996 -49098 -53993 -68258 -66324 -64697 -118136 -56058 -30911 -17516 14403 -1050
7256a050k5161j5614m5852K2940M7065o3694J119K9847K6266k2266m196q929k8386
7243h7911J0450L4342Q121l230J9845l4986k1421K0759j5747l0105J1168O6004
7231b2711Q9596l6857l3329j3612k6769n8540l0194O1488j1593N3789k9983J4692
7219d4023K8270j088M2122k7694j9989k3539J4217m9222L5720K6913m0091R236
7207d9168K1683M3462l3818o3313K9964N809j411K9536L0392r1347l3175J06926
7195d460l693q037J3876j8978j6223L1452K8573L1954n1816k6937m5249L6096
7183c3442o8481N8203M1055l9630j993L9429j2200k6011J5511k5993K5871N3277
7171B5596j1475k2429K4673m1684l5222N8337P6282j1081J9659l7309o2836n6665
$$ plain form
7256 -1050 -26211 -41825 -87677 -64737 -17672 -81366 -80247 -50400 -24134 -46400 -50596 -59525 -87911
7243 -87911 -77461 -43119 -34998 -38228 -18383 -53369 -74790 -54031 -69778 -99883 -88715 -22711
7231 -22711 66885 30028 -3301 -16913 -43682 -102222 -132416 -70928 -82521 -28732 -58715 -44023
7219 -44023 -15753 -16841 25281 -2413 -22402 -45941 -31724 -80946 -45226 -18313 -58404 -49168
7207 -49168 -27485 15977 -17841 -81154 -51190 -45381 -46792 -17256 13136 -78211 -111386 -4460
7195 -4460 -8153 -16190 -2314 -21292 -37515 -6063 22510 54464 2648 -24289 -69538 -33442
7183 -33442 -101923 -43720 -2665 -42295 -44288 -4859 -17059 -43070 -27559 -53552 -27681 25596
7171 25596 14121 -8308 16365 -25319 -60541 -2204 74078 62997 82656 45347 -17489 -74154
7159g4154m656j8836K1571N9279K8661O004j9804j7959P822J4069N1620J5512
7147F9129n8294n9306k9763k3807J1093J9765J5317L4782R674r948k8378n93K030
7134d8299L993k5118L4251J0146K2027O4153n9286k8152J6116L596J3132k9327
7122b2768R3048L7235m8573J0059k0429n087l423M0204p4670j0701M1589k761
7110C3723l0577L0957J151k0484k411J0411o442j1954j1163r4125M8480m912j7340
7097g4686J16536l0260l4098K5501j3983k4587L0615K1662L2367j3533J21L1929
7085F7584r289m6260k246k8552o6186L2295R8707m6342j00437J4082J1761L8487
7073c6396k128k2664J1704L062Q0869j3833l1440M2469L5568o9057P488j5782
$$ plain form
7159 -74154 -78810 -97646 -76075 -16796 11865 17869 -1935 -19894 -12072 1997 53617 69129
7147 69129 10835 -48471 -78234 -102041 -90948 -71183 -55866 -21084 -11410 -21358 -49736 -50329 -48299
7134 -48299 -44306 -69424 -35173 -25027 -3000 61153 1867 -26285 -10169 -6573 6559 -22768
7122 -22768 70280 107515 58942 69001 48572 43485 40062 80266 5596 -5105 36484 33723
7110 33723 3146 34103 35254 14770 12359 22770 16328 4374 -6789 -100914 -52434 -57346 -74686
7097 -74686 41850 11590 -22508 2993 -10990 -35577 -4962 16700 49067 35534 35655 67584
7085 67584 58295 12035 9789 -18763 -84949 -52654 46053 -289 -100726 -86644 -74883 -36396
7073 -36396 -38524 -61188 -49484 -46422 34447 20614 -10826 31643 67211 -1846 5642 -10140
7061a0140j1197J685k4013p027m731J7155K2463l0065M1804K676n0153j825p5906
7048a29274N8823L0125L0461N8592l5006r0135L4714R489P8869K375o6702K5104
7036G435J7916k0873j7745l4613L6532J8201M5127K0248l7810j0400q423M935
7024B0530o893K4514k2402K5355k6697l0057O9724k9332l3263o2357J2011M3000
7012a5867p940m235J432J0817k4679q322O547n104R918m0971Q502M9071N5168
6999C4337P6532q7283o1196k2599K7681K7781n2230m0893L2722M9658l1351o0798
6987a07639J9123J2089Q5304n167o2364J13696p5896m7529O7033N449R391K3663
6975C7153l4115K2457O1740n0904n1395q830j17816O062L0479R5566J738j019
$$ plain form
7061 -10140 -21337 -19652 -43665 -50692 -55423 -38268 -15805 -45870 -4066 -1390 -51543 -53368 -129274
7048 -129274 -70451 -40326 -9865 48727 13721 -76414 -41700 -32211 46658 49033 -17669 7435
7036 7435 25351 4478 -13267 -47880 -11348 6853 51980 72228 34418 24018 15595 20530
7024 20530 13637 38151 15749 41104 14407 -15650 54074 24742 -8521 -70878 -58867 -15867
7012 -15867 -23807 -28042 -26610 -15793 -40472 -48794 -42247 -47351 -37433 -78404 -69902 -20831 34337
6999 34337 110869 23586 -37610 -60209 -32528 -4747 -56977 -97870 -65148 -15490 -46841 -107639
6987 -107639 -88516 -76427 8877 3710 -58654 55042 -20854 -68383 -1350 4099 13490 37153
6975 37153 3038 25495 87235 36331 -15064 -23894 -141710 -135648 -105169 -9603 -7865 -8884
6963h884J5082J5200l239p4167P612K2478J5665J094K6925M75j01574j8660N9118
6950d2875K2104K1730l5567k1820P3168k3180l1722N1619q1011L1241L4814l8262
6938c9761M0300k1276q915M466L2824K2187m9799j3960m0576P1327l1589l3109
6926f7881K752M3509L4754p5342J2142L0809N806n0148J8986M7683K668n164j840
6913a266j5194n572M0795o8804J6912K4622K8336Q5q069M8794l1471r1792o018
6900f8642J8280L8709q493K9242M5842p213n2671L396J1970j6873n2096m4703
6888a03252L1524M4033j927L7952j5594O1564k0334r9170N7304r667L3053j9726
6876d240l5411L6753j6477r506N4466n0875n4447L1705Q3349r943l0014l3919
$$ plain form
6963 -8884 6198 21398 18159 -56008 -48396 -25918 -10253 -9159 17766 18241 -83333 -101993 -42875
6950 -42875 -20771 959 -34608 -56428 16740 -6440 -38162 13457 -67554 -36313 -1499 -39761
6938 -39761 539 -20737 -29652 -25186 7638 29825 -19974 -33934 -74510 -3183 -34772 -67881
6926 -67881 -65129 -21620 13134 -62208 -50066 -19257 -13451 -63599 -44613 3070 5738 574 -1266
6913 -1266 -16460 -22032 18763 -50041 -33129 -8507 19829 19914 11845 60639 29168 -62624 -68642
6900 -68642 -50362 -11653 -20146 9096 54938 47725 -4946 -1550 10420 -6453 -58549 -103252
6888 -103252 -71728 -27695 -29622 8330 -7264 54300 33966 -65204 -7900 -17567 15486 -4240
6876 -4240 -39651 -2898 -19375 -28881 25585 -25290 -79737 -48032 35317 25374 -4640 -38559
6864c8559j1410P8454j286j0395m4417k230n2998L7598O727m653N7397j9319J730
6851c361N6633l3983m9305K7695L8785k603J6400L9659m6060l0941m8264K114
6839c3231J3172o08o909O5451k7302l6332k3396O527Q7069q168q280k3676O6303
6826G0620o7306q9015P9794L8821O9734J0000k3632p10m1731n6675j9397J981
6814b7516L0776L055N5812l4707n6124J0823N5467K5722o8527k1506N8953K8047
6802F0275J9724o7538j9352l4457P8912l1220k2984N6416m3570K5160M4772p3530
6790g392N0470o858M7128L39p6542L6051j9088j1812o8352J0173K7802j2384L4176
6777C711J3444K9477K805O7955L1259l0426j6379k1991j4768j2615n4395j3696
$$ plain form
6864 -38559 -49969 28485 27199 16804 -27613 -29843 -82841 -45243 -38516 -43169 14228 -5091 -3361
6851 -3361 53272 19289 -30016 -2321 36464 33861 50261 89920 43860 12919 -35345 -33231
6839 -33231 -20059 -20667 -27576 37875 10573 -25759 -49155 -42628 44441 36273 27993 4317 70620
6826 70620 3314 -85701 -5907 32914 102648 112648 89016 88306 46575 -10100 -29497 -27516
6814 -27516 3260 6315 62127 27420 -28704 -17881 37586 63308 -5219 -26725 32228 60275
6802 60275 79999 12461 -6891 -41348 37564 6344 -16640 39776 -3794 21366 66138 -7392
6790 -7392 43078 36220 83348 83687 7145 43196 24108 12296 -56056 -45883 -18081 -30465 3711
6777 3711 17155 46632 49437 117392 148651 118225 101846 79855 65087 52472 -1923 -15619
6765a5619N1190k0039O1528l2283p6682q068L3196k2729k601M4500P459r9023
6753g9171L4737L3807K0609n2630N2085O5742L407K3279Q087O428L555J1791j5424
6740A16302n5463n2788M2355K1946j4031J229O3838J0840n8515L0253n7104J0500
6728E9362K6985m5148o419j5515j3728J6069M8190l4256o7245L680r919L9865
6716A921J0010J0619q4698l140K534O3930R2182J3284k919m2498J6749j9308R858
6703F8524N4679L3981l3249l2589r945M466Q0684O2316l1701M657l6329k0905
6691A44589j5687j2808l184J562M129P45O3297J6359j583m4458q4731L9554Q4480
6678A92264j321p3259L1912l4781K1275j245K5400N440n218K2657P6651k0949
$$ plain form
6765 -15619 35571 15532 77060 44777 -31905 -39973 -6777 -29506 -32107 12393 19852 -79171
6753 -79171 -44434 -10627 9982 -42648 9437 75179 78586 101865 109952 116380 119935 131726 116302
6740 116302 60839 8051 50406 72352 58321 59550 123388 134228 75713 105966 48862 59362
6728 59362 86347 41199 34780 19265 5537 21606 69796 35540 -31705 -28025 -37944 1921
6716 1921 11931 22550 -62148 -65288 -62754 1176 93358 106642 103723 61225 77974 58666 68524
6703 68524 123203 157184 123935 91346 81401 85867 166551 228867 197166 201823 165494 144589
6691 144589 128902 116094 112910 114472 118601 119346 182643 199002 197419 152961 68230 107784 192264
6678 192264 190943 117684 149596 114815 136090 134845 160245 165685 160467 183124 259775 238826
6666B38826n3028p2033k0554j168l1641M0723K2724J4205l0041N138L0491n185
6654A38457J8613J9655q301N422q584m6988J8047M0344k5563J1931m408m7127
6642A11498R0322n4275l8986M7023R549l6821O395L2506q297j9891q8931J9816
6630F9908J763M092P4545M7632j0969k9411m0594M5934O0107J3432l8667r558
6618A88214k0404l0639J9819J22773q8833k4713J9583m737Q263R3116R028p5789
6606B15681M0772o41l1261j820N4383j591J2459L7534m8711Q5203k9954P469L9100
6593C78623k7463J581j210J0541j7266j1641N7742l6197p8433l0119M6647L2605
6581C25410j7555J2492k1063L1388l508j3700J4221k2848k5540O0869K0160l3475
$$ plain form
6666 238826 185798 113765 93211 92043 60402 101125 123849 138054 108013 113151 143642 138457
6654 138457 157070 176725 168424 173846 165262 118274 136321 176665 151102 163033 158625 111498
6642 111498 201820 147545 108559 155582 165131 128310 134705 167211 158914 139023 50092 69908
6630 69908 71671 75763 150308 197940 186971 157560 116966 162900 223007 236439 197772 188214
6618 188214 167810 137171 156990 279763 190930 166217 185800 181063 189326 282442 291470 215681
6606 215681 256453 255812 224551 222731 277114 275523 287982 325516 276805 362008 332054 339523 378623
6593 378623 351160 352741 351531 362072 344806 333165 390907 354710 276277 246158 292805 325410
6581 325410 307855 320347 299284 330672 327164 313464 327685 304837 279297 340166 360326 326851
6569C26851m870l8117P8192L004n4462M547j3567K1664k4414N2140P624m5856
6557C12736o1189K8328l5547Q593J2871P8852j861J6189O879K1M5470p6064K819
6544C38097J6466K6878M0510m120M327K902m806j8003o1654j5265k6563J6433
6532C15202L8840l6604Q4679j7811p036K2386M1566m7338l6996m4459n534J0167
6520C17062k4849L3182O5046L0396j2919K7852m0464k3218L9788j9500Q139m9195
6508C51320Q215K2243k6130o0849J8710R5351n0110j4474K6185m0984m6507K2101
6496C05071J6518N4649M3460j9042r209k4330l1155L1781j387R470m2979M2921
6484C75768r263K6123J8742k2025M6572j9281K2155L6075m41k2138o7768J782
$$ plain form
6569 326851 321981 283864 362056 365060 310598 315145 301578 323242 298828 350968 358592 312736
6557 312736 251547 279875 244328 252921 265792 344644 342783 358972 365851 365872 411342 335278 338097
6544 338097 354563 381441 421951 417831 422158 425060 420254 402251 340597 325332 298769 315202
6532 315202 354042 317438 402117 384306 377270 399656 441222 393884 356888 312429 306895 317062
6520 317062 292213 325395 390441 420837 407918 435770 395306 372088 411876 392376 400515 351320
6508 351320 359535 381778 355648 294799 313509 408860 358750 344276 370461 329477 282970 305071
6496 305071 321589 376238 419698 400656 391447 367117 335962 367743 366356 375826 332847 375768
6484 375768 366505 392628 411370 389345 435917 416636 438791 474866 474425 452287 384519 386301
6472C86301j5864J9667j844o006R342M8269j7563l8264M7610l676J4327R2573
6460E34872M263n2024n3613J3672J3298J0117k9539k7071L1865K0261N5512q4826
6448D36787P3220j1979j4671N5636M30R290K322N153J6J5985m9828M0725m4275
6435E18811o5291K0370J5378J7235L5002r4663k002l3325N3775P7861K1656p9080
6423D85727j15K9645l0071l929j3142J0360K1762J8609p153k6275j0980K1857
6411D96295j9782N4799k3737J3723J6729J5456K7943J8068k5641k987N479P73
6399E77118l7026O6273k7649j3826J9048m1306R74l3470j1263O6718k9615j9869
6387E16107K2614K6621K9955K0745J14n5046k5442K5366K5662J456L176k5026
$$ plain form
6472 386301 370437 390104 388260 382254 391596 439865 422302 384038 431648 427972 442299 534872
6460 534872 539135 487111 433498 447170 460468 470585 441046 413975 445840 466101 521613 436787
6448 436787 510007 498028 483357 538993 539423 548713 551035 556188 556204 572189 522361 563086 518811
6435 518811 453520 473890 489268 506503 541505 446842 444840 411515 465290 543151 564807 485727
6423 485727 485612 515257 485186 481257 468115 478475 500237 518846 511693 485418 474438 496295
6411 496295 476513 531312 507575 521298 538027 553483 581426 599494 573853 570866 576345 577118
6399 577118 540092 606365 578716 564890 583938 542632 543606 510136 498873 565591 535976 516107
6387 516107 538721 565342 595297 616042 616156 561110 535668 561034 586696 588152 591328 566302
6375E66302K4665k4315L6791o6267j0044K0333n70J9940l9330o975k3727J8880
6363E15683L9570K9436N6678n8523j3991K806l4366P3706M0185k3424p3228N8557
6351F13089l2518j8237K2482l289L1791K0924l9802n6189M2145k6812K564J1975
6339E68123J2904K9779j2996K9476m5375K7871K4611l4730K3113J1185n5616J0938
6327E89283N7817O972n2467m2823k346j3737M7590L7216j8380J9730j8442m47
6315F09966K1397l7893R480L3567J6895k4420o2086M5193o286m155K7049l8282
6303E90425m845L0026j8435O4342k7025k9423k3485k44J3734k3068O7565n8175
6291E81392M7771k1300k2113M7659J9762l1922K4133L0478K6618n3223M093m7608
$$ plain form
6375 566302 590967 566652 603443 537176 527132 547465 546895 566835 527505 520530 496803 515683
6363 515683 555253 584689 641367 582844 568853 571659 537293 610999 651184 627760 554532 613089
6351 613089 580571 562334 584816 581527 613318 634242 594440 538251 580396 553584 556148 568123
6339 568123 581027 610806 597810 627286 581911 609782 634393 599663 622776 633961 578345 589283
6327 589283 647100 654072 601605 558782 556436 542699 590289 627505 609125 628855 610413 609966
6315 609966 631363 593470 602950 636517 653412 628992 566906 612099 605813 601658 628707 590425
6303 590425 585580 615606 597171 661513 634488 605065 581580 581336 595070 572002 639567 581392
6291 581392 629163 607863 585750 633409 653171 621249 645382 675860 702478 649255 653348 605740
6279F05740k2341Q431J2279M1910l3053l4489N7452M1422o4930m9983Q3977M7397
6267F93812p4859l194K683M3083L0686k8877Q9327K1084n9657M4799K3731k6468
6255G56150N0328j6341l3105j636n405K7474j7514j3515n8615L9983M6776K1069
6243G95649j3023k1558p696J6404l3060K8045K7991j1438M2645P201l8404Q288
6231H01044L1404L40o910K4718L6541M6424j3251K0088M7318K8055P3807j1218
6219A078360Q623J07107J1472M7806M6945J19727P1821R6119J02873O9589R6688
6208A857130J09067P5802L7216K4793k6948K9219L9340P1807l2197m6905o4273
6197B074051q8899L0045k0107j883j7220q8895n2030m4047N8154N9791J18655
$$ plain form
6279 605740 583399 591830 604109 646019 612966 578477 635929 677351 612421 562438 646415 693812
6267 693812 618953 615759 618442 661525 692211 663334 752661 773745 714088 758887 782618 756150
6255 756150 806478 790137 757032 755396 749991 777465 759951 746436 687821 727804 774580 795649
6243 795649 782626 761068 753372 769776 736716 764761 792752 781314 823959 831160 792756 801044
6231 801044 832448 832788 825878 850596 887137 933561 920310 940398 987716 1015771 1089578 1078360
6219 1078360 1086983 1194090 1205562 1253368 1300313 1420040 1491861 1587980 1690853 1760442 1857130
6208 1857130 1966197 2041999 2079215 2104008 2077060 2106279 2145619 2217426 2185229 2138324 2074051
6197 2074051 1985152 2015197 1995090 1993207 1975987 1887092 1835062 1791015 1849169 1908960 2027615
6186B027615J06347J20351J10051O5406O3860O0202J8655o323o080k1023l4233
6175B504828L6317N4549P3473J1082r8799p3755j55237j26223p7689n2020o8121
6164B028405N844K9756P9630K8053m1357j1949O304J43071J05683N7458K22074
6153B652972J70904J33812K99706K46286K70372K07554J66187k1747j71425k43231
6143C711390k91945k56571k95598k63647j29689j90338j42921o2083j35411j31759
6133A811428k3195q243m3047q363p7305P8569M7032p1030j2369o6848J1727O6225
6121A704581L7501k642O1811p6l0669p2499l6481l3745m2519n4287N014N25m4352
6108A492162m1908L759k8961J566n2712k5317K1161m060K7583J3233j7635r598
$$ plain form
6186 2027615 2133962 2254313 2364364 2429770 2493630 2553832 2572487 2566164 2560084 2539061 2504828
6175 2504828 2541145 2595694 2669167 2680249 2581450 2507695 2352458 2226235 2148546 2096526 2028405
6164 2028405 2034249 2064005 2143635 2171688 2130331 2118382 2124686 2267757 2373440 2430898 2652972
6153 2652972 2823876 2957688 3257394 3503680 3774052 3981606 4147793 4126046 3954621 3711390
6143 3711390 3419445 3162874 2867276 2603629 2473940 2283602 2140681 2078598 1943187 1811428
6133 1811428 1788233 1779990 1736943 1728580 1651275 1729844 1776876 1705846 1693477 1626629 1638356 1704581
6121 1704581 1742082 1739440 1801251 1801175 1770506 1698007 1661526 1627781 1585262 1530975 1535989 1536514 1492162
6108 1492162 1450254 1454013 1425052 1426618 1373906 1348589 1369750 1365690 1393273 1406506 1388871 1379273
6096A379273N7527J9131P3068O2488M1286P7967k703Q169M2814O1528M5431M3186
6084A909165k4621j18324J0462j4244M6752n3414j10139p5265K0729m7441n8177
6073A485483m7153M9326J4669J7104j4802N0024r034p742K6580N7227M3144L2969
6061A697795N6316m7721L0104k1021N1881P5017n1696j9616N0779O319n2758L841
6049A779240n2961m9951q1934o9111N541j114l277j7684q4826N4885p263j9392
6037A452153N031P816k9933J0055K1204R7750K1607J4399l738o4295M7898N7845
6025A637792K6471j5514P0042j5435R81l2348m5356Q940K487k5106o8570j173
6013A543211p0378p3864M9900m34J792L7915l4801k9460l5916q015J014q1596
$$ plain form
6096 1379273 1436800 1455931 1528999 1591487 1632773 1710740 1708037 1716206 1759020 1820548 1865979 1909165
6084 1909165 1884544 1766220 1776682 1762438 1809190 1755776 1645637 1570372 1591101 1543660 1485483
6073 1485483 1438330 1487656 1502325 1519429 1504627 1554651 1545617 1537875 1564455 1621682 1664826 1697795
6061 1697795 1754111 1706390 1736494 1715473 1767354 1842371 1790675 1771059 1821838 1828157 1775399 1779240
6049 1779240 1726279 1676328 1594394 1525283 1530824 1529710 1526433 1508749 1423923 1478808 1471545 1452153
6037 1452153 1457184 1465000 1435067 1445122 1466326 1564076 1585683 1600082 1596344 1532049 1579947 1637792
6025 1637792 1664263 1648749 1718791 1703356 1704337 1671989 1626633 1635573 1638060 1612954 1544384 1543211
6013 1543211 1472833 1398969 1448869 1448435 1450227 1488142 1453341 1423881 1387965 1379950 1380964 1299368
6001A299368M9980j3859p273P3756O1046j2129K4567J2043Q4031j3333k708N412
5989A560901L2947O0284L4451K5364R0739M1678Q8093M3111L3314O3958R6480
5978B171320N4210Q4680J05273J7145O3003J11938O0505M2882k5026r3711o4482
5967B527737l9128m5193o8714o3840j3530M9064J3554J8274n7631M3463k6O9118
5955B433148J12830k7051j2747K4528J12518J06565K234O712K7215M2798R720
5944B838470n572M2462L9534M5228O5407P2253N6320O2299l455O3677P5837N7884
5932C410344n910O8130Q5617M0193m0273N4990M5805J6336L2616k244O9568N7935
5920C833107J632M2660J65257K4060o5827M6785L8129J9521q146Q172K2534N7095
$$ plain form
6001 1299368 1349348 1335489 1328216 1401972 1463018 1450889 1475456 1487499 1571530 1558197 1555489 1560901
5989 1560901 1593848 1654132 1688583 1713947 1804686 1846364 1934457 1977568 2010882 2074840 2171320
5978 2171320 2225530 2310210 2415483 2432628 2495631 2607569 2668074 2710956 2685930 2592219 2527737
5967 2527737 2488609 2443416 2374702 2310862 2297332 2346396 2359950 2378224 2320593 2364056 2364030 2433148
5955 2433148 2545978 2518927 2506180 2530708 2643226 2749791 2752025 2758737 2785952 2828750 2838470
5944 2838470 2832898 2875360 2914894 2960122 3025529 3097782 3154102 3216401 3212946 3276623 3352460 3410344
5932 3410344 3404434 3472564 3558181 3598374 3558101 3613091 3658896 3675232 3707848 3705604 3775172 3833107
5920 3833107 3834739 3877399 4042656 4066716 4000889 4047674 4085803 4105324 4097178 4105350 4127884 4184979
5908D184979P7655R8072J85307R4107M1748J29456J37958M1646J78406J39854
5898E309188K69578J89672J25621J67921K19941K18353J30080K63454J87279J87530
5888G268617K58213K83786K46458K11459K62424K75132L27664K89868K73780K66492
5878I963893K93840L68040L75806K48922L66898N40612N97963O59959P68072R49870
5868A5133875J022794J043673J180738J155837J334123J479054J598439J759995
5860B5708528J947537K149556K431799K651455K857672K983898L179146L376851
5852D7286442L395922L532544L724567L755569L451805L167495L332309L847237
5844G5493890M371359N012524N582828O016278O627300P417291Q320890R680716
$$ plain form
5908 4184979 4262634 4360706 4546013 4640120 4681868 4811324 4949282 4990928 5169334 5309188
5898 5309188 5578766 5768438 5894059 6061980 6281921 6500274 6630354 6893808 7081087 7268617
5888 7268617 7526830 7810616 8057074 8268533 8530957 8806089 9133753 9423621 9697401 9963893
5878 9963893 10257733 10625773 11001579 11250501 11617399 12158011 12755974 13415933 14184005 15133875
5868 15133875 16156669 17200342 18381080 19536917 20871040 22350094 23948533 25708528
5860 25708528 27656065 29805621 32237420 34888875 37746547 40730445 43909591 47286442
5852 47286442 50682364 54214908 57939475 61695044 65146849 68314344 71646653 75493890
5844 75493890 79865249 84877773 90460601 96476879 103104179 110521470 118842360 128523076
5836A28523076J1517753J3687648J5724481J7952118K1585873K6876090L3714396
5829B69581435M0630981M6134588M8442474M4691000K9313845L821867k3658368
5822D58957822m3723821n0561718m8604467m3993404l8364103l1988319k6191809
5815A75530181k1294234j7398748j4306782j2030936j0350200r029355p749541
5808H3370385o629133n567735m789264m161198l707640l238134k921617k708749
5800D9646915k563704k431341k313836k215999k035362j779473j629207j350020
5792C3327973j205916j080704j001540r56924r72910j011995r83586r01792q18308
5783B4394298p21408o47441n23221n54972n97386n75944n78809n76418o66978
$$ plain form
5836 128523076 140040829 153728477 169452958 187405076 208990949 235867039 269581435
5829 269581435 310212416 356347004 404789478 449480478 478794323 482616190 458957822
5822 458957822 415234001 364672283 316067816 272074412 233710309 201721990 175530181
5815 175530181 154235947 136837199 122530417 110499481 100149281 91119926 83370385
5808 83370385 76741252 71173517 66384253 62223055 58515415 55277281 52355664 49646915
5800 49646915 47083211 44651870 42338034 40122035 38086673 36307200 34677993 33327973
5792 33327973 32122057 31041353 30039813 29082889 28109979 27097984 26114398 25212606 24394298
5783 24394298 23672890 23025449 22502228 21947256 21349870 20773926 20195117 19618699 18951721
5774A8951721o03219o08502n61835n21753m44970m85211m77734m26439l80039
5765A4442019k79834l28425l56332k80032k21488k00538k08605j45977j46483
5756A2274305j53490p5014r3998j39756o6147K3912Q359q8278k6627l56n0093
5745A1612817j09887j3054n8636j59700o1526o3410r6947l2314n7197r4181l1786
5734A0834179K2776j3586J9781O9934R1462L1582J29856J59984J06176J96641
5724A1648785K12171J42242K17085L17653L20938L55524L33538M38813M81843
5715A4468592N26077N88158O89564O79218P58582P87599R38514J013301R68689
5706B1418294J171790J249504J271102J447043J570377J620647J631465J755751
$$ plain form
5774 18951721 18348502 17740000 17178165 16656412 16211442 15726231 15248497 14822058 14442019
5765 14442019 14162185 13833760 13477428 13197396 12975908 12775370 12566765 12420788 12274305
5756 12274305 12120815 12045801 11951803 11812047 11745900 11769812 11778171 11689893 11663266 11662910 11612817
5745 11612817 11502930 11489876 11431240 11271540 11210014 11146604 11049657 11017343 10960146 10865965 10834179
5734 10834179 10856955 10843369 10863150 10933084 11024546 11056128 11185984 11345968 11452144 11648785
5724 11648785 11860956 12003198 12220283 12537936 12858874 13214398 13547936 13986749 14468592
5715 14468592 14994669 15582827 16272391 16951609 17710191 18497790 19436304 20449605 21418294
5706 21418294 22590084 23839588 25110690 26557733 28128110 29748757 31380222 33135973
5698C3135973J899749K117653K268502K339173K462479K734082K921639L114848
5690E2994098L456123L771394M074899M488482M983471N460500N997438O680419
5682I1906824P400064Q004851Q638789R204015R610797R785836R772820R600268
5674A63924264R260253Q668375P690514O353061M334073J802776j024238l774308
5666A97234770o005283p667344q746625r542953j0109306j0452563j0590449j0503112
5658A23617135j0108786r585403q787294p989962p180113o379911n595156m977257
5650F3013253m389245l832226l470014l083718k698900k411036k222828k021028
5642C8884258j806277j728519j655343j591271j533320j366357j285838j231836
$$ plain form
5698 33135973 35035722 37153375 39421877 41761050 44223529 46957611 49879250 52994098
5690 52994098 56450221 60221615 64296514 68784996 73768467 79228967 85226405 91906824
5682 91906824 99306888 107311739 115950528 125154543 134765340 144551176 154323996 163924264
5674 163924264 173184517 181852892 189543406 195896467 200230540 202033316 201009078 197234770
5666 197234770 191229487 183562143 174815518 165272565 155163259 144710696 134120247 123617135
5658 123617135 113508349 103922946 95135652 87145690 79965577 73585666 67990510 63013253
5650 63013253 58624008 54791782 51321768 48238050 45539150 43128114 40905286 38884258
5642 38884258 37077981 35349462 33694119 32102848 30569528 29203171 27917333 26685497
5634B6685497j130100j086768r64017q95148q39500q54162p77812p15485o42813
5625A8779692o35113o15775o44907n98175n30660m35750m30694m69215m99248
5616A3920155m15371k74368l24121k53759j91373j72094k83523l34557l88842
5607A1282147l91967l41632l60601l43993l54128k74917k94414k28822j98879
5598H492794k35755j63495j58389k31787j70437j51991j52033j79215j56356j72085
5588F721251j17311j26636j63451j11763j21369p7444q0648j25324o0644N233
5578E741894o7891r5586j46744j06814j73412j47406j21655j36405r4940j10934
5568D540107j40491l0619r1887j17106m9401l0850j06978k8381l9776k6030j04066
$$ plain form
5634 26685497 25555397 24468629 23504612 22609464 21769964 20915802 20137990 19422505 18779692
5625 18779692 18144579 17528804 16883897 16285722 15755062 15319312 14888618 14419403 13920155
5616 13920155 13504784 13230416 12906295 12652536 12461163 12289069 12005546 11670989 11282147
5607 11282147 10890180 10548548 10187947 9843954 9489826 9214909 8920495 8691673 8492794
5598 8492794 8257039 8093544 7935155 7703368 7532931 7380940 7228907 7049692 6893336 6721251
5588 6721251 6603940 6477304 6313853 6202090 6080721 6003277 5922629 5797305 5736661 5741894
5578 5741894 5674003 5578417 5431673 5324859 5151447 5004041 4882386 4745981 4651041 4540107
5568 4540107 4399616 4368997 4277110 4160004 4110603 4079753 3972775 3944394 3904618 3878588 3774522
5557C774522n3680r471j01968m4509n2623l4210m3694n2q745o9793n3385k3992
5545C278400M823J7029l5863p6279n742k6296p8075l4113n9927P3069J1644p0184
5533B998486M2279j608K7386r7703k5282o6237p9424N8755L7850l3077k3516L8299
5521B876208m8436p3319K0970j0653M4416P0531J0705O4186n790O473m5560l4094
5509B875637K8369R0223J27547R8174J13704J01088J72315K19192J76431J98172
5499D200852J54972J9752l1675j75159k34779k97450k46639k50637k22381j47273
5489B769583j30134j92789p0701l4232n1144n3308r0648j26335l2517k6171o2114
5478A899490l8892j10623N5673m9229q7842J7490j8180O909J1653o205m72m4951
$$ plain form
5557 3774522 3720842 3711371 3609403 3564894 3512271 3478061 3434367 3434315 3425570 3355777 3302392 3278400
5545 3278400 3283223 3300252 3264389 3188110 3182368 3156072 3077997 3043884 2983957 3057026 3068670 2998486
5533 2998486 3040765 3039157 3066543 2968840 2943558 2877321 2797897 2856652 2894502 2861425 2837909 2876208
5521 2876208 2827772 2754453 2775423 2764770 2809186 2879717 2890422 2954608 2948818 2955291 2909731 2875637
5509 2875637 2904006 2994229 3121776 3219950 3333654 3434742 3607057 3826249 4002680 4200852
5499 4200852 4355824 4375576 4343901 4168742 3933963 3636513 3389874 3139237 2916856 2769583
5489 2769583 2639449 2446660 2375959 2341727 2290583 2237275 2146627 2020292 1987775 1961604 1899490
5478 1899490 1860598 1749975 1805648 1756419 1668577 1686067 1667887 1674796 1686449 1680244 1679772 1634821
5466A634821K1460m412n7221p5630L1768m5058o251L540k7175L8560m8474q0417
5454A385511J0625L3015q709L3868k170K9271q4769O482P8607m3435m1363j5366
5442A381567k156r5188M5732P870L4712q1557K263o615m4844K7262K1080m0450
5430A249676n2995j8958K2127N9091J4347l9392j9493O6451p6112m767J20620
5419A320595L240n5801m6175M8591k618m0161K8452M6017j8351q4146M3103N3860
5407A296606l8430J4464K084q424L0691J3488K1348j050J7592n669O1499J696
5395A405895K3243N3938p234n9204M3328J55097Q7289K3912q30j2237M7510J02717
5383A863424J17563P4210M8598J09825J11891J73396K75467L32213K89061M23646
$$ plain form
5466 1634821 1656281 1651869 1594648 1519018 1550786 1505728 1499477 1503017 1475842 1514402 1465928 1385511
5454 1385511 1396136 1429151 1420442 1454310 1452140 1481411 1396642 1403124 1481731 1438296 1396933 1381567
5442 1381567 1379411 1284223 1329955 1337825 1372537 1290980 1293243 1286628 1241784 1269046 1290126 1249676
5430 1249676 1196681 1177723 1199850 1258941 1273288 1233896 1214403 1280854 1204742 1199975 1320595
5419 1320595 1323835 1268034 1221859 1270450 1267832 1227671 1256123 1302140 1283789 1199643 1242746 1296606
5407 1296606 1258176 1272640 1274724 1266300 1296991 1310479 1331827 1330777 1348369 1342700 1404199 1405895
5395 1405895 1429138 1483076 1475842 1416638 1459966 1615063 1702352 1726264 1725434 1713197 1760707 1863424
5383 1863424 1980987 2055197 2103795 2213620 2325511 2498907 2774374 3106587 3395648 3819294
5373C819294M25436L99736J14536j90071k96289k89613l00512l21063k31071j25153
5363C005230k04975k31833j67192j9667o0395j90784q6207r1108j67954o2816
5353A722299k7557o3271j7245j62741n3215j7234k9681r1721m3270o7148n2837
5342A096379l9023K3607r586k3165l1634l4782O567k8272r3009j1755j0695n165
5330H39467m861o4052k5102M6822k9673k0014r262j0163j5239k660N3878n5719
5318G03422L109O1192n856o4465l8486J5655j813m537l1699L0975O9404n4811
5306F82090k8076j256K5059n0165J5850P215j7837P1736J6891q7968J8729K000
5294F54268o4295Q7419M9656q3403K6969r576m9743j8790j0298L679J0333P9117
$$ plain form
5373 3819294 4244730 4644466 4759002 4568931 4272642 3983029 3682517 3361454 3130383 3005230
5363 3005230 2800255 2568422 2401230 2381563 2321168 2130384 2044177 1953069 1785115 1722299
5353 1722299 1694742 1631471 1614226 1451485 1398270 1381036 1351355 1259634 1216364 1149216 1096379
5342 1096379 1057356 1080963 1071377 1048212 1016578 981796 988363 960091 867082 855327 844632 839467
5330 839467 834606 770554 745452 792274 762601 742587 733325 723162 707923 705263 759141 703422
5318 703422 706531 767723 761867 697402 658916 674571 672758 668221 636522 667497 736901 682090
5306 682090 654014 652758 677817 627652 643502 650717 632880 704616 721507 633539 652268 654268
5294 654268 589973 677392 727048 643645 670614 661038 611295 592505 582207 585886 596219 675336
5282F75336P244P202q6901j03153M1860J3073m1961j2540N9449J89m5680j4714
5270D99404J4449O8102k0666K757j4228m4054j7518L9775l1266R4570J9438j20396
5258D90367P625J08507p6302j8379K5279J3683K2905l8864j0939m6498J7269q429
5246D86224K6080J8786p4187M5758O92n6904l88N35O491j0761m6133P0481M1306
5233E07980m8341r193J8027N4864m2896J197k1817q375J371l3651J4038J0301
5221D43505J7090J8332p4463K7377R368L490l2096L0527J9202j6067o1940K6616
5209D10941N7946J3449J250J3429l7467M2501q1678k2744M7395K3532K9125l1651
5197D66028q128J3531L518K6115M5158j5647n7425M260O6524r344l9771L0296
$$ plain form
5282 675336 682580 689782 602881 499728 541588 554661 512700 500160 559609 559798 514118 499404
5270 499404 513853 581955 561289 564046 549818 505764 488246 528021 496755 591325 610763 490367
5258 490367 497992 606499 530197 511818 537097 550780 573685 534821 523882 477384 494653 486224
5246 486224 512304 531090 456903 502661 503353 446449 446061 446596 453087 442326 396193 466674 507980
5233 507980 459639 450446 468473 523337 480441 481638 459821 451446 452817 419166 433204 443505
5221 443505 460595 478927 404464 431841 441209 444699 412603 443130 462332 446265 384325 410941
5209 410941 468887 482336 483586 497015 459548 502049 420371 397627 445022 468554 497679 466028
5197 466028 457900 471431 474949 501064 546222 530575 473150 477410 543934 534590 494819 525115
5185E25115K0492q9290m479Q6581O456l9022L6792K7353Q606Q794j1458O0241
5173F36181K1223m419k3233N8279K6855l3428O8687r798n025O135L9256O4033
5161H44746k4220Q368N0884l6768L3155L1891n9678j3818N5002j7662m6117O2980
5149H88763K8795j401Q6223J8868n6244Q4617K1912j9082K7121j2179M5673k0113
5137A092953P0316j0624L7020j1919M32M8380O3356m8814m1331M788m1524j4830
5125A148203j4053j4439M2781n5401Q34j8105J0454O2835l1377j3618J9004J868
5113A138986M7176J9949J0903K6501k8213J3390k3560N924l0566L0886N726k1169
5101A195933o711M772l2251l8969m2785K9688J6897N4040l04j8046R559J3354
$$ plain form
5185 525115 545607 456317 451838 538419 544875 505853 542645 569998 578604 587398 575940 636181
5173 636181 657404 652985 629752 688031 714886 681458 750145 740347 735322 741457 780713 844746
5161 844746 820526 828894 879778 843010 876165 908056 848378 834560 889562 871900 825783 888763
5149 888763 917558 916157 1002380 1021248 965004 1049621 1071533 1052451 1079572 1067393 1113066 1092953
5137 1092953 1163269 1152645 1189665 1177746 1178178 1226558 1289914 1241100 1199769 1204557 1163033 1148203
5125 1148203 1134150 1119711 1162492 1107091 1107925 1089820 1100274 1163109 1131732 1118114 1137118 1138986
5113 1138986 1186162 1206111 1217014 1243515 1215302 1228692 1205132 1211056 1180490 1211376 1217102 1195933
5101 1195933 1189222 1193994 1161743 1122774 1079989 1109677 1126574 1180614 1180310 1162264 1171823 1185177
5089A185177n3757M5645M5267k0395K1246L8922K9750Q169J5336K8629m4368j02097
5077A197524l4188M2922k6457r1513L4230j2057l2563M325M6535l9201L7601J4816
5065A141974m4687M8148L2382L2694q0409j8840Q417M5069K1694L796O6449k228
5053A254459P2529J2042n4238J4158K9855m663j5865M9873J24344J0959Q042n7778
5041A443717J020l1164K8241M2524n3921J4249R95R542K7837o5430N8863K5771
5029A502244j3086j3881k6525L5228K8930M3426J7633j0753O6539N9128j0883
5018A678000O8123N2519Q4217O7305J02311R2059k5062M5370P3673K2305p8518
5007B182302k2099J7660p976j1265o6347K200P800P5530l7863M1645O1950K4478
$$ plain form
5089 1185177 1131420 1177065 1222332 1201937 1223183 1262105 1291855 1300024 1315360 1343989 1299621 1197524
5077 1197524 1163336 1206258 1179801 1088288 1122518 1110461 1077898 1082223 1128758 1089557 1127158 1141974
5065 1141974 1097287 1145435 1177817 1210511 1130102 1111262 1119679 1164748 1186442 1190238 1256687 1254459
5053 1254459 1326988 1339030 1284792 1298950 1328805 1324142 1308277 1358150 1482494 1493453 1501495 1443717
5041 1443717 1444737 1413573 1441814 1484338 1430417 1444666 1445661 1455203 1483040 1417610 1476473 1502244
5029 1502244 1489158 1475277 1448752 1483980 1512910 1556336 1573969 1563216 1629755 1688883 1678000
5018 1678000 1746123 1798642 1882859 1950164 2052475 2144534 2119472 2164842 2238515 2260820 2182302
5007 2182302 2160203 2177863 2169887 2158622 2092275 2094475 2102275 2177805 2139942 2181587 2243537 2268015
4995B268015K858N0935N3428M8679N6697P0741J56692P7089R8330R3816J56416
4984C133696J51680J26437K11110K24836J36791J14895R7910N0472J31708R6828
4974D476363N7922O6742J962l0410p4372r7562j63500j30592r9451q5579j01122
4963C820401j68877j0494p051k7322q2588l6021j0804J7599m455m443N056O3181
4951C554182K4550M1568J17369L1596o5075L8546R0304R2094K7845L156M5152
4940D001287O3405J1946N5579P9410J8943j1245J1511k831K4256L6427M5299K8852
4928D362839O0410J28235N2629M1955O8253N7768J3284j4659O1029O8539O9012
4917D969294Q6114M8516Q0397R8768R7211J18517Q4433J18166J20359J39694J08039
$$ plain form
4995 2268015 2270873 2321808 2375236 2423915 2480612 2551353 2708045 2785134 2883464 2977280 3133696
4984 3133696 3285376 3411813 3622923 3847759 3984550 4099445 4197355 4247827 4379535 4476363
4974 4476363 4534285 4601027 4602989 4572579 4498207 4400645 4237145 4106553 4007102 3921523 3820401
4963 3820401 3651524 3641030 3633979 3606657 3524069 3488048 3477244 3494843 3490388 3485945 3491001 3554182
4951 3554182 3578732 3620300 3737669 3769265 3704190 3742736 3833040 3925134 3952979 3956135 4001287
4940 4001287 4064692 4076638 4132217 4211627 4230570 4219325 4230836 4228005 4252261 4288688 4333987 4362839
4928 4362839 4423249 4551484 4604113 4646068 4714321 4772089 4785373 4770714 4831743 4900282 4969294
4917 4969294 5055408 5103924 5184321 5283089 5380300 5498817 5583250 5701416 5821775 5961469 6069508
4906F069508N6168J86309J04181J22403J69171J76701J56894K11416J66924K17402
4896G637077J78302K12343L03057L20190L18461L35050L38784L72730M16398M96904
4886A0929296M49287N36541N35254N93155O68679O27889O89736Q52207Q21422
4877A6703466Q82284R99867J029388J139703J274153J345300J495594J593226
4869B6462981J731284J846432K078256K331712K559161K638708K890207L096976
4861D5635717L143834L043819K854040K647621K237000J682317J222761P19994
4853F3187103L29882M8401j53548j45608m5510K53817N39468Q00699J215873J626331
4843F7656908J962128K429762K906051L462745L943519M454908M909168N385068
$$ plain form
4906 6069508 6125676 6311985 6416166 6538569 6707740 6884441 7041335 7252751 7419675 7637077
4896 7637077 7815379 8027722 8330779 8650969 8969430 9304480 9643264 10015994 10432392 10929296
4886 10929296 11378583 11915124 12450378 13043533 13712212 14340101 15029837 15882044 16703466
4877 16703466 17585750 18585617 19615005 20754708 22028861 23374161 24869755 26462981
4869 26462981 28194265 30040697 32118953 34450665 37009826 39648534 42538741 45635717
4861 45635717 48779551 51823370 54677410 57325031 59562031 61244348 62467109 63187103
4853 63187103 63516985 63565386 63411838 63266230 63220720 63474537 64014005 64814704 66030577 67656908
4843 67656908 69619036 72048798 74954849 78417594 82361113 86816021 91725189 97110257
4835I7110257N707138N917751N692800N149583M140825K831199R74507j056590
4827A26467470k961378m527890n573652n897595n830972n402109m751960m109423
4819H7412491l395256k589242k018405j351809p45882k00350M12177Q61826J332390
4810G9717940J774458K066520K130658J894633J334834N76689m77752j512872
4802H7505108k664242l485419m118236m566125m692523m654295m423415m181399
4794E4719454l725956l428958l080694k664337k520508k273367k010999j867094
4786C3147541j681677j480485j386400j227170j092945j005309r56047q35845
4778B3481663p84911q06376p71101p37716o02424m68463m29192m93666m36497
$$ plain form
4835 97110257 102817395 108735146 114427946 119577529 123718354 126549553 127524060 126467470
4827 126467470 123506092 118978202 113404550 107506955 101675983 96273874 91521914 87412491
4819 87412491 84017235 81427993 79409588 78057779 77311897 77111547 77523724 78385550 79717940
4810 79717940 81492398 83558918 85689576 87584209 88919043 89495732 89017980 87505108
4802 87505108 84840866 81355447 77237211 72671086 67978563 63324268 58900853 54719454
4794 54719454 50993498 47564540 44483846 41819509 39299001 37025634 35014635 33147541
4786 33147541 31465864 29985379 28598979 27371809 26278864 25273555 24317508 23481663
4778 23481663 22696752 21890376 21119275 20381559 19779135 19310672 18881480 18387814 17951317
4769A7951317l94059m17966l49931k87138l43552k23706j94114l16974k13391
4760A5210486k16368k53796k07534j66732k27650j26738j3786j17780p1986j06726
4750A3701390l5568q205p0525K0020J3977P3964J03790R2931J32449J33047P8513
4739A4235783J41727J82258J81531J42105K18341K52633K75085K02328K46620
4730A6078411K80633K32419K94718L18478L16142L86969L86280M15043M54544
4721A9163637N64973N62033O67271P86719P45693R81299R84760J123732J280316
4712B6860433J333456J385376J589570J634954J845152K071577K137838K312108
4704D1170464K546484K787589K915190L063490L297687L594341L816111M026542
$$ plain form
4769 17951317 17557258 17139292 16789361 16502223 16158671 15934965 15740851 15423877 15210486
4760 15210486 14994118 14740322 14532788 14366056 14138406 14011668 13997882 13880102 13808116 13701390
4750 13701390 13665822 13657617 13587092 13607112 13621089 13695053 13798843 13891774 14024223 14157270 14235783
4739 14235783 14377510 14559768 14741299 14883404 15101745 15354378 15629463 15831791 16078411
4730 16078411 16359044 16591463 16886181 17204659 17520801 17907770 18294050 18709093 19163637
4721 19163637 19728610 20290643 20957914 21744633 22490326 23471625 24456385 25580117 26860433
4712 26860433 28193889 29579265 31168835 32803789 34648941 36720518 38858356 41170464
4704 41170464 43716948 46504537 49419727 52483217 55780904 59375245 63191356 67217898
4696F7217898M270615M392365M582940M863578N200879N588647O044063O570309
4688A08731294P103523P738920Q539145R401576J0471320J1819113J3399976J5247183
4680A92452050J7422678K0068138K3188341K6787719K9896896L2010286L1953162
4673C73779270K8550089K0915417R213991m047038j5772442k3500645k6872934
4666C62265708k7294883k5940900k3537771k0599159j7559862j4951318j2797415
4659B19584400j1109711r865193q850055q024131p242790o506593n757753n025186
4651A57202988m353967l796768l190079k550576j911368j294951p16486j80177
4643A39208616K48195O06719R78181J179255J232571J139808Q03914L25662m57460
$$ plain form
4696 67217898 71488513 75880878 80463818 85327396 90528275 96116922 102160985 108731294
4688 108731294 115834817 123573737 132112882 141514458 151985778 163804891 177204867 192452050
4680 192452050 209874728 229942866 253131207 279918926 309815822 341826108 373779270
4673 373779270 402329359 423244776 432458767 428411729 412639287 389138642 362265708
4666 362265708 334970825 309029925 285492154 264892995 247333133 232381815 219584400
4659 219584400 208474689 198609496 189759441 181735310 174492520 167985927 162228174 157202988
4651 157202988 152849021 149052253 145862174 143311598 141400230 140105279 139388793 139208616
4643 139208616 139456811 140063530 141041711 142220966 143453537 144593345 145397259 145722921 145265461
4634A45265461j207137j979059k604063l271791l666218l948702m187690m336475
4626A20064326m338392m289906m222664m032346l818198l559674l217864k783419
4618H9801863k577446k238500k008044j657024j596039j464301j382153j367666
4610G5510690j432227j488833j669722j789308j912548k050006k220063k299718
4602F0648265k427645k483949k385751k427557k425776k313325k185191k128054
4594D1871017j978426j882258j722051j703590j489316j408240j300630j215894
4586B9170612j114184j036062r45313r85087q74365q17049o99704o55798n85816
4577B1457234p14641o59727n14029o21582m41349m11989m77646m64601m38153
$$ plain form
4634 145265461 144058324 142079265 139475202 136203411 132537193 128588491 124400801 120064326
4626 120064326 115725934 111436028 107213364 103181018 99362820 95803146 92585282 89801863
4618 89801863 87224417 84985917 82977873 81320849 79724810 78260509 76878356 75510690
4610 75510690 74078463 72589630 70919908 69130600 67218052 65168046 62947983 60648265
4602 60648265 58220620 55736671 53350920 50923363 48497587 46184262 43999071 41871017
4594 41871017 39892591 38010333 36288282 34584692 33095376 31687136 30386506 29170612
4586 29170612 28056428 27020366 26075053 25089966 24215601 23398552 22698848 22043050 21457234
4577 21457234 20742593 20082866 19568837 18947255 18505906 18093917 17616271 17151670 16713517
4568A6713517l73721m13936m32715l51104l27725l01894l24805l17557l22527
4559A3547533l45660k16973k54165j57361k40271l04905j91370j62673j84725
4550A1489430k28900j03681j81564k10305k24545r9001j67715j83883k06212k14325
4540I669299j42459p5236j58192j39618j21678j62061j03897j59377j36573j60532
4530H309676j61768k01785p2262p0933j03770j00119m3380m8401j70708p9088
4520G257462q3260m3508p5586p4992p8540q5039j21290j09419j12395m5745j21254
4509F306434j04900j17009n4608j33440j07177j3498r5468r6737p0878m9869j1962
4498E450888k0888o4958j09175J3857m0670j70386k3728r5703m4931j48042j8009
$$ plain form
4568 16713517 16339796 15925860 15493145 15142041 14814316 14512422 14187617 13870060 13547533
4559 13547533 13201873 12984900 12730735 12573374 12333103 12028198 11836828 11674155 11489430
4550 11489430 11260530 11156849 10975285 10764980 10540435 10441434 10273719 10089836 9883624 9669299
4540 9669299 9526840 9451604 9293412 9153794 9032116 8870055 8766158 8606781 8470208 8309676
4530 8309676 8147908 7946123 7873861 7802928 7699158 7599039 7555659 7507258 7336550 7257462
4520 7257462 7174202 7130694 7055108 6980116 6901576 6816537 6695247 6585828 6473433 6427688 6306434
4509 6306434 6201534 6084525 6029917 5896477 5789300 5775802 5680334 5583597 5512719 5462850 5450888
4498 5450888 5430000 5365042 5255867 5269724 5229054 5058668 5034940 4939237 4894306 4746264 4728255
4487D728255J7293p4686j3600L439k6701n4536j84999m5393o5148p3590N087r2538
4475D122883l74n135n8389p7684p7826n803l0623j6809j0422o2911p1644j2171
4463C693092k2044p0005k7693j2377n5393m2725m7010N147k909j8961L0747j9889
4451C409980o5265m9156J8217l4281j7700j479r8795n1428K5811O1881j16331
4440C081454o8388k2616j6193n3006m3511k5574n6450J4082K0943N021J9940k5471
4428B830231n3981j0438m1088K6658m9027r360M2985m4676o1460Q3145K8125j3580
4416B727534k1474J8239K0865o8060Q767J187N5264J6099m3765J694k1524P980
4404B702806L9695L1633k4463M0839m4945p5217L9771M0857J48431R766j26168
$$ plain form
4487 4728255 4745548 4670862 4657262 4660701 4634000 4579464 4394465 4349072 4283924 4210334 4215421 4122883
4475 4122883 4122509 4117374 4058985 3981301 3903475 3897672 3867049 3850240 3839818 3776907 3705263 3693092
4463 3693092 3671048 3601043 3573350 3560973 3505580 3462855 3415845 3420992 3418083 3399122 3429869 3409980
4451 3409980 3344715 3295559 3313776 3279495 3261795 3260316 3161521 3110093 3135904 3197785 3081454
4440 3081454 3013066 2990450 2974257 2921251 2877740 2852166 2795716 2809798 2830741 2835762 2855702 2830231
4428 2830231 2776250 2765812 2724724 2751382 2702355 2692995 2735980 2691304 2629844 2712989 2741114 2727534
4416 2727534 2706060 2724299 2745164 2677104 2685871 2687058 2742322 2758421 2714656 2716350 2694826 2702806
4404 2702806 2742501 2774134 2749671 2790510 2745565 2670348 2710119 2750976 2899407 2909173 2783005
4393B783005J6189K6620J1171r559L9182l5515l0863L1357N1960Q4528Q2410L5921
4381C086406Q7163N532K050J03619R6573J06840O9506Q4239J47355Q3318P2992
4370C945593J43571J80545R435J03827R4726l2556q3309j23539j38591q1244j58020
4359C860438j30375k7086p5315j00035j83072j16574o3265J3538q1548m953n7659
4348C034094q4888q4298k4357N1765J9632o2335j31487o5471N7670m9181l6100
4337B625044m0894j1341q9030n5354J5034m7378n4337M0252k6202j4448N1877
4326B393223j2877l1627o3315K187o7305L2903p4270Q770k5473j9476N817r5108
4314B053449k7518l5591o7318j6247J2909q3875k2569L1239o6542m8864j262k1327
$$ plain form
4393 2783005 2799194 2825814 2836985 2827426 2866608 2831093 2800230 2831587 2883547 2968075 3050485 3086406
4381 3086406 3173569 3179101 3181151 3284770 3381343 3488183 3557689 3641928 3789283 3872601 3945593
4370 3945593 4089164 4269709 4279144 4382971 4477697 4445141 4361832 4238293 4099702 4018458 3860438
4359 3860438 3730063 3702977 3627662 3527627 3344555 3227981 3164716 3178254 3096706 3091753 3034094
4348 3034094 2949206 2864908 2840551 2892316 2911948 2849613 2718126 2652655 2710325 2661144 2625044
4337 2625044 2584150 2572809 2483779 2428425 2443459 2396081 2341744 2381996 2355794 2341346 2393223
4326 2393223 2380346 2348719 2285404 2287591 2220286 2253189 2178919 2187689 2162216 2142740 2148557 2053449
4314 2053449 2025931 1990340 1923022 1906775 1919684 1835809 1813240 1844479 1777937 1729073 1727811 1706484
4302A706484l3685n281n6821k3520J1343J916L2969l9261K8177l0402l3230j424
4290A557265J3796q601l9327m423j2991k0746N7304J4392p1395l9860l8097O151
4278A413468L04K0466J2164l3353R745l4874j9080J1098j6213L5130j4224m1420
4266A343211j9564l8135K6280j3684K615R738l3241m628n3922M5407L5938l4736
4254A265279k4467J1246r928K7783K9815k9912j7446P6720j3759k9579m2930l8335
4242A204487N4413j3413k513j02317n4729J111N5934O0632L1746m7352K1305j2260
4230A197044p169j5806j1901j0825M0400R687J00Q5589m4188J1086M5978L3116
4218A333111l183o7813l0178j0622J7042P5982p8947n6031N6617N951j02502l0147
$$ plain form
4302 1706484 1672799 1667518 1610697 1587177 1598520 1600436 1633405 1594144 1622321 1591919 1558689 1557265
4290 1557265 1571061 1562460 1523133 1518710 1505719 1484973 1542277 1556669 1485274 1445414 1407317 1413468
4278 1413468 1413772 1434238 1446402 1413049 1422794 1387920 1368840 1379938 1363725 1398855 1384631 1343211
4266 1343211 1323647 1285512 1311792 1298108 1300723 1310461 1277220 1272592 1218670 1264077 1300015 1265279
4254 1265279 1240812 1252058 1242130 1269913 1299728 1269816 1252370 1329090 1315331 1285752 1242822 1204487
4242 1204487 1258900 1245487 1242974 1140657 1085928 1087039 1142973 1203605 1235351 1187999 1209304 1197044
4230 1197044 1189875 1174069 1162168 1151343 1191743 1201430 1201530 1287119 1242931 1254017 1299995 1333111
4218 1333111 1329928 1262115 1231937 1221315 1238357 1314339 1235392 1179361 1235978 1241929 1139427 1109280
4206A109280k185p870L3332j5928k7728R494J4180k8957j1650m235K6238N8499
4194A152470l3119n3029M0539n1296L0368k3651M1059K1172l924k4405l7622J3021
4182A071583n0583O1961k6306m3121p4742l9830O0298O4354M5816o2492o7751
4171I39187K5386j3148j2784l2999q074j64M6671J6939j6963N0523q229q3721
4159I02624J200m5741j8974j07K2862Q986M5122M5627M106o0423J0689N364k0761
4146I00574J0035N0581l5771m6655K8073j4378N895J0550r5561M8926Q8167k4373
4134I26063l4382n8451K1044L922Q03j4570o8731j4713K1661L7371M8743p3845
4122G94915L7953j1522j1189m1787j6612n874l1948P5839Mj8976N9108k3001l5838
$$ plain form
4206 1109280 1107095 1099225 1132557 1116629 1088901 1098395 1112575 1083618 1071968 1067733 1093971 1152470
4194 1152470 1119351 1066322 1106861 1055565 1085933 1062282 1103341 1124513 1120589 1096184 1058562 1071583
4182 1071583 1021000 1082961 1056655 1013534 938792 898962 959260 1023614 1069430 1006938 939187
4171 939187 964573 951425 938641 905642 897568 897404 944075 961014 944051 994574 986345 902624
4159 902624 903824 858083 839109 839002 861864 870850 915972 961599 965705 905282 915971 921335 900574
4146 900574 910609 961190 925419 878764 906837 892459 898354 908904 813343 862269 950436 926063
4134 926063 891681 833230 854274 858196 858999 844429 775698 760985 782646 820017 868760 794915
4122 794915 832868 821346 810157 768370 751758 745884 713936 789775 789779 770803 829911 806910 771072
4109G71072p2662J7863L7867J6481r899p590l6738R593o4346L8035N7000J504
4097G58180n1852m3955Q3083J0877K2383o0606N5965r9459j9470O9585k5346k6544
4085F72841P097K6355N9747n4829n2415k7154r631l873j10K1233P51L0127L1334
4072G01473n1394l7224k2L8400K5400r955R317K1965L432n9138N8082l6238o3898
4059F00200j421N2805N463l0378L0870L9487R676k0183l3504j4826j1915o054
4047F20220J3419O3548J902l0629k392l7203l6970J1407m7948K4281J4089J4838
4035F08562l7698j4397K3789K7471L7689O0568m6470l827K8764j7059k9622J7699
4023F55469M077j8598K1735m2671m7219L1144K2031l3224J864O4863N3136p1688
$$ plain form
4109 771072 698410 716273 754140 770621 760722 753132 716394 725987 661641 699676 756676 758180
4097 758180 706328 662373 745456 756333 778716 718110 774075 674616 655146 724731 699385 672841
4085 672841 679938 706293 766040 711211 658796 631642 622011 618138 618028 639261 640012 670139 701473
4072 701473 650079 612855 612833 651233 676633 666678 675995 697960 701392 642254 700336 664098 600200
4059 600200 598779 651584 657047 626669 657539 697026 706702 686519 653015 638189 626274 620220
4047 620220 633639 697187 699089 668460 666068 628865 591895 603302 555354 579635 593724 608562
4035 608562 570864 556467 580256 607727 645416 705984 659514 655687 684451 667392 637770 655469
4023 655469 659546 640948 662683 620012 572793 603937 625968 592744 594608 659471 712607 640919
4011F40919O381J3044k3574O737R216K8420j0794K4153J2238m39p5524j2422Q8257
3998G06612k937m1877l4668N7351p498k1896m3352J6723M337j5824q926M1496
3986F49541k4078J5614k6750K597N3051n2893L3043M1388p6991L1068o8375m3420
3974E33795M3122N2510O7879o9095l8178K8451m0339n496L6884P479K857M767
3962F24636j62K1077m7366K7560R302j2217Q3077q7460O8447N650M35k9801L2812
3949F95990j6135m1328N245O0033L3840n3070j01026K5845J55883l1895J157M4042
3937G78581Q772J9127L9547p6992M1643J9799L2082m737n0880k0498k3352L6438
3925G99530K7510j7718L3266N8567o7791o0334J0873N4102Q1787j442P4434L2898
$$ plain form
4011 640919 647300 660344 636770 643507 652723 681143 670349 694502 706740 706301 630777 618355 706612
3998 706612 703675 661798 627130 684481 676983 655087 611735 628458 632795 616971 608045 649541
3986 649541 625463 641077 614327 616924 669975 617082 650125 691513 614522 645590 577215 533795
3974 533795 576917 629427 697306 628211 590033 618484 578145 572649 609533 617012 619869 624636
3962 624636 624474 645551 598185 625745 635047 622830 705907 618447 686894 692544 692979 663178 695990
3949 695990 679855 638527 643772 703805 737645 684575 583549 609394 765277 733382 734539 778581
3937 778581 787353 806480 846027 769035 810678 830477 862559 857822 806942 786444 763092 799530
3925 799530 827040 809322 842588 901155 833364 773030 783903 838005 919792 918350 992784 1025682
3913A025682r0998j1580M1893k9463n8693K0712K2840k1575k641K999k3203O1484
3901I37457N9581J1714K2447j5434L5215J7860J6122l9625J6639M9023K3238J9383
3889A153620k7727q562J08851l0431l5272k3304o7629J1508P057l9469l5956N558
3877A018244l0276l0706K6305K0414K952J2873N0569N6215m6471k4099M3921N0083
3865A150024L253q3752N030k0372k2773O1560J2823n1303k0593m942n2379M2671
3853A019247J6565r551l1716l4554k9342O6514k8781M8403J8322j7514k3577K0662
3841A014678J8064J2892r368j9917l0380k1501M7950Q2045k8428m8859m7988j336
3829I67852o5660L215O2173L6933J2225q5735o519Q6211j9222k921k65m3740N3404
$$ plain form
3913 1025682 934684 923104 964997 935534 876841 897553 920393 898818 896177 899176 875973 937457
3901 937457 997038 1008752 1031199 1015765 1050980 1068840 1084962 1045337 1061976 1110999 1134237 1153620
3889 1153620 1125893 1117331 1226182 1195751 1160479 1137175 1069546 1081054 1088111 1048642 1012686 1018244
3877 1018244 987968 957262 983567 1003981 1006933 1019806 1070375 1126590 1080119 1056020 1099941 1150024
3865 1150024 1153277 1069525 1074555 1054183 1031410 1092970 1105793 1054490 1033897 1028955 976576 1019247
3853 1019247 1035812 1026261 994545 959991 930649 997163 968382 1016785 1035107 1017593 994016 1014678
3841 1014678 1032742 1045634 1036266 1016349 985969 964468 1012418 1094463 1066035 1017176 969188 967852
3829 967852 902192 905407 967580 1004513 1016738 931003 924484 1010695 991473 988552 988287 944547 997951
3816I97951O0279l5273K3151j1079n5140K1037Q258m7827K6639K0316R02M6479
3804A055693P65L9270K961k439l1169J7042m5254k0427K3036p022M0560M2524
3792A115540K1983q9279J1528P2497N339K0690K1165q546L3098N0976j0214Q460
3780A253237l3786j6566o580L284j3498j8243K4278r447k7916R258j4230J2465
3768A162256l9805l2260n7750K3108m2175p7713l8712N5560L2696q559n8099k8120
3756H90427N0314N5184l6802q4885J7998O5242l0603J4632l2799N6282R394l440
3744I70944o0144l6669N7697q93K7818l6018p6654j0763R4238o0356j13655k21
3732G55324M7627q640K8214L4200l2240l3918K734N3837l867k7030L9627K3065
$$ plain form
3816 997951 1058230 1022957 1046108 1035029 979889 1000926 1009184 961357 987996 1008312 1009214 1055693
3804 1055693 1056458 1095728 1098689 1096250 1065081 1082123 1036869 1016442 1039478 1032456 1073016 1115540
3792 1115540 1137523 1048244 1059772 1132269 1137608 1158298 1179463 1170917 1204015 1254991 1244777 1253237
3780 1253237 1219451 1202885 1196305 1199589 1186091 1167848 1192126 1182679 1154763 1164021 1149791 1162256
3768 1162256 1122451 1090191 1032441 1055549 1013374 935661 896949 952509 985205 976646 918547 890427
3756 890427 940741 995925 959123 874238 892236 957478 926875 941507 908708 964990 974384 970944
3744 970944 910800 874131 931828 930935 958753 922735 846081 835318 929556 869200 755545 755324
3732 755324 802951 794311 822525 856725 824485 790567 793301 847138 843271 816241 855868 878933
3720H78933j5217J2983P0648J7731n0217Q02K5729k0288M9695l228q2453L0159
3708I15277L4187l6308q394J6698o2070M7070J0003q229P7263k1063l6394k2728
3696I05312k002J4721J4636j7255L7759J7432L2204q062O0073M8273j6854K8683
3684A114920J7086K714J33536M9885J7094J4186L6720J0300J8652K0969j924P8400
3672A512538J1022q1657r7238L774p527q2932o3107N7407M3640L7522m6377p2996
3660A214069q988K9191L4802J12858K551K2632R8817O3464O6255l8946Q197J8680
3648A623582J20428J13939k248k441O1999O9258L7799o854k881m0666N68m1349
3636A931134j00892q4154l4425j2926j9648o9953q698N6325j2723l1194q780p746
$$ plain form
3720 878933 863716 876699 947347 965078 914861 915663 941392 921104 970799 967571 885118 915277
3708 915277 949464 913156 904762 921460 859390 906460 916463 908234 985497 964434 928040 905312
3696 905312 903310 918031 932667 915412 953171 970603 1002807 994745 1054818 1103091 1086237 1114920
3684 1114920 1132006 1134720 1268256 1318141 1335235 1349421 1386141 1396441 1415093 1436062 1434138 1512538
3672 1512538 1523560 1441903 1344665 1348439 1340912 1257980 1194873 1252280 1295920 1333442 1287065 1214069
3660 1214069 1205081 1234272 1269074 1381932 1384483 1407115 1505932 1569396 1635651 1596705 1604902 1623582
3648 1623582 1744010 1857949 1855701 1853260 1915259 1984517 2022316 2015462 2012581 1971915 1972483 1931134
3636 1931134 1830242 1746088 1711663 1698737 1679089 1609136 1600438 1656763 1644040 1612846 1604066 1596320
3624A596320J12180Q5092K3223M2563J06249k0975N3165P8656O3638J04526j4340
3613B230297Q1962J13440J6763N2688m0720O281J3607l3220J6691J4470N5831
3602B528090m1325l2158K6909J2456m1291j1870J9270K1587L6193N7035P3817
3591B648713J04638M2383P034J39119J35024j4778J44321Q7329J08566J48258
3581C550607N4774O1616J38920Q9028P3313J3349K4682Q2301K6957J05478J40720
3570D361745J45923J65272R4660J71847J97446K10818J38523J82455N6845P1267
3560E796801J23136M2011n0028J2851o8363o4398l3096j10624p8044o2322m1557
3549E466367j64364j26690M8173l6806n9351J6364Q92n2933q553o9664k3402J7813
$$ plain form
3624 1596320 1708500 1793592 1816815 1859378 1965627 1944652 1997817 2076473 2140111 2244637 2230297
3613 2230297 2312259 2425699 2442462 2495150 2454430 2460711 2474318 2441098 2457789 2472259 2528090
3602 2528090 2486765 2454607 2481516 2493972 2452681 2440811 2460081 2481668 2517861 2574896 2648713
3591 2648713 2753351 2795734 2802768 2941887 3076911 3062133 3206454 3293783 3402349 3550607
3581 3550607 3605381 3666997 3805917 3894945 3968258 3981607 4006289 4088590 4115547 4221025 4361745
3570 4361745 4507668 4672940 4767600 4939447 5136893 5347711 5486234 5668689 5725534 5796801
3560 5796801 5919937 5961948 5911920 5924771 5856408 5792010 5758914 5648290 5570246 5507924 5466367
3549 5466367 5302003 5175313 5223486 5186680 5127329 5143693 5144585 5091652 5083099 5013435 4990033 5007846
3537E007846n9649m2627m8981R749m1966J08540J9511K0130J8053M8303L8563
3526E077472P1515K4928J14286P9898J17435J87455J25995J73500K37551J84516
3516F394551K18423K78274L02372L06063K69336L27561L33403L98231L70657M68840
3506I667711L81952L19740L43829K80359K02992N9583o1487o1868o5762k08269
3496A0858780j47305j66233k28379k14140k48401k82057j81520j91401k60854
3487H938490k16929j45465j58120j29460j54361j68363j38859j20197j76143q6501
3477G444092m2103o7613K885m8202n1200j8607j903k0752p6749m0522j5551R3044
3465G156819m870j28568M19j50806j44705j58481j97510k00150k51511l12142
$$ plain form
3537 5007846 4948197 4905570 4856589 4866338 4824372 4932912 4952423 4972553 4990606 5038909 5077472
3526 5077472 5148987 5173915 5288201 5368099 5485534 5672989 5798984 5972484 6210035 6394551
3516 6394551 6612974 6891248 7193620 7499683 7769019 8096580 8429983 8828214 9198871 9667711
3506 9667711 10049663 10369403 10713232 10993591 11196583 11256166 11194679 11132811 11067049 10858780
3496 10858780 10711475 10545242 10316863 10102723 9854322 9572265 9390745 9199344 8938490
3487 8938490 8721561 8576096 8417976 8288516 8134155 7965792 7826933 7706736 7530593 7444092
3477 7444092 7401989 7334376 7337261 7289059 7237859 7219252 7217349 7196597 7119848 7079326 7063775 7156819
3465 7156819 7151949 7023381 7023800 6872994 6728289 6569808 6372298 6172148 5920637 5608495
3455E608495k79777k76360k23425k08244k45015k08925j46154j00221j21745j44126
3445C654503j26513j7469m3027k7584j4629l3545Q1893J26069N6914q1566m8030
3434C527016j35364j48142j36814r7259j23483j38472j02748j04702n2974o6284
3424B420774j03877n5712m4305j9433m230K7358O9502m4281n230R3860L1647p6822
3412B289251J18949J27293J20997J46560J88225K40939K59861K65759O7661j07691
3402C717804k20515k77938k88654k78760k80290j88780j11418j07531n7808l6688
3392A869422m4455o2421k8378m0299j23689j9373K6522k5657K5942J798K8795
3381A608207m0067j4771P0081J12067J21476M9678J15915P9045L8137O4153j9447
$$ plain form
3455 5608495 5328718 5052358 4828933 4620689 4375674 4166749 4020595 3920374 3798629 3654503
3445 3654503 3527990 3510521 3467494 3439910 3425281 3391736 3473629 3599698 3656612 3575046 3527016
3434 3527016 3391652 3243510 3106696 3009437 2885954 2747482 2644734 2540032 2487058 2420774
3424 2420774 2316897 2261185 2216880 2197447 2193217 2220575 2290077 2245796 2240566 2334426 2366073 2289251
3412 2289251 2408200 2535493 2656490 2803050 2991275 3232214 3492075 3757834 3825495 3717804
3402 3717804 3497289 3219351 2930697 2651937 2371647 2182867 2071449 1963918 1906110 1869422
3392 1869422 1824967 1762546 1734168 1693869 1570180 1550807 1577329 1551672 1577614 1579412 1608207
3381 1608207 1568140 1553369 1623450 1735517 1856993 1906671 2022586 2101631 2139768 2203921 2184474
3370B184474j16137k10093j27784r6053j15149n5860q8595m8940k8272j3489q4285
3359A199817p537m3494o1443q3982K4581j4085m1654j5281o2610n8783m336M8584
3347H79777j3216k0135L4642J168m8904O2192m0337k7647K4107m6489R298j6691
3335G97765M668R693N455j8455k5562M1045o6764l1926J308O2790p5745N5809
3323G60081J4052k3954l2129m4377N9157l0414j3631J7477k5418N4013l7037N9633
3311G57453k7393K769k2868o5591N5956l9417m077l1689j0440K5567O1757P633
3299G09660j1313n72J6852q507M3246l791k4113L2155l5775j8681P1239J2406
3287G82806m470J1136m5454j0053Q849j5381K2190J2408j7609K4088Q342K7190
$$ plain form
3370 2184474 2068337 1858244 1730460 1634407 1519258 1463398 1374803 1325863 1297591 1284102 1199817
3359 1199817 1192280 1148786 1087343 1003361 1027942 1013857 972203 956922 894312 835529 831193 879777
3347 879777 866561 846426 881068 882236 833332 895524 855187 827540 851647 805158 814456 797765
3335 797765 802433 812126 817581 799126 773564 814609 747845 715919 717227 780017 704272 760081
3323 760081 774133 750179 718050 673673 732830 702416 688785 706262 680844 734857 697820 757453
3311 757453 730060 732829 709961 644370 700326 660909 656832 625143 614703 640270 702027 709660
3299 709660 698347 697775 714627 706120 749366 745575 721462 753617 717842 699161 770400 782806
3287 782806 778336 789472 744018 733965 742814 727433 749623 762031 744422 768510 776852 804042
3275H04042M8996O0277j1068p4244J9203O4949N1483J5182k225J1781M8350J775
3263A038501j6433j26078K5865R2857J2127o094K3320l1071M7128o5157O1934
3252A056899j4655j7419P6445j3577J05508L1241J9732M195P5247P3296P1457
3241A468369K6306N8552L8078N0178J63057P0302J05102J08143J14742J70326
3231B373155J73523J60344J49051R2462J19656Q8349k8109m465m4710j4452j06885
3220B957919q3169j30158m2803K7914m7335p3252o3348K3939K930M8701Q4383
3209B705721J37799Q6361P9660J56613J19321J88644J04715J01381J70957J65529
3199D016701J71614K89557K80770K09278L14465K87607K53028J79090k1250j28628
$$ plain form
3275 804042 853038 913315 902247 828003 847206 912155 963638 978820 976595 988376 1036726 1038501
3263 1038501 1022068 895990 921855 1014712 1026839 1020745 1044065 1012994 1060122 994965 1056899
3252 1056899 1042244 1024825 1101270 1087693 1193201 1224442 1244174 1248369 1323616 1396912 1468369
3241 1468369 1494675 1553227 1591305 1641483 1804540 1874842 1979944 2088087 2202829 2373155
3231 2373155 2546678 2707022 2856073 2948535 3068191 3156540 3128431 3123966 3079256 3064804 2957919
3220 2957919 2874750 2744592 2701789 2729703 2682368 2609116 2545768 2569707 2572637 2621338 2705721
3209 2705721 2843520 2929881 3009541 3166154 3285475 3474119 3578834 3680215 3851172 4016701
3199 4016701 4188315 4477872 4758642 4967920 5282385 5569992 5823020 6002110 5980860 5852232
3189E852232j79752k87316j83269j55164j38385j73551j08202l8787K6142m8865
3179D565083L2015L344P8586J83812L9230j9997o6057o0819r4259n9866o7654
3168D533418m7995k2406M6602P1465K8880M4065R5874O0500J9944r6330j10520
3157D623497j16914j55721k32536j86523j93410p8539q4885j25144q2174o6088
3147C301563p8400j4979J4703p9062q7965k8839o7750j06778l2788k6795p0125
3136B722785l6100L999j48124r1334q4338p3780j1163o7819o3500q5250p1573
3125A993803m9166p3369j03917L818j1807m9137m814k1358o4020r3566j814M7356
3113A572009q2820o0580j3529m1017l7672k3380j48270l0200n2537K709q263n5512
$$ plain form
3189 5852232 5672480 5385164 5201895 5046731 4908346 4734795 4626593 4587806 4613948 4565083
3179 4565083 4597098 4600442 4679028 4862840 4902070 4882073 4816016 4755197 4660938 4601072 4533418
3168 4533418 4485423 4463017 4509619 4581084 4609964 4654029 4749903 4810403 4830347 4734017 4623497
3157 4623497 4506583 4350862 4118326 3931803 3738393 3659854 3574969 3449825 3367651 3301563
3147 3301563 3223163 3208184 3222887 3143825 3055860 3027021 2959271 2852493 2819705 2792910 2722785
3136 2722785 2686685 2690684 2542560 2451226 2366888 2293108 2281945 2214126 2150626 2065376 1993803
3125 1993803 1944637 1871268 1767351 1771169 1759362 1710225 1705411 1684053 1620033 1526467 1524653 1572009
3113 1572009 1489189 1428609 1415080 1374063 1336391 1313011 1164741 1134541 1082004 1084713 1076450 1020938
3101A020938K3921J0217p1767K176l2320o4078k6571R493l8783l4150L3687N2349
3089H85112j6673J9340K0242l8784P0464q6712J1095k158J5314k3307p1789m0450
3077G41694l2119o6843j2153j6421L2579K411l6676j4960k77o7822P415l1605
3065E05223j9806l6245L5537J1354m5377K9101J0646q005j4932l0735J9356J7869
3053D73986K0248m3167K3668j8160n7440J5506n0785m2822K4915K3236O0653p14
3041D29124n112L8854o5244m1525K1729j2029J9081l6424o2044M689m7707k8608
3029B14784R157N7727R6463n9436K8962M1818k1994K923N3892j4493k3533n34
3017C85736m8766k6205N2852L3070l0253m3745p2565J1896j2958L1557l4722N1358
$$ plain form
3101 1020938 1044859 1055076 983309 985485 953165 889087 862516 872009 833226 799076 832763 885112
3089 885112 868439 887779 908021 869237 939701 852989 864084 861926 877240 853933 782144 741694
3077 741694 709575 642732 630579 614158 646737 649148 612472 597512 597235 529413 536828 505223
3065 505223 485417 449172 484709 496063 450686 479787 490433 482428 467496 436761 456117 473986
3053 473986 494234 451067 474735 456575 399135 414641 363856 321034 345949 369185 429838 429124
3041 429124 424012 462866 397622 356097 377826 365797 384878 348454 286410 291099 243392 214784
3029 214784 223941 281668 378131 318695 347657 389475 367481 370404 424296 409803 386270 385736
3017 385736 336970 310765 363617 396687 366434 322689 250124 262020 249062 280619 245897 297255
3005B97255P170m5322J9833L1980q544j6132m1122L4033l8191R501J8312l9200
2993B29573k0631J0777l2324J1950J6239M0534l2805O891n1918O6774m101P987
2981B48946K3706l6341M2817N492M0849k5130n3005L0342k628J1142n139K4751
2969C05802n467q7798j6259K5295P9377j2845l7744n0326M1108M2272m8192j8498
2957B16725M7266J989l2793p567P228R904p2280l1939k9453m703N4375K7927K8477
2944B15156m7972k0040k0331K2830K5000P1496J5812J9257j3321M918m2080j9170
2932B11555k8774k03N2760O4632o0065K702n685l7412k1257J7606L0917L8835
2920B65611M5005l7434l2480l6050K3478l8531M2640L006j0232K9967J3336J8928
$$ plain form
3005 297255 304425 259103 278936 310916 302372 286240 245118 279151 240960 250461 268773 229573
2993 229573 208942 219719 187395 199345 215584 256118 223313 230204 178286 245060 240959 248946
2981 248946 272652 236311 279128 284620 325469 300339 247334 277676 275048 286190 281051 305802
2969 305802 300335 212537 196278 221573 300950 288105 250361 200035 241143 283415 235223 216725
2957 216725 263991 265980 233187 225620 232848 242752 170472 138533 109080 104377 158752 186679 215156
2944 215156 167184 147144 126813 149643 174643 246139 261951 281208 267887 272805 230725 211555
2932 211555 182781 182578 235338 299970 239905 242607 236922 199510 178253 195859 226776 265611
2920 265611 310616 273182 240702 204652 228130 189599 232239 235245 225013 254980 268316 287244
2908B87244M5994p0339j8321k3937Q440K8962j0740m7047K0060k0537P8293K4353
2896C02425j9813J2056r624K0755j9008K6746k257J8588L8396k1981j4062R9009
2884D31230k8768p5519k3677M0418J0264l6066P519k6171k904M8221k2802N726
2872C27471M357k790k4726M8556L3622L8693o2935J8976M7869m4681n2100j1905
2860C20407p825Q3465M2842j2689N4246Q377O221M2455n5350k9402k9674m1747
2848C81326M2616j0024n1735l5105O7650L2558m6379j0574o6873k3785O448O7489
2836C53612J1983k3110m0128K0790k980p1128L1196K5181q397l3637K7748j05763
2824A85367J2054J06637j1028k6048P0526o244R972o7833K4528l5610j5619j9123
$$ plain form
2908 287244 333238 262899 244578 220641 229081 258043 247303 200256 220316 199779 278072 302425
2896 302425 282612 294668 285044 305799 286791 313537 311280 329868 368264 346283 332221 431230
2884 431230 402462 326943 303266 343684 353948 317882 325401 299230 296326 344547 321745 327471
2872 327471 331828 329038 304312 352868 386490 425183 362248 381224 429093 384412 332312 320407
2860 320407 312582 396047 438889 426200 480446 488823 495044 537499 482149 452747 423073 381326
2848 381326 423942 413918 362183 327078 394728 427286 380907 370333 303460 279675 286123 353612
2836 353612 365595 342485 302357 323147 320167 249039 280235 305416 297019 263382 291130 185367
2824 185367 197421 304058 293030 266982 337508 331264 341236 273403 297931 262321 246702 227579
2812B27579L7455K4772K9269l8138l4626J1272P0760K3720r7725j14991M2938
2801A82285L1097j1662K4548l1127K7971r1447R334M0647k1604k7450J7029K7574
2789A77195j41j9129N5089m4864J0750J7978l4857L1981L1071l9814k252l079
2777A79928K4402m474q490m1507n0555P5312r555L964j812l4835k2869K4743J2130
2764A46382J8351q4490O142N5656j340M352k4108J1245m0572l3988M3349O7732
$$ plain form
2812 227579 265034 289806 319075 280937 246311 257583 328343 352063 254338 139347 182285
2801 182285 213382 201720 226268 195141 223112 131665 140999 181646 160042 132592 149621 177195
2789 177195 177054 157925 213014 168150 178900 196878 162021 194002 225073 185259 183007 179928
2777 179928 204330 199856 191366 149859 99304 174616 165061 169025 167213 132378 109509 134252 146382
2764 146382 164733 80243 86385 142041 140701 145053 120945 132190 91618 57630 100979 168711
$$ [...]
##END NTUPLES=NMR SPECTRUM
##END=
