##TITLE=1H_CA-9319-2
 200.13MHz, CDCl3,
 8 sc
 
 12.2.2025
##JCAMPDX= 6.0         $$ Bruker NMR JCAMP-DX V2.0
##DATA TYPE= NMR SPECTRUM
##DATA CLASS= NTUPLES
##ORIGIN= UXNMR, Bruker Analytische Messtechnik GmbH
##OWNER= pz
$$ XWIN-NMR		Version 3.5
$$ Wed Feb 12 14:30:29 2025 Russian Standard Time (UT+4h)  she@DPX200
##.OBSERVE FREQUENCY= 200.1313
##.OBSERVE NUCLEUS= ^1H
##.ACQUISITION MODE= SIMULTANEOUS
##.ACQUISITION SCHEME= undefined
##.AVERAGES= 16
##.DIGITISER RES= 18
##SPECTROMETER/DATA SYSTEM= spect
##.PULSE SEQUENCE= zg30
##.SOLVENT NAME= D2O
##.SHIFT REFERENCE= (INTERNAL, D2O, 0, 15.4637)
##AUDIT TRAIL= $$ (NUMBER, WHEN, WHO, WHERE, WHAT)
$$ ##TITLE= Audit trail, XWIN-NMR		Version 3.5
$$ ##JCAMPDX= 5.01
$$ ##ORIGIN= Bruker BioSpin GmbH
$$ ##OWNER= she
$$ F:/spectra/data/she/nmr/H-C/1/pdata/1/auditp.txt
$$ ##AUDIT TRAIL=  $$ (NUMBER, WHEN, WHO, WHERE, WHAT)
(   1,<2025-02-12 14:27:52.56 +0400>,<she>,<DPX200>,
      <created by zg, POWCHK disabled, PULCHK disabled
       configuration hash MD5:
       00 E9 B6 7A A2 85 ED C7 34 08 36 98 17 FE 4E 26
       data hash MD5: 16K
       4B 99 D4 B8 D4 D5 EA 15 43 67 09 A1 C0 06 BE A1>)
(   2,<2025-02-12 14:27:56.28 +0400>,<she>,<DPX200>,
      <Start of raw data processing
       efp BC_mod = 2 LB = 0.25 FT_mod = 6 PKNL = 1 PHC0 = -624.3777 PHC1 = 10.99221 SI = 16K 
       data hash MD5: 16K
       F7 44 BA 65 EF 58 EE 19 FA 1A 7D 7C 9E B1 33 C4>)
(   3,<2025-02-12 14:28:17.28 +0400>,<she>,<DPX200>,
      <pk PHC0 = 1.660588 PHC1 = -2.8 
       data hash MD5: 16K
       58 F9 82 7A 7D B5 8A 6D D7 40 D1 96 3C 5D 61 FD>)
(   4,<2025-02-12 14:28:21.73 +0400>,<she>,<DPX200>,
      <abs ABSG = 5 
       data hash MD5: 16K
       CA 05 89 94 51 81 56 D2 2B 6E 57 A4 DA C8 89 6A>)
(   5,<2025-02-12 14:28:44.23 +0400>,<she>,<DPX200>,
      <abs ABSG = 5 
       data hash MD5: 16K
       72 8E A5 C3 AA F0 43 CA BE BA FF F7 41 92 D5 3A>)
$$ ##END=
$$ 
$$ hash MD5
$$ 82 B5 92 30 68 29 AD 91 33 8A 3E BA D3 DD 34 3A
##$RELAX= 
##$RELAX= 
##$RELAX= 
##$RELAX= 
##$RELAX= 
##$RELAX= 
$$ Bruker specific parameters
$$ --------------------------
##$DU= <F:/spectra>
##$EXPNO= 1
##$NAME= <H-C>
##$PROCNO= 1
##$TYPE= <nmr>
##$USER= <she>
##$AMP= (0..31)
100 100 100 100 100 100 100 100 100 100 100 100 100 100 100 100 100 100 
100 100 100 100 100 100 100 100 100 100 100 100 100 100 
##$AQSEQ= 0
##$AQ_mod= 1
##$AUNM= <au_zg>
##$AUTOPOS= <>
##$BF1= 200.13
##$BF2= 200.13
##$BF3= 200.13
##$BF4= 200.13
##$BF5= 200.13
##$BF6= 200.13
##$BF7= 200.13
##$BF8= 200.13
##$BYTORDA= 1
##$CFDGTYP= 0
##$CFRGTYP= 5
##$CHEMSTR= <none>
##$CNST= (0..31)
1 1 145 1 1 1 1 1 1 1 1 1 1 1 1 1 1 1 1 1 1 1 1 1 1 1 1 1 1 1 1 1 
##$CPDPRG= <>
##$CPDPRG1= <>
##$CPDPRG2= <>
##$CPDPRG3= <>
##$CPDPRG4= <mlev>
##$CPDPRG5= <mlev>
##$CPDPRG6= <mlev>
##$CPDPRG7= <mlev>
##$CPDPRG8= <mlev>
##$CPDPRGB= <>
##$CPDPRGT= <>
##$D= (0..31)
0 0.7 0 0 0 0 0 0 0 0 0 0.03 0 0 0 0 0 0 0 0 0 0 0 0 0 0 0 0 0 0 0 0 
##$DATE= 1739356071
##$DBL= (0..7)
$$ [...]
##$SUBNAM3= <"">
##$SUBNAM4= <"">
##$SUBNAM5= <"">
##$SUBNAM6= <"">
##$SUBNAM7= <"">
##$SUBNAM8= <"">
##$SUBNAM9= <"">
##$SW= 18.0517328524113
##$SWIBOX= (0..15)
0 0 2 0 0 0 0 0 0 0 0 0 0 0 0 0 
##$SW_h= 3612.71676300578
##$TD= 16384
##$TD0= 1
##$TE= 0
##$TE2= 300
##$TE3= 300
##$TEG= 300
##$TL= (0..7)
0 120 120 120 120 120 120 120 
##$TP= (0..7)
150 150 150 150 150 150 150 150 
##$TP07= 0
##$TPNAME0= <>
##$TPNAME1= <>
##$TPNAME2= <>
##$TPNAME3= <>
##$TPNAME4= <>
##$TPNAME5= <>
##$TPNAME6= <>
##$TPNAME7= <>
##$TPOAL= (0..7)
0.5 0.5 0.5 0.5 0.5 0.5 0.5 0.5 
##$TPOFFS= (0..7)
0 0 0 0 0 0 0 0 
##$TUNHIN= 0
##$TUNHOUT= 0
##$TUNXOUT= 0
##$USERA1= <user>
##$USERA2= <user>
##$USERA3= <user>
##$USERA4= <user>
##$USERA5= <user>
##$V9= 5
##$VALIST= <valist>
##$VCLIST= <CCCCCCCCCCCCCCC>
##$VD= 0
##$VDLIST= <DDDDDDDDDDDDDDD>
##$VPLIST= <PPPPPPPPPPPPPPP>
##$VTLIST= <TTTTTTTTTTTTTTT>
##$WBST= 1024
##$WBSW= 4
##$XGAIN= (0..3)
0 0 0 0 
##$XL= 0
##$YL= 0
##$YMAX_a= 844439
##$YMIN_a= -725998
##$ZGOPTNS= <>
##$ZL1= 120
##$ZL2= 120
##$ZL3= 120
##$ZL4= 120
##$ABSF1= 15.46373
##$ABSF2= -2.58812
##$ABSG= 5
##$ABSL= 3
##$ALPHA= 0
##$AQORDER= 0
##$ASSFAC= 0
##$ASSFACI= 0
##$ASSFACX= 0
##$ASSWID= 0
##$AUNMP= <proc_1d>
##$AZFE= 0.1
##$AZFW= 0.1
##$BCFW= 0
##$BC_mod= 2
##$BYTORDP= 0
##$COROFFS= 0
##$CY= -3
##$DATMOD= 1
##$DC= 0
##$DFILT= <>
##$DTYPP= 0
##$F1P= 0
##$F2P= 0
##$FCOR= 1
##$FTSIZE= 16384
##$FT_mod= 6
##$GAMMA= 0
##$GB= 0
##$INTBC= 1
##$INTSCL= 3.241238e-09
##$ISEN= 128
##$LB= 0.25
##$LEV0= 0
##$LPBIN= 0
##$MAXI= 10000
##$MC2= 0
##$MEAN= 0
##$ME_mod= 0
##$MI= 1.114404
##$NCOEF= 0
##$NC_proc= -5
##$NLEV= 6
##$NOISF1= 3.799351
##$NOISF2= 2.8
##$NSP= 0
##$NTH_PI= 0
##$NZP= 0
##$OFFSET= 15.46373
##$PC= 1
##$PHC0= -622.7171
##$PHC1= 8.19221
##$PH_mod= 1
##$PKNL= yes
##$PPARMOD= 0
##$PSCAL= 0
##$PSIGN= 0
##$REVERSE= no
##$SF= 200.130011602863
##$SI= 16384
##$SIGF1= 3
##$SIGF2= 2
##$SINO= 0.751879
##$SIOLD= 32768
##$SREGLST= <19F.Aceton>
##$SSB= 0
##$STSI= 16384
##$STSR= 0
##$SW_p= 3612.71676300578
##$SYMM= 0
##$S_DEV= 0
##$TDeff= 16384
##$TDoff= 0
##$TI= <>
##$TILT= no
##$TM1= 0
##$TM2= 0
##$TOPLEV= 0
##$USERP1= <user>
##$USERP2= <user>
##$USERP3= <user>
##$USERP4= <user>
##$USERP5= <user>
##$WDW= 1
##$XDIM= 16384
##$YMAX_p= 289373300
##$YMIN_p= -135693
$$ End of Bruker specific parameters
$$ ---------------------------------
##NTUPLES= NMR SPECTRUM
##VAR_NAME=  FREQUENCY,     SPECTRUM/REAL,   SPECTRUM/IMAG
##SYMBOL=    X,             R,               I
##VAR_TYPE=  INDEPENDENT,   DEPENDENT,       DEPENDENT
##VAR_FORM=  AFFN,          ASDF,            ASDF
##VAR_DIM=   16384,         16384,           16384
##UNITS=     HZ,            ARBITRARY UNITS, ARBITRARY UNITS
##FACTOR=    0.220516191357247, 1,           1
##FIRST=     3094.75643598482, 0,            0
##LAST=      -517.960327020962, 0,           0
##MIN=       -517.960327020962, -135693,     0
##MAX=       3094.75643598482, 289373300,    0
$$ Real data points
##PAGE= N=1
##DATA TABLE= (X++(R..R)), XYDATA
$$ [...]
$$ plain form
7818 -83144 -94144 -109901 -103635 -104309 -78894 -94057 -89186 -111656 -99116 -94216 -76952 -91015 -76125
7805 -76125 -88130 14270 107717 -75111 -57502 -81050 -55025 -80413 -87356 -104678 -112348 -83051
7793 -83051 -81904 -85944 -109402 -103936 -98966 -97710 -111632 -126591 -96206 -76112 -84596 -103810 -119467
7780 -119467 -113062 -108490 -120594 -113558 -116202 -135693 -114061 -104775 -129383 -112682 -85789 -74885 -81207
7767 -81207 -79249 -75618 -82300 -74518 -92003 -85307 -76963 -68992 -89953 -108116 -98653 -93430 -87945 -95260
7753 -95260 -100653 -99120 -97916 -71322 -70198 -81897 -97328 -105451 -101963 -97024 -96164 -77075 -87283 -104606
7739 -104606 -94409 -54548 -57585 -73346 -85928 -76551 -88399 -77932 -87719 -91852 -109736 -109256 -92145
7726 -92145 -93405 -72996 -71101 -113202 -113396 -83196 -88019 -110683 -92504 -91306 -116521 -113867 -110213
$$ packed form
7818h3144j1000j5757O266o74K5415j5163M871k2470J2540M900J7264j4063J4890
7805g6125j2005J02400R3447j82828J7609k3548K6025k5388o943j7322p670K9297
7793h3051J147m040k3458N466M970J256j3922j4959L0385K0094q484j9214j5657
7780a19467O405M572j2104P036k644j9491K1632R286k4608J6701K6893J0904o322
7767h1207J958L631o682P782j7485O696Q344P971k0961j8163R463N223N485p315
7753i5260n393J533J204K6594J124j1699j5431q123L488M939Q60J9089j0208j7323
7739a04606J0197L9861l037j5761j2582R377j1848J0467r787m133j7884M80J7111
7726i2145j260K0409J895m2101j94L0200m823k2664J8179J198k5215K654L654
$$ plain form
7713 -110213 -110844 -103552 -87653 -108774 -105487 -107716 -115670 -107575 -117428 -110341 -96703 -105095 -92714 -77358
7699 -77358 -71749 -84181 -101683 -113004 -92140 -79455 -81017 -83826 -80307 -74947 -84339 -86558 -98049
7686 -98049 -93774 -100694 -74267 -54667 -84025 -68948 -78824 -65896 -62090 -71956 -75195 -69856 -50714
7673 -50714 -31330 -39500 -27881 -24015 -38272 -60939 -50124 -45922 -43906 -17134 -17337 -779 -1166
7660 -1166 5562 12169 14953 17024 7614 -5912 -13538 -19880 -14082 -25040 -62297 -39157 -32531 -43937
7646 -43937 -59721 -72807 -69390 -75610 -71157 -68029 -83338 -65473 -59326 -46200 -43456 -46036 -36986
7633 -36986 -38033 -38954 -28477 -31669 -48780 -36046 -56629 -37304 -25486 -1768 -9806 -27514 -34617
7620 -34617 -20545 -19466 -36382 -60662 -52912 -50540 -83845 -88062 -66645 -56679 -65081 -73221 -50211
$$ packed form
7713a10213o31P292J5899k1121L287k229p954Q095r853P087J3638q392J2381J5356
7699g7358N609j2432j7502j1321K0864J2685j562k809L519N360r392k219j1491
7686i8049M275o920K6427J9600k9358J5077r876J2928L806r866l239N339J9142
7673e0714J9384q170J1619L866j4257k2667J0815M202K016K6772k03J6558l87
7660a166O728O607K784K071r410j3526p626o342N798j0958l7257K3140O626j1406
7646d3937j5784j3086L417o220M453L128j5309J7865O147J3126K744k580R050
7633c6986j047r21J0477l192j7111J2734k0583J9325J1818K3718q038j7708p103
7620c4617J4072J079j6916k4280P750K372l3305m217K1417R966q402q140K3010
$$ plain form
7607 -50211 -50711 -45724 -22489 -23357 -19242 -37203 -47381 -37525 -37107 -31142 -19170 -9261 -7275 -11526
7593 -11526 -12216 -11984 -8840 2353 -7875 -1377 26768 23883 40482 60186 56729 78819 103418
7580 103418 129708 140495 140334 117154 103171 94056 46738 51388 47896 8293 15696 19867 -12465
7567 -12465 -20431 -19855 -34556 -21728 -20773 -13959 -20995 -18293 5936 11624 11331 18432 39642 12068
7553 12068 27637 37836 30768 35493 60085 54047 37644 28781 44834 34679 15445 -12029 -26970
7540 -26970 -34535 -39300 -64308 -60950 -47744 -54243 -51828 -61208 -78971 -56466 -29120 -47120 -76911
7527 -76911 -82120 -77968 -66536 -54022 -38373 -55152 -50744 -38743 -57021 -56044 -40927 -48383 -50162
7514 -50162 -76921 -47536 -58958 -37582 -4440 -12958 -39496 -41130 -16460 -17198 -8677 166 17631
$$ packed form
7607e0211n00M987K3235q68M115j7961j0178R856M18N965J1972R909J986m251
7593a1526o90K32L144J1193j0228O498K8145k885J6599J9704l457K2090K4599
7580A03418K6290J0787j61k3180j3983r115m7318M650l492l9603P403M171l2332
7567a2465p966N76j4701J2828R55O814p036K702K4229N688k93P101K1210k7574
7553A2068J5569J0199p068M725K4592o038j6403q863J6053j0155j9234k7474j4941
7540b6970p565m765k5008L358J3206o499K415r380j7763K2505K7346j8000k9791
7527g6911n209M152J1432J2514J5649j6779M408J2001j8278R77J5117p456j779
7514e0162k6759K9385j1422K1376L3142q518k6538j634K4670p38Q521Q843J7465
$$ plain form
7501 17631 4163 24424 24326 51111 24685 17285 26934 6025 -27316 1362 -11239 -1441 -45
7488 -45 -16730 -21629 -30410 -26738 -16002 -20020 -19605 -38863 -51409 -56734 -53283 -65331 -66995 -49664
7474 -49664 -22373 -20306 -18646 -11569 4555 -1098 9530 375 -24446 -21367 -45555 -41376 -57893
7461 -57893 -46129 -68886 -73658 -59941 -60377 -66842 -81566 -73541 -79947 -97710 -68890 -74748 -82401
7448 -82401 -100179 -94780 -93667 -98394 -87361 -111478 -78752 -83071 -91390 -92741 -79216 -68065 -78185
7435 -78185 -81853 -94323 -98675 -82334 -73925 -64225 -69569 -88531 -83176 -93268 -78812 -86787 -64594
7422 -64594 -81351 -117727 -98323 -91870 -81402 -58996 -65385 -88012 -110654 -97881 -76122 -68185
7410 -68185 -58996 -73523 -81480 -106163 -98743 -100945 -97213 -95953 -111905 -116214 -104709 -95883 -91046 -108612
$$ packed form
7501A7631j3468K0261r8K6785k6426p400R649k0909l3341K8678j2601R798J396
7488d5j6685m899q781L672J0736m018M15j9258j2546n325L451j2048j664J7331
7474d9664K7291K067J660P077J6124n653J0628r155k4821L079k4188M179j6517
7461e7893J1764k2757m772J3717m36o465j4724Q025o406j7763K8820n858p653
7448h2401j7778N399J113m727J1033k4117L2726m319q319j351J3525J1151j0120
7435g8185l668j2470m352J6341Q409R700n344j8962N355j0092J4456p975K2193
7422f4594j6757l6376J9404O453J0468K2406o389k2627k2642J2773K1759P937
7410f8185R189j4527p957k4683P420k202L732J260j5952m309J1505Q826M837j7566
$$ plain form
7396 -108612 -95420 -92893 -85605 -76092 -59444 -70608 -75742 -59270 -83240 -107511 -114100 -107005 -98357
7383 -98357 -112031 -100751 -99909 -85650 -88372 -105269 -85086 -70253 -81618 -110588 -115211 -96875 -87458
7370 -87458 -98755 -100874 -119687 -109029 -114299 -128979 -118972 -103875 -105481 -85856 -85776 -86317 -82649 -72798
7356 -72798 -83540 -56422 -77555 -100171 -94309 -95682 -94204 -88110 -82642 -81792 -82492 -60140 -56891 -44682
7342 -44682 -49522 -24588 -11590 -14131 -30513 -52281 -38073 -35475 -66394 -53027 -49697 -45606 -60535
7329 -60535 -60938 -57507 -62273 -73288 -90719 -70832 -55797 -58229 -49078 -49332 -67172 -51311 -66748
7316 -66748 -70504 -72456 -72011 -89196 -70043 -72388 -74905 -63124 -72097 -46312 -41576 -55465 -48311 -63648
7302 -63648 -74275 -56418 -31940 -31032 -38324 -47392 -50715 -29954 -6211 -5716 11956 3860 -991 -15367
$$ packed form
7396a08612J3192K527P288R513J6648j1164n134J6472k3970k4271o589P095Q648
7383i8357j3674J1280Q42J4259k722j6897K0183J4833j1365k8970m623J8336R417
7370h7458j1297k119j8813J0658n270j4680J0007J5097j606J9625Q0n41L668R851
7356g2798j0742K7118k1133k2616N862j373J478O094N468Q50p00K2352L249J2209
7342d4682m840K4934J2998k541j6382k1768J4208K598l0919J3367L330M091j4929
7329f0535m03L431m766j1015j7431J9887J5035k432R151k54j7840J5861j5437
7316f6748l756j952M45j7185J9153k345k517J1781q973K5785M736j3889P154j5337
7302f3648j0627J7857K4478R08p292r068l323K0761K3743M95J7672q096m851j4376
$$ plain form
7288 -15367 -7074 3419 10568 14376 -6845 -25247 -29151 -51682 -28555 -20411 -43375 -34422 -21713
7275 -21713 -16388 -20662 -15973 -10353 -26075 -34383 -29172 -47148 -23984 1312 -17704 -7925 -11203
7262 -11203 -16708 -455 13489 28880 53090 51270 39741 25842 31553 42359 32261 51681
7250 51681 32931 26630 33427 28959 18626 11263 37248 61507 84225 61278 61861 79588 72768
7237 72768 61690 39981 28076 22498 19391 23300 14902 22481 42111 33508 34682 23901 14437
7224 14437 6355 42942 65604 66044 83171 83577 122752 118307 109955 100390 102260 97668 102156 86491
7210 86491 86208 80693 71516 72221 57727 78731 72786 74617 71887 63143 56167 59698 67179 69372 53953
7195 53953 44982 48961 47348 39023 46235 50024 38866 7489 2947 44544 57790 77090 90088
$$ packed form
7288a5367Q293J0493P149L808k1221j8402l904k2531K3127Q144k2964Q953J2709
7275b1713N325m274M689N620j5722q308N211j7976K3164K5296j9016R779l278
7262a1203n505J6253J3944J5391K4210j820j1529j3899N711J0806j0098J9420
7250E1681j8750o301O797m468j0333p363K5985K4259K2718k2947N83J7727o820
7237G2768j1078k1709j1905n578l107L909q398P579J9630q603J174j0781r464
7224A4437q082L6587K2662M40J7127M06L9175m445q352r565J870m592M488j5665
7210H6491k83n515r177P05j4494K1004n945J831k730q744o976L531P481K193j5419
7195E3953q971L979j613q325P212L789j1158l1377m542M1597J3246J9300J2998
$$ plain form
7182 90088 76415 83518 75931 58246 50914 43262 58836 55072 40233 36590 22374 31219 46491
7169 46491 47247 64286 92407 99185 101227 80561 68624 58202 44401 43249 27776 23029 33548
7156 33548 9675 15426 37845 23854 -3688 -18105 -34736 -31099 -27784 -14958 -10378 -4982 -20460
7143 -20460 -21039 -15022 2212 -6304 -13006 -8525 -8341 7380 -2173 36019 52113 24115 8097 16364
7129 16364 9295 -35386 -17334 -11255 -396 -10349 -25452 -46837 -46758 -17310 -33733 -38656 -58639
7116 -58639 -37881 -19145 -27601 -46729 -38758 -35617 -34503 -27851 -17102 -22923 -36984 -26686 -28059
7103 -28059 -30155 -21141 -18934 -16759 14223 -9414 -2218 -5447 6331 16509 6836 8439 -10532
7090 -10532 1847 22587 11527 29448 4664 -1152 19682 14404 43351 19445 37996 23147
$$ packed form
7182I0088j3673P103p587j7685p332p652J5574l764j4839l643j4216Q845J5272
7169D6491P56J7039K8121O778K042k0666j1937j0422j3801j152j5473m747J0519
7156C3548k3873N751K2419j3991k7542j4417j6631L637L315J2826M580N396j5478
7143b0460n79O017J7234q516o702M481J84J5721r553L8192J6094k7998j6018Q267
7129A6364p069m4681J8052O079J0859r953j5103k1385P9K9448j6423m923j9983
7116e8639K0758J8736q456j9128P971L141J114O652J0749n821j4061J0298j373
7103b8059k096R014K207K175L0982k3637P196l229J1778J0178r673J603j8971
7090a0532J2379K0740j1060J7921k4784n816K0834n278K8947k3906J8551j4849
$$ plain form
7078 23147 2740 -160 -2013 3229 -13378 -33026 -36425 -25739 -23650 -20793 -7930 1422 2872
7065 2872 -11859 3042 11187 5548 -13112 7246 -5993 18086 20659 -1543 18397 29387 9981
7052 9981 -746 446 24840 28232 28935 41553 62233 60571 79153 100295 85335 92211 88214
7039 88214 79263 73777 66710 73054 99585 85107 84694 82820 60609 56461 61452 48619 40408 36185
7025 36185 11916 9059 -6560 -27928 -29191 -33441 -24565 -19468 -497 -12292 5156 1146 -23887
7012 -23887 -26974 -17409 -8744 -18498 623 31196 25521 5323 2109 16268 -2082 -35921 -44236
6999 -44236 -41945 -30790 -22688 -29312 -17261 351 -27107 -41489 -28497 -44152 -50454 -66011 -71708
6986 -71708 -61975 -50024 -26497 -17268 -15601 -160 -17013 -9431 -7069 -18010 -23929 932 -289
$$ packed form
7078B3147k0407k900j853N242j6607j9648l399J0686K089K857J2863R352J450
7065B872j4731J4901Q145n639j8660K0358j3239K4079K573k2202J9940J0990j9406
7052I981j0727J192K4394L392P03J2618K0680j662J8582K1142j4960O876l997
7039H8214q951n486p067O344K6531j4478m13j874k2211m148M991j2833q211m223
7025C6185k4269k857j5619k1368j263m250Q876N097J8971j1795J7448m010k5033
7012b3887l087R565Q665r754J9121L0573n675k0198l214J4159j8350l3839q315
6999d4236K291J1155Q102o624J2051J7612k7458j4382J2992j5655o302j5557n697
6986g1708R733J1951K3527R229J667J5441j6853P582K362j0941n919K4861j221
$$ plain form
6973 -289 -22225 6143 40394 45046 20195 20746 30906 4463 -27465 -49843 -46375 -37684 -45922
6960 -45922 -28036 -11683 -8691 -38441 -40275 -56765 -74762 -61243 -25968 -25647 -25442 -31123 -8959
6947 -8959 9859 16497 11174 25969 27387 18877 27323 23030 -3562 -2962 22989 12090 -1579 -21021
6933 -21021 -25792 -27461 -26961 -42406 -35448 -17941 2001 -1336 22235 7426 -4725 -10080 -26403
6920 -26403 -45846 -21860 -39825 -49329 -38360 -19830 -17474 -36757 -36831 -54313 -43621 -39740 -35669
6907 -35669 -6488 -5138 -28934 -10629 -26917 -41964 -27520 -24794 -8630 -15563 -26234 -12474
6895 -12474 -2922 5172 -17128 -36864 -36234 -43371 -41747 -22387 -1562 -8092 -21881 -33705 -17600
6882 -17600 -2738 -14093 -6911 4866 -2825 -23055 -21948 -29210 -12098 -8409 -5304 -14790 -9704
$$ packed form
6973b89k1936K8368L4251M652k4851N51J0160k6443l1928k2378L468Q691q238
6960d5922J7886J6353K992k9750j834j6490j7997J3519L5275L21K05n681K2164
6947h959J8818O638n323J4795J418q510Q446m293k6592O00K5951j0899j3669j9442
6933b1021m771j669N00j5445O958J7507J9942l337K3571j4809j2151n355j6323
6920b6403j9443K3986j7965r504J0969J8530K356j9283p4j7482J0692L881M071
6907c5669K9181J350k3796J8305j6288j5047J4444K726J6164o933j0671J3760
6895a2474R552Q094k2300j9736O30p137J624J9360K0825o530j3789j1824J6105
6882a7600J4862j1355P182J1777p691k0230J107p262J7112L689L105r486N086
$$ plain form
6869 -9704 -17645 -17221 -41249 -29519 -23352 -25540 -2181 1751 -1155 -34397 -29926 -22993 26832 -2192
6855 -2192 -22110 -17777 -22303 -48701 -32244 -3575 -16987 -2380 -5830 -11886 -7053 -17482 -25753
6842 -25753 -27593 -30380 3496 4692 -17699 -34750 -31957 -361 4399 11678 12925 19694 -4175
6829 -4175 -26317 -2063 -2113 24025 3617 -10679 -10669 11979 23590 15734 38534 32613 540 1441
6815 1441 -1112 7860 26436 21355 9588 25656 23231 18026 869 906 13087 41491 14481 -6245
6801 -6245 1188 -500 -2220 5495 7839 20394 20553 28730 12816 6523 10905 -4934 -10970 -5566
6787 -5566 2278 21360 14599 15655 23495 25002 15827 2476 20785 5276 23940 6146 -19006
6774 -19006 -34132 -11192 -20535 17187 -11182 2561 33397 41280 23809 16205 14395 14941 25367
$$ packed form
6869i704p941M24k4028J1730O167k188K3359L932k906l3242M471O933M9825k9024
6855b192j9918M333m526k6398J6457K8669j3412J4607l450o056M833j0429q271
6842b5753j840k787L3876J196k2391j7051K793L1596M760P279J247O769k3869
6829d175k2142K4254n0K6138k0408j4296J0K2648J1611p856K2800n921l2073R01
6815A441k553Q972J8576n081j1767J6068k425n205j7157L7J2181K8404k7010k0726
6801f245P433j688j720P715K344J2555J59Q177j5914o293M382j5839o036N404
6787e566P844J9082o761J056P840J507r175j3351J8309j5509J8664j7794k5152
6774a9006j5126K2940r343L7722k8369J3743L0836P883j7471p604j810N46J0426
$$ plain form
6761 25367 14484 11700 12324 16912 -7750 9151 15648 9922 27386 17196 14876 -1142 2772
6748 2772 4175 155 15643 2992 -7250 -3051 -8278 -2101 17178 36298 19259 28438 22284
6735 22284 29884 27468 5014 22842 35583 23481 15866 43189 52687 52424 53973 48545 37998
6722 37998 51893 43355 44253 38656 52107 57719 46823 48708 27724 15248 33735 29456 38741
6709 38741 33072 33803 26362 33642 46134 36697 53189 53775 48768 53211 50132 48966 52097 37600
6695 37600 44490 71799 48912 55182 45888 49034 54991 67337 53029 39934 48958 52868 72637
6682 72637 51799 38162 51311 54243 42494 73211 78606 40137 24710 36806 41988 37921 36996
6669 36996 74496 84856 98672 80307 58345 87178 79388 69793 76563 89446 88277 68203 59839
$$ packed form
6761B5367j0883k784O24M588k4662J6901O497n726J7464j0190k320j6018L914
6748B772J403m020J5488j2651j0242M199n227O177J9279J9120j7039R179o154
6735B2284P600k416k2454J7828J2741j2102p615K7323R498k63J549n428j0547
6722C7998J3895q538Q98n597J3451N612j0896J885k0984j2476J8487m279R285
6709C8741n669P31p441P280J2492r437J6492N86n007M443l079j166L131j4497
6695C7600O890K7309k2887O270r294L146N957J2346j4308j3095R024L910J9769
6682G2637k0838j3637J3149K932j1749L0717N395l8469j5427J2096N182m067r25
6669C6996L7500J0360J3816j8365k1962K8833p790r595O770J2883j169k0074q364
$$ plain form
6656 59839 64740 64093 71861 68775 59814 56266 57314 71166 58462 63525 63675 73197 85781 74653
6642 74653 87171 88567 86676 104351 113883 103358 81597 94178 104163 104057 96457 113395 120196
6629 120196 121358 109388 97052 117774 125948 128005 109954 130870 103325 116980 108883 108065 99576
6616 99576 109997 118996 103389 108039 121980 109469 113377 113364 118891 123970 104736 121329 133808
6603 133808 127277 118905 130190 120551 132478 113645 108972 113040 130142 141675 119551 109290 113808
6590 113808 111669 108294 127313 131943 128918 116459 120506 139486 140814 136629 152644 167266 135147
6577 135147 144549 163365 153642 153315 165917 161717 177438 177378 145502 145937 173010 168520 155275 160882
6563 160882 176216 190683 163865 163191 181646 174160 180189 158656 174873 166608 180125 173179 173055
$$ packed form
6656E9839M901o47P768l086q961l548J048J3852j2704N063J50R522J2584j1128
6642G4653J2518J396j891J7675R532j0525k1761J2581R985j06p600J6938O801
6629A20196J162j1970j2336K0722Q174K057j8051K0916k7545J3655q097q18q489
6616I9576J0421Q999j5607M650J3941j2511L908j3N527N079j9234J6593J2479
6603A33808o531q372J1285r639J1927j8833m673M068J7102J1533k2124j0261M518
6590A13808k139l375J9019M630l025j2459M047J8980J328m185J6015J4622l2119
6577A35147R402J8816r723l27J2602m200J5721o0l1876M35K7073m490j3245N607
6563A60882J5334J4467k6818o74J8455p486O029k1533J6217q265J3517o946j24
$$ plain form
6550 173055 197855 201640 194390 207796 202382 182692 186329 200692 212703 219113 220696 238759 238840
6537 238840 243591 224156 213550 234089 229626 231096 218905 226968 233169 267344 274775 249617 225624
6524 225624 221528 217623 212591 216812 212677 229554 216537 211985 235484 246134 240731 238213 240011
6511 240011 226661 224789 217509 226282 230858 286683 277686 252734 260559 270830 275870 273441 275948
6498 275948 282378 277451 316810 297583 271162 290342 315098 322459 335977 375822 370458 364315 356962
6485 356962 366484 337781 325438 341855 317397 295938 298924 299176 295433 308820 316265 314912 307775
6472 307775 316515 322244 353293 360676 346586 345856 338162 352112 358765 368766 371938 359834 377366
6459 377366 384655 394627 408156 396987 397836 408335 411974 421742 398945 370029 348177 357104 356448
$$ packed form
6550A73055K4800L785p250J3406n414j9690L637J4363J2011O410J583J8063Q1
6537B38840M751j9435j0606K0539m463J470j2191Q063O201L4175P431k5158k3993
6524B25624m096l905n032M221m135J6877j3017m552K3499J0650n403k518J798
6511B40011j3350j872p280Q773M576N5825q997k4952P825J0271N040k429K507
6498B75948O430m927L9359j9227k6421J9180K4756P361J3518L9845n364o143p353
6485C56962R522k8703j2343J6417k4458k1459K986K52l743J3387P445j353p137
6472C07775Q740N729L1049P383j4090p30p694J3950O653J0001L172j2104J7532
6459C77366P289R972J3529j1169Q49J0499L639R768k2797k8916k1852Q927o56
$$ plain form
6446 356448 365091 393551 390374 368965 355190 346358 349792 366992 364546 346673 346304 350479 357711
6433 357711 341100 338871 347484 326004 343947 343262 341099 349558 383970 387108 379551 387743 395762 399028
6419 399028 409079 416742 423573 430764 439579 398821 395856 412888 405473 384402 398349 415781 433675
6406 433675 418845 419533 430637 406480 399626 426271 437623 448798 462217 458086 466622 492395 491262
6393 491262 475898 487495 500599 514072 521125 536241 531018 545119 551295 550553 553202 553837 573260
6380 573260 557233 567051 566096 570978 565548 548825 559040 566038 564422 564262 556098 543143 578290 579081
6366 579081 583987 590878 608169 623797 619847 609689 630696 667544 682537 693335 718516 746219
6354 746219 755521 740793 753268 773023 760563 747240 712003 694504 684984 678995 689015 671158
$$ packed form
6446C56448Q643K8460l177k1409j3775q832L434J7200k446j7873l69M175P232
6433C57711j6611k229Q613k1480J7943o85k163Q459L4412L138p557Q192Q019L266
6419C99028J0051P663O831P191Q815m0758k965J7032p415k1071J3947J7432J7894
6406D33675j4830O88J1104k4157o854K6645J1352J1175J3419m131Q536K5773j133
6393D91262j5364J1597J3104J3473P053J5116n223J4101O176p42K649O35J9423
6380E73260j6027R818r55M882n430j6723J0215O998j616j60q164j2955L5147P91
6366E79081M906O891J7291J5628l950j0158K1007L6848J4993J0798K5181K7703
6354G46219R302j4728J2475J9755j2460j3323l5237j7499r520n989J0020j7857
$$ plain form
6342 671158 649147 654843 654309 651613 629156 621326 626665 628462 604240 591213 603557 624390 617860
6329 617860 646791 671682 671110 656735 618256 639960 639593 649098 675766 701036 689055 681882 666084
6316 666084 666307 645468 652624 627938 624263 622403 620303 625431 636150 617298 615359 620390 635926
6303 635926 632770 622489 634211 629235 634348 637088 641484 619364 611379 614156 613840 611858 620934 645567
6289 645567 626473 622423 634121 621791 636453 627660 641524 632587 653158 655541 653836 677486 685391
6276 685391 688764 724015 736787 702400 705601 705959 707987 727441 726563 715336 696012 723856 712709
6263 712709 712117 728158 741107 750600 750903 743631 738430 764108 757572 762443 773631 779073 769975 775513
6249 775513 794430 797056 798533 803629 831129 868341 876343 892732 903079 901039 896058 902498 893009
$$ packed form
6342F71158k2011N696n34k696k2457p830N339J797k4222j3027J2344K0833o530
6329F17860K8931K4891n72j4375l8479K1704l67R505K6668K5270j1981p173j5798
6316F66084K23k0839P156k4686l675j860k100N128J0719j8852j939N031J5536
6303F35926l156j0281J1722m976N113K740M396k2120p985K777l16j982R076K4633
6289F45567j9094m050J1698j2330J4662q793J3864q937K0571K383j705K3650P905
6276F85391L373L5251J2772l4387L201L58K028J9454q78j1227j9324K7844j1147
6263G12709n92J6041J2949R493L03p272n201K5678o536M871J1188N442r098N538
6249G75513J8917K626J477N096K7500L7212Q002J6389J0347k040m981O440r489
$$ plain form
6236 893009 893734 933805 933935 965419 955349 947520 955048 978811 992740 981471 1011666 1028325 1015831
6223 1015831 1022980 1023974 1022206 1065130 1085660 1074595 1076720 1094137 1118887 1141161 1129888 1137692 1181441
6210 1181441 1204033 1218493 1240750 1251014 1263909 1266428 1289937 1305983 1345331 1382904 1393054 1404618
6198 1404618 1437112 1456959 1483581 1531545 1572618 1558821 1551088 1579006 1621527 1635926 1652078 1683092
6186 1683092 1703634 1724833 1736920 1756754 1753253 1754887 1767934 1778576 1779052 1790908 1815262 1866673
6174 1866673 1889404 1913737 1937130 1995923 2041072 2079369 2095387 2107903 2152871 2210675 2235669
6163 2235669 2274628 2309839 2342083 2365101 2391995 2439942 2470400 2479235 2541497 2582914 2621068 2678335
6151 2678335 2734146 2756454 2811606 2889272 2973008 3031152 3082168 3171518 3267534 3392001 3501088
$$ packed form
6236H93009P25M0071J30L1484j0070p829P528K3763J3929j1269L0195J6659j2494
6223A015831P149R94j768M2924K0530j1065K125J7417K4750K2274j1273P804M3749
6210A181441K2592J4460K2257J0264J2895K519K3509J6046L9348L7573J0150J1564
6198A404618L2494J9847K6622M7964M1073j3797p733K7918M2521J4399J6152L1014
6186A683092K0542K1199J2087J9834l501J634J3047J0642M76J1856K4354N1411
6174A866673K2731K4333K3393N8793M5149L8297J6018J2516M4968N7804K4994
6163B235669L8959L5211L2244K3018K6894M7947L0458Q835O2262M1417L8154N7267
6151B678335N5811K2308N5152P7666Q3736N8144N1016Q9350R6016J24467J09087
$$ plain form
6140 3501088 3644667 3780999 3950968 4079579 4220281 4331677 4331618 4300245 4225058 4132666 4095201
6129 4095201 4072261 4076025 4073337 4110471 4126747 4180945 4259619 4343544 4454476 4555544 4658749
6118 4658749 4774822 4871467 5001004 5154842 5288691 5428305 5578536 5737060 5938423 6153298
6108 6153298 6386853 6646645 6920576 7227685 7535493 7859186 8205911 8548932 8808686 9029900
6098 9029900 9250732 9489794 9784332 10054860 10388402 10738454 11141482 11629096 12098678 12634947
6088 12634947 13251496 13864912 14580434 15379025 16253505 17211706 18276416 19438635 20750029
6079 20750029 22194914 23754552 25456092 27231928 29084143 30959035 32739991 34347675
6071 34347675 35611882 36424095 36725756 36540087 35985244 35174488 34249169 33312960 32475765
$$ packed form
6140C501088J43579J36332J69969J28611J40702J11396n9l1373p5187r2392l7465
6129D095201k2940L764k688L7134J6276N4198P8674Q3925J10932J01068J03205
6118D658749J16073R6645J29537J53838J33849J39614J50231J58524K01363K14875
6108F153298K33555K59792K73931L07109L07808L23693L46725L43021K59754K21214
6098I029900K20832K39062K94538K70528L33542L50052M03028M87614M69582N36269
6088A2634947O16549O13416P15522P98591Q74480R58201J064710J162219J311394
6079B0750029J444885J559638J701540J775836J852215J874892J780956J607684
6071C4347675J264207Q12213L01661j85669n54843q10756r25319r36209q37195
$$ plain form
6062 32475765 31769295 31202446 30820524 30658013 30661583 30860473 31228762 31792798 32564616 33544713
6052 33544713 34770045 36243602 37951205 39899371 42159596 44703096 47499711 50591956
6044 50591956 53858634 57275345 60607768 63620480 65953826 67171910 67007115 65415731
6036 65415731 62664184 59134471 55292634 51515888 47897025 44605558 41695606 39173709
6028 39173709 36990657 35145027 33641749 32431139 31472368 30743363 30218286 29915811 29802186
6019 29802186 29886123 30141060 30526770 31096700 31847763 32697865 33645721 34680629 35671746
6010 35671746 36538548 37124872 37230383 36770155 35723722 34178131 32297782 30231400 28096005
6001 28096005 26046628 24098823 22303435 20677975 19214189 17898658 16689275 15604644
$$ packed form
6062C2475765p06470n66849l81922j62511L570J98890L68289N64036P71818R80097
6052C3544713J225332J473557J707603J948166K260225K543500K796615L092245
6044E0591956L266678L416711L332423L012712K333346J218084j64795j591384
6036F5415731k751547l529713l841837l776746l618863l291467k909952k521897
6028C9173709k183052j845630j503278j210610r58771p29005n25077l02475j13625
6019B9802186Q3937K54937L85710N69930P51063Q50102R47856J034908R91117
6010C5671746Q66802N86324J05511m60228j046433j545591j880349k066382k135395
6001B8096005k049377j947805j795388j625460j463786j315531j209383j084631
$$ plain form
5993 15604644 14629288 13795297 13020334 12336683 11740333 11183008 10635578 10162206 9753178
5984 9753178 9361112 9007773 8676988 8373292 8086906 7802027 7566045 7351469 7139654 6939994
5974 6939994 6732476 6512745 6336364 6195583 6059567 5939856 5852176 5743474 5657431 5567644
5964 5567644 5485471 5427837 5330207 5268669 5200350 5133026 5097675 5029940 4971785 4928681 4919798 4900054
5952 4900054 4883924 4867185 4849389 4852300 4877623 4883263 4902323 4887962 4866953 4879656 4881499 4870979
5940 4870979 4824976 4807490 4769711 4747440 4786101 4776294 4776958 4805051 4826023 4840553 4853871 4877755
5928 4877755 4895794 4949423 4969340 4984034 4990018 5015253 5046425 5067978 5071210 5088691 5090175 5128304
5916 5128304 5139432 5151813 5186506 5202456 5220585 5244542 5259602 5264578 5303057 5323335 5366246 5394396
$$ packed form
5993A5604644r75356q33991p74963o83651n96350n57325n47430m73372m09028
5984I753178l92066l53339l30785l03696k86386k84879k35982k14576k11815j99660
5974F939994k07518k19731j76381j40781j36016j19711q7680j08702q6043q9787
5964E567644q2173n7634r7630o1538o8319o7324l5351o7735n8155m3104q883j9744
5952D900054j6130j6739j7796K911K5323N640J9060j4361k1009J2703J843j0520
5940D870979m6003j7486l7779k2271L8661r807O64K8093K0972J4530J3318K3884
5928D877755J8039N3629J9917J4694N984K5235L1172K1553L232J7481J484L8129
5916E128304J1128J2381L4693J5950J8129K3957J5060M976L8479K0278M2911K8150
$$ plain form
5904 5394396 5446183 5531380 5561926 5616948 5653766 5683894 5728051 5781949 5809036 5872930 5981450
5893 5981450 6022270 6076743 6158457 6231854 6294536 6421791 6518976 6583689 6640796 6727206 6790458
5882 6790458 6885158 6975741 7072498 7164488 7299863 7436689 7628305 7837408 8042546 8280384
5872 8280384 8536406 8774692 9041641 9333160 9623895 9944998 10251137 10548859 10854872 11149103
5862 11149103 11489238 11836529 12241354 12662359 13113357 13644344 14279188 15005493 15772274
5853 15772274 16626873 17560758 18574320 19617843 20775592 22061048 23462909 24979866
5845 24979866 26653942 28455330 30339600 32192363 33839609 35306451 36761920 38265205
5837 38265205 39896315 41699643 43727357 45972481 48484140 51249339 54334644 57635636
$$ packed form
5904E394396N1787Q5197L0546N5022L6818L0128M4157N3898K7087O3894J08520
5893E981450M0820N4473Q1714P3397O2682J27255R7185O4713N7107Q6410O3252
5882F790458R4700R0583R6757R1990J35375J36826J91616K09103K05138K37838
5872H280384K56022K38286K66949K91519K90735L21103L06139K97722L06013K94231
5862A1149103L40135L47291M04825M21005M50998N30987O34844P26305P66781
5853A5772274Q54599R33885J013562J043523J157749J285456J401861J516957
5845B4979866J674076J801388J884270J852763J647246J466842J455469J503285
5837C8265205J631110J803328K027714K245124K511659K765199L085305L300992
$$ plain form
5829 57635636 61231345 65202141 69820869 75166830 81408986 88662246 96978456 106419235
5821 106419235 117156427 129922502 145520122 164042903 185212429 209439489 235871594
5814 235871594 259315818 271594678 266562959 245889575 217831507 190240110 166867758
5807 166867758 147634132 131487042 117998235 107300213 99048459 92727216 87883701
5800 87883701 84220848 81632371 79935664 78977033 78577340 78637141 79223327 80337350 82047555
5791 82047555 84524910 87937291 92416814 97916798 104674038 113310499 124297754 137502499
5783 137502499 152732963 170335475 188948521 203837290 208773497 200140595 181038341
5776 181038341 158135143 136643448 118529227 103429957 90555603 79634959 70742132
$$ packed form
5829E7635636L595709L970796M618728N345961O242156P253260Q316210R440779
5821A06419235J0737192J2766075J5597620J8522781K1169526K4227060K6432105
5814B35871594K3444224J2278860n031719k0673384k8058068k7591397k3372352
5807A66867758j9233626j6147090j3488807j0698022q251754o321243m843515
5800H7883701l662853k588477j696707r58631l99693N9801N86186J114023J710205
5791H2047555K477355L412381M479523N499984O757240Q636461J0987255J3204745
5783A37502499J5230464J7602512J8613046J4888769M936207q632902j9102254
5776A81038341k2903198k1491695j8114221j5099270j2874354j0920644q892827
$$ plain form
5769 70742132 63528849 57558976 52519876 48242662 44575366 41382950 38601133 36125213
5761 36125213 33911923 31922251 30168363 28584351 27140169 25796904 24569307 23518086
5753 23518086 22569712 21751019 21024718 20360692 19718387 19126389 18489093 17891284 17307883
5744 17307883 16759919 16253762 15796361 15336141 14890621 14479743 14082310 13724306 13353030
5735 13353030 12980006 12656774 12377181 12084275 11805793 11545762 11356041 11188235 11018382
5726 11018382 10865034 10712897 10592297 10510914 10453319 10411906 10355183 10293399 10242945 10201945 10190013
5715 10190013 10160333 10116798 10078113 10018987 9919176 9851539 9789214 9708272 9612342 9561077 9536665
5704 9536665 9513660 9516451 9529374 9559064 9583575 9634461 9703149 9741957 9834925 9920308 9998630 10070683
$$ packed form
5769G0742132p213283n969873n039100m277214l667296l192416k781817k475920
5761C6125213k213290j989672j753888j584012j444182j343265j227597j051221
5753B3518086r48374q18693p26301o64026o42305n91998o37296n97809n83401
5744A7307883n47964n06157m57401m60220m45520m10878l97433l58004l71276
5735A3353030l73024l23232k79593k92906k78482k60031j89721j67806j69853
5726A1018382j53348j52137j20600q1383n7595m1413n6723o1784n0454m1000j1932
5715A0190013k9680m3535l8685n9126r9811o7637o2325q0942r5930n1265k4412
5704I536665k3005K791J2923K9690K4511N0886O8688L8808R2968Q5383P8322P2053
$$ plain form
5692 10070683 10188201 10310070 10433500 10571654 10715550 10889758 11085416 11292299 11508735
5683 11508735 11750191 12035371 12356286 12685678 13027591 13428193 13900070 14383029 14887610
5674 14887610 15413485 16031582 16695813 17408788 18152357 18948356 19835017 20785766 21771918
5665 21771918 22807026 23906769 25079206 26316123 27618179 28975280 30419113 31938689
5657 31938689 33512971 35177776 36951771 38877127 40934037 43142063 45549719 48194139
5649 48194139 51058564 54167940 57576791 61300305 65376080 69814561 74629622 79802995
5641 79802995 85298298 91062433 97019688 103043636 109072988 115015732 120817449 126386264
5633 126386264 131568666 136103179 139682970 142089895 143358118 143602800 143134975 142225794
$$ packed form
5692A0070683J17518J21869J23430J38154J43896J74208J95658K06883K16436
5683A1508735K41456K85180L20915L29392L41913M00602M71877M82959N04581
5674A4887610N25875O18097O64231P12975P43569P95999Q86661R50749R86152
5665B1771918J035108J099743J172437J236917J302056J357101J443833J519576
5657C1938689J574282J664805J773995J925356K056910K208026K407656K644420
5649D8194139K864425L109376L408851L723514M075775M438481M815061N173373
5641G9802995N495303N764135N957255O023948O029352N942744N801717N568815
5633A26386264N182402M534513L579791K406925J268223K44682m67825r09181
$$ plain form
5625 142225794 140999814 139478839 137653195 135542584 133188857 130604868 127667801 124217656
5617 124217656 120160741 115481678 110248662 104619429 98782690 92870546 87016566 81250993
5609 81250993 75584230 70149512 64981691 60141605 55675702 51603509 47899989 44515190
5601 44515190 41489052 38766255 36298730 34067308 32046543 30207005 28510819 26945791
5593 26945791 25537478 24260884 23074576 21959039 20913395 19974705 19108527 18297138 17530106
5584 17530106 16821205 16150529 15512394 14946317 14385649 13880408 13413705 12982339 12584511
5575 12584511 12202281 11776800 11366661 10962625 10577151 10198141 9828668 9481293 9176118
5566 9176118 8922157 8641348 8393193 8147355 7910316 7662294 7451455 7257620 7059054 6857618
$$ packed form
5625A42225794j225980j520975j825644k110611k353727k583989k937067l450145
5617A24217656m056915m679063n233016n629233n836739n912144n853980n765573
5609H1250993n666763n434718n167821m840086m465903m072193l703520l384799
5601D4515190l026138k722797k467525k231422k020765j839538j696186j565028
5593B6945791j408313j276594j186308j115537j045644r38690q66178q11389p67032
5584A7530106p08901o70676o38135n66077n60668n05241m66703m31366l97828
5575A2584511l82230m25481m10139m04036l85474l79010l69473l47375l05175
5566I176118k53961k80809k48155k45838k37039k48022k10839j93835j98566k01436
$$ plain form
5556 6857618 6710192 6555604 6407516 6250579 6136149 6025012 5896919 5776115 5687684 5602099
5546 5602099 5503280 5442394 5377617 5304530 5195605 5032907 4880711 4743966 4603503 4502684
5536 4502684 4388448 4271403 4180791 4092191 4010783 3926689 3886112 3815613 3765316 3711348 3642677
5525 3642677 3588041 3539967 3511341 3484915 3436173 3390980 3356707 3337202 3304060 3268270 3247703
5514 3247703 3232160 3217408 3198151 3194224 3179777 3121240 3084263 3033296 2992357 2980096 2951240 2948202
5502 2948202 2927611 2900771 2855851 2838554 2862348 2855906 2856257 2897466 2944498 2983336 3018573 3092628
5490 3092628 3197854 3273376 3389650 3467387 3450186 3363890 3226337 3085961 2916172 2779046
5480 2779046 2651031 2566700 2473291 2397213 2320925 2272220 2230275 2187083 2145642 2131776 2104493
$$ packed form
5556F857618j47426j54588j48088j56937j14430j11137j28093j20804q8431q5585
5546E602099r8819o0886o4777p3087j08925j62698j52196j36745j40463j00819
5536D502684j14236j17045r0612q8600q1408q4094m0577p0499n0297n3968o8671
5525C642677n4636m8074k8626k6426m8742m5193l4273j9505l3142l5790k0567
5514C247703j5543j4752j9257l927j4447n8537l6977n0967m0939j2261k8856l038
5502B948202k0591k6840m4920j7297K3794o442L51M1209M7032L8838L5237P4055
5490C092628J05226P5522J16274P7737j7201q6296j37553j40376j69789j37126
5480B779046j28015q4331r3409p6078p6288m8705m1945m3192m1441j3866k7283
$$ plain form
5469 2104493 2084797 2071597 2031132 2004173 1991716 1986765 1980210 1966390 1993663 2040339 2071642 2139096
5457 2139096 2198613 2267582 2329314 2385402 2404601 2368595 2282871 2150035 2010081 1887405 1799964
5446 1799964 1749159 1688827 1618394 1554679 1515661 1504136 1467622 1453648 1450056 1415421 1371392 1346463
5434 1346463 1344043 1338759 1311985 1277179 1253169 1224084 1226093 1241904 1246790 1226290 1195654 1177571
5422 1177571 1182937 1180049 1148680 1142657 1148644 1149814 1123475 1124706 1097982 1078707 1078589 1065943 1053668
5409 1053668 1059491 1055742 1063232 1043393 1019469 996503 987195 1009207 996683 1001276 972166 983646
5397 983646 980815 942631 945053 953108 948282 956398 967259 968437 954300 948402 934007 948489 952637
5384 952637 950537 961542 974813 962798 964303 965933 974175 975549 976288 969497 996723 987042 978568 1000566
$$ packed form
5469B104493j9696j3200m0465k6959j2457m951o555j3820K7273M6676L1303O7454
5457B139096N9517O8969O1732N6088J9199l6006q5724j32836j39954j22676q7441
5446A799964n0805o0332p0433o3715l9018j1525l6514j3974l592l4635m4029k4929
5434A346463k420n284k6774l4806k4010k9085K009J5811M886k0500l0636j8083
5422A177571N366k888l1369o023N987J170k6339J231k6724j9275j18j2646j2275
5409A053668N823l749P490j9839k3924k2966r308K2012j2524M593k9110J1480
5397I83646k831l8184K422Q055m826Q116J0861J178j4137n898j4395J4482M148
5384I52637k100J1005J3271j2015J505J630Q242J374P39o791K7226r681q474K1998
$$ plain form
5370 1000566 996608 984267 982576 1007124 986810 979517 961280 991818 980245 969796 978571 965334
5358 965334 976814 983572 975610 992596 1010511 1018631 1009136 996519 1025328 1060006 1063728 1081859 1093336
5345 1093336 1092020 1120075 1148780 1170935 1191288 1224001 1225781 1227641 1255951 1277709 1285767 1315031
5333 1315031 1360826 1383143 1392389 1412539 1444618 1484830 1506421 1519799 1554866 1563944 1583218 1604203
5321 1604203 1610898 1589927 1575156 1588536 1606787 1621977 1606220 1589870 1607506 1618747 1629999 1646521
5309 1646521 1666620 1699649 1735652 1695055 1613884 1539871 1449429 1381799 1314223 1278225 1244912
5298 1244912 1209063 1186572 1157992 1127212 1143951 1121674 1098005 1107148 1077317 1075496 1078270 1071648
5286 1071648 1068324 1045748 1025515 1025536 1044574 1034342 1028237 1036583 1005745 968013 965160 981315 986186
$$ packed form
5370A000566l958j2341j691K4548k0314p293j8237L0538j1573j0449Q775j3237
5358I65334J1480O758p962J6986J7915Q120r495j2617K8809L4678L722J8131J1477
5345A093336j316K8055K8705K2155K0353L2713J780J860K8310K1758Q058K9264
5333A315031M5795K2317R246K0150L2079M0212K1591J3378L5067R078J9274K0985
5321A604203O695k0971j4771J3380J8251J5190j5757j6350J7636J1241J1252J6522
5309A646521K0099L3029L6003m0597q1171p4013r0442o7630o7576l5998l3313
5298A244912l5849k2491k8580l0780J6739k2277k3669R143k9831j821K774o622
5286A071648l324k2576k0233K1J9038j0232o105Q346l0838l7732k853J6155M871
$$ plain form
5273 986186 969608 958077 957768 965649 980786 994920 1013242 1007288 1000364 1000470 991443 1010498 1026372
5260 1026372 1015659 988872 1027839 1032792 1019556 1014124 1012372 993519 954605 956731 953687 930130
5248 930130 922368 914517 914838 905307 888777 871877 851506 862057 875069 855733 849328 857166 859242
5235 859242 861775 877424 900142 890518 893226 879614 885509 900947 939003 938464 928811 924467 924157 924317
5221 924317 908212 903283 889722 889998 887622 870706 856899 874452 905365 865860 871136 870976 891365
5208 891365 890077 882007 863637 878172 887498 893088 905326 882646 895565 932017 937320 929628 931541
5195 931541 943660 941178 921355 943172 938764 954047 953086 934108 947671 943214 956197 990026 994148
5182 994148 994505 1000534 1008296 989500 1008126 1009669 1009455 1010275 1039502 1044701 1030403 1051057 1065813 1074546
$$ packed form
5273I86186j6578j1531l09P881J5137J4134J8322n954o924J06r027J9055J5874
5260A026372j0713k6787L8967M953j3236n432j752j8853l8914K126l044k3557
5248I30130p762p851L21r531j6530j6900k0371J0551J3012j9336o405P838K076
5235H59242K533J5649K2718r624K708j3612N895J5438L8056n39r653m344l10J60
5221I24317j6105m929j3561K76k376j6916j3807J7553L0913l9505N276j60K0389
5208H91365j288q070j8370J4535R326N590J2238k2680J2919L6452N303p692J913
5195I31541J2119k482j9823K1817m408J5283r61j8978J3563m457J2983L3829M122
5182I94148L57O029P762j8796J8626J543k14Q20K9227N199j4298K0654J4756Q733
$$ plain form
5168 1074546 1088929 1050955 1063698 1073630 1082197 1107347 1126570 1125789 1109406 1123485 1147746 1127696
5156 1127696 1118482 1145720 1152338 1153982 1169308 1174661 1178796 1184935 1178105 1195020 1197534 1189834 1219126
5143 1219126 1249110 1255125 1273903 1273715 1307074 1314227 1333451 1338325 1357218 1395307 1426567 1422153 1428996
5130 1428996 1471576 1483807 1475234 1479681 1504720 1531476 1562576 1581513 1592144 1620310 1629910 1638249
5118 1638249 1686569 1713498 1727858 1750490 1771775 1797484 1834832 1855633 1882564 1929201 1924606 1936533
5106 1936533 1982204 2032564 2049775 2083090 2131662 2133788 2162835 2199591 2240105 2295355 2340257 2357448
5094 2357448 2391125 2433947 2475078 2495147 2542932 2600706 2630798 2657944 2712938 2751372 2780133
5083 2780133 2813439 2828593 2874863 2890667 2897074 2927239 2936086 2956963 2968709 2998999 3023317 3038299
$$ packed form
5168A074546J4383l7974J2743R932Q567K5150J9223p81j6383J4079K4261k0050
5156A127696r214K7238O618J644J5326N353M135O139o830J6915K514p700K9292
5143A219126K9984O015J8778j88L3359P153J9224M874J8893L8089L1260m414O843
5130A428996M2580J2231q573M447K5039K6756L1100J8937J0631K8166R600Q339
5118A638249M8320K6929J4360K2632K1285K5709L7348K0801K6931M6637m595J1927
5106A936533M5671N0360J7211L3315M8572K126K9047L6756M0514N5250M4902J7191
5094B357448L3677M2822M1131K0069M7785N7774L0092K7146N4994L8434K8761
5083B780133L3306J5154M6270J5804O407L0165Q847K0877J1746L0290K4318J4982
$$ plain form
5071 3038299 3074475 3102956 3108666 3147383 3184450 3219934 3261060 3310819 3379198 3407964 3458715 3529859
5059 3529859 3600335 3657901 3721791 3763609 3836857 3895433 3920470 4012014 4061300 4128508 4211917
5048 4211917 4286981 4353110 4407290 4497978 4581131 4670250 4744311 4849376 4995436 5138843 5257353
5037 5257353 5409969 5591405 5742187 5947770 6168977 6368762 6604864 6890866 7161493 7431900
5027 7431900 7742089 8072154 8400008 8753012 9147365 9498874 9906012 10334182 10782660 11240969
5017 11240969 11727842 12280891 12843253 13436127 14101159 14830795 15652070 16551539 17477199
5008 17477199 18512851 19695975 21006293 22414324 23944818 25614666 27412423 29295728
5000 29295728 31230951 33191560 35062625 36713020 38067208 38996466 39468397 39486548 39088857
$$ packed form
5071C038299L6176K8481N710L8717L7067L5484M1126M9759O8379K8766N0751P1144
5059C529859P0476N7566O3890M1818P3248N8576K5037R1544M9286O7208Q3409
5048D211917P5064O6129N4180R0688Q3153Q9119P4061J05065J46060J43407J18510
5037E257353J52616J81436J50782K05583K21207J99785K36102K86002K70627K70407
5027G431900L10189L30065L27854L53004L94353L51509M07138M28170M48478M58309
5017A1240969M86873N53049N62362N92874O65032P29636Q21275Q99469R25660
5008A7477199J035652J183124J310318J408031J530494J669848J797757J883305
5000B9295728J935223J960609J871065J650395J354188R29258M71931J8151l97691
$$ plain form
4991 39088857 38387063 37465637 36493336 35537294 34688832 34012187 33492308 33187441 33067279
4982 33067279 33168041 33474058 33983645 34691301 35584312 36718550 38066973 39689821 41598981
4973 41598981 43769914 46237644 49032319 52061462 55305143 58567044 61680003 64281761
4965 64281761 66129300 66998313 66748016 65363830 62973926 59880000 56398127 52806921
4957 52806921 49299116 46039067 43095503 40542230 38355536 36497658 34911401 33672362
4949 33672362 32632342 31830160 31177808 30726795 30477314 30366347 30443025 30679033 31086756
4940 31086756 31631333 32293476 33054767 33843441 34588761 35189062 35529114 35557045 35199251 34432744
4930 34432744 33314220 31887446 30278703 28571756 26848812 25165236 23573557 22137650
$$ packed form
4991C9088857p01794r21426r72301r56042q48462o76645n19879l04867j20162
4982C3067279J00762L06017N09587P07656Q93011J134238J348423J622848J909160
4973D1598981K170933K467730K794675L029143L243681L261901L112959K601758
4965F4281761J847539Q69013k50297j384186k389904l093926l481873l591206
4957E2806921l507805l260049k943564k553273k186694j857878j586257j239039
4949C3672362j040020q02182o52352m51013k49481j10967P6678K36008M07723
4940C1086756N44577O62143P61291P88674P45320O00301L40052K7931l57794p66507
4930C4432744j118524j426774j608743j706947j722944j683576j591679j435907
$$ plain form
4922 22137650 20815434 19621368 18562284 17608609 16741188 15922904 15168547 14477328 13844504
4913 13844504 13211039 12651939 12163796 11685475 11268251 10880611 10538963 10237114 9960142
4904 9960142 9738219 9518951 9305131 9104279 8930048 8778407 8618219 8496128 8383177 8250567
4894 8250567 8132295 8032575 7940283 7869065 7811479 7734603 7687263 7627749 7591452 7569871 7558910
4883 7558910 7544570 7525890 7537409 7546374 7593363 7607908 7599015 7644248 7700045 7731133 7788184 7838973
4871 7838973 7904137 7989267 8068821 8153659 8220589 8301827 8397051 8511892 8638940 8743326 8870554
4860 8870554 9006596 9185796 9321434 9487783 9693736 9895688 10100645 10321961 10559799 10813572
4850 10813572 11050214 11337334 11644139 11972516 12334184 12676764 13064161 13483331 13933849
$$ packed form
4922B2137650j322216j194066j059084r53675q67421q18284p54357o91219o32824
4913A3844504o33465n59100m88143m78321m17224l87640l41648l01849k76972
4904I960142k21923k19268k13820k00852j74231j51641j60188j22091j12951j32610
4894H250567j18272r9720r2292p1218n7586p6876m7340n9514l6297k1581j0961
4883G558910j4340j8680J1519Q965M6989J4545q893M5233N5797L1088N7051N0789
4871G838973O5164Q5130P9554Q4838O6930Q1238R5224J14841J27048J04386J27228
4860H870554J36042J79200J35638J66349K05953K01952K04957K21316K37838K53773
4850A0813572K36642K87120L06805L28377L61668L42580L87397M19170M50518
$$ plain form
4841 13933849 14406481 14894326 15428874 15968173 16577545 17200156 17887394 18602411 19370696
4832 19370696 20179147 21022228 21952034 22933131 24020127 25200522 26435922 27781753 29235474
4823 29235474 30741416 32361071 34046140 35804608 37628111 39483640 41299468 43115660
4815 43115660 44915968 46695722 48519593 50340824 52190289 54071845 55920636 57760270
4807 57760270 59514960 61113218 62566192 63821640 64930914 65929702 66916062 67991314
4799 67991314 69179451 70563249 72146870 73954280 76005664 78223797 80609686 83118192
4791 83118192 85709652 88339482 90892090 93285356 95375339 97129433 98555903 99727156
4783 99727156 100722980 101569658 102240604 102628632 102517712 101697358 100073910 97701241 94784177
$$ packed form
4841A3933849M72632M87845N34548N39299O09372O22611O87238P15017P68285
4832A9370696Q08451Q43081R29806R81097J086996J180395J235400J345831J453721
4823B9235474J505942J619655J685069J758468J823503J855529J815828J816192
4815D3115660J800308J779754J823871J821231J849465J881556J848791J839634
4807E7760270J754690J598258J452974J255448J109274R98788R86360J075252
4799F7991314J188137J383798J583621J807410K051384K218133K385889K508506
4791H3118192K591460K629830K552608K393266K089983J754094J426470J171253
4783I9727156R95824Q46678O70946L88028j10920q20354j623448k372669k917064
$$ plain form
4774 94784177 91663049 88596277 85850137 83523778 81607026 80105464 78992420 78135597
4766 78135597 77482271 76913423 76302253 75613996 74862647 74039738 73154104 72225863 71297945
4757 71297945 70334196 69250864 67993881 66472535 64582825 62355274 59754018 56879012
4749 56879012 53847382 50811371 47802156 44929029 42233093 39727550 37478925 35421094
4741 35421094 33546054 31895580 30417370 29075210 27875406 26773931 25792104 24896974
4733 24896974 24124687 23440286 22830329 22239988 21741886 21306893 20905644 20600511 20303102
4724 20303102 20065403 19897130 19749729 19625594 19547819 19519805 19500464 19561207 19628802 19735773
4714 19735773 19888525 20049060 20236480 20477660 20718747 21023732 21354402 21720898 22083281
$$ packed form
4774I4784177l121128l066772k746140k326359j916752j501562j113044q56823
4766G8135597o53326n68848o11170o88257p51349q22909q85634r28241r27918
4757G1297945r63749j083332j256983j521346j889710k227551k601256k875006
4749E6879012l031630l036011l009215k873127k695936k505543k248625k057831
4741C5421094j875040j650474j478210j342160j199804j101475r81827q95130
4733B4896974p72287o84401o09957n90341m98102m34993m01249l05133k97409
4724B0303102k37699j68273j47401j24135p7775k8014j9341O0743O7595J06971
4714A9735773J52752J60535J87420K41180K41087L04985L30670L66496L62383
$$ plain form
4705 22083281 22485554 22962958 23493047 24045116 24671002 25325157 26046825 26862870 27736970
4696 27736970 28677746 29688195 30780820 31963037 33213452 34514878 35918514 37354631
4688 37354631 38842766 40348873 41880170 43351202 44768908 46099430 47332588 48438789
4680 48438789 49415666 50256397 50956307 51540353 52076896 52553085 52986633 53463925 54020613
4671 54020613 54698479 55481355 56449147 57573880 58869756 60387906 62065796 63873662 65819908
4662 65819908 67901690 70063614 72290025 74541892 76765297 78982314 81081939 83063281
4654 83063281 84843241 86462599 87993999 89480751 91013545 92642159 94355369 96205124
4646 96205124 98211375 100357081 102767479 105472139 108545853 112101907 116248845 121008432
$$ packed form
4705B2083281M02273M77404N30089N52069O25886O54155P21668Q16045Q74100
4696B7736970R40776J010449J092625J182217J250415J301426J403636J436117
4688C7354631J488135J506107J531297J471032J417706J330522J233158J106201
4680D8438789R76877Q40731O99910N84046N36543M76189M33548M77292N56688
4671E4020613O77866P82876R67792J124733J295876J518150J677890J807866J946246
4662F5819908K081782K161924K226411K251867K223405K217017K099625J981342
4654H3063281J779960J619358J531400J486752J532794J628614J713210J849755
4646I6205124K006251K145706K410398K704660L073714L556054M146938M759587
$$ plain form
4638 121008432 126489183 132786479 139944867 148056498 157166098 167446397 179050649 192049222
4630 192049222 206272538 221443703 236993384 251798559 264381296 273496374 278936789
4623 278936789 281734890 283478316 285368889 287695133 289373300 288290811 282235587 270188116
4615 270188116 253056819 233128077 212754312 193579056 176171368 160493228 146334948
4608 146334948 133592444 122381329 112652369 104282876 97033118 90669531 85084837 80139901
4600 80139901 75787548 71965723 68550800 65581297 62945001 60570150 58473208 56682957
4592 56682957 55140523 53813426 52722679 51792130 51012886 50359939 49865647 49508117 49304530
4583 49304530 49264725 49367209 49653028 50046475 50554315 51183650 51879679 52650885 53466068 54290431
$$ packed form
4638A21008432N480751O297296P158388Q111631R109600J0280299J1604252J2998573
4630A92049222J4223316J5171165J5549681J4805175J2582737R115078N440415
4623B78936789K798101J743426J890573K326244J678167j082489o055224j2047471
4615B70188116j7131297j9928742k0373765j9175256j7407688j5678140j4158280
4608A46334948j2742504j1211115r728960q369493p249758o363587n584694m944936
4600H0139901m352353l821825l414923k969503k636296k374851k096942j790251
4592E6682957j542434j327097j090747r30549p79244o52947m94292l57530k03587
4583D9304530l9805J02484K85819L93447N07840O29335O96029P71206Q15183Q24363
$$ plain form
4573 54290431 55061166 55836872 56503244 57079097 57498827 57731328 57837888 57744161 57522596 57228282
4563 57228282 56868175 56489551 56131172 55851435 55660207 55619529 55718383 56000883 56484853 57116670
4553 57116670 57917386 58850123 59840956 60906607 61983610 63007061 63937847 64737421 65319727
4544 65319727 65588489 65516200 65039816 64153033 62947441 61487651 59793051 57947395 55985236
4535 55985236 53971636 51963926 50018077 48153486 46410676 44799441 43379874 42133315
4527 42133315 41003854 40012224 39155324 38390079 37720807 37084353 36491663 35892231 35275294
4518 35275294 34585489 33823758 32980380 32068822 31053335 29978372 28843642 27641253 26454445
4509 26454445 25260914 24057274 22865366 21737000 20665561 19636477 18636653 17740123
$$ packed form
4573E4290431P70735P75706O66372N75853M19730K32501J06560r3727k21565k94314
4563E7228282l60107l78624l58379k79737j91228m0678R8854K82500M83970O31817
4553E7116670Q00716R32737R90833J065651J077003J023451R30786P99574N82306
4544F5319727K68762p2289m76384q86783j205592j459790j694600j845656j962159
4535E5985236k013600k007710j945849j864591j742810j611235j419567j246559
4527D2133315j129461r91630q56900p65245o69272o36454n92690n99432o16937
4518C5275294o89805p61731q43378r11558j015487j074963j134730j202389j186808
4509B6454445j193531j203640j191908j128366j071439j029084r99824q96530
$$ plain form
4501 17740123 16854747 16000100 15255888 14565720 13931378 13342790 12790234 12305441 11831892
4492 11831892 11380507 10975407 10589450 10234706 9896054 9578945 9289231 9028469 8781543
4483 8781543 8528991 8310266 8100640 7905834 7727505 7534710 7370980 7206545 7033334 6875210
4473 6875210 6698597 6538407 6384038 6255502 6120709 5969808 5848163 5715940 5596417 5453982
4463 5453982 5324074 5219111 5108219 4995590 4858251 4741646 4640961 4552753 4477135 4372670
4453 4372670 4274241 4200793 4125408 4052704 3968835 3912378 3836310 3771318 3708711 3641062 3610586
4442 3610586 3565788 3522610 3467376 3410689 3362226 3312434 3268719 3230129 3186769 3133052 3104279
4431 3104279 3066130 3024931 2989740 2953682 2939322 2883842 2845760 2813081 2759925 2731914 2694395
$$ packed form
4501A7740123q85376q54647p44212o90168o34342n88588n52556m84793m73549
4492A1831892m51385m05100l85957l54744l38652l17109k89714k60762k46926
4483H781543k52552k18725k09626j94806j78329j92795j63730j64435j73211j58124
4473F875210j76613j60190j54369j28536j34793j50901j21645j32223j19523j42435
4463E453982j29908j04963j10892j12629j37339j16605j00685q8208p5618j04465
4453D372670r8429p3448p5385p2704q3869n6457p6068o4992o2607o7649l0476
4442C610586m4798m3178n5234n6687m8463m9792m3715l8590m3360n3717k8773
4431C104279l8149m1199l5191l6058j4360n5480l8082l2679n3156k8011l7519
$$ plain form
4420 2694395 2641320 2617490 2577159 2537820 2512275 2484522 2459129 2406203 2375218 2337821 2323177
4409 2323177 2285609 2254689 2245559 2229570 2193211 2177299 2148792 2124351 2102061 2045768 2043889 2045246
4397 2045246 2031618 2006834 2003817 1963549 1949229 1936492 1914605 1899149 1887185 1883292 1851060 1830069
4385 1830069 1826341 1797184 1789819 1782002 1773902 1755881 1728016 1697113 1707939 1726600 1708700 1715111
4373 1715111 1744129 1720538 1714898 1706418 1673621 1672397 1680130 1651971 1642225 1624272 1636234 1647717
4361 1647717 1642359 1638994 1600134 1610324 1588996 1548422 1548976 1568356 1572647 1582286 1567525 1556807 1538928
4348 1538928 1556531 1581019 1572013 1563631 1550545 1539837 1581227 1585239 1583122 1599976 1596596 1622052
4336 1622052 1632117 1661116 1673656 1683971 1728074 1767029 1787137 1825967 1865257 1931463 1981766
$$ packed form
4420B694395n3075k3830m0331l9339k5545k7753k5393n2926l0985l7397j4644
4409B323177l7568l0920r130j5989l6359j5912k8507k4441k2290n6293j879J357
4397B045246j3628k4784l017m0268j4320j2737k1887j5456j1964l893l2232k0991
4385A830069l728k9157p365p817q100j8021k7865l0903J0826J8661j7900O411
4373A715111K9018k3591n640q480l2797j224P733k8159r746j7953J1962J1483
4361A647717n358l365l8860J0190k1328m0574N54J9380M291R639j4761j0718j7879
4348A538928J7603K4488r006q382j3086j0708M1390M012k117J6854l380K5456
4336A622052J0065K8999J2540J0315M4103L8955K0108L8830L9290O6206N0303
$$ plain form
4325 1981766 1994353 2067619 2101724 2133446 2182825 2213759 2218450 2214568 2221723 2210549 2184219 2178039
4313 2178039 2133915 2089246 2002256 1904418 1827468 1729822 1632955 1547111 1488456 1425033 1360516
4302 1360516 1317469 1250947 1197286 1187917 1171360 1137126 1111429 1082413 1074723 1026481 1005216 1014063
4290 1014063 1009364 978501 958550 937392 934360 936630 947866 923878 914309 915817 901984 896157 893853
4277 893853 874708 867027 838672 835794 862790 855387 843172 790557 785185 784552 781321 788352 798071
4264 798071 776194 762742 748963 758576 761285 768171 755232 766507 769398 767136 748220 756289 767947
4251 767947 760056 749582 734058 705146 698537 709646 665013 636512 670669 659162 633074 648015
4239 648015 642119 620238 628561 608318 613100 604529 596481 602540 579504 582130 570088 561807 560877 551554
$$ packed form
4325A981766J2587P3266L4105L1722M9379L0934M691l882P155j1174k6330o180
4313B178039m4124m4669q6990r7838p6950r7646r6867q5844n8655o3423o4517
4302A360516m3047o6522n3661r369j6557l4234k5697k9016p690m8242k1265Q847
4290A014063m699l0863j9951k1158l032K270J1236k3988r569J508j3833n827k304
4277H93853j9145p681k8355k878K6996p403j2215n2615n372o33l231P031R719
4264G98071k1877j3452j3779R613K709O886j2939J1275K891k262j8916Q069J1658
4251G67947p891j0474j5524k8912o609J1109m4633k8501L4157j1507k6088J4941
4239F48015n896k1881Q323k0243M782q571q048O059k3036K626j2042q281r30r323
$$ plain form
4225 551554 536412 519082 522865 538617 531318 524597 534425 511967 496959 480395 461053 446845
4213 446845 443446 465755 475286 445197 425815 420676 422526 426992 418090 419852 409404 379143 374399
4200 374399 361523 361169 354422 346260 361775 384913 371818 373601 374442 364101 394564 354678 331878
4187 331878 331815 353362 345558 320490 306506 314324 329339 323721 315631 303191 299979 312005 329269
4174 329269 288694 275150 281894 277823 279893 278470 283798 277540 255756 263298 261795 240323 228643
4161 228643 230429 237889 217417 237048 260878 261075 256650 253690 242200 254703 247041 233783 245075
4148 245075 276739 275103 264223 261688 246586 262297 271900 263003 284411 257254 254164 235039 252189
4135 252189 229271 224724 224550 212783 220961 207429 211227 207510 229181 213545 220808 231771 228845
$$ packed form
4225E51554j5142j7330L783J5752p299o721R828k2458j5008j6564j9342j4208
4213D46845l399K2309R531l0089j9382n139J850M466q902J762j0448l0261m744
4200C74399j2876l54o747q162J5515K3138j3095J783Q41j0341L0463l9886k2800
4187C31878o3K1547p804k5068j3984P818J5015n618q090j2440l212J2026J7264
4174C29269m0575j3544O744m071K070j423N328o258k1784P542j503k1472j1680
4161B28643J786P460k0472J9631K3830J97m425k960j1490J2503p662j3258J1292
4148B45075L1664j636j0880k535j5102J5711R603q897K1408k7157l090j9125J7150
4135B52189k2918m547j74j1767Q178j3532L798l717K1671j5636P263J0963k926
$$ plain form
4122 228845 236879 208974 200962 230584 247500 229289 229784 259135 263090 250711 222979 219250 231963
4109 231963 245119 211303 212894 195361 190313 192540 195598 204072 205124 206001 183646 189910 192089 188641
4095 188641 192420 162068 150599 182589 213624 175780 162934 171238 184614 176062 154994 155445 157021
4082 157021 150070 157239 173498 181050 164531 157988 154264 140657 151107 163660 158071 138341 157821
4069 157821 157157 142380 116221 138834 106663 109464 141120 137072 153156 154901 139607 133806 134575
4056 134575 141094 102506 109431 150526 131380 128826 132913 133879 134275 113322 119633 127244 127515 126468
4042 126468 119031 82059 109910 134348 110512 115502 128214 125049 115580 122106 117266 120486 116346
4029 116346 104906 79313 89468 87325 92166 87296 90434 98375 88125 77628 72160 107544 116260
$$ packed form
4122B28845Q034k7905q012K9622J6916j8211M95K9351L955j2379k7732l729J2713
4109B31963J3156l3816J591j7533n048K227L058Q474J052Q77k2355O264K179l448
4095A88641L779l0352j1469L1990L1035l7844j2846Q304J3376q552k1068M51J576
4082A57021o951P169J6259P552j6519o543l724j3607J0450J2553n589j9730J9480
4069A57821o64j4777k6159K2613l2171K801L1656m048J6084J745j5294n801P69
4056A34575O519l8588O925M1095j9146k554M087R66L96k0953O311P611K71j047
4042A26468p437l6972K7851K4438k3836M990J2712l165r469O526m840L220m140
4029A16346j1440k5593J0155k143M841m870L138P941j0250j0497n468L5384Q716
$$ plain form
4016 116260 88479 86366 88185 71924 83179 93757 107454 110216 117579 107597 98015 107880 103971
4003 103971 107482 80099 78393 63142 78159 81779 97719 120319 103007 123356 126874 110813
3991 110813 106640 73508 102144 117978 121024 107769 110730 109554 99652 98500 101289 97162 105801
3978 105801 111026 122386 113590 105088 116745 106300 97658 101594 93315 94237 106110 103099 91157
3965 91157 76509 102084 109990 104155 86927 83302 88847 93643 89403 90052 86921 88011 103928 126927
3951 126927 97865 87094 86631 88801 102096 100709 128128 140251 113331 94390 105619 94176
3939 94176 96336 97427 97800 129693 118222 107138 138029 100284 115238 129575 109635 117940 114882
3926 114882 101481 94581 124708 131124 120517 112335 124902 122614 117515 111279 103713 93111 101332
$$ packed form
4016A16260k7781k113J819j6261J1255J0578J3697K762P363r982r582R865l909
4003A03971L511k7383j706j5251J5017L620J5940K2600j7312K0349L518j6061
3991A10813m173l3132K8636J5834L046j3255K961j176r902j152K789m127Q639
3978A05801N225J1360q796q502J1657j0445q642L936q279R22J1873l011j1942
3965I1157j4648K5575P906n835j7228l625N545M796m240O49l131J090J5917K2999
3951A26927k9062j0771m63K170J3295j387K7419J2123k6920j8941J1229j1443
3939I4176K160J091L73L1893j1471j1084L0891l7745J4954J4337j9940Q305l058
3926A14882j3401o900L0127O416j0607q182J2567k288n099o236p566j0602Q221
$$ plain form
3913 101332 82926 98626 118819 120657 117200 121749 118181 124797 165394 164450 114986 120104 110142
3900 110142 123926 127941 123729 157989 152576 137711 144663 155859 151951 133402 135005 150268 172656
3887 172656 159275 169327 168663 162630 160024 159489 155411 166366 152368 148421 164835 174966 202383
3874 202383 174480 160888 149028 161634 142249 125747 125287 136572 124136 96495 114707 117356
3862 117356 146278 160513 140132 128796 139062 138513 125784 117831 120264 132515 138943 145574 161273
3849 161273 167020 177041 178917 168958 170933 168226 160043 127104 120543 104002 132091 135677 137808
3836 137808 119669 109802 121657 101917 132720 129765 105643 121810 84789 93939 119489 115406
3824 115406 132045 115674 112183 139361 127039 147619 129018 126164 110881 89404 117609 119972
$$ packed form
3913A01332j8406J5700K0193J838l457M549l568O616M0597r44m9464N118r962
3900A10142J3784M015m212L4260n413j4865O952J1196l908j8549J603J5263K2388
3887A72656j3381J0052o64o033k606n35m078J0955j3998l947J6414J0131K7417
3874B02383k7903j3592j1860J2606j9385j6502m60J1285j2436k7641J8212K649
3862A17356K8922J4235k0381j1336J0266n49j2729p953K433J2251O428O631J5699
3849A61273N747J0021J876r959J975k707q183l2939o561j6541K8089L586K131
3836A37808j8139r867J1855j9740L0803k955k4122J6167l7021R150K5550m083
3824A15406J6639j6371l491K7178j2322K0580j8601k854j5283k1477K8205K363
$$ plain form
3812 119972 95216 106881 133069 142085 141053 141379 153370 145450 149299 135086 160651 161573 149709
3799 149709 146019 130063 126206 124286 127355 104411 104130 113458 112095 128761 114610 104386 127104
3786 127104 119018 122852 120094 96576 81954 113654 124935 109889 118005 100551 117619 124636 102661
3773 102661 105023 125066 131391 139100 145226 141913 149534 161009 158518 158005 158594 171304 150764 131590
3759 131590 109182 97655 121701 118925 121449 135431 135873 131988 126236 122778 114309 108560 128823
3746 128823 135874 119408 120520 110165 109922 115510 110207 114117 106759 109206 123997 131820 115904 96476
3732 96476 109851 91047 95576 110488 102095 116376 88481 77361 77090 73591 74116 90360 105918
3719 105918 114372 106354 113033 106726 98007 111037 102304 75948 73923 90608 98875 97755 107279 95251
$$ packed form
3812A19972k4756J1665K6188R016j032L26J1991p920L849j4213K5565R22j1864
3799A49709l690j5956l857j920L069k2944k81R328j363J6666j4151j0224K2718
3786A27104q086L834k758k3518j4622L1700J1281j5046Q116j7454J7068P017k1975
3773A02661K362K0043O325P709O126l313P621J1475k491n13N89J2710k0540j9174
3759A31590k2408j1527K4046k776K524J3982M42l885n752l458q469n749K0263
3746A28823P051j6466J112j0355k43N588n303L910p358K447J4791P823j5916j9428
3732I6476J3375j8804M529J4912q393J4281k7895j1120k71l499N25J6244J5558
3719A05918Q454q018O679o307q719J3030q733k6356k025J6685Q267j120R524j2028
$$ plain form
3705 95251 103116 96952 91324 94445 103502 110925 95501 115979 133918 146986 135581 131762 119550
3692 119550 115796 127396 135828 120518 135455 136838 117742 97695 113879 141741 132127 99473
3680 99473 114775 130601 111066 121615 142896 145194 156787 159686 175508 186603 182203 159325
3668 159325 157846 163782 162002 160832 184687 206929 207203 188161 174878 187352 176476 167057 159647
3655 159647 144900 160587 153963 170422 206125 174428 165487 188446 188855 191193 193412 166388 180248
3642 180248 203764 203625 221455 224955 233893 252375 241143 244193 266728 277757 288796 307821 317262
3629 317262 325877 323342 353068 363778 343798 332098 312830 315901 309081 313477 333325 320556 300009
3616 300009 297758 277674 268545 263259 268224 276755 278531 290854 295928 313238 328508 340193 335361
$$ packed form
3705I5251P865o164n628L121R057P423j5424K0478J7939J3068j1405l819j2212
3692A19550l754J1600Q432j5310J4937J383j9096k0047J6184K7862r614l2654
3680I9473J5302J5826j9535J0549K1281K298J1593K899J5822J1095m400k2878
3668A59325j479N936j780j170K3855K2242K74j9042j3283J2474j0876r419p410
3655A59647j4747J5687o624J6459L5703l1697q941K2959M09K338K219k7024J3860
3642A80248K3516j39J7830L500Q938J8482j1232L050K2535J1029J1039J9025R441
3629C17262Q615k535K9726J0710j9980j1700j9268L071o820M396J9848j2769k0547
3616C00009k251k0084r129n286M965Q531J776J2323N074J7310J5270J1685m832
$$ plain form
3603 335361 333790 341536 352541 387056 398190 390398 403133 409193 446804 441064 447289 419727 400745
3590 400745 417966 439622 441220 433782 417880 420767 424696 398146 415506 425275 433851 421877 414260
3577 414260 433908 461330 466551 463948 477026 489104 527863 522907 525314 566967 566692 583178 599436
3564 599436 585012 603928 617597 629315 644813 675456 674076 685193 721624 752207 747080 772584
3552 772584 817483 834525 838412 852487 894505 925569 949873 935382 966202 999598 995723 992953
3540 992953 968797 966583 946750 937628 939656 938764 922296 911369 929726 919024 923829 909846 938203
3527 938203 946794 921214 909399 906703 940284 934034 931952 935110 940056 962487 971322 996176 1018898
3514 1018898 1011093 1029100 1063259 1091355 1097920 1137523 1173047 1195356 1235697 1275181 1321319 1325883
$$ packed form
3603C35361j571P746J1005L4515J1134p792J2735O060L7611n740O225k7562j8982
3590D00745J7221K1656J598p438j5902K887L929k6550J7360R769Q576j1974p617
3577D14260J9648K7422N221k603J3078J2078L8759m956K407M1653k75J6486J6258
3564E99436j4424J8916J3669J1718J5498L0643j380J1117L6431L0583n127K5504
3552G72584M4899J7042L887J4075M2018L1064K4304j4491L0820L3396l875k770
3540I92953k4156k214j9833r122K028q92j6468j0927J8357j0702M805j3983K8357
3527I38203Q591k5580j1815k696L3581o250k082L158M946K2431Q835K4854K2722
3514A018898p805J8007L4159K8096O565L9603L5524K2309M0341L9484M6138M564
$$ plain form
3502 1325883 1363946 1387884 1457167 1514322 1585291 1664728 1722023 1809857 1877960 1932392 2017382
3491 2017382 2046366 2096757 2149947 2158030 2114796 2062010 1977480 1889399 1768224 1676399 1605555
3480 1605555 1502365 1420233 1333312 1244247 1194228 1156321 1112261 1081783 1043104 998085 974337
3469 974337 939930 896114 885032 864812 861378 830681 833315 801695 791444 781925 731055 714190
3457 714190 723595 705931 669740 656229 646401 623838 613328 587565 598166 592031 546240 534542
3445 534542 542183 541292 528044 526126 501857 499316 480251 446243 458102 461959 454107 446647 446513 410999
3431 410999 379901 364290 382524 381511 356324 376508 353913 367759 354025 344765 348216 326391
3419 326391 312431 326737 328483 329422 319482 306395 316832 330918 329972 318909 336455 338267 337175
$$ packed form
3502A325883L8063K3938O9283N7155P0969P9437N7295Q7834O8103N4432Q4990
3491B017382K8984N0391N3190Q083m3234n2786q4530q8081j21175r1825p0844
3480A605555j03190q2132q6921q9065n0019l7907m4060l0478l8679m5019k3748
3469I74337l4407m3816j1082k0220l434l0697K634l1620j0251r519n0870j6865
3457G14190R405j7664l6191j3511r828k2563j0510k5763J0601o135m5791j1698
3445E34542P641q91j3248j918k4269k541j9065l4008J1859L857p852p460j34l5514
3431D10999l1098j5611J8234j013k5187K0184k2595J3846j3734r260L451k1825
3419C26391j3960J4306J746R39r940j3087J0437J4086r46j1063J7546J812j092
$$ plain form
3406 337175 339408 339986 353130 375568 358845 365176 360569 367773 415902 413421 425758 456641 474175
3393 474175 478669 493016 529786 561262 626815 668918 712744 737622 706031 661878 617627 574388
3381 574388 562437 513876 492321 485637 456196 428169 422951 433521 452246 435818 427128 427960 404834
3368 404834 432277 440369 434281 480252 497662 518165 560373 598858 641710 704816 792622 887189
3356 887189 976328 1048976 1060646 982234 869702 779818 692673 605499 549672 514889 492605
3345 492605 459312 434252 410574 382333 388115 391737 375485 344920 356093 343350 352436 344015
3333 344015 326627 352987 371714 388001 401722 447564 485341 488206 524703 587772 618093 586914
3321 586914 510606 461762 426674 402111 357366 324721 298837 279898 266522 281413 251156 252784
$$ packed form
3406C37175K233N78J3144K2438j6723O331m607P204M8129k481J2337L0883J7534
3393D74175M494J4347L6770L1476O5553M2103M3826K4878l1591m4153m4251m3239
3381E74388j1951m8561k1555o684k9441k8027n218J0570J8725j6428q690Q32k3126
3368D04834K7443Q092o088M5971J7410K0503M2208L8485M2852O3106Q7806R4567
3356H87189Q9139P2648J1670p8412j12532q9884q7145q7174n5827l4783k2284
3345D92605l3293k5060k3678k8241N782L622j6252l0565J1173j2743R086q421
3333C44015j7388K6360J8727J6287J3721M5842L7777K865L6497O3069L0321l1179
3321E86914p6308m8844l5088k4563m4745l2645k5884j8939j3376J4891l0257J628
$$ plain form
3309 252784 233997 229886 216282 218638 208892 222107 218350 213811 215853 215479 196637 194595 218886
3296 218886 225500 255918 246540 231630 225731 212103 247646 254947 269984 278604 274913 308029 322901
3283 322901 328441 326037 328543 341946 355942 352233 370585 392369 426271 463289 464577 460271 476046
3270 476046 508251 517834 527136 550899 528635 555213 533870 537627 576163 562443 532560 517365
3258 517365 534030 564770 554246 510376 513829 542616 548139 554150 568467 581861 602704 623761
3246 623761 604025 619412 619268 659903 695112 709820 743399 792705 826707 868851 930226 970773
3234 970773 1019089 1032082 1039071 1053057 1026938 983519 928966 924351 897483 877135 872589 848170
3222 848170 829015 821686 832838 841169 874041 887894 906965 912311 925076 926412 908603 901720 900419
$$ packed form
3309B52784j8787m111j3604K356r746J3215l757m539K042l74j8842k042K4291
3296B18886O614L0418r378j4910n899j3628L5543P301J5037Q620l691L3116J4872
3283C22901N540k404K506J3403J3996l709J8352K1784L3902L7018J288m306J5775
3270D76046L2205R583R302K3763k2264K6578k1343L757L8536j3720k9883j5195
3258E17365J6665L0740j0524m3870L453K8787N523O011J4317J3394K0843K1057
3246F23761j9736J5387j44M0635L5209J4708L3579M9306L4002M2144O1375M0547
3234I70773M8316J2993O989J3986k6119m3419n4553m615k6868k0348m546k4419
3222H48170j9155p329J1152Q331L2872J3853J9071N346J2765J336j7809o883j301
$$ plain form
3209 900419 884896 880464 894594 878599 866069 854695 851303 858595 857636 882373 899791 917325 920504
3196 920504 925079 914222 915794 901929 879973 871061 881455 874349 857567 881063 902862 916200
3184 916200 931630 939166 951680 971710 1003182 1029024 1074442 1095170 1084330 1072051 1015764 981223
3172 981223 933393 898351 848490 803542 788880 799536 796319 779974 766102 775536 794319 799256
3160 799256 823145 839713 843123 834038 826252 808222 811592 776754 771369 789194 769136 788503 809463
3147 809463 826824 835808 817020 809037 785546 790977 752961 757746 724768 691741 654748 621513
3135 621513 638492 621070 612338 615452 618310 607305 612212 573466 555567 567951 561902 559314 549629
3122 549629 523330 508186 479733 467236 471244 483603 496796 475556 475303 448686 429468 451828
$$ packed form
3209I00419j5523m432J4130j5995j2530j1374l392P292r59K4737J7418J7534L179
3196I20504M575j0857J572j3865k1956q912J0394p106j6782K3496K1799J3338
3184I16200J5430P536J2514K0030L1472K5842M5418K0728j0840j2279n6287l4541
3172I81223m7830l5042m9861m4948j4662J0656l217j6345j3872R434J8783M937
3160G99256K3889J6568L410r085p786j8030L370l4838n385J7825k0058J9367K0960
3147H09463J7361Q984j8788p983k3491N431l8016M785l2978l3027l6993l3235
3135F21513J6979j7422q732L114K858j1005M907l8746j7899J2384o049k588r685
3122E49629k6299j5144k8453j2497M008J2359J3193k1240k53k6617j9218K2360
$$ plain form
3110 451828 438744 418464 411052 393508 370943 375664 358515 347733 336541 320644 317214 317235 295119
3097 295119 267972 275683 284718 295006 286085 262975 251061 251188 244189 248159 245996 199458 193390
3084 193390 194434 188171 185770 202110 224856 221541 221291 228780 210846 195724 182243 190762 194124
3071 194124 224140 237224 243310 277395 279427 287879 308238 310084 322312 323722 330550 334273 286898
3058 286898 263855 252869 222073 171324 143474 115168 110529 121194 99755 114717 132600 110249
3046 110249 101233 100498 82397 87981 74203 79867 95391 94443 79096 44151 43974 44160 25283 30141
3032 30141 30456 28891 38619 26542 12895 29812 52852 40679 30615 18297 2926 -98 17123
3019 17123 11051 -13844 1411 12850 12804 21027 29387 23273 10512 12465 -2303 -14966 -7209 21354
$$ packed form
3110D51828j3084k0280p412j7544k2565M721j7149j0782j1192j5897l430K1k2116
3097B95119k7147P711R035J0288q921k3110j1914J27o999L970k163m6538o068
3084A93390J044o263k401J6340K2746l315k50P489j7934j5122j3481Q519L362
3071A94124L0016J3084O086L4085K032Q452K0359J846J2228J410O828L723m7375
3058B86898k3043j0986l0796n0749k7850k8306m639J0665k1439J4962J7883k2351
3046A10249r016p35j8101N584j3778N664J5524r48j5347l4945j77J86j8877M858
3032C0141L15j565R728j2077j3647J6917K3040j2173j0064j2318j5371l024J7221
3019A7123o072k4895J5255J1439m6Q223Q360o114j2761J953j4768j2663P757K8563
$$ plain form
3005 21354 32993 46870 29489 10736 -303 10903 -9730 -20163 -11480 -16354 15933 2087
2993 2087 8941 18919 23535 -1850 -11166 -21058 2353 -1000 -16057 4764 -8942 -1512 -1526 -8123
2979 -8123 -28614 -16515 -21844 -6556 -439 -3945 -10784 -24662 -7945 -7294 -17543 14463 19373
2966 19373 1688 -8360 -17562 -13432 49 -15363 21037 35309 14894 16578 13642 12984 -14827
2953 -14827 -25624 -29846 -6109 -12126 -17499 15054 -290 -25273 -31254 -21249 -2064 11246 25049
2940 25049 22889 15868 -7584 2477 18843 28004 25637 33119 39173 40650 49135 57892 41861 30179
2926 30179 20120 24036 16805 34352 56703 66672 68844 52434 73657 81938 84291 79879 112147
2913 112147 113206 115551 107723 120274 119923 113925 111225 110267 112512 135385 148649 154892 160908 180776
$$ packed form
3005B1354J1639J3877j7381j8753j1039J1206k0633j0433Q683m874L2287j3846
2993B087O854R978M616k5385r316r892K3411l353j5057K0821j3706P430j4o597
2979h123k0491J2099n329J5288O117l506o839j3878J6717O51j0249L2006M910
2966A9373j7685j0048r202M130J3481j5412L6400J4272k0415J684k936o58k7811
2953a4827j0797m222K3737o017n373L2553j5344k4983n981J0005J9185J3310J3803
2940B5049k160p021k3452J0061J6366R161k367P482O054J477Q485Q757j6031j1682
2926C0179j0059L916p231J7547K2351R969K172j6410K1223Q281K353m412L2268
2913A12147J059K345p828J2551l51n998k700r58K245K2873J3264O243O016J9868
$$ plain form
2899 180776 181440 196613 193595 189164 216938 229213 215226 208971 237706 242321 243514 232785 238512
2886 238512 239378 254423 245030 236488 240117 258060 249734 263747 263081 259419 269899 293495 298774 286223
2872 286223 289522 302185 303283 323440 325569 322512 354798 388791 394276 386788 411987 425803 405726
2859 405726 405781 404884 415544 422132 423331 409237 415485 416276 416021 390138 373562 353963 342980 325343
2845 325343 307160 305449 287616 267238 253301 243157 263199 269013 261980 270499 276517 303236 305309
2832 305309 317985 323628 323277 323939 323371 303057 310279 304706 320613 338144 350380 343022 341028 338365
2818 338365 328314 308290 289272 260067 253252 249055 222887 223106 183543 171326 172464 167046 166875
2805 166875 149632 140372 130175 134916 152231 134671 103346 99010 95274 130453 137893 125231 106384
$$ packed form
2899A80776O64J5173l018m431K7774J2275j3987o255K8735M615J193j0729N727
2886B38512Q66J5045r393q542L629J7943q326J4013o66l662J0480K3596N279j2551
2872B86223L299J2663J098K0157K129l057L2286L3993N485p488K5199J3816k0077
2859D05726N5q97J0660O588J199j4094O248P91k55k5883j6576j9599j0983j7637
2845C25343j8183j711j7833k0378j3937j0144K0042N814p033Q519O018K6719K073
2832C05309J2676N643l51O62n68k0314P222n573J5907J7531J2236p358j994k663
2818C38365j0051k0024j9018k9205o815m197k6168K19l9563j2217J138n418j71
2805A66875j7243r260j0197M741J7315j7560l1325m336l736L5179P440j2662j8847
$$ plain form
2792 106384 116446 127563 124359 104592 85494 70317 98868 116043 96433 66372 64340 87070
2780 87070 81576 100404 68165 46015 52445 60505 27316 3852 24010 -1508 -22403 1657
2768 1657 6839 -5107 -7878 -2732 19345 27950 -5312 7185 15372 -3838 -296 8312 11917 -9657
2754 -9657 -13034 25565 3135 -16194 -29500 -16260 -6775 -1807 1239 -24230 -34806 -40014 -25609
2741 -25609 -48967 -44129 -26390 -15992 -13782 -16551 -31258 -19513 -12939 -8873 3061 -7959 -37769
2728 -37769 -9536 1943 -18370 -20171 -6611 -19550 -21280 -816 -17463 -33163 -34889 -17174
2716 -17174 -14531 -21655 -18747 -375 8200 -14157 -19956 -4771 -2265 -11287 -29468 -38467 -37248 -22783
2702 -22783 -34453 -43700 -14300 -12642 -22979 -26901 -22518 -14398 -34295 -43700 -40044 -26467 -24051
$$ packed form
2792A06384J0062J1117l204j9767j9098j5177K8551J7175j9610l0061k032K2730
2780H7070n494J8828l2239k2150O430Q060l3189k3464K0158k5518k0895K4060
2768A657N182j1946k771N146K2077Q605l3262J2497Q187j9210L542Q608L605k1574
2754i657l377L8599k2430j9329j3306J3240R485M968L046k5469j0576n208J4405
2741b5609k3358M838J7739J0398K210k769j4707J1745O574M066J1934j1020k9810
2728c7769K8233J1479k0313j801J3560j2939j730K0464j6647j5700j726J7715
2716a7174K643p124K908J8372Q575k2357n799J5185K506r022j8181q999J219J4465
2702b2783j1670r247K9400J658j0337l922M383Q120j9897r405L656J3577K416
$$ plain form
2689 -24051 -29898 -23510 -9526 -26813 -43626 -42791 -40816 -23748 -32970 -43553 -32588 -42801 -48077
2676 -48077 -20828 -6811 -4202 8054 5299 -6930 -36870 -72672 -75280 -62319 -55022 -31116 -9474
2663 -9474 -17046 -18893 -12140 -13838 -26578 -56601 -23907 -8620 -18643 -16125 -47888 -34429 -26425
2650 -26425 -25707 -16279 -18992 -13163 -32042 -31430 -20440 -11204 -28250 -29356 -18885 -15624 -34187 -45649
2636 -45649 -47026 -48179 -29995 -9710 -251 2450 -1300 12191 7218 -4497 -8338 -25430 -31782
2623 -31782 -31187 -43909 -21959 -29683 -17727 384 -18470 4055 -3084 435 -5625 -32058 -29024
2610 -29024 -36248 -45778 -31042 -21932 -26203 -40418 -29419 -9514 -4231 1428 12986 -13104 -20335
2597 -20335 -22464 -17594 -22379 -30264 -29124 -30422 -43486 -55814 -36513 -29627 -15835 -18265 -12675 -28988
$$ packed form
2689b4051n847O388J3984j7287j6813Q35J975J7068r222j0583J0965j0213n276
2676d8077K7249J4017K609J2256k755j2229k9940l5802k608J2961P297K3906K1642
2663i474p572j847O753j698j2740l0023L2694J5287j0023K518l1763J3459Q004
2650b6425P18R428k713N829j8879O12J0990R236j7046j106J0471L261j8563j1462
2636d5649j377j153J8184K0285R459K701l750J3491m973j1715l841j7092o352
2623c1782N95j2722K1950p724J1956J8111j8854K2525p139L519o060k6433L034
2610b9024p224r530J4736R110m271j4215J0999J9905N283N659J1558k6090p231
2597b0335k129M870m785p885J140j298j3064j2328J9301O886J3792k430N590j6313
$$ plain form
2583 -28988 -14667 -20487 -36050 -32558 -16307 -9518 6332 -8699 -25529 -14756 -54648 -30332
2571 -30332 -19433 -19583 -24955 -33111 -31476 -71420 -73614 -54983 -50249 -37665 -29359 -23065 -7433 -25447
2557 -25447 -22060 -31075 -33437 -14755 -19944 14193 -7050 -4204 5224 4932 -19330 -51847 -53712 -56451
2543 -56451 -50617 -37981 -40330 -37617 -27717 -26361 -44088 -30475 -25658 -25410 -24079 -38143 -56011 -39841
2529 -39841 -41230 -58654 -53116 -36270 -24807 -8076 -18738 -37844 -31410 -22573 -12281 -12735 -24065
2516 -24065 -17135 -25203 -15635 -13250 -10103 -17888 -24252 -25929 -19269 -26678 -27303 -43868 -30192 -17619
2502 -17619 -25559 -27227 -25893 8063 -9327 -36652 -50947 -24515 -3136 -19087 -61896 -46568
2490 -46568 -30710 -9622 -10661 -15435 -4496 3596 9152 12352 17750 929 -24497 -41161 -35071
$$ packed form
2583b8988J4321n820j5563L492J6251O789J5850j5031j6830J0773l9892K4316
2571c0332J0899j50n372q156J635l9944k194J8631M734J2584Q306O294J5632j8014
2557b5447L387r015k362J8682n189L4137k1243K846R428k92k4262l2517j865k739
2543e6451N834J2636k349K713R900J356j7727J3613M817K48J331j4064j7868J6170
2529c9841j389j7424N538J6846J1463J6731j0662j9106O434Q837J0292m54j1330
2516b4065O930q068R568K385L147p785o364j677O660p409o25j6565J3676J2573
2502a7619p940j668J334L3956j7390k7325j4295K6432K1379j5951m2809J5328
2490d6568J5858K1088j039m774J0939Q092N556L200N398j6821k5426j6664O090
$$ plain form
2477 -35071 -32322 -20882 549 -16364 -21891 -14040 5056 1320 -6025 -19820 -35275 -41355 -22785
2464 -22785 -3154 -21971 -23440 -10514 -14026 8777 8426 21250 26402 410 -6873 -10317 -3345
2451 -3345 -14479 -25986 -23838 -47144 -20643 -1189 7774 6752 2322 708 -12761 7528 19294
2438 19294 11455 -20799 -12974 5172 -6191 -6509 4164 9576 15355 38163 50981 57150 31707
2425 31707 34989 45362 34968 36728 37858 46892 37375 34018 38900 31025 32117 22697 33541 24419
2411 24419 24853 41333 57532 55024 51384 45823 59083 68581 52414 72758 89781 78705 72553
2398 72553 85474 96920 97754 115933 128448 140440 135604 156229 198131 218297 203400 191596
2386 191596 212763 262346 312147 303377 331289 379118 422552 440338 464204 497992 506703 532761
$$ packed form
2477c5071K749J1440K1431j6913n527P851J9096l736p345j3795j5455o080J8570
2464b2785J9631j8817j469J2926l512K2803l51J2824N152k5992p283l444O972
2451c345j1134j1507K148k3306K6501J9454Q963j022m430j614j3469K0289J1766
2438A9294p839l2254P825J8146j1363l18J0673N412N779K2808J2818O169k5443
2425C1707L282J0373j0394J760J130R034r517l357M882p875J092r420J0844r122
2411B4419M34J6480J6199k508l640n561J3260R498j6167K0344J7023j1076o152
2398G2553J2921J1446Q34J8179J2515J1992m836K0625M1902K0166j4897j1804
2386A91596K1167M9583M9801q770K7912M7829M3434J7786K3866L3788Q711K6058
$$ plain form
2374 532761 574663 583043 620909 635889 672539 721819 774963 824497 911427 975692 1027561 1086364
2362 1086364 1145711 1241359 1361945 1481695 1651654 1845414 2080926 2404111 2783599 3176373
2352 3176373 3688085 4319068 4785682 4838101 4370791 3682001 3024519 2518222 2143275 1841721
2342 1841721 1558956 1300070 1150166 1032732 948197 853257 787590 723883 692581 630628 572235
2331 572235 515079 447798 430362 373946 325614 318233 291494 244542 263732 275824 287570 249236
2319 249236 214354 230045 217839 192533 182066 178604 173971 174589 157864 157091 146146 135829 136228
2306 136228 122928 90961 90441 99735 74651 72789 94962 95965 76136 78898 104400 104962 72276
2293 72276 41909 46172 41292 4734 23982 32572 11239 10930 23581 37760 32476 20261 45420
$$ packed form
2374E32761M1902Q380L7866J4980L6650M9280N3144M9534Q6930O4265N1869N8803
2362A086364N9347R5648J20586J19750J69959J93760K35512L23185L79488L92774
2352C176373N11712O30983M66614N2419m67310o88790o57482n06297l74947l01554
2342A841721k82765k58886j49904j17434q4535r4940o5667o3707l1302o1953n8393
2331E72235n7156o7281j7436n6416m8332p381k6739m6952J9190J2092J1746l8334
2319B49236l4882J5691j2206k5306j0467l462m633O18j6725p73j0945j0317L99
2306A36228j3300l1967n20R294k5084j862K2173J003j9829K762K5502N62l2686
2293G2276l0367M263m880l6558J9248Q590k1333l09J2651J4179n284j2215K5159
$$ plain form
2280 45420 52052 19156 29887 35547 25293 30531 14207 1380 7428 5249 6121 20100 10996
2267 10996 18765 23542 23426 37711 33134 24626 21768 35979 39538 36825 46786 17569 5181 1162
2253 1162 5765 23976 34559 15582 10063 -12232 -26114 -37869 -23100 -15672 -22358 -493 15256
2240 15256 19086 23058 8259 -2391 -13803 1317 25162 24490 23354 25868 19070 -7580 -13350
2227 -13350 -21224 -924 -117 17333 -5722 -39465 -50468 -40412 -27104 -35516 -2021 -6392 -8354
2214 -8354 -11314 -10587 -25955 -23957 -23967 -5655 1202 -10447 -5996 -18372 -27690 -24852 -9711 -22697
2200 -22697 -36309 -27635 -1496 5679 51 -9937 -26822 -12538 -15056 -17111 -13208 -16066 -18125 -8568
2186 -8568 -14845 -24667 -14144 -32577 -33870 -31481 -41847 -10704 -14802 -50030 -41035 -38116 -38938 -21075
$$ packed form
2280D5420O632l2896J0731N660j0254N238j6324j2827O048k179Q72J3979r104
2267A0996P769M777j16J4285m577q508k858J4211L559k713R961k9217j2388m019
2253A162M603J8211J0583j8977n519k2295j3882j1755J4769P428o686K1865J5749
2240A5256L830L972j4799j0650j1412J5120K3845o72j136K514o798k6650n770
2227a3350p874K0300Q07J7450k3055l3743j1003J0056J3308q412L3495m371j962
2214h354k960P27j5368J998j0J8312O857j1649M451j2376r318K838J5141j2986
2200b2697j3612Q674K6139P175n628r988j6885J4284k518k055L903k858k059R557
2186h568o277r822J0523j8433j293K389j0366L1143m098l5228Q995K919q22J7863
$$ plain form
2172 -21075 -5836 -3271 18472 28547 21549 522 -8527 -21388 -15146 -31262 -22509 21914 21315
2159 21315 -1301 -8697 -37309 -19094 -1452 430 -29381 -22556 -17303 -15564 -13670 3887 8087
2146 8087 -15230 -1178 -1862 -33635 -50918 -38182 -24985 -15247 -7863 -2662 -5456 2736 -12379
2133 -12379 -16748 -6300 847 -13347 -34647 -15880 8889 -6184 -17650 -21422 -30300 -33696 -20341
2120 -20341 -13313 7721 -24668 -32706 11461 -4671 -9986 4973 -22427 -16208 9170 12223 19136
2107 19136 -20128 -38169 -21448 -16941 -24830 -2904 -11585 -173 -2291 3525 4296 -13753 -16258
2094 -16258 -23994 -18725 -11241 4441 -7937 -8680 -5956 -7628 9868 4138 -7667 9365 21418
2081 21418 32152 19885 31920 30464 34780 28830 22032 8164 2196 -24491 -19504 -28192 -30675
$$ packed form
2172b1075J5239K565K1743J0075o998k1027r049j2861O242j6116Q753M4423n99
2159B1315k2616p396k8612J8215J7642J882k9811O825N253J739J894J7557M200
2146H087k3317J4052o84l1773j7283J2736J3197R738P384N201k794Q192j5115
2133a2379m369J0448P147j4194k1300J8767K4769j5073j1466l772q878l396J3355
2120b0341P028K1034l2389q038M4167j6132n315J4959k7400O219K5378L053O913
2107A9136l9264j8041J6721M507p889K1926q681J1412k118N816P71j8049k505
2094a6258p736N269P484J5682j2378p43K724j672J7496n730j1805J7032J2053
2081B1418J0734j2267J2035j456M316n950o798j3868n968k6687M987q688k483
$$ plain form
2068 -30675 -6980 2005 -7547 -5516 13792 6542 8917 -28094 -32142 -23789 -21022 -16411 -22872 -12643
2054 -12643 7298 13394 -11166 -22274 -23857 -7319 -6168 8091 12383 -7094 -9892 -21764 -3442
2041 -3442 -10748 -12453 4565 -6782 2300 -10620 -54229 -44633 -18996 -26066 -33606 -39261 -10755
2028 -10755 -15933 -22399 -2779 -12275 -11546 -16612 -5224 -1631 -20709 -37003 -40824 -25609 -17729 -12962
2014 -12962 -18895 -1024 -168 -4581 -29080 -42584 -20333 -41042 -47375 -42676 -25992 -32411 -30070
2001 -30070 -31641 -32232 -44735 -43758 -10662 -26623 -16860 -18342 -22462 -35624 -34571 -19715 -8126 -11317
1987 -11317 -45771 -35813 -23410 -16675 -7280 -13237 10408 -22314 -36130 -28118 -53074 -31179 -25862
1974 -25862 -29248 -13309 -6724 -5852 -9391 -34902 -8498 -23811 -19461 -13534 -5627 -13336 -14503 8900
$$ packed form
2068c0675K3695Q985r552K031J9308p250K375l7011m048Q353K767M611o461J0229
2054a2643J9941O096k4560j1108j583J6538J151J4259M292j9477k798j1872J8322
2041c442p306j705J7018j1347R082j2920m3609R596K5637p070p540n655K8506
2028a0755n178o466J9620r496P29n066J1388L593j9078j6294l821J5215P880M767
2014a2962n933J7871Q56m413k4499j3504K2251k0709o333M699J6684o419K341
2001c0070j571n91j2503R77L3096j5961R763j482m120j3162J053J4856J1589l191
1987a1317l4454R958J2403O735R395n957K3645l2722j3816Q012k4956K1895N317
1974b5862l386J5939O585Q72l539k5511K6404j5313M350N927P907p709j167K3403
$$ plain form
1960 8900 9673 7428 5381 8454 10329 3414 -1431 -7867 -28601 -42578 -39329 -35799 -33322 -33636 2745
1945 2745 -17096 -15641 -3065 4402 -18690 -15039 2129 8268 -53 -27811 -33500 -33581 -12611 -10896
1931 -10896 -12191 -21442 -18218 -22921 -29170 -37214 -8022 -17325 -14119 -6383 12971 -9085 -1492 697
1917 697 -6327 -1986 -3709 -14835 -10836 5478 12164 11906 -14949 -9496 10063 28040 21734 11006
1903 11006 1960 14132 -9931 -22521 -2694 -21228 -5468 1242 -27493 -23885 -30835 -16671 -9882
1890 -9882 -38228 -19727 -29190 -38606 -33353 -11152 -21148 -30216 -22158 -13487 -16397 -8167 -24987 -26306
1876 -26306 -16867 -11841 -2334 -40 -1383 -7065 -8580 2085 2165 -10790 -15322 15090 17162 23834
1862 23834 -5212 -41256 -24515 -19916 6524 2577 -10804 3702 11307 23737 20593 12109 13478
$$ packed form
1960H900P73k245k047L073J875o915m845o436k0734j3977L249L530K477l14L6381
1945B745j9841J455J2576P467k3092L651J7168O139q321k7758n689q1K0970J715
1931a0896j295r251L224m703o249q044K9192r303L206P736J9354k2056P593K189
1917F97p024M341j723j1126L999J6314O686k58k6855N453J9559J7977o306j0728
1903A1006r046J2172k4063j2590J9827j8534J5760O710k8735L608o950J4164O789
1890i882k8346J8501r463r416N253K2201r996r068Q058Q671k910Q230j6820j319
1876b6306R439N026R507K294j343n682j515J0665Q0j2955m532L0412K072O672
1862B3834k9046l6044J6741M599K6440l947j3381J4506P605J2430l144q484J369
$$ plain form
1849 13478 -4473 -19318 -27797 -16273 -12329 -13576 -18146 -15514 -29287 7284 -6681 -3596 -8480
1836 -8480 -43441 -47753 -3571 329 56 -4665 5864 3713 -3437 -2860 11765 -2658 -31783 -18311
1822 -18311 14268 14607 9188 10240 6759 -20360 -28608 -18219 -28742 -14386 -14839 -18004 -16666 -11341
1808 -11341 -25383 -9578 4271 15135 -5309 -2436 8837 -9286 -9197 -1391 13384 7414 -645
1795 -645 11569 -10977 -5126 -7777 3617 21778 19354 -17554 -32708 -6634 -4016 28099 30518
1782 30518 20991 8205 -8461 -19649 -13951 -21579 -22834 -23215 -11373 -15776 -28236 -19647 -25651 -32885
1768 -32885 -24597 -16908 -23042 -31665 -31056 -7907 -10640 230 10108 -9779 -20519 -12789 -34436 -28243
1754 -28243 -23985 -20225 -6884 -2027 3650 1081 -2453 5442 5239 8371 -15077 8096 24300 7158
$$ packed form
1849A3478j7951j4845q479J1524L944j247m570K632j3773L6571j3965L085m884
1836h480l4961m312M4182L900k73m721J0529k151p150N77J4625j4423k9125J3472
1822a8311L2579L39n419J052l481k7119q248J0389j0523J4356m53l165J338N325
1808a1341j4042J5805J3849J0864k0444K873J1273j8123Q9P806J4775n970q059
1795f45J2214k2546N851k651J1394J8161k424l6908j5154K6074K618L2115K419
1782C0518r527j2786j6666j1188N698p628j255l81J1842m403j2460Q589o004p234
1768c2885Q288P689o134q623O09K3149k733J0870R878j9887j0740P730k1647O193
1754b8243M258L760J3341M857N677k569l534P895k03L132k3448K3173J6204j7142
$$ plain form
1740 7158 -19649 -33659 -17441 -11173 -17675 -2470 -12549 -3606 7747 1200 -8717 3106 7814
1727 7814 6656 25089 4053 -12203 -11763 13033 4845 -9271 -8735 -764 -2360 -5817 -7175 1200
1713 1200 3358 12002 13417 12916 -16695 -21185 -23154 -10879 -13678 -24461 -11557 -31795 -26699 -14602
1699 -14602 -11540 10885 1268 -23043 -31862 -19682 -11960 -15004 -3032 -17757 -24990 -18008 -33527
1686 -33527 -3997 618 10474 42653 24193 23305 10711 11433 -15988 -25069 -10674 -5509 -14309 -18107
1672 -18107 -20529 -4001 -9111 -851 -18585 1844 12743 7269 22017 238 9425 -179 905
1659 905 -14778 -4140 -5896 -31832 -10846 -10065 -16313 10478 5877 17293 10822 25043 913
1646 913 -2395 853 -21369 -4243 -22370 -24877 -8707 -13515 -18765 -9177 -16919 -21024 -17658 -18638
$$ packed form
1740G158k6807j4010J6218O268o502J5205j0079Q943J1353o547r917J1823M708
1727G814j158J8433k1036j6256M40K4796q188j4116N36P971j596l457j358Q375
1713A200K158Q644J415n01k9611m490j969J2275k799j0783J2904k0238N096J2097
1699a4602L062K2425r617k4311q819J2180P722l044J1972j4725p233O982j5519
1686c3527K9530M615R856L2179j8460q88j2594P22k7421r081J4395N165q800l798
1672a8107k422J6528n110Q260j7734K0429J0899n474J4748k1779R187r604J084
1659I05j5683J0638j756k5936K0986P81o248K6791m601J1416o471J4221k4130
1646I13l308L248k2222J7126j8127k507J6170m808n250R588p742m105L366r80
$$ plain form
1632 -18638 -10821 -15184 -18280 -4417 15441 17602 398 -4552 -9822 3757 16558 -6079 18529
1619 18529 -1241 -21001 -1173 3663 7491 7600 1351 20446 30232 28389 31535 19229 -2397
1606 -2397 10205 17581 7660 1920 4071 -508 -3149 -10052 -19732 -26028 -10405 -9296 -12193 -3932
1592 -3932 -2439 -10576 -16591 -1680 11225 8049 -11598 -11213 -20516 -12625 9753 7249 -16069 -13073
1578 -13073 7145 -2954 -18184 -18961 -24096 -9425 -21350 565 -5284 -11601 -2652 7821 5040
1565 5040 11927 29178 17587 -18210 -12524 -2440 -6965 -1686 25469 9 -16041 -417 13397
1552 13397 5702 3504 -409 -4739 19176 970 738 -4215 -2744 -6634 -11906 1265 13023 10809
1538 10809 3461 -12277 -14977 -11511 22579 18162 10791 6859 -10271 -11106 14695 -5539 -16809
$$ packed form
1632a8638P817m363l096J3863J9858K161j7204m950n270J3579J2801k2637K4608
1619A8529j9770j9760J9828M836L828J09o249J9095R786j843L146j2306k1626
1606b397J2602P376r921n740K151m579k641o903r680o296J5623J109k897Q261
1592c932J493q137o015J4911J2905l176j9647L85r303P891K2378k504k3318K996
1578a3073K0218j0099j5230p77n135J4671j1925K1915n849o317Q949J0473k781
1565E040O887J7251j1591l5797N686J0084m525N279K7155k5460j6050J5624J3814
1552A3397p695k198l913m330K3915j8206k32m953J471l890n272J3171J1758k214
1538A0809p348j5738k700L466L4090m417p371l932j7130q35K5801k0234j1270
$$ plain form
1525 -16809 -4138 7027 15449 1419 -9794 -5113 -16059 -32533 -14163 -16762 -18090 -24533 -24526 -1377
1511 -1377 28511 17543 5089 20348 9126 -10975 -6497 -6669 -11998 -22861 7612 8417 16374
1498 16374 -8948 -20035 -25272 -41413 -19244 1036 2411 13912 1671 755 19591 6575 3169
1485 3169 -3457 -9650 -9939 -23986 -2534 -6128 -45189 -23137 27499 10256 6500 9629 3613 -3103
1471 -3103 -12955 24465 19071 11919 6828 -9824 -10166 3584 -11599 -17169 -4405 -20998 -26235 12544
1457 12544 -3657 -21958 1468 20335 7085 7576 8621 21328 18758 20016 10735 -14841 -5965
1444 -5965 20837 16784 22095 10125 9157 24193 3239 -9649 -20005 -12620 12624 -5276 3593
1431 3593 -562 -18645 -19057 -18203 -13600 -16257 -18353 -1996 -13636 -2056 -7422 -11401 5408 7472
$$ packed form
1525a6809J2671J1165Q422j4030j1213M681j0946j6474J8370k599j328o443PK3149
1511a377K9888j0968j2454J5259j1222k0101M478j72n329j0863L0473Q05P957
1498A6374k5322j1087n237j6141K2169K0280J375J1501j2241r16J8836j3016l406
1485C169o626o193k89j4047K1452l594l9061K2052N0636j7243l756L129o016o716
1471c103r852L7420n394p152n091j6652l42J3750j5183n570J2764j6593n237L8779
1457A2544j6201j8301K3426J8867j3250M91J045J2707k570J258r281k5576Q876
1444e965K6802m053N311j1970r68J5036k0954j2888j0356P385K5244j7900Q869
1431C593m155j8083m12Q54M603k657k096J6357j1640J1580n366l979J6809K064
$$ plain form
1417 7472 -5837 -15545 5559 9103 -8159 -11053 6299 6049 -2844 -10597 -21407 -15177 -9802 -21947
1403 -21947 -14777 -21325 -29862 -26608 -45306 -10513 19895 18259 20427 -1018 -36432 -14901 10434
1390 10434 5662 10213 1987 -245 -4730 -5133 2733 17263 9669 18907 -3379 1602 2960 7827
1376 7827 8604 -8151 8305 28386 12388 11540 -3239 -15087 9855 5588 -1922 1606 3065 5375
1362 5375 -6347 7243 -13256 17004 -2767 -13204 12823 13948 20010 24607 4544 9778 -5030
1349 -5030 -25000 7324 -8814 -22878 -11752 -16717 -6505 3474 -14333 -12184 -722 19409 13503
1336 13503 423 22587 41656 39794 19444 -9965 11451 14287 13498 17110 17678 21882 19080 30790
1322 30790 42704 12767 -1038 15745 23223 13343 4497 26596 45990 20069 3902 9982 579
$$ packed form
1417G472j3309r708K1104L544j7262k894J7352k50q893p753j0810O230N375j2145
1403b1947P170o548q537L254j8698L4793L0408j636K168k1445l5414K1531K5335
1390A0434m772M551q226k232m485m03P866J4530p594R238k2286M981J358M867
1376G827P77j6755J6456K0081j5998q48j4779j1848K4942m267p510L528J459K310
1362E375j1722J3590k0499L0260j9771j0437K6027J125O062M597k0063N234j4808
1349e030j9970L2324j6138j4064J1126m965J0212R979j7807K149J1462K0131n906
1336A3503j3080K2164J9069j862k0350k9409K1416K836p89L612N68M204k802J1710
1322C0790J1914k9937j3805J6783P478r880q846K2099J9394k5921j6167O080r403
$$ plain form
1309 579 -7411 -14054 2212 -17654 -30006 -11894 -8445 -11697 -1042 22927 11928 -16845 -6317
1296 -6317 1856 4356 -6847 -4662 6987 -5225 -3120 -11312 -5524 19713 7215 4369 8985 5082
1282 5082 13729 32583 43766 20905 5217 -6837 -7115 -9302 2859 -7583 -13376 -13281 -6573 20144
1268 20144 19196 -2968 -7778 10444 9559 19996 9510 19642 30673 -9017 -9248 6473 8742
1255 8742 12649 -5291 -13846 9725 14056 15273 24708 30753 22123 3254 -19083 925 16133
1242 16133 19709 2878 2784 11470 25410 13429 30240 6909 -744 -13971 -9236 -3291 7243
1229 7243 26291 28073 16318 16234 584 -14371 17467 20118 17351 6473 -17835 -26644 -10439
1216 -10439 -6047 -946 -8511 -22971 -21573 -1943 23845 52562 54439 37201 35331 38029 32048
$$ packed form
1309E79p990o643J6266j9866j2352J8112L449l252J0655K3969j0999k8773J0528
1296f317Q173K500j1203K185J1649j2212K105q192N788K5237j2498k846M616l903
1282E082Q647J8854J1183k2861j5688j2054k78k187J2161j0442n793R5O708K6717
1268B0144r48k2164m810J8222q85J0437j0486J0132J1031l9690k31J5721K269
1255H742L907j7940q555K3571M331J217R435O045q630j8869k2337K0008J5208
1242A6133L576j6831r4Q686J3940j1981J6811k3331p653j3227M735N945J0534
1229G243J9048J782j1755q4j5650j4955L1838K651k767j0878k4308q809J6205
1216a0439M392N101p565j4460J398J9630K5788K8717J877j7238j870K698n981
$$ plain form
1203 32048 22527 10957 12595 31431 11057 12474 19308 21353 40572 36051 21239 -14241 -2864
1190 -2864 -19361 5753 16491 12628 18440 32898 13533 6386 6420 7585 -2786 -805 10963 24440
1176 24440 15639 381 -7753 -3779 -4931 -12858 20550 25800 14653 -1435 1339 24055 10979
1163 10979 3884 -2513 -7327 -11332 -1904 20572 37346 39892 20640 11392 3841 -6138 1656 7513
1149 7513 28535 15655 33679 32973 16582 15084 11278 26004 13676 1248 -14460 -33084 -26540
1136 -26540 -13845 583 10483 6378 -2091 -3970 904 -1985 -7135 -1670 -13973 531 -1046 -3210
1122 -3210 34302 42759 11042 2902 11290 -2089 2365 -1455 12127 14931 184 -6199 -8285 3153
1108 3153 17590 16623 16213 -671 -2808 16058 22070 3601 22403 423 -10508 2350 15927
$$ packed form
1203C2048r521j1570J638J8836k0374J417O834K045J9219m521j4812l5480J1377
1190b864j6497K5114J0738l863N812J4458j9365p147L4J165j0371J981J1768J3477
1176B4440q801j5258q134L974j152p927L3408N250j1147j6088K774K2716j3076
1163A0979p095o397m814m005R428K2476J6774K546j9252r248p551r979P794N857
1149G513K1022j2880J8024p06j6391j498l806J4726j2328j2428j5708j8624O544
1136b6540J2695J4428R900m105q469j879M874k889n150N465j2303J4504j577k164
1122c210L7512Q457l1717q140Q388j3379M454l820J3582K804j4747o383k086J1438
1108C153J4437r67m10j6884k137J8866O012j8469J8802k1980j0931J2858J3577
$$ plain form
1095 15927 -725 12 -11109 -7778 -15078 -1691 2906 13174 -2974 -3919 9952 11276 11201 14339
1081 14339 23876 26127 21490 1847 15418 -5904 121 43777 40683 17887 19359 10130 5986
1068 5986 15409 -3264 -3659 15063 15569 1470 -28734 -3513 17010 9143 11598 1346 8552 11039
1054 11039 16045 9887 13351 32370 13809 14014 -8265 4993 -6196 6683 4030 -18746 1904
1041 1904 -1866 -9310 -17337 -23126 10977 14183 -2263 3005 15932 12118 8633 38483 32169 38929
$$ packed form
1095A5927j6652P37j1121L331p300J3387M597J0268j6148r45J3871J324p5L138
1081A4339R537K251m637j9643J3571k1322O025M3656l094k2796J472r229m144
1068E986R423j8673l95J8722N06j4099l0204K5221K0523p867K455j0252P206K487
1054A1039N006o158L464J9019j8561K05k2279J3258j1189J2879k653k2776K0650
1041A904l770p444q027n789L4103L206j6446N268J2927l814l485K9850o314O760
$$ [...]
##END NTUPLES=NMR SPECTRUM
##END=
