##TITLE=1H_CA-9319-1
 200.13MHz, CDCl3,
 8 sc
 
 12.2.2025
##JCAMPDX= 6.0         $$ Bruker NMR JCAMP-DX V2.0
##DATA TYPE= NMR SPECTRUM
##DATA CLASS= NTUPLES
##ORIGIN= UXNMR, Bruker Analytische Messtechnik GmbH
##OWNER= pz
$$ XWIN-NMR		Version 3.5
$$ Wed Feb 12 14:23:26 2025 Russian Standard Time (UT+4h)  she@DPX200
##.OBSERVE FREQUENCY= 200.1313
##.OBSERVE NUCLEUS= ^1H
##.ACQUISITION MODE= SIMULTANEOUS
##.ACQUISITION SCHEME= undefined
##.AVERAGES= 16
##.DIGITISER RES= 18
##SPECTROMETER/DATA SYSTEM= spect
##.PULSE SEQUENCE= zg30
##.SOLVENT NAME= D2O
##.SHIFT REFERENCE= (INTERNAL, D2O, 0, 15.5045)
##AUDIT TRAIL= $$ (NUMBER, WHEN, WHO, WHERE, WHAT)
$$ ##TITLE= Audit trail, XWIN-NMR		Version 3.5
$$ ##JCAMPDX= 5.01
$$ ##ORIGIN= Bruker BioSpin GmbH
$$ ##OWNER= she
$$ F:/spectra/data/she/nmr/H-C/1/pdata/1/auditp.txt
$$ ##AUDIT TRAIL=  $$ (NUMBER, WHEN, WHO, WHERE, WHAT)
(   1,<2025-02-12 14:21:51.17 +0400>,<she>,<DPX200>,
      <created by zg, POWCHK disabled, PULCHK disabled
       configuration hash MD5:
       00 E9 B6 7A A2 85 ED C7 34 08 36 98 17 FE 4E 26
       data hash MD5: 16K
       60 13 BF B5 49 56 5E 7B CF 65 12 EF 95 CE C5 61>)
(   2,<2025-02-12 14:21:53.09 +0400>,<she>,<DPX200>,
      <Start of raw data processing
       efp BC_mod = 2 LB = 0.25 FT_mod = 6 PKNL = 1 PHC0 = -471.8589 PHC1 = 13.39221 SI = 16K 
       data hash MD5: 16K
       47 88 FD 40 77 14 6F EA 5F B3 71 47 8D D9 9E 70>)
(   3,<2025-02-12 14:22:25.79 +0400>,<she>,<DPX200>,
      <pk PHC0 = -152.5188 PHC1 = -2.4 
       data hash MD5: 16K
       45 A3 01 05 EA 02 40 76 90 FA 67 86 9E 4C E2 E0>)
(   4,<2025-02-12 14:22:29.10 +0400>,<she>,<DPX200>,
      <abs ABSG = 5 
       data hash MD5: 16K
       46 2B 1C 06 97 5B 75 E4 A5 AE 9B BC 5A 2E DF 14>)
$$ ##END=
$$ 
$$ hash MD5
$$ A7 84 BF 9B C9 4A 2F 45 F1 8C 1B 9D 58 20 74 9E
##$RELAX= 
##$RELAX= 
##$RELAX= 
##$RELAX= 
##$RELAX= 
##$RELAX= 
$$ Bruker specific parameters
$$ --------------------------
##$DU= <F:/spectra>
##$EXPNO= 1
##$NAME= <H-C>
##$PROCNO= 1
##$TYPE= <nmr>
##$USER= <she>
##$AMP= (0..31)
100 100 100 100 100 100 100 100 100 100 100 100 100 100 100 100 100 100 
100 100 100 100 100 100 100 100 100 100 100 100 100 100 
##$AQSEQ= 0
##$AQ_mod= 1
##$AUNM= <au_zg>
##$AUTOPOS= <>
##$BF1= 200.13
##$BF2= 200.13
##$BF3= 200.13
##$BF4= 200.13
##$BF5= 200.13
##$BF6= 200.13
##$BF7= 200.13
##$BF8= 200.13
##$BYTORDA= 1
##$CFDGTYP= 0
##$CFRGTYP= 5
##$CHEMSTR= <none>
##$CNST= (0..31)
1 1 145 1 1 1 1 1 1 1 1 1 1 1 1 1 1 1 1 1 1 1 1 1 1 1 1 1 1 1 1 1 
##$CPDPRG= <>
##$CPDPRG1= <>
##$CPDPRG2= <>
##$CPDPRG3= <>
##$CPDPRG4= <mlev>
##$CPDPRG5= <mlev>
##$CPDPRG6= <mlev>
##$CPDPRG7= <mlev>
##$CPDPRG8= <mlev>
##$CPDPRGB= <>
##$CPDPRGT= <>
##$D= (0..31)
0 0.7 0 0 0 0 0 0 0 0 0 0.03 0 0 0 0 0 0 0 0 0 0 0 0 0 0 0 0 0 0 0 0 
##$DATE= 1739355710
##$DBL= (0..7)
120 120 120 120 120 120 120 120 
##$DBP= (0..7)
150 150 150 150 150 150 150 150 
##$DBP07= 0
##$DBPNAM0= <>
##$DBPNAM1= <>
##$DBPNAM2= <>
##$DBPNAM3= <>
##$DBPNAM4= <>
$$ [...]
##$SUBNAM3= <"">
##$SUBNAM4= <"">
##$SUBNAM5= <"">
##$SUBNAM6= <"">
##$SUBNAM7= <"">
##$SUBNAM8= <"">
##$SUBNAM9= <"">
##$SW= 18.0517328524113
##$SWIBOX= (0..15)
0 0 2 0 0 0 0 0 0 0 0 0 0 0 0 0 
##$SW_h= 3612.71676300578
##$TD= 16384
##$TD0= 1
##$TE= 0
##$TE2= 300
##$TE3= 300
##$TEG= 300
##$TL= (0..7)
0 120 120 120 120 120 120 120 
##$TP= (0..7)
150 150 150 150 150 150 150 150 
##$TP07= 0
##$TPNAME0= <>
##$TPNAME1= <>
##$TPNAME2= <>
##$TPNAME3= <>
##$TPNAME4= <>
##$TPNAME5= <>
##$TPNAME6= <>
##$TPNAME7= <>
##$TPOAL= (0..7)
0.5 0.5 0.5 0.5 0.5 0.5 0.5 0.5 
##$TPOFFS= (0..7)
0 0 0 0 0 0 0 0 
##$TUNHIN= 0
##$TUNHOUT= 0
##$TUNXOUT= 0
##$USERA1= <user>
##$USERA2= <user>
##$USERA3= <user>
##$USERA4= <user>
##$USERA5= <user>
##$V9= 5
##$VALIST= <valist>
##$VCLIST= <CCCCCCCCCCCCCCC>
##$VD= 0
##$VDLIST= <DDDDDDDDDDDDDDD>
##$VPLIST= <PPPPPPPPPPPPPPP>
##$VTLIST= <TTTTTTTTTTTTTTT>
##$WBST= 1024
##$WBSW= 4
##$XGAIN= (0..3)
0 0 0 0 
##$XL= 0
##$YL= 0
##$YMAX_a= 745025
##$YMIN_a= -559450
##$ZGOPTNS= <>
##$ZL1= 120
##$ZL2= 120
##$ZL3= 120
##$ZL4= 120
##$ABSF1= 15.60312
##$ABSF2= -2.448731
##$ABSG= 5
##$ABSL= 3
##$ALPHA= 0
##$AQORDER= 0
##$ASSFAC= 0
##$ASSFACI= 0
##$ASSFACX= 0
##$ASSWID= 0
##$AUNMP= <proc_1d>
##$AZFE= 0.1
##$AZFW= 0.1
##$BCFW= 0
##$BC_mod= 2
##$BYTORDP= 0
##$COROFFS= 0
##$CY= -3
##$DATMOD= 1
##$DC= 0
##$DFILT= <>
##$DTYPP= 0
##$F1P= 0
##$F2P= 0
##$FCOR= 1
##$FTSIZE= 16384
##$FT_mod= 6
##$GAMMA= 0
##$GB= 0
##$INTBC= 1
##$INTSCL= 3.241238e-09
##$ISEN= 128
##$LB= 0.25
##$LEV0= 0
##$LPBIN= 0
##$MAXI= 10000
##$MC2= 0
##$MEAN= 0
##$ME_mod= 0
##$MI= 1.114404
##$NCOEF= 0
##$NC_proc= -5
##$NLEV= 6
##$NOISF1= 3.799351
##$NOISF2= 2.8
##$NSP= 0
##$NTH_PI= 0
##$NZP= 0
##$OFFSET= 15.50449
##$PC= 1
##$PHC0= -624.3777
##$PHC1= 10.99221
##$PH_mod= 1
##$PKNL= yes
##$PPARMOD= 0
##$PSCAL= 0
##$PSIGN= 0
##$REVERSE= no
##$SF= 200.130003442992
##$SI= 16384
##$SIGF1= 3
##$SIGF2= 2
##$SINO= 0.751879
##$SIOLD= 32768
##$SREGLST= <19F.Aceton>
##$SSB= 0
##$STSI= 16384
##$STSR= 0
##$SW_p= 3612.71676300578
##$SYMM= 0
##$S_DEV= 0
##$TDeff= 16384
##$TDoff= 0
##$TI= <>
##$TILT= no
##$TM1= 0
##$TM2= 0
##$TOPLEV= 0
##$USERP1= <user>
##$USERP2= <user>
##$USERP3= <user>
##$USERP4= <user>
##$USERP5= <user>
##$WDW= 1
##$XDIM= 16384
##$YMAX_p= 321986149
##$YMIN_p= -236625
$$ End of Bruker specific parameters
$$ ---------------------------------
##NTUPLES= NMR SPECTRUM
##VAR_NAME=  FREQUENCY,     SPECTRUM/REAL,   SPECTRUM/IMAG
##SYMBOL=    X,             R,               I
##VAR_TYPE=  INDEPENDENT,   DEPENDENT,       DEPENDENT
##VAR_FORM=  AFFN,          ASDF,            ASDF
##VAR_DIM=   16384,         16384,           16384
##UNITS=     HZ,            ARBITRARY UNITS, ARBITRARY UNITS
##FACTOR=    0.220516191357247, 1,           1
##FIRST=     3102.91361680499, 0,            0
##LAST=      -509.803146200789, 0,           0
##MIN=       -509.803146200789, -236625,     0
##MAX=       3102.91361680499, 321986149,    0
$$ Real data points
##PAGE= N=1
##DATA TABLE= (X++(R..R)), XYDATA
$$ [...]
8979A404883K3493M0634N0485L8720L6681N0119O6470O7232Q5475J02131R1976
8968B058299Q1378R1505J24163J26370J14345J54121J71885J40934R7813J01578
8958C262391J53743J82485J76995K60847K69580K41702K34875K53817K63513J73822
8948E473770J57933K22468K55553K63732K56256K50145K51047K57046L13223L37256
8938H038429L67663M58536N32484O34125P97143R48117J133000J366300J608649
8929A5884446K152719K886481L171123M085618M891933L981428M56632l301456
8921C4208924n292293m888793l734942k953476k465835k038204j566018j291169
8913I978194j025645r13133p39553o29947m99763m47235l20533l19025k85481
$$ y = [1404883, 1428376, 1469010, 1519495, 1558215, 1594896, 1645015, 1711485, 1778717, 1864192, 1966323, 2058299, 2139677, 2231182, 2355345, 2481715, 2596060, 2750181, 2922066, 3063000, 3160813, 3262391, 3416134, 3598619, 3775614, 4036461, 4306041, 4547743, 4782618, 5036435, 5299948, 5473770, 5631703, 5854171, 6109724, 6373456, 6629712, 6879857, 7130904, 7387950, 7701173, 8038429, 8406092, 8864628, 9397112, 10031237, 10828380, 11776497, 12909497, 14275797, 15884446, 18037165, 20923646, 24094769, 28180387, 33072320, 37053748, 37510380, 34208924, 28916631, 24027838, 20292896, 17339420, 14873585, 12835381, 11269363, 9978194, 8952549, 8039416, 7299863, 6669916, 6170153, 5722918, 5402385, 5083360, 4797879]
8904D797879k57671k17247j86187j33634j27715q1023j16497r4078q9753q8759
8894C405315r1601p8201r6642q5839m7967n0647p4066q0536q7278p3522p0625
8883B568391m1203m0669k2274n6342k4363K99j9235j8342j6396j7529m292k6177
8871B281868l883m0828J2162K1077l9812o519m588k0116O344J7593N26P921L3837
8858B265582K4252L1968O352K7857L1679L9748L0497J6456J7253M2022Q277J959
8846B543902M1511O2887M3832L1792L5377N5079Q5658N2157O5185O2275P0104
8835C149759N3034J08524J39477J27265J35319J30720J56678J83549J05542O4230
8825D354097J6931L116O5653J17017J02081J33355J47112J17017Q6413N6382M7359
$$ y = [4797879, 4540208, 4322961, 4136774, 4003140, 3875425, 3794402, 3677905, 3583827, 3494074, 3405315, 3313714, 3235513, 3138871, 3053032, 3005065, 2954418, 2880352, 2799816, 2712538, 2639016, 2568391, 2527188, 2486519, 2464245, 2407903, 2383540, 2383839, 2364604, 2346262, 2329866, 2312337, 2308045, 2281868, 2277985, 2237157, 2249319, 2270396, 2230584, 2224065, 2219477, 2199361, 2205705, 2223298, 2223824, 2231745, 2265582, 2289834, 2321802, 2328154, 2356011, 2387690, 2427438, 2457935, 2474391, 2491644, 2533666, 2541943, 2543902, 2585413, 2648300, 2692132, 2723924, 2759301, 2814380, 2900038, 2952195, 3017380, 3079655, 3149759, 3202793, 3311317, 3450794, 3578059, 3713378, 3844098, 4000776, 4184325, 4289867, 4354097, 4371028, 4374144, 4439797, 4556814, 4658895, 4792250, 4939362, 5056379, 5142792, 5199174, 5246533]
8814E246533L2767K7410K9376K4757L6825J1474m0196j36844k01646k26715k58043
8803D545698k01595j55670j79641j09871j22067j09144n4351p5906l3116m5389
8793C458948J998j719J1396O8729K9859J8766M087O7304N2852L2167P8333O9058
8781C891778P2277J02292J21462J36131J10609J88462J96229J99241K31889K45114
8771E495484K92566K35138J77323R3724N0622J8870n601L6591O9442J27282J79827
8760F771268K22575K60151L23582L77435M07344M53135N03943N15542M60238M26105
8750A0721318L55894L09796K71876L17778L95446M56109N60350O36184P65110
8741A4789861Q84168J017819J232742J453576J678751K061650K536693L022294
$$ y = [5246533, 5279300, 5306710, 5336086, 5360843, 5397668, 5409142, 5368946, 5232102, 5030456, 4803741, 4545698, 4344103, 4188433, 4008792, 3898921, 3776854, 3667710, 3613359, 3537453, 3504337, 3458948, 3460946, 3459227, 3470623, 3539352, 3569211, 3587977, 3592064, 3659368, 3712220, 3744387, 3822720, 3891778, 3964055, 4066347, 4187809, 4323940, 4434549, 4623011, 4819240, 5018481, 5250370, 5495484, 5788050, 6023188, 6200511, 6294235, 6344857, 6363727, 6358126, 6394717, 6464159, 6591441, 6771268, 6993843, 7253994, 7577576, 7955011, 8362355, 8815490, 9319433, 9834975, 10295213, 10721318, 11077212, 11387008, 11658884, 11976662, 12372108, 12828217, 13388567, 14024751, 14789861, 15674029, 16691848, 17924590, 19378166, 21056917, 23118567, 25655260, 28677554]
8733B8677554L611051M164443M270495L526826K051212K25074j714366l183780
8725D1628509l996782m022165l479364k902696k373182j857600j401030j028344
8717B0567346p24120m81886k41071r8168Q952P1995M3115O6898P2592P7226J78941
8706A9541820L13240M39244O07871P69830R67918J172670J378256J608003J953938
8697B8752790K422077L008695L688302M435742N275200N837030N408223L812519
8689F2640578J485758j077326l552840n375513o154128n947909n127412m369117
8681C2522091l647486l058920k542933k101381j725075j511262j315277j086923
8673A5532834r57799q46713p28263o76807n79171n24089n09264m51208l81582
$$ y = [28677554, 32288605, 36453048, 40723543, 44250369, 46301581, 46526655, 44812289, 41628509, 37631727, 33609562, 30130198, 27227502, 24854320, 22996720, 21595690, 20567346, 19843226, 19361340, 19120269, 19022101, 19031053, 19103048, 19146163, 19213061, 19285653, 19362879, 19541820, 19855060, 20294304, 20902175, 21672005, 22639923, 23812593, 25190849, 26798852, 28752790, 31174867, 34183562, 37871864, 42307606, 47582806, 53419836, 58828059, 62640578, 64126336, 63049010, 59496170, 54120657, 47966529, 42018620, 36891208, 32522091, 28874605, 25815685, 23272752, 21171371, 19446296, 17935034, 16619757, 15532834, 14575035, 13728322, 13000059, 12323252, 11744081, 11219992, 10710728, 10259520, 9877938]
8664I877938l27940l33547l33026k81940k60897k04809k23019j95624j70015j30743
8654G416378j52508j72753j61430j56708j27295j10109p6859p4003n2747o4943
8644F267023l9681n483N287k8436l8288l3960k6229m8504O239J5213L9279L8497
8632F150957J7969L4483N721O19j5773o1215j4599k1986j4269J0628L6434K4444
8620F153413N236J8276K6076L355O4073J08798R1875Q2627Q5769J03019J21329
8609F863846J28331J48324K16025K18790K50222K92899L07828L25106L28723L60080
8599I440174L29288L14098K06888J46248R2469P5260Q8755J65176K57804L31397
8589A1447557L58135L61785K81157K11372J02044O6914J6913J47490K51626N4645
$$ y = [9877938, 9549998, 9216451, 8883425, 8601485, 8340588, 8135779, 7912760, 7717136, 7547121, 7416378, 7263870, 7091117, 6929687, 6772979, 6645684, 6535575, 6458716, 6384713, 6331966, 6267023, 6227342, 6221859, 6227146, 6198710, 6160422, 6126462, 6100233, 6051729, 6057968, 6073181, 6112460, 6150957, 6168926, 6203409, 6209130, 6209749, 6193976, 6132761, 6118162, 6096176, 6081907, 6092535, 6128969, 6153413, 6158649, 6176925, 6203001, 6206356, 6270429, 6379227, 6471102, 6553729, 6639498, 6742517, 6863846, 6992177, 7140501, 7356526, 7575316, 7825538, 8118437, 8426265, 8751371, 9080094, 9440174, 9769462, 10083560, 10290448, 10436696, 10529165, 10604425, 10693180, 10858356, 11116160, 11447557, 11805692, 12167477, 12448634, 12660006, 12762050, 12828964, 12845877, 12993367, 13244993, 13299638]
8579A3299638K49096L32950M42078N14909N85496O58340P32379Q04260Q76744
8570A8495890R93410J056034J142279J266971J364626J515452J673751J886987
8562B9395400K112768K466987K879348L399395L955127M584202N019716M962929
8554E8775872M231431K909812J349416j37116j024120j025987k52512Q77044K059878
8545F7763718K926054K984627J983771R9030k140228m124729n426732n831437
8537E8234074n435864m660949l823538l036659k358852j716919j141018o50921
8529C5409354j55812L40592P43059J043743J142102R69266N46538J75280M6894
8520D0261016J89539N52157R17245J126313J110803Q24930N00264K81941M1787
$$ y = [13299638, 13548734, 13881684, 14323762, 14838671, 15424167, 16082507, 16814886, 17619146, 18495890, 19489300, 20545334, 21687613, 22954584, 24319210, 25834662, 27508413, 29395400, 31508168, 33975155, 36854503, 40253898, 44209025, 48793227, 53812943, 58775872, 63007303, 65917115, 67266531, 67129415, 66105295, 65079308, 64826796, 65703840, 67763718, 70689772, 73674399, 75658170, 75757200, 73616972, 69492243, 64065511, 58234074, 52798210, 48137261, 44313723, 41277064, 38918212, 37201293, 36060275, 35409354, 35253542, 35594134, 36337193, 37380936, 38523038, 39492304, 40038842, 40214122, 40261016, 40450555, 41002712, 41919957, 43046270, 44157073, 44982003, 45482267, 45764208, 45805995]
8511D5805995k59288n71456p68664o76954l60294K044K94250L59131J29023k22443
8501D3731344m97388n38319l53146l8114K87791P41082J230452J877841K662950
8492D9104493L382440L966053M330176M083694K882993J118779k63404p73006
8484F7832218m95314j3135K64531L37072M35058Q02132R55274M75678m98948j577010
8474F8517556k331600k597885k613508k475853k410887k428911k435949k270233
8466D8952730j871528j369503q99895o12086o30486r11240j239395j384020j218731
8457C8815846r60679n72653j81978L27170R14235J386119J733631J880454J447675
8448D4789820L90145r07701j826666k039646j706302j173775o75999k56201O5939
$$ y = [45805995, 45546707, 44975251, 44206587, 43529633, 43169339, 43171383, 43465633, 43824764, 43953787, 43731344, 43233956, 42695637, 42342491, 42304377, 42592168, 43333250, 44563702, 46441543, 49104493, 52486933, 56452986, 60783162, 64866856, 67749849, 68868628, 68605224, 67832218, 67336904, 67323769, 67588300, 67925372, 68360430, 69162562, 70117836, 70593514, 70094566, 68517556, 66185956, 63588071, 60974563, 58498710, 56087823, 53658912, 51222963, 48952730, 47081202, 45711699, 44811804, 44199718, 43569232, 42657992, 41418597, 40034577, 38815846, 37855167, 37282514, 37100536, 37427706, 38341941, 39728060, 41461691, 43342145, 44789820, 45179965, 44272264, 42445598, 40405952, 38699650, 37525875, 36849876, 36593675, 36659614]
8439C6659614J51068j10225q64826j929598k733548k948861k751045k405405k091873
8430B0975301j818481j500245j284931j098332r47190q12551p61464o79720o05633
8421A1466754m93616m48976l78328l19041k72257k60165k42284k43952l23910
8412H484225l27267k90087k69406k54675k56359k41972j73016j77068j58100j72686
8402F163589k16526j97370k09402j92445j78729j66204j09574j24484j36894j29831
8392D502130j11606r8321q0580q6458r8830o8249p3637n6992q0426k8175k2881
8381C695975m8872l2602j1445k2024k0489k8871m4124j2584K7469j002o15L3050
8369C533866N3197R3813N6237Q8863Q9786N3875O6283K7312J1195k8568k9472
$$ y = [36659614, 36810682, 36700457, 35835631, 33906033, 31172485, 28223624, 25472579, 23067174, 20975301, 19156820, 17656575, 16371644, 15273312, 14326122, 13513571, 12752107, 12072387, 11466754, 10973138, 10524162, 10145834, 9826793, 9554536, 9294371, 9052087, 8808135, 8484225, 8156958, 7866871, 7597465, 7342790, 7086431, 6844459, 6671443, 6494375, 6336275, 6163589, 5947063, 5749693, 5540291, 5347846, 5169117, 5002913, 4893339, 4768855, 4631961, 4502130, 4390524, 4292203, 4211623, 4125165, 4026335, 3958086, 3884449, 3827457, 3747031, 3718856, 3695975, 3647103, 3614501, 3603056, 3581032, 3560543, 3531672, 3487548, 3474964, 3502433, 3501431, 3500816, 3533866, 3587063, 3680876, 3737113, 3825976, 3915762, 3969637, 4035920, 4063232, 4074427, 4045859, 4016387]
8358D016387m2633k5696m2305q3306l8440o4456p7688j04240r2721q0219p0934
8347C293749m4471k009m3321l8998L256K9229K5066K1320M6131P5712R7346J01454
8335C564464P9005M2109K9145K3037K6402L6568M3460N9982J28049J83068K16790
8324D432079K60295L13156L23139L23711K42770J4355j23645k20205k74511k15817
8314E075327j63539o9273l4069k1195k6889n7062j40614j97384j92814j96783
8304C975705j83920j39944j22202r8336o6610k7237L7201K830J1552L3109M0896
8293C463044Q1962Q2836J16987J13904P5299P4344O7129R0042J48638J75347J95370
8282D684902J82924J63125R4462n9941j94351l07163l72335l85586l07764k63568
$$ y = [4016387, 3973754, 3948058, 3905753, 3822447, 3784007, 3719551, 3641863, 3537623, 3444902, 3364683, 3293749, 3249278, 3247269, 3203948, 3164950, 3168206, 3197435, 3222501, 3243821, 3289952, 3365664, 3463010, 3564464, 3643469, 3685578, 3714723, 3737760, 3764162, 3800730, 3844190, 3904172, 4032221, 4215289, 4432079, 4692374, 5005530, 5328669, 5652380, 5895150, 5909505, 5785860, 5565655, 5291144, 5075327, 4911788, 4842515, 4808446, 4787251, 4760362, 4703300, 4562686, 4365302, 4172488, 3975705, 3791785, 3651841, 3529639, 3431303, 3364693, 3337456, 3374657, 3377487, 3389039, 3422148, 3463044, 3545006, 3627842, 3744829, 3858733, 3934032, 4008376, 4075505, 4165547, 4314185, 4489532, 4684902, 4867826, 5030951, 5125413, 5065472, 4871121, 4563958, 4191623, 3806037, 3498273, 3234705]
8272C234705k51922j90172j40589r8912j23160j37874j02812q9377p8029r8207
8262A923651q3168r3377o5814o7574o9663n8789k3144l6571k5595j9614n8936
8251A321406l2268j490l1157k5722j278j0975J1252o824k0880l814K6682M451
8239A229383J9744J7248J290K7317Q3536Q6597O6685R8466L3112K6380m4559r0849
8227A554350j02246r1239n9324r7217q2412p0216p1650l3498k6002m8258k0979
8216H51309m2006k3554N986k7256j10j3697l7311J7666J0056k1787k5203L138
8204F97231k3944M442K3220K2878q622K6118N0958L2999j5267N9544Q148L6355
8192I14060k69377j92909J17466O175N2121J3308j242k0808M659n691j7246l0789
$$ y = [3234705, 2982783, 2792611, 2652022, 2553110, 2429950, 2292076, 2189264, 2099887, 2021858, 1923651, 1840483, 1747106, 1681292, 1613718, 1544055, 1485266, 1462122, 1425551, 1399956, 1380342, 1321406, 1289138, 1287648, 1256491, 1230769, 1229491, 1218516, 1229768, 1222944, 1202064, 1198250, 1224932, 1229383, 1249127, 1266375, 1267665, 1294982, 1378518, 1465115, 1531800, 1630266, 1663378, 1689758, 1645199, 1554350, 1452104, 1360865, 1301541, 1204324, 1121912, 1051696, 980046, 946548, 920546, 872288, 851309, 809303, 785749, 791735, 764479, 764369, 750672, 713361, 731027, 741083, 719296, 694093, 697231, 673287, 677729, 700949, 723827, 715205, 741323, 792281, 825280, 810013, 869557, 877705, 914060, 644683, 451774, 569240, 575415, 627536, 640844, 639602, 618794, 623453, 617762, 600516, 569727]
8180E69727r302k6869j7766l1733m992R872J7204l6751r767K6308o527j0401k4760
8167D44243k7872q05j2463J7199j3961P736N675k767p350k476J3557M044K0001
8154D44761J1825p371j156L2180r665l936p264L910j8922M624L0400k4775J0844
8141D65455K1508O064K1738K1037o637L748N246j483R737J329J4553o084p152
8128E49059L0197K7578j348P207J0174k7995J8615k557j684J3786k2588j861r856
8115E88727L6096K0902L8o847Q142Q932j9704J3983K8725L6615K2376j2255L4473
8102G60203M2724L9947l9627l7806k6180k5357n3352j8469l4345m0385P544k7194
8090E47703m763J9203j4598k6449l4032k0707k4127j0781m353k9892J7646l315
$$ y = [569727, 560425, 533556, 515790, 484057, 479065, 488937, 506141, 469390, 459623, 485931, 479404, 469003, 444243, 416371, 415566, 403103, 420302, 406341, 414077, 419752, 416985, 409635, 407159, 420716, 424760, 444761, 456586, 449215, 448059, 480239, 470574, 466638, 459374, 463284, 444362, 448986, 479386, 454611, 465455, 486963, 493027, 514765, 535802, 529165, 532913, 538159, 536676, 546413, 547742, 562295, 556211, 549059, 579256, 606834, 605486, 612693, 622867, 594872, 613487, 610930, 609246, 623032, 600444, 598583, 588727, 624823, 645725, 645763, 638916, 647058, 655990, 636286, 650269, 678994, 715609, 737985, 725730, 760203, 802927, 842874, 803247, 765441, 739261, 713904, 660552, 642083, 607738, 567353, 574897, 547703, 542940, 562143, 547545, 521096, 487064, 466357, 442230, 431449, 427096, 397204, 414850, 411535]
8078D11535Q559J1984j0330l7305k5620k3476n072j6709l2871j5634r184j543
8066B54334j9290k4308O003m478M203K1525j0609l8099j8635P725J4796J1707
8054B04874q187J60m235k786j0391L8835K2041j6066l1004m226l4605j0619J4695
8041A58486K128j8158m470O661M057j8405j9405J0681k0529M756q34r150q295
8028H7523M832j9596J3624j983K694j4252J673Q392L101k6078N251J9456n954
8015G8683j6384j1926R09J6871L4797P919p960m234l132Q574L44r588k2847k5906
8001D6120R395r114K2930o774l0979j0038j2191K2059R464k1395M21k386R557
7988B7069L745J1909j5561j1048P591P458N632k9540R772k117l2677l1066J8162
$$ y = [411535, 420094, 432078, 421748, 384443, 358823, 335347, 330275, 313566, 280695, 265061, 255877, 254334, 235044, 210736, 216739, 212261, 216464, 237989, 227380, 189281, 170646, 178371, 193167, 204874, 196687, 196847, 192612, 189826, 179435, 218270, 240311, 224245, 193241, 189015, 154410, 143791, 158486, 160614, 142456, 137986, 144647, 148704, 130299, 110894, 121575, 101046, 105802, 104968, 95818, 87523, 92355, 72759, 86383, 84400, 87094, 72842, 74515, 82907, 86008, 59930, 65181, 84637, 78683, 62299, 50373, 51282, 68153, 102950, 110869, 102909, 98675, 95543, 104117, 104461, 94873, 72026, 46120, 55515, 46401, 69331, 62557, 31578, 21540, 9349, 31408, 40872, 19477, 19898, 17512, 27069, 30814, 42723, 27162, 16114, 23705, 31163, 36795, 7255, 17027, 14910, -17767, -48833, -30671]
7975c0671Q251J297q668J3055M453j9177K2551j0424j6236J2744J3486r730Q59
7962a8210J1693J3982R083k723J3274q469M546L591M463k3496r020PP33J6526
7948A5980m722j1953J0496J885l741k0656k663K491R844K498P031J6340k850k08
7934A9772k3910j70K0286J250K0085r785p77Q505m354K572k5241J2505k3194k2603
7920b5059l898K6122N147n125K3269j4442r974m232k5347N233M3041J0555m1526
7907a6236m1744M843M0699M347J9909J4501m358K353p771Q870N532j5504K3030
7894C8471r150J4898J3125J2561R908q813j841j682j5245k1320k3255J6914J1770
7881C6341J413j3663l7191p639j921K1136J2042j315Q840k8042l508J6450J1711
$$ y = [-30671, -22420, -21123, -29791, -16736, -12283, -31460, -8909, -19333, -35569, -22825, -9339, -19069, -18210, -6517, 7465, 16548, 13825, 27099, 18630, 23176, 26767, 31230, 7734, -1286, -1279, -546, 15980, 11258, -695, 9801, 11686, 7945, -12711, -15374, -12883, -3039, -541, 6490, 22830, 19980, 19772, -4138, -4308, 15978, 17228, 37313, 27528, 26751, 35256, 30902, 33474, 8233, 20738, -2456, -25059, -28957, -2835, 2312, -2813, 20456, 6014, -3960, -8192, -33539, -28306, 14735, 25290, -16236, -57980, -53137, -12438, -8091, 11818, 26319, 21961, 24314, 16543, 25413, 30945, 15441, 38471, 29321, 44219, 57344, 69905, 79813, 71000, 69159, 67477, 52232, 30912, 7657, 24571, 36341, 37754, 24091, -13100, -20739, -22660, -1524, 10518, 9203, 18043, -9999, -13507, 2943, 14654]
7868A4654J757n866k0362L570j1082j0817m734j1209K4417j9585n936K4668k541
7855b3066p521j4101j1754J81m536J2864M1587l847j0959L730J762P261q557k0636
7841c7592J4742K3700k4820q818J992j3499R01o618J6805J0900K66j1052R201
7828b3892r301j1833k292P993j2945k5820K9681L289L43J800J388j866j4212n251
7814f2918J429M151j0472q27L97J142R569Q129k2013k0171q4212o0829K39237
7801B612J8302k2164j4676l4414L397J4731j1971m92M724j7149o620k2274K3149
7788f2845J4573o758o683k387P584j9077L253J5273K1998q980m001j4002j3648
7775g5700O582K0386R14K1620L391k5550L201L853Q075j4792k698l104J0222j7462
$$ y = [14654, 16411, 10545, -9817, -6247, -17329, -28146, -32880, -44089, -19672, -39257, -45193, -20525, -23066, -30587, -44688, -56442, -56261, -60797, -47933, -6346, -10193, -21152, -17422, -15660, -8399, -16956, -37592, -22850, 850, -23970, -32788, -30796, -44295, -43394, -50012, -33207, -22307, -22041, -33093, -23892, -33193, -45026, -47318, -39325, -52270, -78090, -48409, -45120, -44777, -42977, -41589, -43455, -57667, -62918, -61489, -57338, -67810, -68637, -68240, -67098, -57529, -49400, -71413, -91584, -175796, -236625, 2612, 20914, -1250, -15926, -50340, -46943, -32212, -44183, -44675, -39951, -57100, -63720, -85994, -62845, -48272, -55030, -61713, -64100, -56516, -75593, -72340, -57067, -35069, -44049, -48050, -62052, -75700, -69118, -48732, -47818, -26198, -22807, -48357, -45156, -41303, -33228, -48020, -50718, -53822, -43600, -61062]
7761f1062J2186j1626Q404R54Q866j0983J9736J4403M580r560k0464R611r240
7748d4195P727k758k4148P018K3940m005o583O485k1594O527K1343p296R969j051
7734b8621r022q725R570J1663L817o551J6J4776j2556J306J5756l258p277r170
7720b8276K0274R897k986l364j4403R185J2263r666j7204j4541j8162J6620O348
7707c4015K1476N866M141k9965K7149K8355k1882j3838L512M555K0794N574n5
7694B1667J2880Q228J1896K7963q975j4659R338J2161M199M639J8525K0694L8586
7681A67142j3235p314J6166J4034m568K044L1694K8486K3318J0066J6861M0215
7669C24909L1140K5765K3522L2840N3959L9213P5699Q8988P8354R9325J27869
$$ y = [-61062, -48876, -60502, -52098, -51144, -42278, -53261, -33525, -19122, -14542, -24102, -44566, -34955, -44195, -36468, -39226, -63374, -56356, -32416, -36421, -43004, -36519, -58113, -51586, -30243, -37539, -27570, -28621, -37643, -46368, -36798, -25135, -21318, -27869, -27853, -13077, -25633, -24327, -8571, -11829, -19106, -28276, -8002, 1895, -1091, -4455, -18858, -9673, 2590, -7076, -24280, -38821, -56983, -40363, -34015, -12539, -6673, -2532, -32497, -5348, 23007, 1125, -12713, -9201, -4646, 16148, 21722, 21667, 34547, 42775, 54671, 82634, 73659, 59000, 68338, 80499, 84698, 89337, 107862, 128556, 167142, 153907, 146593, 162759, 176793, 172225, 174269, 205963, 234449, 257767, 267833, 284694, 324909, 356049, 381814, 405336, 438176, 492135, 531348, 607047, 696035, 774389, 873714, 1001583]
7658A001583J40267J26250R1261J5846l9951o7141j49991j38970j17699j19813
7648G41642q5445r8099m8542l8436m8699m4757l4309k9516q212k3802q774K137
7636B75188l1862l491j3961k7646l071J2649J2759j5465N41J9058J7572J0808
7624B53079K5684K0580p295J9525K8325L979j1328M053K411K1156o112J4887M6713
7611D15657K2955M060K500J1994N3262L9438J8727L7562N8486O2635O7425O3578
7599H58279L9187M0414J9154K9513J1826M8716O9883J06593R9371Q8284O0401
7588A471621K1729n6315l9736o3947o6084l2998j3445K3900j047M5062Q0371N5009
7576A424120M3286q348o1935r9406r1039j20318j06583j33502j00536l6398k7075
$$ y = [1001583, 1141850, 1268100, 1359361, 1375207, 1335256, 1268115, 1118124, 979154, 861455, 741642, 656197, 558098, 509556, 471120, 422421, 377664, 343355, 313839, 305627, 281825, 273051, 275188, 243326, 239835, 225874, 198228, 195157, 207806, 220565, 205100, 205641, 224699, 242271, 253079, 278763, 299343, 292048, 311573, 339898, 343877, 332549, 336602, 339013, 360169, 354057, 368944, 415657, 438612, 442672, 445172, 457166, 510428, 549866, 568593, 606155, 664641, 727276, 794701, 858279, 897466, 937880, 957034, 986547, 998373, 1047089, 1116972, 1223565, 1322936, 1411220, 1471621, 1493350, 1437035, 1397299, 1333352, 1267268, 1234270, 1220825, 1244725, 1243678, 1288740, 1369111, 1424120, 1467406, 1459058, 1397123, 1297717, 1206678, 1086360, 979777, 846275, 745739, 709341, 682266]
7565F82266n0087m5887l1578l3123j0743k2691p952k3925K231J1170l932O96l7872
7552D28573L913J2854J2358J5891m378K2974J9757J9594r72L6521L1675J3160
7540F11920M2290K2998M831M7545M8476K9213L8569P0895M2614P1510P4095J21027
7528A225983J15347J36976J67376K15606J97997J67953J14430K7634o1439j37963
7518B169900j62548j56413j65832j11781p7323q9329k6483J8683Q746k9466m4703
7507A333451q2060j09148j28570q2950j06355j04015o4196m3924n0863l4412q446
7496E18512m1300l1669l7036m1956l308k1760O439n506r360l4585j3151m901l7139
7483B43280J5792J651p128j3517p574J0273n223J1592J5211J5016j3499K795R339
$$ y = [682266, 632179, 586292, 554714, 521591, 510848, 488157, 480205, 456280, 458511, 469681, 465749, 466445, 428573, 432486, 445340, 457698, 473589, 469211, 492185, 511942, 531536, 530564, 567085, 598760, 611920, 654210, 677208, 682039, 729584, 778060, 807273, 845842, 916737, 959351, 1030861, 1104956, 1225983, 1341330, 1478306, 1645682, 1861288, 2059285, 2227238, 2341668, 2369302, 2307863, 2169900, 2007352, 1850939, 1685107, 1573326, 1496003, 1406674, 1380191, 1398874, 1407620, 1378154, 1333451, 1251391, 1142243, 1013673, 930723, 824368, 720353, 656157, 612233, 561370, 526958, 518512, 477212, 445543, 408507, 366551, 363243, 341483, 347922, 342416, 333056, 298471, 285320, 280419, 243280, 259072, 260723, 253595, 240078, 232504, 242777, 237554, 249146, 264357, 279373, 265874, 268669, 278008]
7470B78008m947o129M524p15J5444J5066p764q315o276M9864L1404j1900k369
7457C45895K1303J9510K3527N1727M3652L0803N8158N5020M2216Q3013J41859
7446I16683J34473J34378J37125J15926M5538n976n4249j43364j57580j69156
7436I53798j08626j22235j18836o9635n9012n5353l1096l7184m2880k343n3322
7425B53276n0651m0067k641k9328L377K0614j4261l8366n036M001k690J4951k3016
7412I0163k1313Q078J1751N362k3738q287R786L787j7412o343o965J697Q019Q438
7398F3023k3322l4917q113K0077j9208N349M955j3235P936l866K0971J2572L536
7385C5758j6729N430j358j563k508n682J3554k545j6044N605K2116o402j7742
$$ y = [278008, 273061, 266932, 271456, 270741, 286185, 301251, 293487, 285172, 278896, 328760, 360164, 348264, 345895, 367198, 386708, 410235, 461962, 505614, 536417, 594575, 649595, 691811, 774824, 916683, 1051156, 1185534, 1322659, 1438585, 1484123, 1478147, 1423898, 1280534, 1122954, 953798, 845172, 722937, 604101, 534466, 475454, 420101, 389005, 351821, 308941, 306598, 253276, 202625, 162558, 159917, 130589, 133966, 154580, 140319, 101953, 96917, 100918, 98228, 113179, 90163, 68850, 76928, 88679, 94041, 70303, 62016, 71802, 75589, 58177, 51834, 44869, 46566, 54585, 63023, 39701, 4784, -3329, 16748, -2460, 2889, 7844, -5391, 2545, -1321, 19650, 32222, 35758, 19029, 24459, 23101, 21538, 19030, 13348, 26902, 24357, 8313, 13918, 36034, 29632, 11890]
7372A1890J0841j5807k5061J9452J9033k6026r816J4353J8074l899q028k03M2931
7359D7734o860j6498p678k464L899k1358J6525J424j1517K8874J3657J0711j1603
7346D4846j7696k2356Q566J2087K5156j4197k1848K638p405k3962j1661P870P239
7333a0723R399l439J3669q988J550j6991m548K7092J8080j0154J5653K0003m691
7320D5912k5434K206J6145r336O986l012j0838L4719K1043k425K31J46R645K0611
7306A06599J7077n619J5243J1664Q360K8788p161J047K1060k749L5847P593P002
7293B44751J5439R847J2592J710J0268M5447K3956K0935M6589N1426L3222N0510
7281E66692P1447Q4023R4054J02030J15578J21199J08096P2608M5447n5111j13487
$$ y = [11890, 22731, 6924, -18137, 1315, 20348, -5678, -15494, -1141, 16933, 13034, 5006, 4803, 47734, 40874, 24376, 16698, 14234, 18133, -3225, 13300, 14724, 3207, 32081, 45738, 56449, 44846, 27150, 4794, 13360, 25447, 50603, 36406, 14558, 17196, 9791, -14171, -25832, -17962, -10723, -1324, -4763, 8906, -82, 1468, -15523, -20071, 7021, 25101, 14947, 30600, 50603, 45912, 20478, 22684, 38829, 29493, 36479, 33467, 22629, 57348, 78391, 75966, 76197, 76343, 85988, 106599, 123676, 118057, 133300, 144964, 153324, 182112, 174951, 175998, 197058, 194309, 230156, 237749, 244751, 260190, 270037, 282629, 284339, 294607, 340054, 364010, 384945, 431534, 482960, 516182, 566692, 638139, 722162, 816216, 918246, 1033824, 1155023, 1263119, 1335727, 1381174, 1326063, 1212576]
7270A212576j06799j30649j21541j07348j16303p6189l9375l3745l525j044k4652
7259D51406m5208L544Q749K50n161O324K7297L952L9275J0744j7242R679J2561
7246E06170J5525l679J9502K776O398L0955J9544M5450K7361M2960N9289O6902
7234H39153K7114O7578Q5179J04238J28237J31278J19602J65411J40957R4183
7224A902930R9656O2051r443o8442n5407l3064k8208o7010r6727j02292j45973
7213A458071j51406j33861j09254r9958o6310o1920p1576m7819l8623l5426L247
7202F45165k8578k2720M606j000J271p874k2474l5623J3530R493J2010J4917O938
7189E89661J0610j1664L1078J1711K6846L7521M5602J155L4423N6776O5856N5922
$$ y = [1212576, 1105777, 975128, 853587, 746239, 629936, 553747, 514372, 480627, 477102, 476058, 451406, 406198, 409742, 418491, 418741, 413580, 419904, 447201, 451153, 490428, 501172, 483930, 493609, 506170, 521695, 518016, 537518, 540294, 546692, 577647, 597191, 642641, 670002, 712962, 772251, 839153, 866267, 933845, 1019024, 1123262, 1251499, 1382777, 1502379, 1667790, 1808747, 1902930, 2002586, 2064637, 2055194, 1986752, 1931345, 1898281, 1870073, 1803063, 1706336, 1604044, 1458071, 1306665, 1172804, 1063550, 963592, 897282, 835362, 763786, 715967, 677344, 641918, 645165, 616587, 593867, 598473, 597473, 598744, 590870, 568396, 532773, 546303, 555796, 567806, 582723, 589661, 600271, 588607, 619685, 631396, 658242, 695763, 741365, 742520, 776943, 833719, 899575, 955497]
7177I55497L8658M9381M184L5960N5109O1395O1734J05760J03270O5381O7849
7166A604178K6238k3719m5430j9399j7481K110O5348P6538R1201J29486R7358
7155A986428Q7122K1418m0436j29163j78622j90484k04830j38545j24960j01360
7145I86568r6089q1759p1761k8592n0918k7100m4859l0271l7562l1549k6036L609
7133D63681n205J2272N899q824N68j6626j3198L0179K9488K557j2114R494J4226
7120E12397L4080J6022J4005L1216L9263K1196K2855M8442R1573Q6561J09179
7109A026789J39283J41533J34877J35673O7546j0662o1416j01753j47556j83685
7099A140629j45347j22254j20189j00920o8939n9886p1594n6221n5452k9329J28
$$ y = [955497, 994155, 1043536, 1047720, 1083680, 1138789, 1200184, 1261918, 1367678, 1470948, 1536329, 1604178, 1630416, 1606697, 1561267, 1541868, 1524387, 1526497, 1591845, 1668383, 1759584, 1889070, 1986428, 2073550, 2094968, 2054532, 1925369, 1746747, 1556263, 1351433, 1212888, 1087928, 986568, 890479, 808720, 736959, 708367, 657449, 630349, 585490, 555219, 517657, 486108, 460072, 463681, 458476, 470748, 476647, 467823, 468391, 451765, 438567, 468746, 498234, 500791, 488677, 498171, 512397, 546477, 562499, 576504, 607720, 646983, 668179, 691034, 739476, 831049, 917610, 1026789, 1166072, 1307605, 1442482, 1578155, 1645701, 1635039, 1573623, 1471870, 1324314, 1140629, 995282, 873028, 752839, 651919, 582980, 523094, 451500, 395279, 339827, 310498, 310626]
7088C10626j4546l5002l0179o369j3060J0368m7555R965k699J21j2486j8539j4090
7075A36555J5580o105l1385P679M926K2501k072L016n683L123n077k0482j2352
7062A10224m36l4255j2283K1724q15J385O633l611j0225k5183L161J4394J0989
7049H1702j4686p927K4382Q950m5532k0337J1802J5502J7520k4361R540K088l315
7036E5328j1772N107K0887J1865l381p345m605n108l0258L473R94q167n901R649
7022C0766j6275P382p780N649J1158j5817M921l905l5808J335N814J7774q630
7009c416o72J0336J0989P450j7159N722P087j3693M386j710j9898N873k1421J7721
6995h405K3554M286r893r718Q55r588k4448k3177J9326J3027N81J4685Q883Q980
$$ y = [310626, 296080, 261078, 230899, 224530, 211470, 221838, 174283, 184248, 181549, 181670, 169184, 150645, 136555, 152135, 146030, 114645, 122324, 127250, 149751, 147679, 150695, 145012, 148135, 143058, 122576, 110224, 109788, 75533, 63250, 84974, 84159, 85544, 92177, 88566, 78341, 53158, 56319, 70713, 81702, 67016, 59089, 83471, 92421, 46889, 26552, 38354, 53856, 71376, 47015, 56555, 58643, 55328, 43556, 48663, 69550, 81415, 78034, 70689, 66084, 60976, 30718, 34191, 35185, 27018, 21117, 30766, 14491, 21873, 14093, 19742, 30900, 15083, 20004, 16099, -19709, -18374, -12560, 5214, -3416, -4088, 6248, 17237, 24687, 7528, 13250, 20337, 6644, 11030, 9320, -10578, -4705, -26126, -8405, 15149, 19435, 9542, -176, 679, -8909, -33357, -56534, -37208, -24181, -23600, -8915, -32, 8948]
6981H948M0200J0236O131j1814j0705k0380l3269n410j845J1771K0439K0739o588
6968B8453J3277k2900k0139r431j3957j6203k0081M683K6762o85j5985r999J4896
6955d1309K457K4147K8511J3157l5791j1933R400M268j1866l2525J4256J7017
6943b0211n675O090R235J281N888l889J6484j3319o058j7644J0850j4011M117
6930b6862K1792l016o47r544J0875k432N755k791J2259k1990k4345O238N862N697
6916b3149N267j563j7591J52L2874N493j8260q079l285R305J02m828J4385L128
6902f049j5492j9079K533K0717K2841N719j5083O055n438j6437K0792j9048j7652
6889c5621R811J8481J0698k2378p023K8330p443j9795j3986L739K3912p701K246
$$ y = [8948, 49148, 59384, 65515, 53701, 42996, 22616, -10653, -16063, -17908, -6137, 14302, 35041, 28453, 41730, 18830, -1309, -10740, -24697, -40900, -60981, -56298, -29536, -30221, -46206, -56205, -41309, -38852, -14705, 13806, 26963, -8828, -20761, -11361, -7093, -18959, -51484, -37228, -20211, -25886, -19796, -10561, -9280, -3392, -7281, 9203, -4116, -10174, -27818, -16968, -30979, -26862, -5070, -8086, -8733, -18277, -7402, -9834, -4079, -6870, 5389, -16601, -40946, -34708, -28846, -23149, -17882, -19445, -37036, -36884, -4010, 1483, -16777, -24856, -28141, -18836, -18734, -23562, -9177, -6049, -21541, -40620, -38087, -17370, 5471, 11190, -3893, 2162, -3276, -19713, 1079, -17969, -35621, -25810, -7329, 3369, -19009, -26032, 2298, -5145, -24940, -38926, -35187, -11275, -18976, -16730]
6876a6730j790J9181j202l8149k693o675K0556r332J5330p159J1908j1415m123
6863c2293J0741n560K3027N994p822k025O857J9628q166k1967N332j1922o230
6850b4406l329m30K362q935k061K7371k64q439L1908j9276O597O888J315K0286
6836B9587K258m833l816j5072j8802L990j5687L1098r949k4119L6468P765j4826
6823D062m760j1394J225m938K0383K2024m036K767q924q267l180l2005l170J4322
6809a5891M482J541J4468P180L2425j6806J8316N171K418l2702k3892R259J4679
6796B0648J672k928j7136R74P589R25j5978J2677p032o00O1053j293j5737j902
6782D2932L79l081j3503J0975q322J9192p063k2587m794J2666Q029m0600r881
$$ y = [-16730, -18520, 661, -541, -38690, -41383, -48058, -27502, -36834, -21504, -28663, -16755, -28170, -32293, -21552, -27112, -4085, 1909, -5913, -7938, -1081, 18547, 10381, -11586, -6254, -18176, -24406, -27735, -28165, -25803, -34738, -36799, -9428, -9692, -18131, 13777, -5499, 1098, 7986, 9301, 29587, 31845, 27012, 23196, 8124, -10678, -6688, -22375, 8723, -1226, -25345, 11123, 18888, 4062, -698, -12092, -10867, -15805, 4578, 26602, 22566, 25333, 16409, 8142, 4962, -27043, -30213, -15891, -11409, -9868, 4600, 11780, 44205, 27399, 45715, 50886, 53304, 20602, -3290, 5969, 20648, 22320, 19392, 2256, 3230, 10819, 11744, -4234, 8443, 1411, 811, 61864, 60571, 44834, 42932, 43311, 40230, 26727, 37702, 29380, 48572, 41509, 18922, 14128, 26794, 34823, -5777, -15658]
6769a5658L053J7068M774l944K181l512J2534p781o320L259J879k7898J2814K4175
6755A6624j6912J4301Q147k4772j1550L839J1138K8764m405K4011j2690j5457
6743B1038l8047N923o38j1719J6142J2172R274N252l321p73o88K301K869j5664
6729D121p326l900M762J8442j2832k0183J3359J6968j2844j969k6189M998K8718
6716F125q61j2596R275O254P736p129J5501q632K2429n488k4991r261l102J0985
6702F245l1211n799K6548j470N002K628R402p456J1585N055j076J0401n268P31
6688B5317J151j8542N153j109q080K3236r252M072r243q568j967J6609L622r033
6674A3366K62J7375K6056q335j3196j1870R328K4674q980q757j2791j2359J7255
$$ y = [-15658, -12605, 4463, 9237, 5293, 7474, 3962, 16496, 8715, 2395, 5654, 7533, -20365, -7551, 16624, -288, 14013, 22160, -2612, -14162, -10323, 815, 29579, 25174, 49185, 36495, 21038, -17009, -11086, -11724, -23443, -7301, 4871, 14145, 19397, 16076, 15303, 14615, 16916, 19785, 4121, -3205, -7105, -2343, 16099, 3267, -16916, -3557, 13411, 567, -1402, -27591, -22593, 6125, 5264, -7332, 1943, 8197, 15933, 8804, 24305, 15673, 38102, 32614, 7623, -1638, -4740, 6245, -24966, -30765, -4217, -5687, -685, 1943, 11345, 3889, 15474, 20529, 19453, 29854, 24586, 25317, 26468, 7926, 13079, 11970, 3890, 27126, 17874, 21946, 12703, 4135, 2168, 18777, 22399, 13366, 13628, 31003, 57059, 48724, 35528, 23658, 32986, 57660, 48680, 39923, 27132, 14773, 32028]
6661C2028J8638j9371p626j3949J4062N627J6422O91J866k7357J3138P762K3470
6648F5401k0792O645M39k8882K4818J3295n036p038q679Q419J4617j1296M937
6635E6848K30q983r602J1854K5373q506k1301J9649j123N834P546K5590j2450
6622I0959J0395k7154r195J9359K5135p137j3658l006l894j6408k081N070k5009
6609D3376J2023N338K1727j9211O078K0278j1860j366P586K044j6587K3089j1928
6596H0587J1315K246j8673J5673J4130J3359k5364j2885P27K9334j0972j0208
6584H9269m663p068J4405P864N290O239L224Q321Q513j5975k7292J6831J0919
6571A15877J4147J5359M721n946R642o355r891k2362J6178p962R825J5389n143
$$ y = [32028, 50666, 31295, 23669, 9720, 23782, 29409, 45831, 46522, 48388, 21031, 34169, 41931, 65401, 44609, 51254, 51693, 22811, 47629, 60924, 55888, 48850, 40171, 48590, 63207, 51911, 56848, 57078, 48095, 38493, 50347, 75720, 67214, 45913, 65562, 64439, 70273, 77819, 103409, 90959, 101354, 74200, 65005, 84364, 109499, 102362, 88704, 85698, 81804, 65396, 63315, 68385, 43376, 55399, 60737, 82464, 63253, 69331, 89609, 77749, 76383, 83969, 86013, 69426, 92515, 80587, 91902, 94148, 75475, 91148, 105278, 118637, 93273, 80388, 81115, 110449, 99477, 89269, 84606, 77538, 91943, 99807, 105097, 111336, 114560, 122881, 131394, 115419, 88127, 104958, 115877, 130024, 145383, 150104, 144158, 153800, 147445, 137554, 115192, 131370, 123408, 133233, 148622, 143479]
6558A43479m727n946K8476J9806J9656j8962n611O166M1117l404N418J9478k621
6545B42325q808j0921M428j1098P949K513j4224o411M403k234K839J4691q496
6532B16956L3955j1308k4147K16J0281K8375K0883j3192K4162M746K3942R431
6520C24300N047Q848k729J7318K7171M0194o710K9621J2582k2183J4571L0757
6508D78787L5946K7122L7886K8326K6130L3900K2351O2901N2026O3349O0765K8228
6496I57717N0711M1386K5260L0751L8992O1454L7829M7126M6174O3096N1998Q1127
6484A533621P7261P4900J28115J18339J42621J20797J93890J86562J87026K62085
6474C025217L01602L54742L73330M18583M20697L80144K25927O0024j47198l27988
$$ y = [143479, 138752, 132806, 161282, 181088, 200744, 181782, 176171, 182337, 223454, 220050, 225468, 244946, 242325, 233517, 222596, 227024, 215926, 223875, 226388, 212164, 205753, 210156, 207922, 210761, 225452, 216956, 250911, 239603, 215456, 215672, 225953, 254328, 275211, 262019, 286181, 290927, 314869, 324300, 329347, 338195, 335466, 352784, 379955, 420149, 413439, 443060, 455642, 433459, 448030, 478787, 514733, 541855, 579741, 608067, 634197, 668097, 690448, 753349, 805375, 868724, 929489, 957717, 1008428, 1049814, 1075074, 1105825, 1144817, 1206271, 1244100, 1291226, 1337400, 1400496, 1452494, 1533621, 1610882, 1685782, 1813897, 1932236, 2074857, 2195654, 2389544, 2576106, 2763132, 3025217, 3326819, 3681561, 4054891, 4473474, 4894171, 5274315, 5500242, 5560266, 5413068, 5085080]
6464E085080l92422m17923m21166l96788l70934l05821k56400k16210j94783j60797
6454A951836j76426j30211r6536j04562r6571r8574q3993m3500n6727l7198j5167
6443A012371o6004l4258m4269l7368l3956m1327j5403j2487l8407l8403k145k387
6431F45957O076q223l4085k6636K089p591j9760p133l654J3079j7144m613J2867
6418E51229l401l102J2219j2937N307l673j5097L466K7928n667q893n256J8633
6405E60756K0670n365o09K6118O432J4573O55j4287n452j6407k940P377l322j140
6391E87059P36O726q297q507K965R549K4635j1484j1977L0049J4351J2707K3242
6378F71754J4035J6200K6445J917K1351J6449j2684K6291J0986l493J5313j5756
$$ y = [5085080, 4692658, 4274735, 3853569, 3456781, 3085847, 2780026, 2523626, 2307416, 2112633, 1951836, 1775410, 1645199, 1548663, 1444101, 1347530, 1248956, 1164963, 1121463, 1064736, 1027538, 1012371, 946367, 912109, 867840, 830472, 796516, 755189, 739786, 727299, 688892, 650489, 648344, 645957, 652033, 643810, 609725, 583089, 585178, 577587, 557827, 550694, 547040, 560119, 542975, 538362, 551229, 547828, 544726, 556945, 544008, 549315, 545642, 530545, 534011, 561939, 556272, 547379, 542123, 560756, 581426, 576061, 575452, 601570, 608002, 622575, 623230, 608943, 603491, 587084, 584144, 591521, 588199, 587059, 587795, 594521, 586224, 577717, 580682, 590231, 614866, 603382, 591405, 621454, 635805, 648512, 671754, 685789, 701989, 728434, 730351, 751702, 768151, 755467, 781758, 792744, 789251, 804564, 788808]
6366G88808l3010k5931k1106j4140l9326k0454P175J3771m0870j1543P547l926
6354F06995n252k2004J7561J4573j9687K7144K4760j2979L318j0105m843K1019
6342F40500n595L83J3009k1676J2629r377j979j184j589k2238l0943K0586m3310
6329E49216j9539K0601k018j2339l08j9580J5660j9155k2740J23r728J5057O710
6316E01960l2060j001J1326J0901M963k1141k849J0545J0800r223O121R350N105
6303E04797M897l957Q720j3233Q33k031o807J2581J0009K7117J0354n442p29Q686
6289E55795j7977n703n725J4393M5855j377J0830K36K8741o22L733P352K9901
6276F65432J8974J8379J773K4195J6119K2754n452K1259L3206K3165L9418R780
$$ y = [788808, 755798, 729867, 708761, 694621, 655295, 634841, 642016, 655787, 614917, 603374, 610921, 606995, 601743, 579739, 597300, 611873, 592186, 619330, 644090, 631111, 634429, 624324, 619481, 640500, 634905, 635288, 648297, 626621, 639250, 629873, 627894, 626710, 625121, 602883, 571940, 592526, 549216, 529677, 550278, 548260, 535921, 535613, 516033, 531693, 512538, 489798, 489921, 480193, 495250, 501960, 469900, 468899, 480225, 491126, 496089, 474948, 472099, 482644, 493444, 484221, 490342, 499692, 504797, 509694, 505737, 514457, 501224, 502057, 500026, 493219, 505800, 515809, 542926, 553280, 547838, 547109, 555795, 537818, 532115, 526390, 540783, 586638, 585261, 596091, 596327, 625068, 624446, 628179, 635531, 665432, 684406, 702785, 704558, 728753, 744872, 767626, 762174, 783433, 816639, 839804, 879222, 889002]
6264H89002K3824J2552J3995L3630N3037J2035K3918J6052L192M547J878K774
6252A090436K6425J5269L1713o271K8909L3240j643J6699M6103M6205R930N78
6240A337593L9145J7923O089J6626L3303O516m666R618L1900j0514j7005O949
6228A473477n091J1022m017j0142K65j7896K9720K6826L4157K4194L06L2000L0175
6215A624996J7374J9515K6730J2808q068j2540J3429N0869j1396k1928j4179p147
6203A690463k9585J6533M914J9883l677n247J5934K7266M8719J3178K0050j3472
6191A804959J8796M2638L1148J5239J1489J2042K5859L942L3132K1089n977j957
6179B012399p75J4105J2323j828J6777M418L1135L9050K4509M5117K5531N9945
$$ y = [889002, 912826, 925378, 939373, 973003, 1026040, 1038075, 1061993, 1078045, 1081237, 1085784, 1087662, 1090436, 1116861, 1132130, 1163843, 1157572, 1186481, 1219721, 1218078, 1234777, 1280880, 1327085, 1337015, 1337593, 1376738, 1394661, 1400750, 1417376, 1450679, 1457195, 1452529, 1462147, 1494047, 1483533, 1466528, 1473477, 1468386, 1479408, 1475391, 1465249, 1465514, 1447618, 1477338, 1504164, 1538321, 1562515, 1562821, 1594821, 1624996, 1642370, 1661885, 1688615, 1701423, 1693355, 1680815, 1694244, 1745113, 1733717, 1711789, 1697610, 1690463, 1660878, 1677411, 1682325, 1702208, 1698531, 1693284, 1709218, 1736484, 1785203, 1798381, 1818431, 1804959, 1823755, 1866393, 1897541, 1912780, 1924269, 1936311, 1962170, 1966112, 1999244, 2020333, 2014356, 2012399, 2011624, 2025729, 2038052, 2036224, 2053001, 2057419, 2088554, 2127604, 2152113, 2197230, 2222761, 2282706]
6167B282706M9201M3194L6936N0447M8455L0792L9404L8175O0169M8533M2597
6156B770609K7508N4898N4976O0596L2927L1720M6996N4113L0444M2437P2532
6145C279756O6017O3721P7185O6449R2134J13507J31485J18076J31486J61865
6135D301681J45769J64233J81220J42906J66723J57824J61779J85854K19635K28742
6125F056366K52232K47296K80066L19917K93495L65580L66300L84169M52968M60838
6115I479227N01033M99780N16797N55860O06889O38833O55096P07633P80868Q56181
6105A5798197R48755J048647J170815J288838J377707J448384J482427J555691
6097B6119461J637577J815124K018134K209843K393317K459798K376376K082784
$$ y = [2282706, 2331907, 2375101, 2412037, 2462484, 2510939, 2541731, 2581135, 2619310, 2679479, 2728012, 2770609, 2798117, 2853015, 2907991, 2968587, 3001514, 3033234, 3080230, 3134343, 3164787, 3207224, 3279756, 3345773, 3409494, 3486679, 3553128, 3645262, 3758769, 3890254, 4008330, 4139816, 4301681, 4447450, 4611683, 4792903, 4935809, 5102532, 5260356, 5422135, 5607989, 5827624, 6056366, 6308598, 6555894, 6835960, 7155877, 7449372, 7814952, 8181252, 8565421, 9018389, 9479227, 9980260, 10480040, 10996837, 11552697, 12159586, 12798419, 13453515, 14161148, 14942016, 15798197, 16746952, 17795599, 18966414, 20255252, 21632959, 23081343, 24563770, 26119461, 27757038, 29572162, 31590296, 33800139, 36193456, 38653254, 41029630, 43112414]
6089D3112414J493057P64643R24o31979j047655j268778j280156j219937j053570
6080C8868963q75167o78185m81526k51720J6637K05290M33987P01108R47346J255890
6070D0142623J542380J804890K170394K548357K909240L285890L703032M178422
6062F2285228M607965M839583M755105M255177L095319J312974q20025k870284
6054H1461042m244166m982370n150681m991267m609196m142285l657079l163660
6046D6520338k757185k326175j919357j554375j209995r30223o15358l65048r0987
6037C4751635J36250L89944O49247Q89924J106620J330286J535638J659826J633051
6028D4082421J395175R20044J55426p31273j606820k275871k706663k905290k843161
$$ y = [43112414, 44605471, 45370114, 45371038, 44739059, 43691404, 42422626, 41142470, 39922533, 38868963, 37993796, 37315611, 36834085, 36582365, 36599002, 36804292, 37238279, 37939387, 38886733, 40142623, 41685003, 43489893, 45660287, 48208644, 51117884, 54403774, 58106806, 62285228, 66893193, 71732776, 76487881, 80743058, 83838377, 85151351, 84331326, 81461042, 77216876, 72234506, 67083825, 62092558, 57483362, 53341077, 49683998, 46520338, 43763153, 41436978, 39517621, 37963246, 36753251, 35823028, 35207670, 34842622, 34751635, 34887885, 35277829, 35927076, 36817000, 37923620, 39253906, 40789544, 42449370, 44082421, 45477596, 46397640, 46553066, 45821793, 44214973, 41939102, 39232439, 36327149, 33483988]
6019C3483988k749338k571010k333152k101091j875285j687600j521834j333165
6011A7311513j171118j055962r53546q39605p58050p08846o20108n29112m91148
6002A0184018m82974m09412m11598l26309l24669l17767k67136k54603k41873
5993G147677k60043k12869j70956j84177k11318k08957j91545j85730j53354j53567
5983E215161j38267j55423j32953r7904j05009r9583j18535j06425r6957q9509
5973D074596j11148o2772o9249n8581m6205o3840o1008n5107l5525n6341p9130
5962C375690m0371m8366n0335l5609l8371K246k4290k5953l3070k6397n9483n0496
5950B945195l8489n3922l7396l7295j1206j6065n5188k8171j1507L905k0212p689
$$ y = [33483988, 30734650, 28163640, 25830488, 23729397, 21854112, 20166512, 18644678, 17311513, 16140395, 15084433, 14130887, 13291282, 12533232, 11824386, 11204278, 10675166, 10184018, 9701044, 9291632, 8880034, 8553725, 8229056, 7911289, 7644153, 7389550, 7147677, 6887634, 6674765, 6503809, 6319632, 6108314, 5899357, 5707812, 5522082, 5368728, 5215161, 5076894, 4921471, 4788518, 4690614, 4585605, 4486022, 4367487, 4261062, 4164105, 4074596, 3963448, 3900676, 3831427, 3772846, 3726641, 3662801, 3601793, 3546686, 3511161, 3454820, 3375690, 3335319, 3286953, 3236618, 3201009, 3162638, 3164884, 3140594, 3114641, 3081571, 3055174, 2995691, 2945195, 2906706, 2852784, 2815388, 2778093, 2766887, 2750822, 2695634, 2667463, 2655956, 2659861, 2639649, 2631960]
5938B631960L3461J7020K1520L8989J2302l941j9509K804j6852j0875j1615l0345
5926B664919j6226P037K143j2206k9806Q330J4426N171J8562K7346J5473J6572
5914B721741J5651J5023J2607J3029J7839m88J0296J5468M0279J0872M1161O4604
5902B978082J7477J8798M6986L2394O3185M2446Q0622P3415Q9226P1249P5543
5891C589423P2321Q1129O3357K3985N3559K6610j2344l4857j6725j1734j8044
5880C816680j2762N431K9186K4283J1257J3512M0810L3777J0137j326Q866K3838
5868D003689M0863K7509N1668O7337P9812Q3256P1669J13269P6251O5774Q5489
5857D766586P4229N2571J03324Q2850Q9694Q3944R3984N9289R4654J10210Q6079
$$ y = [2631960, 2665421, 2682441, 2703961, 2742950, 2755252, 2751311, 2731802, 2734606, 2717754, 2706879, 2695264, 2664919, 2648693, 2655730, 2657873, 2645667, 2615861, 2624191, 2638617, 2643788, 2662350, 2689696, 2705169, 2721741, 2737392, 2752415, 2765022, 2778051, 2795890, 2795402, 2805698, 2821166, 2861445, 2872317, 2913478, 2978082, 2995559, 3014357, 3061343, 3093737, 3156922, 3199368, 3279990, 3353405, 3442631, 3513880, 3589423, 3661744, 3742873, 3806230, 3830215, 3883774, 3910384, 3898040, 3863183, 3846458, 3834724, 3816680, 3803918, 3809349, 3838535, 3862818, 3874075, 3887587, 3928397, 3962174, 3972311, 3970985, 3979851, 4003689, 4044552, 4072061, 4123729, 4191066, 4270878, 4354134, 4425803, 4539072, 4615323, 4681097, 4766586, 4840815, 4893386, 4996710, 5079560, 5169254, 5253198, 5347182, 5406471, 5501125, 5611335, 5697414]
5846E697414J20544J28630J61338J76456K02705K42077K33950K24426K29966K29237
5836G646743K24939K13576K38582K59794K50308K83786L57104L93007M12450M67358
5826A0747647M94933N64140O10981O38311O54566O97929P20381P32487Q06245
5817A6667620Q58624R09086J033642J112514J175160J336136J456456J679685
5809B6228923J879652K081763K216003K390373K592661K742373K809272K838089
5801D5779109K917522L125379L249470L397026L712500M144316M758238N403352
5793G6486912O085394O508571O317809N731485N525805O202990P606593R187960
5785A29653519J0839877J3393893J7606268K2653480K6828451L0992990L3525039
$$ y = [5697414, 5817958, 5946588, 6107926, 6284382, 6487087, 6729164, 6963114, 7187540, 7417506, 7646743, 7871682, 8085258, 8323840, 8583634, 8833942, 9117728, 9474832, 9867839, 10280289, 10747647, 11242580, 11806720, 12417701, 13056012, 13710578, 14408507, 15128888, 15861375, 16667620, 17526244, 18435330, 19468972, 20581486, 21756646, 23092782, 24549238, 26228923, 28108575, 30190338, 32406341, 34796714, 37389375, 40131748, 42941020, 45779109, 48696631, 51822010, 55071480, 58468506, 62181006, 66325322, 71083560, 76486912, 82572306, 89080877, 95398686, 101130171, 106655976, 112858966, 120465559, 129653519, 140493396, 153887289, 171493557, 194147037, 220975488, 251968478, 285493517]
5778B85493517K7492123R000509j4407894l1310408l6314580l2800049k8091206
5771A79062012k4450941k0692507j6880857j3794737j1576396r937853q470565
5764G3258156p196446o085707n195870m441350l826565l347525k993217k632509
5756C7538967k266992j978062j747335j515359j382771j262558j183260j106648
5748B5095982j027782r24711q56053p76682p19332o78042p26116p35772p41586
5739A7909906p18021o84954o63467o31510n76205n05151m38028l77294l41505
5730A2973771l13172k57026k38369k17256j89952j81034j39603q5014p3233p5033
5720A1204079j67833k90234l50002l67771l75121l21120k76151k51801k19186
$$ y = [285493517, 312985640, 321986149, 307578255, 276267847, 239953267, 207153218, 179062012, 154611071, 133918564, 117037707, 103242970, 91666574, 81728721, 73258156, 66061710, 59976003, 54780133, 50338783, 46512218, 43164693, 40171476, 37538967, 35271975, 33293913, 31546578, 30031219, 28648448, 27385890, 26202630, 25095982, 24068200, 23143489, 22287436, 21510754, 20791422, 20113380, 19387264, 18651492, 17909906, 17191885, 16506931, 15843464, 15211954, 14635749, 14130598, 13692570, 13315276, 12973771, 12660599, 12403573, 12165204, 11947948, 11757996, 11576962, 11437359, 11352345, 11279112, 11204079, 11036246, 10746012, 10396010, 10028239, 9653118, 9331998, 9055847, 8804046, 8584860]
5711H584860j99412j42298j70721j88999j65504j39134j44932j15266j16539j15411
5701G086644r7340q4144n7479o3252o0564j0865k8303k9088l087J9002N1228L5290
5689F758042J9528M1289l175J8824K6523M0369O2493N9102P6019Q5867J38787
5678G323668J61513J81190J88043J77810K15913J65262J30396J04835R9379R5409
5668H843418J22309J28796Q6800P0763K6369k8900o8513j16453j42245j57836
5658H764508j54357j40312j33982j23612q6043q3001m6960j5867j9796J4695L9547
5647H014820J5708N6179N2261M7484Q8605P9940J17589R9691J21638J55334J61870
5636I011119K24830K46657K78355K76330L20318L37230L88151M12266M45026M52179
$$ y = [8584860, 8385448, 8243150, 8072429, 7883430, 7717926, 7578792, 7433860, 7318594, 7202055, 7086644, 6989304, 6905160, 6847681, 6784429, 6723865, 6713000, 6684697, 6655609, 6652522, 6671524, 6722752, 6758042, 6777570, 6818859, 6815684, 6834508, 6861031, 6901400, 6963893, 7022995, 7099014, 7184881, 7323668, 7485181, 7666371, 7854414, 8032224, 8248137, 8413399, 8543795, 8648630, 8748009, 8843418, 8965727, 9094523, 9181323, 9252086, 9278455, 9249555, 9181042, 9064589, 8922344, 8764508, 8610151, 8469839, 8335857, 8212245, 8126202, 8043201, 7996241, 7980374, 7960578, 7975273, 8014820, 8030528, 8086707, 8138968, 8186452, 8275057, 8354997, 8472586, 8572277, 8693915, 8849249, 9011119, 9235949, 9482606, 9760961, 10037291, 10357609, 10694839, 11082990, 11495256, 11940282, 12392461]
5626A2392461N17623N58473N80205O65254P00064Q09107Q34277R01662R89270
5617A8948396J085452J177927J218621J284466J384495J443624J543178J632673
5609B9718832J743420J859780K003461K150924K330721K531060K769908L052397
5601D8160503L381416L704170M135353M536624M984645N424429N779372O023390
5593H6129902O079096O010054N878536N639949N316312M994961M406877L317290
5585A27772977J739792l07702k312665l936953n013985n622879o020530o331754
5577I9966301o568810o717950o794784o657495o330672n849570n309576m801852
5569E0935592m278146l805222l356424k994746k678591k333439k153571j920683
$$ y = [12392461, 12910084, 13468557, 14048762, 14714016, 15414080, 16223187, 17057464, 17959126, 18948396, 20033848, 21211775, 22430396, 23714862, 25099357, 26542981, 28086159, 29718832, 31462252, 33322032, 35325493, 37476417, 39807138, 42338198, 45108106, 48160503, 51541919, 55246089, 59381442, 63918066, 68902711, 74327140, 80106512, 86129902, 92208998, 98219052, 104097588, 109737537, 115053849, 120048810, 124455687, 127772977, 129512769, 129205067, 126892402, 122955449, 117941464, 112318585, 106298055, 99966301, 93397491, 86679541, 79884757, 73227262, 66896590, 61047020, 55737444, 50935592, 46657446, 42852224, 39495800, 36501054, 33822463, 31489024, 29335453, 27414770]
5561B7414770j717076j520038j395355j260776j157814j077215r55614q86506
5553A7444376q07455p70582o99775o69136o17295n54070n51850n37144m97452
5544A1739617m70124m17372m03177l64993k94299l27004k72653k64652k44134
5535H681209k54272k68704k61665k65949k68522k42490k10008k34592k12172j60809
5525F302026j74357j77784j48286j35409j49747j34909j43748j41823j16576r5121
5515D884266j10912j39848j01353q5447p0252n9815r4077r4466o2617n8700p9583
5504C927196m7398p7968r7723r1717n1526n5202p6401o5289m6618k4207p2967
5493C220180m3454n5038o4848m5083j6385j9067l9493k2612n0121n4277j2355
$$ y = [27414770, 25697694, 24177656, 22782301, 21521525, 20363711, 19286496, 18330882, 17444376, 16636921, 15866339, 15166564, 14497428, 13880133, 13326063, 12774213, 12237069, 11739617, 11269493, 10852121, 10448944, 10083951, 9789652, 9462648, 9189995, 8925343, 8681209, 8426937, 8158233, 7896568, 7630619, 7362097, 7119607, 6909599, 6675007, 6462835, 6302026, 6127669, 5949885, 5801599, 5666190, 5516443, 5381534, 5237786, 5095963, 4979387, 4884266, 4773354, 4633506, 4532153, 4446706, 4376454, 4316639, 4222562, 4128096, 4065479, 4006779, 3927196, 3879798, 3801830, 3704107, 3612390, 3560864, 3505662, 3429261, 3363972, 3317354, 3293147, 3220180, 3176726, 3121688, 3056840, 3011757, 2995372, 2976305, 2936812, 2914200, 2864079, 2809802, 2797447]
5482B797447r171j6166l1520j1230k1448k9995j7018j3546j2148R080m820j2884
5470B626581j7136R085K4082J2438j0541o077J7240J6779L839K1089N835J4877
5458B718091J9170O1179J06763J22401J44081J63382J63904J08431k2404j32494
5448C452504j79065k04691j87067j37743j31955j69154j13612q1476r3801l0035
5438B123905n1676o2688n6862m6686p653p5641o264k2265m4592k8348l1289k8801
5426A661140j6760R728l188j9625k9290k0233j66J4807k1609k5191J564j3848
5414A537329M15L898M866j469j2047j3732j7304j9985j3791j8034k0485o142k0008
5401A403511J3709J2171l3688j4667M29J5982m7372k0657M340q363k8231j2721
$$ y = [2797447, 2788276, 2772110, 2740590, 2729360, 2707912, 2677917, 2660899, 2647353, 2635205, 2644285, 2639465, 2626581, 2609445, 2618530, 2642612, 2655050, 2644509, 2638432, 2655672, 2672451, 2676290, 2697379, 2703214, 2718091, 2737261, 2798440, 2905203, 3027604, 3171685, 3335067, 3498971, 3607402, 3584998, 3452504, 3273439, 3068748, 2881681, 2743938, 2611983, 2442829, 2329217, 2247741, 2153940, 2123905, 2072229, 2009541, 1952679, 1905993, 1898340, 1822699, 1816435, 1794170, 1749578, 1721230, 1689941, 1661140, 1644380, 1654108, 1650920, 1631295, 1602005, 1581772, 1581606, 1596413, 1574804, 1549613, 1551177, 1537329, 1537744, 1541642, 1546508, 1545039, 1532992, 1519260, 1501956, 1481971, 1468180, 1450146, 1429661, 1423519, 1403511, 1417220, 1429391, 1395703, 1381036, 1381465, 1397447, 1350075, 1329418, 1333758, 1325395, 1297164, 1284443]
5389A284443n175j4161L102p264O724K2666j695k1780j5272k3683Q826p926J243
5376A230048j8015p279N432k0319j9735J1561Q154l3191k375L436r093j3997K9167
5363A163794J0596m2302p365n658j1938J4410J0207R5j1222k422r43j7008J4924
5350A115168L965k4639R951K530j2636M150m206K1910J6609R994J9126K511j0171
5337A154262j2976j525o683J6206L6550J7085j5627p194J7764Q531J1852j7372
5325A200873J3583L237L678L1116q12Q163J7302J7455pL0490L4299M4044M6434
5312A449855M3241N7543N8990P7537R9240R8729R3908O1956k1393o9240j32117
5301A818249o6702k9885l5923o4456m3819j0260j7770J592R799m665J8033K1786
$$ y = [1284443, 1279268, 1265107, 1268209, 1260945, 1267669, 1290335, 1288640, 1266860, 1251588, 1227905, 1236731, 1228805, 1230048, 1212033, 1204754, 1210186, 1189867, 1170132, 1181693, 1189847, 1156656, 1154281, 1157717, 1148624, 1134627, 1163794, 1174390, 1132088, 1124723, 1119065, 1107127, 1121537, 1131744, 1131839, 1120617, 1118195, 1117252, 1100244, 1115168, 1119133, 1094494, 1104445, 1106975, 1094339, 1098489, 1094283, 1116193, 1132802, 1142796, 1161922, 1164433, 1154262, 1141286, 1139761, 1133078, 1149284, 1185834, 1202919, 1187292, 1180098, 1197862, 1206393, 1218245, 1200873, 1214456, 1217693, 1221371, 1252487, 1251675, 1259838, 1277140, 1294595, 1294588, 1325078, 1359377, 1403421, 1449855, 1493096, 1550639, 1609629, 1687166, 1786406, 1885135, 1979043, 2040999, 2019606, 1950366, 1818249, 1751547, 1721662, 1685739, 1621283, 1577464, 1567204, 1549434, 1551026, 1560825, 1556160, 1574193, 1595979]
5289A595979J8733R909K5110K6530J8723L0263O4799J5384N2528K9855J2437J9815
5277A920065o99J4164l4146q415l6350o2567k8847m3123k8617o7441p8088l9952
5265A505984l0891j1102m0428k8374l9451j4740k6216l156k4858l3658q688j3226
5253A231196O621j4392L937r927k1238j3875k0493L4730l103j0859k0238j2453
5241A149906n428j303l0085j6413m007n136j6899O593k0809j1080k498l9427o979
5228I96435K583n265K070k3164J5635J8742q793k2807l4261K820J6417J735j5675
5215I46472J6831J278l454j8396J261N897q157K9330J2115j9783n929K0211j3831
5202I63845j1604J5564K3999J6947o420k2274k2280J8708J8182L847R862k2501
$$ y = [1595979, 1614712, 1624621, 1649731, 1676261, 1694984, 1725247, 1790046, 1805430, 1857958, 1887813, 1900250, 1920065, 1919366, 1933530, 1899384, 1890969, 1854619, 1792052, 1763205, 1720082, 1691465, 1624024, 1545936, 1505984, 1475093, 1463991, 1423563, 1395189, 1355738, 1340998, 1314782, 1311626, 1286768, 1253110, 1244422, 1231196, 1237817, 1223425, 1227362, 1217435, 1196197, 1182322, 1161829, 1196559, 1193456, 1182597, 1162359, 1149906, 1144478, 1143175, 1113090, 1096677, 1092670, 1087534, 1070635, 1077228, 1056419, 1045339, 1042841, 1003414, 996435, 999018, 993753, 995823, 972659, 988294, 1007036, 998243, 975436, 941175, 943995, 960412, 962147, 946472, 963303, 964581, 961127, 942731, 943992, 949889, 941732, 971062, 983177, 963394, 957465, 977676, 963845, 952241, 967805, 991804, 1008751, 1002331, 980057, 957777, 976485, 994667, 998514, 1008376, 985875]
5190I85875J380P103p923k0747O175j787J6197K9939j3872M616J1504R248r932
5177A017776L842K0771J0113K2448K7833j128R255R175L19J255K0862K5780N764
5164A174065K098J3512Q96K9259M663M553J183j4582j1223K1856o588N968J4840
5151A240500J5956K1885J9211P313J8496L7258j2341J7207K3444J4900l010Q00
5139A401619Q646J1903O123J9295l622K431K0448J3802M3996J1770L0226K9939
5127A596576J2932P019P174l282O347J4464J9001q79K0743J921K2739M1844k285
5114A744314l904J3864K6300L7403J1450J3169J4159M3258M8348J8213K5172P663
5102A999409J9257L2194L7549J2309P1201L7834O0301N9816J8901K7659M8397
$$ y = [985875, 987255, 994358, 986435, 965688, 971863, 970076, 986273, 1016212, 1002340, 1006956, 1018460, 1027708, 1017776, 1021618, 1042389, 1052502, 1074950, 1102783, 1101655, 1110910, 1120085, 1120404, 1121659, 1142521, 1168301, 1174065, 1176163, 1189675, 1190571, 1219830, 1224493, 1229046, 1230229, 1215647, 1204424, 1226280, 1219692, 1225660, 1240500, 1256456, 1278341, 1297552, 1304865, 1323361, 1360619, 1348278, 1365485, 1388929, 1403829, 1400819, 1401619, 1410265, 1422168, 1428291, 1447586, 1443964, 1446395, 1466843, 1480645, 1524641, 1536411, 1566637, 1596576, 1609508, 1616527, 1623701, 1620419, 1626766, 1641230, 1660231, 1659352, 1680095, 1682016, 1704755, 1746599, 1744314, 1740410, 1754274, 1780574, 1817977, 1829427, 1842596, 1856755, 1900013, 1948361, 1966574, 1991746, 1999409, 2018666, 2050860, 2088409, 2100718, 2171919, 2209753, 2270054, 2329870, 2348771, 2376430, 2424827]
5091B424827M0896K7338N3535J7780L2071M8936N4036N4047L7315O6577N7915
5080B915273M9764P2100N9704N3967P5259O5287P4169Q5540P3804J05280P2717
5069C702864P3523J13843J03311R7941J11893J07208J12420J09761J43188J51515
5059D827467J43882J44947J75612K05781K29397K04185J85809K39851K40235K75624
5049F872790L05243L22353L47063L45862L75745L79138M13102M34588M60512M89755
5039A0746151M67064N45176N74896N92162O32511O83376P57246P87786Q60440
5030A6646808R47549J018835J122366J217327J335169J473035J621504J750026
5022B7132619J998678K164447K346490K531424K618146K593864K426579K072462
$$ y = [2424827, 2465723, 2493061, 2546596, 2564376, 2596447, 2645383, 2699419, 2753466, 2790781, 2857358, 2915273, 2965037, 3037137, 3096841, 3150808, 3226067, 3291354, 3365523, 3451063, 3524867, 3630147, 3702864, 3776387, 3890230, 3993541, 4091482, 4203375, 4310583, 4423003, 4532764, 4675952, 4827467, 4971349, 5116296, 5291908, 5497689, 5727086, 5931271, 6117080, 6356931, 6597166, 6872790, 7178033, 7500386, 7847449, 8193311, 8569056, 8948194, 9361296, 9795884, 10256396, 10746151, 11213215, 11758391, 12333287, 12925449, 13557960, 14241336, 14998582, 15786368, 16646808, 17594357, 18613192, 19735558, 20952885, 22288054, 23761089, 25382593, 27132619, 29131297, 31295744, 33642234, 36173658, 38791804, 41385668, 43812247, 45884709]
5014D5884709J590215R55681K95628l19319q49958j168300j326802j350094j250835
5005D2460925j058682q45799n84439l49142j15830J75158M38893O85549R24344
4996D1730977J169071J439435J765258K093630K474643K921459L341760L796829
4988F0733062M228037M517617M567862M295230L514268K346643Q25855p60476
4980H4268098k276274l489078m293184m637705m674589m420561l988498l555245
4972E2932964l034273k599971k150336j756024j440570j100037p95541n16306
4964C9539906k41472J2764K58600M67739O92110Q94487J144865J317773J514988
4955D5601760J589170J482948J193914P05338L5124p38069j468555k090070k521214
$$ y = [45884709, 47474924, 48430605, 48726233, 48406914, 47556956, 46388656, 45061854, 43711760, 42460925, 41402243, 40556444, 39972005, 39622863, 39507033, 39682191, 40121084, 40806633, 41730977, 42900048, 44339483, 46104741, 48198371, 50673014, 53594473, 56936233, 60733062, 64961099, 69478716, 74046578, 78341808, 81856076, 84202719, 85028574, 84268098, 81991824, 78502746, 74209562, 69571857, 64897268, 60476707, 56488209, 52932964, 49898691, 47298720, 45148384, 43392360, 41951790, 40851753, 40056212, 39539906, 39298434, 39311198, 39569798, 40037537, 40729647, 41624134, 42768999, 44086772, 45601760, 47190930, 48673878, 49867792, 50573130, 50608254, 49870185, 48401630, 46311560, 43790346]
4946D3790346k742949k814896k754082k591059k370173k182239j993603j778002
4938B4563343j634092j469465j334513j210500j129365r94550r16585q28439p22313
4929A4323521o43753n90540n53310m92247m36926l94472l57253l33703l01183
4920A0220134k42927k27112k17230j97040j43733j38008j57911j27051j31201
4911H637921j08574j16172j26446j53668j27073j33433j14127j25975j14933r7409
4901G420111q9493n5084o1980l5594j8370k8804j2031L3666J3181J4503N3520
4890G233625R7949R1429P8976R4799Q4289R7698J21021J12365M3138K1954J5126
4879H092369m3579k9553l8283o3837n0513n6963m4953m0040o1592k5054k5627
$$ y = [43790346, 41047397, 38232501, 35478419, 32887360, 30517187, 28334948, 26341345, 24563343, 22929251, 21459786, 20125273, 18914773, 17785408, 16790858, 15874273, 15045834, 14323521, 13679768, 13089228, 12535918, 12043671, 11606745, 11212273, 10855020, 10521317, 10220134, 9977207, 9750095, 9532865, 9335825, 9192092, 9054084, 8896173, 8769122, 8637921, 8529347, 8413175, 8286729, 8133061, 8005988, 7872555, 7758428, 7632453, 7517520, 7420111, 7330618, 7275534, 7213554, 7177960, 7159590, 7130786, 7118755, 7152421, 7165602, 7180105, 7233625, 7331574, 7423003, 7501979, 7596778, 7681067, 7778765, 7899786, 8012151, 8055289, 8077243, 8092369, 8048790, 8019237, 7980954, 7917117, 7866604, 7809641, 7764688, 7724648, 7663056, 7638002, 7612375]
4868G612375p551M849J7023o0J0685M7799L7598M7606N4723P7687Q8119J13021
4856H103874R1985R9810J29509J33834J28657J58563J63895J81737K11935K41451
4846I645250J97801J90883K10140J43320J26864J10875P3682Q3364J23591K04283
4836A1110053K42317K38240K70837K91765L11112K95921K67959K38234J83758
4827A3450196J20091L9783l1295r0670j55122j67759j79220k13248k13785k31220
4817A2327751k44056k13106k38881k34364k32932k07760j72286j70436j30709
4808A0483221r8699p3208q405L462O7859Q1385R2800J08382J64629K04371K43174
4797A1268971K90672L11400L12151L46641L95051M38625M37107M67403N20320
$$ y = [7612375, 7604824, 7609673, 7626696, 7626636, 7637321, 7685120, 7722718, 7770324, 7825047, 7902734, 7990853, 8103874, 8195859, 8295669, 8425178, 8559012, 8687669, 8846232, 9010127, 9191864, 9403799, 9645250, 9843051, 10033934, 10244074, 10387394, 10514258, 10625133, 10698815, 10782179, 10905770, 11110053, 11352370, 11590610, 11861447, 12153212, 12464324, 12760245, 13028204, 13266438, 13450196, 13570287, 13610070, 13578775, 13488105, 13332983, 13165224, 12986004, 12772756, 12558971, 12327751, 12083695, 11870589, 11631708, 11397344, 11164412, 10956652, 10784366, 10613930, 10483221, 10384522, 10311314, 10302909, 10306371, 10374230, 10455615, 10548415, 10656797, 10821426, 11025797, 11268971, 11559643, 11871043, 12183194, 12529835, 12924886, 13363511, 13800618, 14268021, 14788341]
4788A4788341N47714N96122O40308O92923P42371Q42348R22613R81552J065773
4779B1820065J177044J330802J436161J588402J747581J903197K032569K101109
4771C5136930K088378K035757J833625J522382J147627P45733L81603R9448p2593
4762D4918890j73742j84011p2243Q7883K22397M52209O82805R41884J230913J542341
4752D9649326J843472K200798K543122K931105L292709L598478L815623L896098
4744G3770731L765841L371606K646670J517561Q3683j474626k837068l754195
4736G7090203m199654m199313l921877l488912l020961k491964k000420j538655
4728E2228447j125862p45201l39720K4103M03223P22417J027361J241815J325746
$$ y = [14788341, 15336055, 15932177, 16572485, 17265408, 18007779, 18850127, 19772740, 20754292, 21820065, 22997109, 24327911, 25764072, 27352474, 29100055, 31003252, 33035821, 35136930, 37225308, 39261065, 41094690, 42617072, 43764699, 44510432, 44892035, 44991483, 44918890, 44745148, 44561137, 44488894, 44576777, 44799174, 45251383, 45934188, 46876072, 48106985, 49649326, 51492798, 53693596, 56236718, 59167823, 62460532, 66059010, 69874633, 73770731, 77536572, 80908178, 83554848, 85072409, 85156092, 83681466, 80844398, 77090203, 72890549, 68691236, 64769359, 61280447, 58259486, 55767522, 53767102, 52228447, 51102585, 50357384, 50017664, 50041767, 50444990, 51167407, 52194768, 53436583, 54762329]
4719E4762329J342105J095059N82614j04351q31063j609017k273871k785031l059227
4710D7119547l138051l093286k923406k733579k497112k264013k049707j810054
4702B6610339j614902j476906j334216j177230j033940r20575q28208p31187o73293
4693A6819882o18879n19690m60935m41084l88791l85907l59614l07936l01163
4684A3035883k71360k60920k55851k20347j61130j71316j46416r0319j09647j00317
4674A1248260q9150p4047k7422k2562j6260J9936J5530K4847N7005R2406J20054
4663A1348597J03973R7818J28867J72504J84095J90163J90651K68659K83519L24876
4653A3293722L42293M21017M86688N36451N92808O78623P27441O90532N85853
$$ y = [54762329, 56104434, 57199493, 57782107, 57677756, 56846693, 55237676, 52963805, 50178774, 47119547, 43981496, 40888210, 37964804, 35231225, 32734113, 30470100, 28420393, 26610339, 24995437, 23518531, 22184315, 21007085, 19973145, 19052570, 18224362, 17493175, 16819882, 16201003, 15681313, 15220378, 14779294, 14390503, 14004596, 13644982, 13337046, 13035883, 12764523, 12503603, 12247752, 12027405, 11866275, 11694959, 11548543, 11458224, 11348577, 11248260, 11159110, 11085063, 11057641, 11035079, 11018819, 11038755, 11054285, 11079132, 11136137, 11228543, 11348597, 11452570, 11550388, 11679255, 11851759, 12035854, 12226017, 12416668, 12685327, 12968846, 13293722, 13636015, 14057032, 14543720, 15080171, 15672979, 16351602, 17079043, 17769575, 18355428]
4644A8355428L79653J35114n9840k16053k39425k29870k09488j58124p7788J2084
4634A7691691Q4999J33116K05463L06428L83863M69286N33375O14529O75697P66516
4624B1864963Q44164R22416J037339J166580J295567J420180J309065J098450
4616C0958724R47464J017072J274868J478156J600544J745431J926702K095934
4608D3044895K258444K359484K464250K607371K720222K858638K999568L190627
4600F4503499L380870L646827M019417M456423M943730N485145O138084O866000
4592A03439995P652743Q680863R829360J1133428J2667283J4520025J6716763
4585A84640460J8792208K0250783K0444022J8222707J2301718K928569p142722
$$ y = [18355428, 18735081, 18870195, 18810355, 18594302, 18354877, 18125007, 17915519, 17757395, 17679607, 17691691, 17776690, 17909806, 18115269, 18421697, 18805560, 19274846, 19808221, 20422750, 21098447, 21864963, 22709127, 23631543, 24668882, 25835462, 27131029, 28551209, 29860274, 30958724, 31906188, 32923260, 34198128, 35676284, 37276828, 39022259, 40948961, 43044895, 45303339, 47662823, 50127073, 52734444, 55454666, 58313304, 61312872, 64503499, 67884369, 71531196, 75550613, 80007036, 84950766, 90435911, 96573995, 103439995, 111092738, 119773601, 129602961, 140736389, 153403672, 167923697, 184640460, 203432668, 223683451, 244127473, 262350180, 274651898, 277580467, 270437745]
4578B70437745j4792844j8577065j9129674j8029603j6235020j4121658j1923114
4571A57628767r988683q321050o962880n866536m950706m285498l807303l429750
4563A10016361l172597k987969k837370k666963k412531k162756j909934j622831
4555I0243410j310692r67408o12175k07353K38623O10610R18458J054886J002884
4546I0971243P00967L73894J68263M1823m9387k45890n42273j007671j405123
4537H9005846j815965k177191k428766k635955k787672k890604k938620k948670
4529F8382403k854459k740794k547410k323421k115334j864463j638832j421363
4521E0876327j235896j041452r33635q71908p91743p70401q24607q64285r83244
$$ y = [270437745, 255644901, 237067836, 217938162, 199908559, 183673539, 169551881, 157628767, 147640084, 139319034, 132356154, 126489618, 121538912, 117253414, 113446111, 110016361, 106843764, 103855795, 101018425, 98351462, 95938931, 93776175, 91866241, 90243410, 88932718, 87965310, 87353135, 87145782, 87384405, 87995015, 88913473, 89968359, 90971243, 91672210, 92046104, 92214367, 92256190, 92206803, 91960913, 91418640, 90410969, 89005846, 87189881, 85012690, 82583924, 79947969, 77160297, 74269693, 71331073, 68382403, 65527944, 62787150, 60239740, 57916319, 55800985, 53936522, 52297690, 50876327, 49640431, 48598979, 47665344, 46793436, 46001693, 45231292, 44406685, 43542400, 42559156]
4512D2559156j080434j203984j340009j447358j518862j567987j596484j614767
4504C1189271j551042j514490j503057j453760j371956j290813j214559j116497
4496B0173097j020868r31602q41064p57612p24967o77507o27483n59659n09722
4487A3522613m74272m74970m59056m12727l44177l32040l45172l06505k73150
4478A0100544k80125k46742k61181k39051k56015k24936k08563k38572j86621
4469G958738j76767j77279j54808j29734j13873j36915j01544r5428j21312j09067
4459F642011j16379j05996j14250j18401j11902r1527o8445j07244j09832j29599
4449E568436j15916r2132q4468q8831j03408j04710p5458p1171r0993q5184n7238
$$ y = [42559156, 41478722, 40274738, 38934729, 37487371, 35968509, 34400522, 32804038, 31189271, 29638229, 28123739, 26620682, 25166922, 23794966, 22504153, 21289594, 20173097, 19152229, 18220627, 17379563, 16621951, 15896984, 15219477, 14591994, 14032335, 13522613, 13048341, 12573371, 12114315, 11701588, 11357411, 11025371, 10680199, 10373694, 10100544, 9820419, 9573677, 9312496, 9073445, 8817430, 8592494, 8383931, 8145359, 7958738, 7781971, 7604692, 7449884, 7320150, 7206277, 7069362, 6967818, 6872390, 6751078, 6642011, 6525632, 6419636, 6305386, 6186985, 6075083, 5983556, 5915111, 5807867, 5698035, 5568436, 5452520, 5360388, 5275920, 5187089, 5083681, 4978971, 4903513, 4832342, 4741349, 4656165, 4598927]
4438D598927n8669l1620j3850m8186l3553l3983m0732l9312m6782o9622p2380
4427D110238o7965p8389l7805j6558l6222n2881m0015j5511k3978j0417q780m2900
4415C678817n1541k5946n1066m7926k3586q2602m7246k6148n1158o653o354m6211
4403C212380l2726l3307j2220l4377l3980j5389m1462k1072l5811j4761l8953
4392B898322l4865k9884l9190j3172k4146l9562l6103j9028j6178j7152l7415
4381B591627k7226k7583k4328q172k9895l5872r218j187k5575r833l1415j7187
4369B344136j7432k0780J4688j5103k525j7809l3491J361P780N196J6222j9966
4357B262277n870j2286j0902q866j6571L5r898m2240j7052R904q731L447j9947
$$ y = [4598927, 4540258, 4508638, 4494788, 4446602, 4413049, 4379066, 4338334, 4299022, 4252240, 4182618, 4110238, 4042273, 3963884, 3926079, 3909521, 3873299, 3820418, 3780403, 3764892, 3740914, 3730497, 3721717, 3678817, 3627276, 3601330, 3550264, 3502338, 3478752, 3396150, 3348904, 3322756, 3271598, 3264945, 3258591, 3212380, 3179654, 3146347, 3134127, 3099750, 3065770, 3050381, 3008919, 2987847, 2952036, 2937275, 2898322, 2863457, 2833573, 2794383, 2781211, 2757065, 2717503, 2681400, 2662372, 2646194, 2629042, 2591627, 2564401, 2536818, 2512490, 2504318, 2474423, 2438551, 2429333, 2428146, 2402571, 2392738, 2361323, 2344136, 2326704, 2305924, 2320612, 2305509, 2302984, 2285175, 2251684, 2253045, 2260825, 2266021, 2282243, 2262277, 2256407, 2244121, 2233219, 2224353, 2207782, 2207817, 2197919, 2155679, 2138627, 2148531, 2139800, 2143247, 2123300]
4344B123300k5690o562J9325n922K1364L694m529k2022J3219l0141k9909j9270
4332B036857k5449m560k8217j4011j7220k2615j1602q04m1526j595j5654k4101
4320A829503J5934l4217J2788k1979j2516j4842j8746J532M977j1136J5026J7043
4308A783367L658o066J0075L2617j4403J967j5434J4973J0271Q526J6305l240
4296A842616J7744L2344K6901L5062P911K5050L8148J0370J3033K6477N9094P2946
4284B207696M5933N4775P0029P3687N5509P0073P9243L3554q904l4606q6375j00074
4272B460540p9178r3783r2847p5193p3669o5461k6240l6189k5858l9754l2766
4261A819602k7460p2580j0126K8160J4057L588k350r980m795M896K0777p084M015
$$ y = [2123300, 2097610, 2091048, 2110373, 2104451, 2125815, 2129509, 2124980, 2102958, 2116177, 2086036, 2056127, 2036857, 2011408, 2006848, 1978631, 1964620, 1947400, 1924785, 1913183, 1912379, 1870853, 1869258, 1853604, 1829503, 1845437, 1811220, 1824008, 1802029, 1789513, 1774671, 1755925, 1757457, 1762434, 1751298, 1766324, 1783367, 1787025, 1780959, 1791034, 1823651, 1809248, 1811215, 1795781, 1810754, 1821025, 1829551, 1845856, 1842616, 1860360, 1892704, 1919605, 1954667, 1962578, 1987628, 2025776, 2036146, 2049179, 2075656, 2134750, 2207696, 2253629, 2308404, 2378433, 2452120, 2507629, 2577702, 2656945, 2690499, 2681595, 2646989, 2560614, 2460540, 2381362, 2287579, 2194732, 2119539, 2045870, 1980409, 1954169, 1917980, 1892122, 1852368, 1819602, 1792142, 1719562, 1709436, 1737596, 1751653, 1755241, 1752891, 1742911, 1738116, 1743012, 1763789, 1756705, 1760720]
4248A760720q593n273P747q114k7961n055m718m0403L50k4117l4698j7046l0541
4235A562298p852j1944m837k6529j3890k9589l0610O647q839k3312j914J717J4361
4222A425707J7623l5786l5107J1067k4051l9903k890j7847l006j5750j6282o417
4210A257358J5376J2918j4425P931L770J7573o780l3783m9435m3837k2025j5038
4198A129603k4299j6473k566P1k7945M668j1602n961K0226j0621j7624j7270j9114
4185A001093L713L321m675N818q622J8434P802k0951l4159m737n267k3062j8777
4172I19931j2316j6933J4911p107j9581P84q736j7430R237R555j2326j4684l457
4159H41848m448J1931k2044J239p968k5429N683J0757K5480r722j5783l970j4329
$$ y = [1760720, 1752127, 1746854, 1754601, 1746487, 1718526, 1713471, 1708753, 1668350, 1668700, 1644583, 1609885, 1592839, 1562298, 1554446, 1542502, 1537665, 1511136, 1497246, 1467657, 1437047, 1443694, 1434855, 1411543, 1409629, 1411346, 1425707, 1443330, 1407544, 1372437, 1383504, 1359453, 1319550, 1316660, 1298813, 1295807, 1280057, 1263775, 1257358, 1272734, 1285652, 1271227, 1279158, 1282928, 1300501, 1293721, 1259938, 1210503, 1166666, 1144641, 1129603, 1105304, 1088831, 1086265, 1086336, 1058391, 1063059, 1051457, 1045496, 1065722, 1055101, 1037477, 1020207, 1001093, 1004806, 1008127, 1003452, 1009270, 1000648, 1019082, 1026884, 1005933, 971774, 967037, 961770, 938708, 919931, 907615, 890682, 905593, 898486, 878905, 879689, 870953, 853523, 862760, 872315, 859989, 845305, 841848, 837400, 849331, 827287, 828526, 820558, 795129, 800812, 811569, 837049, 827327, 811544, 807574, 793245]
4146G93245r616J4941k444k9858l1692l0335m327k409K2724o743J3354J6292J274
4133G44406o274m032K3284K696k20k4418P594P809J545P288r669k1150m374Q928
4119G33413J4473n604M655p042m060k3027q058J3892P384L44L408J8965M267J6977
4105G69987J9163K1911j5566K1650k030j9314r026K4543j84j9837J3706k4571
4093G80432j6222N535n639k3786j1267J8402L7522K466J1892n774J3029K9870
4081H36460k488J5235r845j2087q145K1975J9516q640l182k7069J0872M1903J1466
4068H85971J5702J3524L711R569R411K3812K9861r393l1478j2514J4048l627r625
4055I38972J6878J4145J061K6938j775P33K6923K7891R540J2912L5499J7220k884
$$ y = [793245, 783629, 798570, 796126, 766268, 734576, 704241, 699914, 697505, 720229, 713486, 726840, 743132, 744406, 738132, 734100, 757384, 760080, 759860, 735442, 743036, 750845, 752390, 759678, 750009, 728859, 724485, 733413, 747886, 742282, 746937, 739895, 735835, 712808, 704750, 718642, 726026, 726370, 729778, 748743, 753010, 769987, 789150, 811061, 795495, 817145, 815115, 795801, 786775, 811318, 811134, 791297, 805003, 780432, 764210, 769745, 764106, 740320, 729053, 747455, 784977, 787443, 799335, 793561, 806590, 836460, 833972, 849207, 839362, 827275, 819130, 841105, 860621, 851981, 848799, 821730, 832602, 874505, 885971, 901673, 915197, 918908, 928477, 937888, 961700, 991561, 982168, 950690, 938176, 952224, 948597, 938972, 955850, 969995, 971056, 997994, 996219, 996952, 1023875, 1051766, 1061306, 1074218, 1109717, 1126937, 1124053]
4042A124053j7302R890J8452Q859J975p090J6922R103L479K1039N230j7749k3428
4029A153433O567p55j771j1677j2370N165J3202J4655n249P971j1149J906j321
4016A158607m797k1687j6938J0183j1010l9570M496K0118j7976j0276L107K486
4004A076743K0717J7595J0815j7453k834K9633n091j9797N628k0804l9510N278
3992A060920L575j5669j2960K7265n412P477j7108J870K5897N0702J9203J0710
3980A156470L5447K4018K771L8275J0884Q711R591J8738Q360Q661m625N161J5772
3967A338234J069k6614r772j694J1694K185O768J5554K2037o945k6573M928K2388
3954A353259j8587k077Q144j7437J9746J4752j2357n882n829p503J4291k5695
$$ y = [1124053, 1106751, 1116641, 1135093, 1143952, 1145927, 1138837, 1155759, 1164862, 1168341, 1189380, 1194610, 1176861, 1153433, 1160000, 1159245, 1157474, 1145797, 1133427, 1138592, 1151794, 1166449, 1161200, 1169171, 1158022, 1159928, 1158607, 1153810, 1132123, 1115185, 1125368, 1114358, 1074788, 1079284, 1099402, 1081426, 1071150, 1074257, 1076743, 1097460, 1115055, 1125870, 1108417, 1105583, 1135216, 1130125, 1110328, 1115956, 1095152, 1055642, 1060920, 1064495, 1048826, 1035866, 1063131, 1057719, 1065196, 1048088, 1049958, 1075855, 1126557, 1145760, 1156470, 1191917, 1215935, 1218706, 1256981, 1267865, 1276576, 1286167, 1304905, 1313265, 1321926, 1317301, 1322462, 1338234, 1339303, 1312689, 1302917, 1301223, 1312917, 1315102, 1321870, 1337424, 1359461, 1352516, 1325943, 1330871, 1353259, 1334672, 1332595, 1340739, 1323302, 1343048, 1357800, 1345443, 1339561, 1333732, 1326229, 1340520, 1314825]
3942A314825M070K1355K7149R314j8297j2889K463P138q687l826p383L025J4081
3929A352338l1371N629J7548j9582l395R198k532J3339q158P29L656J1051j6479
3916A331971j3291l375m997k0793K967k4591n214J014j903j4335J0375n049K8584
3903A281363L3625L1607Q99J6001L7586J0256M3624J4859J2862k2278p894P064
3891A459574l5685k0692p809k8762k8750l5760l0863J3602J3111p627L465J1904
3879A305708P729L6644J945J9218M7070J4257R495J1419l509J6504j0740p138
3867A448602k7864n4679k7677k1793l8527k7379j4478o063k273j4474j331m852
3855A207212K560m133j3030L889J7889M815o692n817J630j7133k4895l7459j4740
$$ y = [1314825, 1318895, 1340250, 1367399, 1376713, 1358416, 1345527, 1347990, 1355128, 1346441, 1342615, 1335232, 1338257, 1352338, 1320967, 1326596, 1344144, 1324562, 1321167, 1330365, 1327833, 1341172, 1333014, 1333743, 1337399, 1348450, 1331971, 1318680, 1315305, 1310308, 1289515, 1292482, 1267891, 1262677, 1263691, 1261788, 1247453, 1257828, 1252779, 1281363, 1314988, 1346595, 1347494, 1363495, 1401081, 1411337, 1454961, 1469820, 1482682, 1460404, 1452510, 1459574, 1423889, 1403197, 1395388, 1366626, 1337876, 1302116, 1271253, 1284855, 1297966, 1290339, 1293804, 1305708, 1313437, 1350081, 1352026, 1371244, 1418314, 1432571, 1442066, 1453485, 1449976, 1466480, 1455740, 1448602, 1420738, 1366059, 1338382, 1316589, 1278062, 1250683, 1236205, 1230142, 1227869, 1213395, 1212064, 1207212, 1209772, 1205639, 1192609, 1196498, 1214387, 1219202, 1212510, 1206693, 1208323, 1191190, 1166295, 1128836, 1114096]
3842A114096q383o195k3368m5665m3374K608K859k1135m327m94N606O910l394
3829I75744j2982J6247k818m7670k4651l3041k2127k6983j0802l002P362j4096
3817H01181j2487j5329M0135k3946l431q475k2031R483n148j1255L302K501j9591
3804G34909q200k6464R398k4202j6008K0065j4327j3798J1039l554n714K0802
3792F83946j5007J9533J4148j6230O171N595m573j5166m706k76k955j3302M338
3779F61516J5074j0871j0007J418k4502o919k4841j0006J2415n154O560K0877
3767F25560J790j2511L650L336k8724j4015J1077l144J2473m677O887P921M911
3754F14534l2746j1891K872n345l4822L81J4544p677K8426M861n460j8635J2542
$$ y = [1114096, 1105713, 1099518, 1076150, 1030485, 987111, 989719, 992578, 971443, 967116, 966622, 972228, 979138, 975744, 962762, 979009, 976191, 928521, 903870, 870829, 848702, 821719, 810917, 807915, 815277, 801181, 788694, 773365, 813500, 789554, 786123, 777648, 755617, 765100, 759952, 748697, 751999, 754500, 734909, 726709, 700245, 709643, 685441, 669433, 689498, 675171, 661373, 672412, 668858, 663144, 683946, 668939, 688472, 702620, 686390, 692561, 698156, 693583, 678417, 673711, 673435, 670480, 657178, 661516, 676590, 665719, 655712, 657130, 632628, 625709, 600868, 590862, 603277, 598123, 604683, 625560, 627350, 614839, 618489, 621825, 593101, 579086, 590163, 587019, 599492, 594815, 601702, 609623, 614534, 581788, 569897, 572769, 567424, 532602, 532983, 547527, 539850, 568276, 573137, 567677, 549042, 561584]
3741E61584j176J6773L485j9044k0003O123P685M610J620p745k413J3344j6974
3728E47869k4158j348J5410m942j5959P082N550R913o50o505k186k818P120J4570
3714E48948q310m41L926M980l156k5455J081P148Q342J5057j5377k0175j0674
3701E05894j1899J0813K3707l277k4062Q472m081j6719k2541j3875p266J8798
3689D63964L1103j23o084n109j5937K3904J6342m3155l22j9892J6176P773Q314
3676D76954L722r078K7447j6058o059R884p975O65l513K73J4659j9364R260J4986
3662D95803O143j441K044N344O218l279j395k5253P468K3177K083J6878J0813
3649E44603j1203j9522j0646r402K6314J1199j7174q716q012l653j0616J8619
$$ y = [561584, 560408, 577181, 580666, 561622, 541619, 547742, 555427, 560037, 561657, 553912, 551499, 564843, 547869, 523711, 522363, 537773, 532831, 516872, 523954, 529504, 539417, 538767, 532262, 530076, 527258, 534378, 548948, 540638, 540197, 544123, 549103, 545947, 520492, 521573, 528721, 537063, 552120, 536743, 516568, 505894, 493995, 504808, 528515, 525238, 501176, 509648, 505567, 488848, 466307, 452432, 445166, 463964, 495067, 494944, 488860, 483751, 467814, 491718, 508060, 464905, 464583, 444691, 460867, 468640, 476954, 480676, 471598, 499045, 482987, 476928, 486812, 478837, 479502, 475989, 476262, 490921, 471557, 480817, 495803, 501946, 500505, 502549, 507893, 514111, 510832, 509437, 484184, 491652, 514829, 516912, 533790, 544603, 533400, 513878, 503232, 493830, 520144, 531343, 514169, 505453, 497441, 493788, 483172, 501791]
3637E01791L1833j0204K4771L4770o73j3523J0229K1986j2808J1036j458n298
3625E92452J1834j849l5765J2564n631N934j2397N557K0741r888j3694k5288L706
3612E48276M378O3j4481L9551J7499j1517J0225j0056J3846K4745O765Q192R383
3599F46869L0618J2032J327j1340J7850j2332L3090m590j3163o407k2969j0429
3587F60556K0535K3620J4689j9945O004R409j2874m945j4455P434P349J3761M6610
3574G57748J0552k5384J6655K8598Q761m010J8529M098k2286j3372M2383q612
3562H13660J2505K697j5059J9284K2105K3135l56J2741q064q773N430K1557O466
3549I07328J4033N460J5510K574L990K4767Q609M50L3490L6105J3865P8K6324
$$ y = [501791, 533624, 523420, 548191, 582961, 582288, 568765, 578994, 600980, 588172, 599208, 597750, 592452, 604286, 602437, 566672, 579236, 573605, 579539, 567142, 572699, 593440, 583552, 569858, 544570, 548276, 552654, 552717, 538236, 577787, 595286, 583769, 593994, 583938, 597784, 622529, 629294, 637486, 646869, 677487, 689519, 690846, 679506, 697356, 685024, 718114, 713524, 700361, 693954, 670985, 660556, 681091, 704711, 719400, 699455, 705459, 714868, 701994, 697049, 682594, 690028, 697377, 711138, 757748, 768300, 742916, 759571, 788169, 796930, 792920, 811449, 815547, 793261, 779889, 822272, 813660, 826165, 828862, 813803, 833087, 855192, 878327, 877971, 890712, 882648, 873875, 879305, 900862, 907328, 921361, 926821, 942331, 944905, 948895, 973662, 982271, 982721, 1016211, 1052316, 1066181, 1066259, 1092583]
3536A092583K4728j884J0787J9447M590n65J6071N551L3476K305R997L962J0154
3523A231202R419L9507M6452R310L3727J2266N181N1320N4896J2985K9204j49
3511A535320N809L7863q336J048J3425j1971J9400J8895j6832K1797J0235N0M8303
3498A675006K3031J7869L3041J3267P856J8323L1442J4214J9912J873O2089M1576
3486A959499K1722K6378N3268N8120M4099O7519N9180M5879O8116O0065M6597
3475B510442N7913O6827Q7518P8142P6436Q6420J40731J18876Q5874J33729J43194
3464C586102J54974J46919J60862J63083J45132K21828J97553J82290J97815K31858
3454E388416J95618J33940R3861K336p5281j62897k46850k88233l05721l00823
$$ y = [1092583, 1117311, 1115427, 1126214, 1145661, 1150251, 1149686, 1165757, 1171308, 1204784, 1207089, 1217086, 1221048, 1231202, 1240621, 1280128, 1326580, 1335890, 1369617, 1381883, 1387064, 1438384, 1493280, 1506265, 1535469, 1535320, 1541129, 1578992, 1570656, 1571704, 1585129, 1573158, 1592558, 1611453, 1594621, 1616418, 1626653, 1626703, 1675006, 1698037, 1715906, 1748947, 1762214, 1770070, 1788393, 1819835, 1834049, 1853961, 1855834, 1917923, 1959499, 1981221, 2007599, 2060867, 2118987, 2163086, 2230605, 2289785, 2335664, 2403780, 2463845, 2510442, 2568355, 2635182, 2722700, 2800842, 2877278, 2963698, 3104429, 3223305, 3309179, 3442908, 3586102, 3741076, 3887995, 4048857, 4211940, 4357072, 4578900, 4776453, 4958743, 5156558, 5388416, 5584034, 5717974, 5811835, 5814171, 5738890, 5575993, 5329143, 5040910, 4735189, 4434366]
3444D434366k49847k46628k12649j76367j76925j82719j17107j16834j05399r6028
3434B753863j03062o6539p3405n8169p7472n1944o5602p8713l7066n9729q9764
3423A992398o2672m9371k7109n1274o5268m2021j5538m3218m1537j1503k5106
3412A557781o2241n4261l0638k1761j7978m5783j3978j0395k7393k6686l486o71
3400A242510k4878m815l8846j5703j6931r950k4069l745J920o752K5155J0378
3388A134274J1942j8736P32j4558l364J3802L0293J1047k2270j1267l414J6819
3376A145300L8281k0161j0533l4258l6398k4948j5305m8419j029j6685j3495k3127
3364I39223j3232L3324j1743p788k0465j2755J4918N447l079J8077J1610J9469
$$ y = [4434366, 4184519, 3937891, 3725242, 3548875, 3371950, 3189231, 3072124, 2955290, 2849891, 2753863, 2650801, 2584262, 2510857, 2452688, 2375216, 2323272, 2257670, 2178957, 2141891, 2082162, 1992398, 1929726, 1880355, 1853246, 1801972, 1736704, 1694683, 1679145, 1635927, 1594390, 1582887, 1557781, 1495540, 1441279, 1410641, 1388880, 1370902, 1325119, 1311141, 1300746, 1273353, 1246667, 1243181, 1242510, 1217632, 1212817, 1173971, 1158268, 1141337, 1131387, 1107318, 1103573, 1105493, 1098741, 1123896, 1134274, 1146216, 1127480, 1128212, 1113654, 1110290, 1124092, 1154385, 1165432, 1143162, 1131895, 1128481, 1145300, 1183581, 1163420, 1152887, 1118629, 1082231, 1057283, 1041978, 993559, 992530, 975845, 962350, 939223, 925991, 959315, 947572, 939784, 919319, 906564, 921482, 926929, 923850, 941927, 953537, 973006]
3352I73006N448J3992Q961J9861N3698N9756P7541M5077L6855m593n6037o8347
3340A165218o1289l7659m4439l3074m5514o1081k5342k3028l1556J4005k2219
3329G94022O209P565r782k748J4694j3939n314k1443Q561O148K7540J2446O823
3316H30782L555J4488L6333K0741K2871O254n923l4550l9824k2505k1664j6585
3304G93973l4175j7075J0468l0049J768Q981j5268K4685R70j2020j9509K2430
3292G35179J390O378j1291l048k81J0298J1864M795J7581J4418Q421q127J0388
3279G97965n137K5838L2663L3105K0252P980J9491J9830o365N1851L3054M2422
3267A072949K4282K2156L7757L8583L7307M7895N1685O1400M0948M6888N5295
$$ y = [973006, 978454, 992446, 1001407, 1021268, 1074966, 1134722, 1212263, 1257340, 1294195, 1289602, 1233565, 1165218, 1103929, 1066270, 1021831, 988757, 943243, 882162, 856820, 833792, 802236, 816241, 794022, 800231, 807796, 798014, 795266, 809960, 796021, 790707, 769264, 777825, 783973, 811513, 823959, 830782, 834337, 848825, 885158, 905899, 928770, 935024, 929101, 894551, 854727, 832222, 810558, 793973, 759798, 742723, 753191, 723142, 724910, 733891, 718623, 743308, 744278, 732258, 712749, 735179, 736569, 742947, 731656, 728608, 728327, 738625, 750489, 755284, 772865, 787283, 795704, 787577, 797965, 792828, 818666, 851329, 884434, 904686, 912666, 932157, 951987, 945622, 997473, 1030527, 1072949, 1097231, 1119387, 1157144, 1195727, 1233034, 1280929, 1332614, 1394014, 1434962, 1481850, 1537145]
3256A537145O4326N0926Q4324O1845M6946P2007P8082Q9899Q9753P0371J16477
3245B362101J08167J10810J27028J39415J79653J78001J83352J85410K18179K07313
3235C999429K27940J82356J49513J22052R2468O1369q06j3175l8370l1790L995
3224D754981L0099J7144O2594P9193Q0737J04666J01609R0660Q5423P6958N6868
3213E540932M1102M2693L4996N6270Q3209Q7235J27223J90338K04208K65541L17422
3202F991169L50547M29255M47437M30160L68957L26108J98418R6755p0304k49270
3192I319232l47300l34956l20233k89663k21633j28289m4671K2783K6430J9096
3182G700796M3837J1787k8138l9179j12839j87862k03287k78590k58653k84374
$$ y = [1537145, 1601471, 1652397, 1736721, 1798566, 1845512, 1917519, 1995601, 2085500, 2175253, 2245624, 2362101, 2470268, 2581078, 2708106, 2847521, 3027174, 3205175, 3388527, 3573937, 3792116, 3999429, 4227369, 4409725, 4559238, 4681290, 4773758, 4835127, 4834321, 4821146, 4782776, 4750986, 4754981, 4785080, 4802224, 4864818, 4944011, 5024748, 5129414, 5231023, 5321683, 5407106, 5484064, 5540932, 5582034, 5624727, 5659723, 5715993, 5799202, 5886437, 6013660, 6203998, 6408206, 6673747, 6991169, 7341716, 7770971, 8218408, 8648568, 9017525, 9343633, 9542051, 9638806, 9568502, 9319232, 8971932, 8636976, 8316743, 8027080, 7805447, 7677158, 7632487, 7655270, 7681700, 7700796, 7744633, 7756420, 7728282, 7689103, 7576264, 7388402, 7185115, 6906525, 6647872, 6363498]
3172F363498k43021j64149j20431k2793Q365P7540J12183J46887J65817J60734
3162F484630J33358N6416j347p6257j54956j88450k15229k20757k29926j80489
3152E406993j24244j23689p9078m6598m0891o380k4420m2782p5930j15240j52709
3141D575032j82391k37166k45579k21282k18170k25221j99839j50697j30620r7738
3131B666329q8920r0727p8198n1551n5551m8539l9000o785m1935j9083k4907j9826
3119B101307l2641n128j306j40j5869K537O081J1346P210j7858j5692k1214l1646
3106A986987l0681k2270m0563l6712m1268k9860j2339n926k1025p95j1114l5976
3094A698458m408l2329k918K1374l2956r765O703j8012j5367k5974k7045L146
$$ y = [6363498, 6120477, 5956328, 5835897, 5813104, 5821469, 5899009, 6011192, 6158079, 6323896, 6484630, 6617988, 6674404, 6673057, 6596800, 6441844, 6253394, 6038165, 5817408, 5587482, 5406993, 5282749, 5159060, 5079982, 5033384, 4992493, 4986113, 4961693, 4918911, 4842981, 4727741, 4575032, 4392641, 4155475, 3909896, 3688614, 3470444, 3245223, 3045384, 2894687, 2764067, 2666329, 2577409, 2486682, 2408484, 2356933, 2301382, 2252843, 2213843, 2207058, 2165123, 2146040, 2121133, 2101307, 2068666, 2063538, 2062232, 2062092, 2046223, 2048760, 2054841, 2066187, 2073397, 2055539, 2039847, 2018633, 1986987, 1956306, 1934036, 1893473, 1856761, 1815493, 1785633, 1773294, 1767368, 1746343, 1745548, 1734434, 1698458, 1694050, 1661721, 1658803, 1680177, 1647221, 1637456, 1644159, 1626147, 1610780, 1584806, 1557761, 1560907]
3082A560907j8058j7834l5518k7618j1381n489l0408j3749l8744j9009l2261k5534
3070A285304l6094M24l3548m2342j3126k8776j020l1766r684l4755q484j6592
3058A029541j5680j2546l5238j3834k4440l0919j9054k4616k2464j9807k9442
3047G81501j4930j3663j9868j5844j3114o373j4576j7631l5668k4918j3704j396
3035E89816L4569l3993p614O520p731k4198j6636J373q708k462j4627k5262l0083
3022D60964K2227j5311l4947K8887q649p596j2929j653j1160k7349M202J3235
3010D09921M396l067j2735J9881N049j3428k1905l5162N820o31n288j932J8327
2997C69246o416p094j7796j7332K504J5171L163k6755j9210Q742K7843j444n688
$$ y = [1560907, 1542849, 1525015, 1489497, 1461879, 1450498, 1445009, 1414601, 1400852, 1362108, 1343099, 1310838, 1285304, 1249210, 1249634, 1216086, 1173744, 1160618, 1131842, 1130822, 1099056, 1089372, 1054617, 1046133, 1029541, 1013861, 1001315, 966077, 952243, 927803, 896884, 877830, 853214, 830750, 810943, 781501, 766571, 752908, 733040, 717196, 704082, 697709, 683133, 665502, 629834, 604916, 591212, 589816, 624385, 590392, 582778, 589298, 581567, 557369, 540733, 542106, 533398, 530936, 516309, 491047, 460964, 483191, 467880, 432933, 461820, 453171, 445575, 432646, 430993, 419833, 392484, 396686, 409921, 414317, 411250, 398515, 418396, 423445, 410017, 388112, 352950, 358770, 358139, 352851, 350919, 369246, 362830, 355736, 337940, 320608, 323112, 338283, 341446, 314691, 295481, 304223, 332066, 330622, 324934]
2984C24934j4063j5408l814n56j9307j2495o77J1556K9233k085Q133k6292K3336
2971C02495J2534q992J640k3000K75J5713L361N687P084j4591p535p391j1841
2958B75439J2k59K7136r930k603P570k188l5734J1020J0689J5878q033o456P271
2944B89812J759p477k146J8882k825n072R72j3044M997J6866J1611Q285J0390
2931C33010L2272R371q157j428J0777j5464j5884J1636P826J7614K8943j162J2497
2918D21851M642N2866J5961R434p417N006K6343J4337K1477Q990K4477J4955J5487
2905F28409n799M806J9179J5279q757K1583L2835K5683N058K3955N8381L2248
2893H52860N2583l501M2108L8598J7034K6645L0270N5349N4817M9747N2480K6790
$$ y = [324934, 310871, 295463, 291649, 291093, 271786, 259291, 258614, 270170, 299403, 297318, 305451, 279159, 302495, 315029, 306037, 307677, 284677, 284952, 300665, 304026, 309713, 316797, 302206, 294671, 287280, 275439, 275451, 275192, 302328, 292398, 289795, 297365, 295177, 259443, 270463, 281152, 297030, 288997, 282541, 289812, 291571, 284094, 281948, 300830, 298005, 292933, 293905, 280861, 285858, 302724, 314335, 322620, 333010, 365282, 374653, 366496, 365068, 375845, 360381, 344497, 356133, 363959, 381573, 410516, 409354, 421851, 426493, 479359, 495320, 504754, 497337, 502343, 528686, 543023, 564500, 573490, 597967, 612922, 628409, 622610, 627416, 646595, 661874, 653117, 674700, 707535, 733218, 738276, 762231, 820612, 852860, 905443, 901942, 944050, 982648, 999682, 1026327, 1056597, 1111946, 1166763, 1216510, 1268990, 1295780]
2881A295780L6232P0317N7398L2748N3338N3218O4106O3720M9754O4868N5915
2870A897394O3384P6587N6270M1121P6381L3394N4418M3898J9439P6920N6660
2859B495866M0666O7595P7957Q5437O1274O3568L2858J8118J348j812K2053K6976
2847B991904N20j251J2774j046N348K6586O0882N4777N0562Q5368J35331J40688
2835C562443J47452J11692J29527R6121L9397j432M5184N5301L6250O3223P9370
2824D364528M6777R7968J08684R2661M8493J9172n2188m8839p1226r5993j06037
2813D404000j39975j35267j49209j30541j13682j03680p7418p4302m0691j6989
2803C422246J4753K2187K8146Q3960O4321Q4448P2736N8337N3495J8894m0067
$$ y = [1295780, 1332012, 1402329, 1459727, 1492475, 1545813, 1599031, 1663137, 1726857, 1776611, 1841479, 1897394, 1960778, 2037365, 2093635, 2134756, 2211137, 2244531, 2298949, 2342847, 2362286, 2439206, 2495866, 2536532, 2604127, 2682084, 2767521, 2828795, 2892363, 2925221, 2943339, 2944687, 2942875, 2964928, 2991904, 2992424, 2991173, 3003947, 3002901, 3008249, 3034835, 3095717, 3150494, 3201056, 3286424, 3421755, 3562443, 3709895, 3821587, 3951114, 4047235, 4086632, 4085200, 4130384, 4185685, 4221935, 4285158, 4364528, 4411305, 4509273, 4617957, 4710618, 4759111, 4778283, 4726095, 4677256, 4606030, 4510037, 4404000, 4264025, 4128758, 3979549, 3849008, 3735326, 3631646, 3554228, 3479926, 3439235, 3422246, 3436999, 3459186, 3487332, 3571292, 3635613, 3720061, 3792797, 3851134, 3904629, 3923523, 3883456]
2792C883456k3787k1479o365p337J1095M296K8889Q575j5154n2319q1731j09430
2780C618709j18660q9390j58119j71926j37678j61673j50322j49744j31424r7189
2770B252584j06832j04265n1992o2361k939k7759j1076k510M115J54K9J6126k3843
2757A879431j8550n1051n3396j5026m1139m8456l5339n2032n3502l8222l4596
2746A438122l1728m9197m2069o3281p7709o7706n2775o8187p4588n1395l7150
2735H22337m6308l8214l9468m3838j3435j7983j3482P50k4603m760k7151k8281
2723E25564M019M279l206k3571l0383n3270k1295l0505m337M918j5846k1742r191
2710C25434r574k429k9467q244Q661j9035j6121j5851j211j2811P391P368j5947
$$ y = [3883456, 3859669, 3838190, 3831825, 3824488, 3835583, 3839879, 3868768, 3877343, 3862189, 3809870, 3728139, 3618709, 3500049, 3410659, 3252540, 3080614, 2942936, 2781263, 2630941, 2481197, 2349773, 2252584, 2145752, 2041487, 1989495, 1927134, 1924195, 1896436, 1885360, 1882850, 1886965, 1887119, 1887148, 1903274, 1879431, 1860881, 1809830, 1756434, 1741408, 1700269, 1651813, 1616474, 1564442, 1510940, 1472718, 1438122, 1406394, 1357197, 1315128, 1251847, 1174138, 1106432, 1053657, 985470, 910882, 859487, 822337, 776029, 737815, 698347, 654509, 641074, 623091, 609609, 610359, 585756, 580996, 553845, 525564, 529583, 533862, 530656, 507085, 476702, 423432, 402137, 371632, 367295, 372213, 356367, 334625, 325434, 315860, 313431, 283964, 275720, 284381, 265346, 249225, 233374, 232163, 219352, 226743, 234111, 218164]
2697B18164j3532K886R475J5886o356k4204O949k9775l4697J6543m933n80J2974
$$ y = [218164, 204632, 207518, 216993, 232879, 226523, 202319, 209268, 179493, 144796, 161339, 156406, 155826, 168800]
$$ [...]
##END NTUPLES=NMR SPECTRUM
##END=
