##TITLE=1H_CA-9318-1
 200.13MHz, CDCl3,
 8 sc
 
 10.2.2025
##JCAMPDX= 6.0         $$ Bruker NMR JCAMP-DX V2.0
##DATA TYPE= NMR SPECTRUM
##DATA CLASS= NTUPLES
##ORIGIN= UXNMR, Bruker Analytische Messtechnik GmbH
##OWNER= pz
$$ XWIN-NMR		Version 3.5
$$ Mon Feb 10 14:25:15 2025 Russian Standard Time (UT+4h)  she@DPX200
##.OBSERVE FREQUENCY= 200.1313
##.OBSERVE NUCLEUS= ^1H
##.ACQUISITION MODE= SIMULTANEOUS
##.ACQUISITION SCHEME= undefined
##.AVERAGES= 8
##.DIGITISER RES= 18
##SPECTROMETER/DATA SYSTEM= spect
##.PULSE SEQUENCE= zg30
##.SOLVENT NAME= CDCl3
##.SHIFT REFERENCE= (INTERNAL, CDCl3, 0, 15.5596)
##AUDIT TRAIL= $$ (NUMBER, WHEN, WHO, WHERE, WHAT)
$$ ##TITLE= Audit trail, XWIN-NMR		Version 3.5
$$ ##JCAMPDX= 5.01
$$ ##ORIGIN= Bruker BioSpin GmbH
$$ ##OWNER= she
$$ F:/spectra/data/she/nmr/H-C/1/pdata/1/auditp.txt
$$ ##AUDIT TRAIL=  $$ (NUMBER, WHEN, WHO, WHERE, WHAT)
(   1,<2025-02-10 14:23:49.75 +0400>,<she>,<DPX200>,
      <created by zg, POWCHK disabled, PULCHK disabled
       configuration hash MD5:
       00 E9 B6 7A A2 85 ED C7 34 08 36 98 17 FE 4E 26
       data hash MD5: 16K
       04 1A 7B EA 57 AC 43 BE AA 6D 91 C6 A3 E5 C3 B3>)
(   2,<2025-02-10 14:23:52.10 +0400>,<she>,<DPX200>,
      <Start of raw data processing
       efp BC_mod = 2 LB = 0.25 FT_mod = 6 PKNL = 1 PHC0 = -464.7956 PHC1 = 6.192205 SI = 16K 
       data hash MD5: 16K
       15 41 A3 5F 2D DD 9B F2 03 E3 30 D9 FC 75 45 42>)
(   3,<2025-02-10 14:24:15.54 +0400>,<she>,<DPX200>,
      <pk PHC0 = -1.813281 PHC1 = 3.2 
       data hash MD5: 16K
       B9 6A FD 05 7E F8 F2 0E F0 CB 23 70 FE D1 1C 6F>)
(   4,<2025-02-10 14:24:19.96 +0400>,<she>,<DPX200>,
      <abs ABSG = 5 
       data hash MD5: 16K
       BF 03 1A D4 FF FF 32 73 6D 49 DE 2B 51 9E 5A 8B>)
$$ ##END=
$$ 
$$ hash MD5
$$ 96 C8 30 7A FB 58 AF 11 1A 60 D5 4F 1C 80 F4 52
##$RELAX= 
##$RELAX= 
##$RELAX= 
##$RELAX= 
##$RELAX= 
##$RELAX= 
$$ Bruker specific parameters
$$ --------------------------
##$DU= <F:/spectra>
##$EXPNO= 1
##$NAME= <H-C>
##$PROCNO= 1
##$TYPE= <nmr>
##$USER= <she>
##$AMP= (0..31)
100 100 100 100 100 100 100 100 100 100 100 100 100 100 100 100 100 100 
100 100 100 100 100 100 100 100 100 100 100 100 100 100 
##$AQSEQ= 0
##$AQ_mod= 1
##$AUNM= <au_zg>
##$AUTOPOS= <>
##$BF1= 200.13
##$BF2= 200.13
##$BF3= 200.13
##$BF4= 200.13
##$BF5= 200.13
##$BF6= 200.13
##$BF7= 200.13
##$BF8= 200.13
##$BYTORDA= 1
##$CFDGTYP= 0
##$CFRGTYP= 5
##$CHEMSTR= <none>
##$CNST= (0..31)
1 1 145 1 1 1 1 1 1 1 1 1 1 1 1 1 1 1 1 1 1 1 1 1 1 1 1 1 1 1 1 1 
##$CPDPRG= <>
##$CPDPRG1= <>
##$CPDPRG2= <>
##$CPDPRG3= <>
##$CPDPRG4= <mlev>
##$CPDPRG5= <mlev>
##$CPDPRG6= <mlev>
##$CPDPRG7= <mlev>
##$CPDPRG8= <mlev>
##$CPDPRGB= <>
##$CPDPRGT= <>
##$D= (0..31)
0 0.7 0 0 0 0 0 0 0 0 0 0.03 0 0 0 0 0 0 0 0 0 0 0 0 0 0 0 0 0 0 0 0 
##$DATE= 1739183028
##$DBL= (0..7)
120 120 120 120 120 120 120 120 
##$DBP= (0..7)
150 150 150 150 150 150 150 150 
##$DBP07= 0
##$DBPNAM0= <>
##$DBPNAM1= <>
##$DBPNAM2= <>
##$DBPNAM3= <>
##$DBPNAM4= <>
$$ [...]
##$SUBNAM3= <"">
##$SUBNAM4= <"">
##$SUBNAM5= <"">
##$SUBNAM6= <"">
##$SUBNAM7= <"">
##$SUBNAM8= <"">
##$SUBNAM9= <"">
##$SW= 18.0517328524113
##$SWIBOX= (0..15)
0 0 2 0 0 0 0 0 0 0 0 0 0 0 0 0 
##$SW_h= 3612.71676300578
##$TD= 16384
##$TD0= 1
##$TE= 0
##$TE2= 300
##$TE3= 300
##$TEG= 300
##$TL= (0..7)
0 120 120 120 120 120 120 120 
##$TP= (0..7)
150 150 150 150 150 150 150 150 
##$TP07= 0
##$TPNAME0= <>
##$TPNAME1= <>
##$TPNAME2= <>
##$TPNAME3= <>
##$TPNAME4= <>
##$TPNAME5= <>
##$TPNAME6= <>
##$TPNAME7= <>
##$TPOAL= (0..7)
0.5 0.5 0.5 0.5 0.5 0.5 0.5 0.5 
##$TPOFFS= (0..7)
0 0 0 0 0 0 0 0 
##$TUNHIN= 0
##$TUNHOUT= 0
##$TUNXOUT= 0
##$USERA1= <user>
##$USERA2= <user>
##$USERA3= <user>
##$USERA4= <user>
##$USERA5= <user>
##$V9= 5
##$VALIST= <valist>
##$VCLIST= <CCCCCCCCCCCCCCC>
##$VD= 0
##$VDLIST= <DDDDDDDDDDDDDDD>
##$VPLIST= <PPPPPPPPPPPPPPP>
##$VTLIST= <TTTTTTTTTTTTTTT>
##$WBST= 1024
##$WBSW= 4
##$XGAIN= (0..3)
0 0 0 0 
##$XL= 0
##$YL= 0
##$YMAX_a= 111687
##$YMIN_a= -148678
##$ZGOPTNS= <>
##$ZL1= 120
##$ZL2= 120
##$ZL3= 120
##$ZL4= 120
##$ABSF1= 15.47254
##$ABSF2= -2.579309
##$ABSG= 5
##$ABSL= 3
##$ALPHA= 0
##$AQORDER= 0
##$ASSFAC= 0
##$ASSFACI= 0
##$ASSFACX= 0
##$ASSWID= 0
##$AUNMP= <proc_1d>
##$AZFE= 0.1
##$AZFW= 0.1
##$BCFW= 0
##$BC_mod= 2
##$BYTORDP= 0
##$COROFFS= 0
##$CY= -3
##$DATMOD= 1
##$DC= 0
##$DFILT= <>
##$DTYPP= 0
##$F1P= 0
##$F2P= 0
##$FCOR= 1
##$FTSIZE= 16384
##$FT_mod= 6
##$GAMMA= 0
##$GB= 0
##$INTBC= 1
##$INTSCL= 3.241238e-09
##$ISEN= 128
##$LB= 0.25
##$LEV0= 0
##$LPBIN= 0
##$MAXI= 10000
##$MC2= 0
##$MEAN= 0
##$ME_mod= 0
##$MI= 1.114404
##$NCOEF= 0
##$NC_proc= -7
##$NLEV= 6
##$NOISF1= 3.799351
##$NOISF2= 2.8
##$NSP= 0
##$NTH_PI= 0
##$NZP= 0
##$OFFSET= 15.55958
##$PC= 1
##$PHC0= -466.6089
##$PHC1= 9.392205
##$PH_mod= 1
##$PKNL= yes
##$PPARMOD= 0
##$PSCAL= 0
##$PSIGN= 0
##$REVERSE= no
##$SF= 200.129992418957
##$SI= 16384
##$SIGF1= 3
##$SIGF2= 2
##$SINO= 0.751879
##$SIOLD= 32768
##$SREGLST= <19F.Aceton>
##$SSB= 0
##$STSI= 16384
##$STSR= 0
##$SW_p= 3612.71676300578
##$SYMM= 0
##$S_DEV= 0
##$TDeff= 16384
##$TDoff= 0
##$TI= <>
##$TILT= no
##$TM1= 0
##$TM2= 0
##$TOPLEV= 0
##$USERP1= <user>
##$USERP2= <user>
##$USERP3= <user>
##$USERP4= <user>
##$USERP5= <user>
##$WDW= 1
##$XDIM= 16384
##$YMAX_p= 269061619
##$YMIN_p= -701277
$$ End of Bruker specific parameters
$$ ---------------------------------
##NTUPLES= NMR SPECTRUM
##VAR_NAME=  FREQUENCY,     SPECTRUM/REAL,   SPECTRUM/IMAG
##SYMBOL=    X,             R,               I
##VAR_TYPE=  INDEPENDENT,   DEPENDENT,       DEPENDENT
##VAR_FORM=  AFFN,          ASDF,            ASDF
##VAR_DIM=   16384,         16384,           16384
##UNITS=     HZ,            ARBITRARY UNITS, ARBITRARY UNITS
##FACTOR=    0.220516191357247, 1,           1
##FIRST=     3113.93859727119, 0,            0
##LAST=      -498.77816573459, 0,            0
##MIN=       -498.77816573459, -701277,      0
##MAX=       3113.93859727119, 269061619,    0
$$ Real data points
##PAGE= N=1
##DATA TABLE= (X++(R..R)), XYDATA
$$ [...]
7555A49929j11942j55678J44671j19552j19580l8800P4860j25014J5081K45077
7545d0948k89719Q3113Q478N9724j7050J8356Q851J08512N7570J34000n1175j26546
7533d6834k38736j66796J7055j6043L70678r5618j18910n7790J52205J59020J88478
7522A46709J7614L0860j57310k05898n9367m1905n3193J90641M5758k9457K14838
7511I9290j70616j3383J10179j26354M9587J99266k46309L35113k82951m15362
7501d61540N14444n6383j44705j24330o680O2704j10419R5450J28404Q7677r7480
7490a12858O2516m513n1832j44297j246Q7947M715M5956J63050J8210j21076j21696
7478a75124Q1823k20346K2330N3399r1289M31456j07242j17341o8733J20343q6203
$$ plain form
7555 149929 37987 -117691 26980 -92572 -212152 -250952 -176092 -301106 -286025 -40948
7545 -40948 -330667 -247554 -239076 -179352 -196402 -178046 -169195 -60683 -3113 130887 79712 -46834
7533 -46834 -285570 -452366 -435311 -451354 -80676 -176294 -295204 -352994 -200789 -41769 146709
7522 146709 164323 195183 37873 -168025 -227392 -269297 -322490 -131849 -86091 -115548 99290
7511 99290 -71326 -84709 25470 -100884 -51297 147969 -98340 236773 -46178 -461540
7501 -461540 52904 -3479 -148184 -272514 -279194 -216490 -326909 -231459 -103055 -15378 -112858
7490 -112858 -50342 -54855 -106687 -250984 -252230 -164283 -159568 -113612 49438 67648 -53428 -175124
7478 -175124 -93301 -313647 -291317 -237918 -329207 102249 -4993 -122334 -191067 -70724 -156927
7467a56927P2311j2822r1140Q3861J06043p7018J28728r3511j57292p8644m8880
7456c25291K17494L91416m0266j04342j54258k88743K2534j10796j23269P0187
7446d45334K29832l3902o3727J95727J06974l3769p9121O78n6951L24758J19065
7435B64230o8846m1980j52417j74395m0872J954l9817j02153N3406K41760J63878
7424A04748j6954r5627J22432j83698r9107q0052N8484j06389J40147M05280n6926
7413A92338k08717N2080J00971l10259k17787J24380k60192J6432J19936K80073
7403a10745M8281k012n379J6299k90048J0502o5296K714n423p3200K19239J91227
7391f3841k07064J87196n1922j85841J9328k23406J06003p3610L89201K26355
$$ plain form
7467 -156927 -84616 -97438 -188578 -104717 1326 -75692 53036 -40475 -197767 -276411 -325291
7456 -325291 -107797 283619 243353 139011 -15247 -303990 -281456 -392252 -515521 -445334
7446 -445334 -215502 -249404 -313131 -117404 -10430 -44199 -123320 -122642 -179593 145165 264230
7435 264230 195384 153404 987 -173408 -214280 -212326 -252143 -354296 -300890 -59130 104748
7424 104748 87794 -7833 114599 -69099 -168206 -248258 -189774 -296163 -156016 249264 192338
7413 192338 -16379 35701 136672 -173587 -391374 -266994 -527186 -510754 -390818 -110745
7403 -110745 -62464 -64476 -69855 -53556 -343604 -333102 -398398 -395684 -401107 -474307 -255068 -63841
7391 -63841 -270905 -83709 -135631 -321472 -302144 -525550 -419547 -493157 -103956 122399
7381A22399k26370j72404J06542J93834P2223J09793j81636j43380j21426j31168
7371c71593J46898o4721O453n5038K03975q8913j0688J07086j03030j76182P8730
7360c27023L36956L6694j62151O468R4616j2258k7445j85212J58598R8366k14416
7349a96807J52114J84814O1952N9058l45564L0704m5994J08848k28078p4952J61808
7338a32097q3469k50379N3351J83292k98194K20701Q2190J63190J45157m3644
7328D0098j99056N1742O0512R4600N4771n6369k09550o6163M5508J88330N2786
7317E7209O0278j61629j42817L03971q4841k07323J59259j51829N9449J87037
7307G8764j4888k9749M6527K08233r7547j54718j04664r449q0880J19722r5557
$$ plain form
7381 122399 -103971 -276375 -169833 24001 96224 206017 24381 -118999 -240425 -371593
7371 -371593 -224695 -289416 -282963 -338001 -134026 -222939 -233627 -126541 -229571 -405753 -327023
7360 -327023 9933 46627 -115524 -109056 -14440 -26698 -54143 -239355 -80757 17609 -196807
7349 -196807 -44693 140121 202073 261131 -84433 -53729 -99723 9125 -218953 -293905 -132097
7338 -132097 -215566 -465945 -412594 -229302 -527496 -306795 -224605 -61415 83742 40098
7328 40098 -158958 -107216 -46704 47896 102667 46298 -163252 -229415 -183907 4423 57209
7317 57209 117487 -44142 -186959 117012 32171 -175152 -15893 -167722 -108273 78764
7307 78764 63876 34127 80654 288887 191340 36622 -68042 -77491 -158371 -38649 -134206
7296a34206j9062K8766l7025K774j5008P9967j04753J6859J3188M1078k56466
7285c83888M24952K49933j32427r2292N7814j28991j14909L5250J68280J4381
7275I8103j38938L5902p7237j66956Q425o8664R6537K52104P4729k03174j19026
7264b08195j51514J45363J66367k39323J38821l6195l01484M6907J74088K0528
7254b44637j569p1402J62721k56757P7032Q5533J76295k50766O4807N6519J80343
7243b1881j34782M8511K30931n3379m8042L7996J25826j90329j87403M4604L4020
7232a13928q7019J31647k04793P7120K16539j93045j93061J05948J99403k57150
7222c18339J74354l393K71441o9218l0141j30828j89808J21077K91087q0726j28171
$$ plain form
7296 -134206 -153268 -124502 -161527 -158753 -173761 -93794 -198547 -181688 -168500 -127422 -383888
7285 -383888 41064 290997 158570 66278 124092 -4899 -119808 -84558 83722 98103
7275 98103 -40835 -4933 -82170 -249126 -240701 -309365 -212828 39276 114005 -89169 -208195
7264 -208195 -359709 -214346 -47979 -287302 -148481 -184676 -486160 -439253 -265165 -244637
7254 -244637 -246206 -317608 -154887 -411644 -334612 -249079 -72784 -323550 -258743 -202224 -21881
7243 -21881 -156663 -108152 122779 69400 21358 59354 185180 -5149 -192552 -147948 -113928
7232 -113928 -200947 -69300 -274093 -196973 19566 -173479 -366540 -260592 -61189 -318339
7222 -318339 -143985 -147378 124063 54845 24704 -106124 -295932 -174855 116232 35506 -92665
7211i2665M9890j48689P2200O6392J15366r1918l303q6167j01758m9676R3749
7200a76579J48328K35739l07902J0932j9160K32085q5048j18499Q859L6549O4847
7189C0151j80829p8245L0886J63096j1014R8258j4798M0942L3112N8067o6339
7178A03287J17355Q7552k00149J21229j48551m3320j62163l1693j75109m3705
7168c75267J27849K12097J02970o7789o6467l9012L5934l5973J68741J30998r5609
7157I8472j75576j42793K9054l3091j7375m1705k0231K8001Q5240J31465j17267
7146a75806j20776J42251J32232L0657l6347L8223j05252k09806N2053J30649
7136a21922J30592p9048k450q3456o9442K61179R3293j94213k08898J17601J53203
$$ plain form
7211 -92665 -42775 -191464 -119264 -52872 62494 -29424 -32727 -118894 -220652 -270328 -176579
7200 -176579 -28251 207488 -100414 -89482 -108642 123443 38395 -80104 -71245 -34696 30151
7189 30151 -150678 -228923 -198037 -34941 -45955 52303 37505 78447 111559 169626 103287
7178 103287 220642 308194 108045 229274 80723 37403 -124760 -156453 -331562 -375267
7168 -375267 -247418 -35321 67649 -140 -66607 -105619 -69685 -105658 63083 194081 98472
7157 98472 -77104 -219897 -190843 -223934 -241309 -283014 -303245 -275244 -190004 -58539 -175806
7146 -175806 -296582 -154331 -22099 8558 -27789 10434 -94818 -304624 -252571 -121922
7136 -121922 8670 -70378 -72828 -156284 -225726 35453 128746 -65467 -274365 -156764 -3561
7125c561K3260Q8419j15946p5644L4758k7817L5515J49971J56487L3036j57094
7114A41384j1446K10253l55985n7610r3572O562J67872j29740J89451L5033o9399
7103C2803k32508K48532j33778L27695J07522q7561J61854n3845l33121J04380
7093A41973K53476k6362O643r9829J01843l42472j26277N8479L41253n5401j65511
7082H7815l99134j14674J29200K35526J90719k5065j54959l5699O3420m7321q2375
7071a52547L3344L5516j44184j42997L9358M27371J71234j40485j81954P4239
7061A8895k30641p4861q5225J22400L21514K7818N4844m1478r0018q3427p4839
7050a35018K68955j68052L5813j43513J54204K8940O3811j51632J3301j66250
$$ plain form
7125 -3561 19699 108118 -7828 -83472 -48714 -76531 -41016 108955 265442 298478 141384
7114 141384 129938 340191 -15794 -73404 -166976 -160414 7458 -122282 67169 102202 32803
7103 32803 -199705 48827 -84951 242744 350266 262705 424559 370714 37593 141973
7093 141973 395449 369087 375730 275901 377744 35272 -91005 -32526 308727 253326 87815
7082 87815 -311319 -425993 -296793 -61267 129452 104387 -50572 -86271 -22851 -70172 -152547
7071 -152547 -119203 -83687 -227871 -370868 -331510 95861 267095 126610 -55344 18895
7061 18895 -211746 -286607 -371832 -249432 72082 99900 154744 113266 23248 -60179 -135018
7050 -135018 133937 -34115 1698 -141815 12389 41329 105140 -46492 -33191 -199441
7040a99441j70402L15913N7457J906J58200M094j33116K18518k23295l1690J29664
7029A27808j88786J35809k8523j18451j3413P1754J01995q2405p0155k5147p4164
7018a63678p4943O9302K06728K59808m6295j29375r0717j8248l9662J42272j61139
7007d5947m2855N6396K04924j12266k27091p754J21991l9257k6284J49092q040
6996B2909j69840Q4408J55803N7624j32012R183j73233R9529o4412J3321J58263
6985F1543o2968M1617J97316P7149k42283j27129L7717K961J58075j30283r3894
6974h0179O0215N8337J91311r7239k42411J33607L24402j79069k25729j89398
6964b46153n6762K53419l0151M9797M1977p5680j13557M1550m0064L9574p2547
$$ plain form
7040 -199441 -369843 -53930 3527 5433 163633 167727 34611 253129 29834 -1856 127808
7029 127808 -60978 74831 46308 -72143 -85556 -13802 88193 5788 -64367 -89514 -163678
7018 -163678 -238621 -169319 37409 297217 250922 121547 30830 12582 -27080 115192 -45947
7007 -45947 -88802 -32406 172518 60252 -166839 -174593 -52602 -91859 -118143 30949 22909
6996 22909 -146931 -62523 93280 150904 18892 28075 -145158 -45629 -110041 -96720 61543
6985 61543 -1425 40192 237508 314657 72374 -54755 -17038 -14077 143998 13715 -80179
6974 -80179 -19964 38373 229684 132445 -109966 23641 348043 168974 -56755 -246153
6964 -246153 -302915 -49496 -79647 -29850 12127 -63553 -177110 -135560 -175624 -136050 -208597
6953b08597j12237J6500J56916M5959m8414J47169J30501J5477l24940p9608R8651
6942a62623J94039Q868l85171J98175J42052r8833M4842j69555O2634M7020K5105
6931i3447J1315p3156r2768N0769o473o0066J01006m602l23191p7659N4214L18783
6919a95275R4768n8404j3528R5840n2507j2627j47944J8786P1757M0990L6746
6908a21398j55160l2898R2437j27831K95830K29090J57999l25171l07212K7040
6898b67274J74126J31522L9241Q7457j08814j84910k1543L51412P3157K0164j13697
6887A80841M4559l16163j9582K32158o931M6985P3907j10949k11285O7617J08646
6876H9803K00187m0453j53445l9557J98930r0333r3996J3945J53964N2430j7327
$$ plain form
6953 -208597 -320834 -304334 -147418 -101459 -149873 -2704 127797 143274 -181666 -261274 -162623
6942 -162623 31416 40284 -344887 -146712 -4660 -103493 -58651 -228206 -165572 -118552 -93447
6931 -93447 -82132 -155288 -248056 -197287 -203760 -263826 -162820 -167422 -490613 -568272 -514058 -195275
6919 -195275 -100507 -158911 -172439 -76599 -129106 -141733 -289677 -270891 -199134 -158144 -121398
6908 -121398 -276558 -309456 -217019 -344850 -49020 180070 338069 12898 -294314 -267274
6898 -267274 -93148 38374 77615 165072 56258 -128652 -150195 201217 274374 294538 180841
6887 180841 225400 -90763 -110345 121813 114882 161867 235774 124825 -86460 -18843 89803
6876 89803 289990 249537 96092 56535 255465 165132 71136 85081 239045 291475 274148
6865B74148k66858j35017K43122j83195j971j6875j27171K13507R6565k87206
6855a90951J69452J63061j62530J86243J24847j59876k06323k02706j3464O7468
6845b24779J15829n3998K23686n8726K51r6375q2691M2501J77762J47928m6566
6834A44822K13559p8815k68657j81885J47921K5144L49967k23643M1239o6647
6824A03005n8969N044j24026r0234J12365P3272q2039K7976m2748L668j5564M1645
6812d6605p1202J62133k30413J34871K17655o5221k08569K7333K36165k23594
6802f7447k6467O7421Q5212q0857J4822k1755k20389K13849Q1952K71292J690
6791C19323O3560k06361J99052o9190l45782m4602J14297J32952K22829N8479
$$ plain form
6865 274148 7290 -127727 115395 -67800 -69771 -86646 -213817 -310 96255 -190951
6855 -190951 -21499 141562 -20968 165275 290122 130246 -76077 -278783 -292247 -224779
6845 -224779 -108950 -162948 60738 2012 2263 -94112 -176803 -134302 43460 191388 144822
6834 144822 358381 279566 10909 -170976 -23055 2089 352056 128413 169652 103005
6824 103005 44036 49080 -74946 -165180 -52815 20457 -61582 -33606 -76354 -72686 -88250 -46605
6812 -46605 -117807 44326 -186087 -51216 166439 101218 -107351 -80018 156147 -67447
6802 -67447 -93914 -26493 58719 -22138 -7316 -29071 -249460 -35611 46341 317633 319323
6791 319323 382883 176522 375574 306384 -39398 -84000 30297 163249 386078 444557
6781D44557k5509j63640J02573r6407m67741j24663L15768K08671k5039j65468
6771C102j14479o092J60043j46737L66514J32602j72598j71686q170j52151j51652
6760b61304L49313J54423R7723j99937k26370k6738J3253J43493J13447q8261
6750F9042J57248J8127J19360k54376m4762J04277j06987M6104N5902j35273o927
6739B1735p8320N5657J38149j0562K1481K18563R5645o7877j64850K25887j53525
6728C01983k6499j74550P1026J60778o1433J07797j82345J35226J6036j57724
6718A90295J49929J37222r0267j96278k17431j23326K30175k18111J56099J71956
6708A90263r5478j27797j41034J49195k1793Q1953K27579J41066k67952j3749
$$ plain form
6781 444557 419048 255408 357981 261574 -206167 -330830 -15062 193609 168570 3102
6771 3102 -111377 -117469 42574 -104163 262351 394953 222355 50669 42499 -109652 -261304
6760 -261304 88009 242432 340155 140218 -86152 -112890 -99637 43856 157303 69042
6750 69042 226290 244417 363777 109401 64639 168916 61929 108033 163935 28662 21735
6739 21735 -56585 -928 137221 126659 148140 366703 462348 394471 229621 455508 301983
6728 301983 275484 100934 171960 332738 271305 379102 196757 331983 348019 190295
6718 190295 340224 477446 387179 190901 -26530 -149856 80319 -137792 18307 190263
6708 190263 94785 -33012 -174046 -24851 -46644 35309 262888 403954 136002 122253
6698A22253J82045j09776J53888j67927j61726J37942k4243J67108p8501j71136
6688D9927J51760Q6460J24104j22751k17749J73944R1727j99960k15060J13177
6678C5579K03348k55546K11536J16949j13665J9376q1493j36797N8152J12777
6668A70216N8013J31893r2707l223k5253j7663O9984R3479j58539l41775J9046
6657i6529O0688j661J91324P4600J30318N0980j26630K4809N2105k97240Q4623
6646A47387L25647n6412r9242p8741J27502o0577j28599L2835m6799Q7398L3610
6635B84009k17792K58682K11873r6366n04740Q397J83807q0762q270J35364J66725
6624C40927k44742P2161j52206k2803K27124N5943j75596K8593J15429J54126
$$ plain form
6698 122253 304298 194522 348410 180483 18757 156699 132456 299564 221063 49927
6688 49927 201687 288147 412251 289500 71751 245695 337422 137462 -77598 35579
6678 35579 238927 -16619 194917 311866 198201 217577 136084 -713 57439 170216
6668 170216 228229 360122 267415 264192 238939 221276 291260 384739 226200 -115575 -96529
6657 -96529 -35841 -37502 153822 228422 358740 409720 283090 307899 360004 62764 147387
6646 147387 473034 416622 317380 238639 366141 305564 176965 209800 163001 250399 284009
6635 284009 66217 324899 536772 440406 -64334 -55937 127870 47108 38838 174202 340927
6624 340927 96185 168346 16140 -6663 220461 276404 100808 129401 244830 398956
6614C98956j32119l7705J40742j74982q1862J60226O5363n3592l63536k7765k9582
6603a35856J2405M7231l8979J54226K54466l5721j58264K29743Q4269n2760n6757
6592C04003j701M7825J36948n1348j22272Q3143l34174j22453N4523Q8037k14018
6581a31487J11099K91911Q8870r2152J05479p8571k8613O5840K52717N5796L8449
6570F79338o6016p7825j97842j83762J78064J01420p5622K2169J3107j68080n874
6559B19077m0960J24283J50388L2606j09339J50809j38769J8087O2852k9612J72147
6548F11569J19829j9340O4869k59394k81238R499N9669L05951J3849r343m2370
6537E73550j72685l8059K17738J1165j28115J77738k63325r788J8731J22621j88472
$$ plain form
6614 398956 266837 229132 369874 194892 113030 273256 338619 285027 -78509 -106274 -135856
6603 -135856 -123451 -76220 -115199 39027 293493 257772 99508 329251 413520 360760 304003
6592 304003 302302 350127 487075 435727 313455 396598 62424 -60029 -5506 82531 -131487
6581 -131487 -20388 271523 360393 268241 373720 295149 266536 332376 585093 640889 679338
6570 679338 613322 535497 337655 153893 331957 433377 357755 379924 393031 224951 219077
6559 219077 178117 302400 452788 485394 376055 526864 388095 406182 469034 439422 611569
6548 611569 731398 712058 776927 517533 236295 245794 305463 611414 625263 615920 573550
6537 573550 400865 362806 580544 591709 463594 641332 378007 368219 386950 509571 321099
6526C21099k02870n0706K31562L4303R1042o1776n8600J22523l7909K44144J27764
6515G60576l79829m6754L34183J4202k59627j3539J02908J855J16993n0339K0454
6504F01083j64041K6813K06261l6964Q6942j11877o6841r0938K36528J9319p2041
6493F34244J58768O4811J05214o5635j6041k77976K7590k994K27471M47861j79391
6482A123922j14364l6571P4147J08936R0994p3321J66329J23056q9832o3310J06234
6471A416220L37562M0410l3268J05615j60922j71737M4519K16024Q4242j2799
6461A865866J30905K47610J37670k28365K09946N6198J82429k035m7179J0141
6451B563186j0123J56426L09306J74705K27256j42033q1855M50090J11463M39028
$$ plain form
6526 321099 118229 67523 299085 333388 424430 362654 304054 426577 388668 632812 760576
6515 760576 380747 333993 668176 682378 422751 409212 512120 513975 630968 580629 601083
6504 601083 437042 463855 670116 633152 720094 608217 541376 450438 686966 706285 634244
6493 634244 793012 857823 963037 897402 881361 603385 630975 627981 855452 1303313 1123922
6482 1123922 1009558 972987 1047134 1156070 1247064 1173743 1340072 1463128 1373296 1309986 1416220
6471 1416220 1753782 1794192 1760924 1866539 1705617 1533880 1578399 1794423 1878665 1865866
6461 1865866 1996771 2244381 2382051 2153686 2363632 2419830 2602259 2600224 2553045 2563186
6451 2563186 2553063 2709489 3018795 3193500 3420756 3278723 3196868 3646958 3758421 4197449
6441D197449Q2462J68950J57056J51120R7914N06560M06541j25425L53349L02089
6431F298065K09793M61158K08659K88225J73605K68364J69493N0896J85144r9081
6421H214321M2571K74679P0777l73866j15242M5150M6561k65921m71887n52565
6411F914578j15565m05777k34584k38211k71397m04002l35934j56673j21998k07157
6401D423280o9496R4229k09252k29444o42556J66424j46064l07064p5395j56405
6391B848257r9880k52830l2103k02763k1409j62669Q4082J20322o8295k70865
6381A941847M0985j57667O7443R6050l38807R9167l096m7272m4789o2420j26182
6370A465259j84498J57228R1823r4477j85286j13614L6172k12530j6686l227J2096
$$ plain form
6441 4197449 4279911 4448861 4605917 4757037 4854951 5361511 5768052 5642627 5995976 6298065
6431 6298065 6507858 6969016 7177675 7465900 7639505 7907869 8077362 8128258 8313402 8214321
6421 8214321 8256892 8531571 8602348 8228482 8113240 8158390 8204951 7939030 7467143 6914578
6411 6914578 6799013 6393236 6158652 5920441 5649044 5245042 4909108 4752435 4630437 4423280
6401 4423280 4353784 4448013 4238761 4009317 3366761 3533185 3387121 3080057 3004662 2848257
6391 2848257 2748377 2495547 2463444 2260681 2239272 2076603 2160685 2281007 2212712 1941847
6381 1941847 1982832 1825165 1892608 1988658 1649851 1749018 1745922 1698650 1653861 1591441 1465259
6370 1465259 1280761 1437989 1529812 1435335 1250049 1136435 1172607 960077 943391 940164 952260
6359I52260j25974J21469j5208M9277n0237k06075K33092m7395K6016q6204Q1522
6348I32543J51639J62786l84502M8127p9700j94106M18474J68498j88538j97965
6338H37256J5030j04780j65459M4681J315p8193j07317J66666Q4110j79757R9808
6327F13360j6564n2608l02212J47632n7871j66716j69555L8359L97990J46652
6317E78467J97804N7461O6916k08954l58744O4555m0727J19014K81631K88834
6307A046257k05021l04475K7129K71164p361l41662N5922l6459o3926p3909J43017
6296E10676L8133q2114K5793K20164j00311j05035K47792j79864n0409l8498L8063
6285E24390k6161J41929j41547J3766L0060k9797p9257J70997J93151O8710L6952
$$ plain form
6359 952260 826286 947755 932547 981824 931587 725512 958604 911209 937225 851021 932543
6348 932543 1084182 1246968 862466 910593 830893 636787 1055261 1223759 1035221 837256
6338 837256 852286 747506 582047 626728 628043 549850 442533 609199 693309 513552 613360
6327 613360 596796 544188 241976 389608 331737 165021 -4534 33825 431815 578467
6317 578467 776271 833732 900648 691694 332950 397505 356778 475792 757423 1046257
6307 1046257 841236 536761 563890 835054 827693 486031 541953 505494 441568 367659 510676
6296 510676 548809 466695 492488 712652 612341 507306 755098 575234 524825 486327 524390
6285 524390 498229 640158 498611 512377 542437 512640 433383 604380 797531 866241 903193
6274I03193j21452k54133J22411M0706k30226J56673k05518o1909K8947J05595
6264D84287j71566l04406K14775K83030j56072k05458J74062Q7189j02650o332
6254B96859L32043j26573l08139J85687k29950J724K04531j36926J41279j17103
6244B43432j46393K12861J14124O0513K763p016J09142k83544r990J92871O837
6233D95600j93688O0281J55597q4421q1620j03564j1822R9524J56570j6216q8444
6222C87797n022N6027M4164j29845k337P7560j23331k3837J65799L6223j43534
6211C39664J34989J49876K60490m6798l41513k21969M17950K93918l16190l4219
6201F36198K22784j86827j78611R6839Q7827l7866l04214o7933J21346P2270J61062
$$ plain form
6274 903193 781741 527608 650019 690725 460499 617172 411654 349745 378692 484287
6264 484287 312721 8315 223090 506120 350048 144590 318652 405841 303191 296859
6254 296859 628902 502329 194190 379877 149927 151651 356182 219256 360535 243432
6244 243432 97039 309900 424024 484537 487300 480284 589426 305882 295892 488763 495600
6233 495600 301912 362193 517790 433369 351749 248185 236363 335887 492457 476241 387797
6222 387797 382775 438802 482966 353121 350784 428344 305013 281176 446975 483198 339664
6211 339664 474653 624529 885019 838221 496708 274739 692689 986607 670417 636198
6201 636198 858982 672155 493544 590383 678210 640344 336130 268197 389543 461813 622875
6190F22875k49743J38240j55974q4799P603K40197R5968k27600j3933K10124M7031
6179F29989k42441J93183K15027j1900j51630l16380k70236K59672R9835j66208
6169B38911p6258K47031R2483k8551N1916J04229j40793j38196L52272l7591J29962
6158G95415P3456l1836k48320M2863Q7973k80150o5973K21479J06730m19403K720
6147B84954K41886J04755J32662l21632j3585J76614P1458L8521k44916q385Q259
6136D70591J10125p1982J66123m7286P7188R8058p3940o7944k47745k23683K34963
6125D24468K97054r4952j8632j54089J28340J13697J744P700j32847j03612k2303
6114D46568j47882P8068R3578J20193j8381j3318J23540j11901N8393K9943o080
$$ plain form
6190 622875 373132 511372 355398 270599 278202 518399 614367 386767 372834 582958 629989
6179 629989 387548 580731 795758 783858 632228 315848 45612 305284 405119 238911
6169 238911 162653 409684 502167 473616 525532 629761 488968 350772 703044 665453 795415
6158 795415 868871 837035 588715 631578 719551 439401 373428 594907 701637 282234 284954
6147 284954 526840 631595 764257 442625 429040 605654 677112 715633 470717 462332 470591
6136 470591 580716 508734 674857 627571 704759 802817 728877 660933 413188 189505 424468
6125 424468 721522 626570 607938 453849 582189 695886 697630 705330 572483 468871 446568
6114 446568 298686 376754 470332 590525 572144 558826 682366 570465 628858 658801 652721
6103F52721q9226Q7303j88315Q174J13145J02300j22102m9568j54233J69568L900
6092E33667K36210K41702k28103l9867J67365p3930L1130K51044m30796J11871
6082H00293L1320m6783k99406K4387L64601j24418p270n4745j45760K6262J97448
6071G65929J51607j4612k52991p3772J97907Q8316L7603M2960j31282J31672K78686
6060A222023j45377r3330q7354R2391M7502R5634k9442k56428k02860j5359k5181
6049F02219p7616J82942J95537L574k49634j83494L6014K18977N2405J44889j60667
6038G65146k28333P8125L11894J74906j12543K09462M9043j90803k85736n195
6028G65966j27228K20785q085r4465J01109m5794o0597R8707L3931K40525r9745
$$ plain form
6103 652721 563495 650798 462483 470657 583802 686102 564000 514432 360199 529767 533667
6092 533667 769877 1011579 783476 743609 910974 837044 868174 1119218 688422 800293
6082 800293 831613 784830 485424 509811 874412 749994 742724 687979 542219 568481 765929
6071 765929 917536 902924 649933 576161 774068 862384 899987 942947 811665 943337 1222023
6060 1222023 1076646 983316 895962 988353 1035855 1131489 1102047 845619 642759 627400 602219
6049 602219 524603 707545 903082 906656 657022 473528 509542 728519 780924 925813 765146
6038 765146 536813 614938 926832 1101738 989195 1198657 1247700 1056897 771161 765966
6028 765966 638738 859523 851438 756973 858082 812288 751691 850398 884329 1124854 1025109
6017A025109j23574J06730j10941j74703J27617O3961j87344J54124K86457j59816
6007A007620j68000J73821o5032r318j97031o6232N6528K89185j25434n1700J88887
5996A033294j3643j32036K33293k15786J21980j37224k81776Q9005j779j42648
5986E52680K35778Q8302k4918R4982j30363O8720R3652j62183J53839n545K4206
5975I89150k54426L7800P5022j93781J1716J91299N7457j15680n307J38109J54875
5964A086234o1401o1591p2172m389k04438K29221n5760m8570J69518R9971m30214
5953F46409J48196K38140j32134L0157K08488K3625j19207J05171L11204p451
5943A452598r2618j01636N52J62532j79135p9975J22437k1930j03070R8051J02906
$$ plain form
6017 1025109 901535 1008265 897324 722621 850238 914199 726855 880979 1167436 1007620
6007 1007620 839620 1013441 948409 939091 742060 675828 732356 1021541 896107 844407 1033294
5996 1033294 1019651 887615 1120908 905122 1027102 889878 608102 697107 695328 552680
5986 552680 788458 876760 851842 946824 816461 885181 978833 816650 970489 964944 989150
5975 989150 734724 772524 847546 653765 665481 856780 914237 798557 793250 931359 1086234
5964 1086234 1024833 963242 891070 886681 682243 911464 855704 807134 976652 1076623 646409
5953 646409 794605 1032745 900611 930768 1139256 1162881 1043674 1148845 1460049 1452598
5943 1452598 1359980 1258344 1258896 1421428 1242293 1162318 1284755 1262825 1159755 1257806 1360712
5932A360712j88880j66770N2130N6565J44787J94283k38591K61357J7064k50372
5922A242285j03932J74661l10241J33933k33992O1738K49775m7583m8955q1101
5912A036588l6000R741J20923J88232j21344Q2916J87707p0709J5586j86013K26746
5901A454373J89235K2936N4792q5339k91007P2393l7868L348m5438J09102j14768
5890A331759k00457L3229J54429K07880l32914L0816M68786m0358l01584j00615
5880A250971J57708J27707L27989r1105l6499k30416j05365K66520j10867q5989
5870A470654l8275K94757N0869M5295N8720k41948O2179k05378J00433P4248p5389
5859A596165k79479k997L854J00227J26355m3243J07106J40130r1801q3774R7159
$$ plain form
5932 1360712 1171832 1005062 1057192 1113757 1258544 1452827 1214236 1475593 1492657 1242285
5922 1242285 1138353 1313014 1002773 1136706 902714 964452 1214227 1166644 1117689 1036588
5912 1036588 1000588 1010329 1131252 1319484 1198140 1281056 1468763 1398054 1413640 1227627 1454373
5901 1454373 1643608 1666544 1721336 1635997 1344990 1417383 1379515 1382863 1337425 1446527 1331759
5890 1331759 1131302 1164531 1318960 1526840 1193926 1224742 1693528 1653170 1351586 1250971
5880 1250971 1408679 1536386 1864375 1773270 1736771 1506355 1400990 1667510 1556643 1470654
5870 1470654 1432379 1727136 1778005 1823300 1882020 1640072 1702251 1496873 1597306 1671554 1596165
5859 1596165 1316686 1313689 1317543 1417770 1544125 1500882 1607988 1748118 1656317 1572543 1669702
5848A669702J07067L8187m1957J53382J97035Q9097N0809k82251M1830P1021j81520
5837A912402p9159R7032K36711r9965K50093N5198j39988M6810p4576R5332j03174
5826B196716l82277J28602L13424k63257J43669k86636P8550j25914J0223j2056
5816A801044j43904L7365j73722K76744K48441k8327p8725J34249P6930J00935
5806B251030j76345J53505N8602o2174J40462l57898j9641Q8849J27408k64644
5796A939154M4399J91775K52008J59494m583Q9372J18048J39046m7858j50575
5786B730280N8048J48837L7256M9078l03085M5675j01196K03310j8857N1981k58147
5775B643180O9345L5458N4215j31516J16578M5091L19289j86177l60543J69470
$$ plain form
5848 1669702 1776769 1814956 1772999 1926381 2123416 2212513 2263322 1981071 2022901 2093922 1912402
5837 1912402 1833243 1930275 2166986 2067021 2317114 2372312 2232324 2279134 2204558 2299890 2196716
5826 2196716 1814439 1943041 2256465 1993208 2136877 1850241 1928791 1802877 1813100 1801044
5816 1801044 1657140 1694505 1520783 1797527 2045968 2017641 1938916 2073165 2150095 2251030
5806 2251030 2074685 2228190 2286792 2224618 2365080 2007182 1987541 2076390 2203798 1939154
5796 1939154 1983553 2175328 2427336 2586830 2582247 2671619 2789667 2928713 2880855 2730280
5786 2730280 2788328 2937165 2974421 3023499 2720414 2766089 2664893 2868203 2849346 2901327 2643180
5775 2643180 2712525 2747983 2802198 2670682 2787260 2832351 3151640 2965463 2604920 2774390
5765B774390K69964j23859o9202k69236l38017K26774N4031l6370K28640Q1114
5755B798229R656j50944R5696J7273l65197O3506q8901o906j14810K77232K53968
5744B788802m8592l21563R8471J2080N3204l8540o9375N4713Q1713m8686k32971
5733B329256J12563M8630l3789K41044J8183j51512P9635J6073J13361k95103
5723B478341J0752j46674K2617j14394K01635K95159O0665K44328l11754j55532
5713B585143J78628j0860j37624k9777j3314R3815k8314J71368N634j114J59000
5702B972585J33860j96784p8657j7123J61024K97083M5216R428n3650k80916k59851
5691B732215L5442M23293K56937j08972k8924k43475L16347j2014j48209K34087
$$ plain form
5765 2774390 3044354 2920495 2851293 2582057 2244040 2470814 2524845 2488475 2717115 2798229
5755 2798229 2807885 2656941 2752637 2769910 2404713 2468219 2379318 2372412 2257602 2534834 2788802
5744 2788802 2740210 2418647 2517118 2529198 2582402 2543862 2474487 2529200 2610913 2562227 2329256
5733 2329256 2441819 2490449 2456660 2697704 2715887 2564375 2644010 2660083 2773444 2478341
5723 2478341 2489093 2342419 2365036 2250642 2452277 2747436 2808101 3052429 2740675 2585143
5713 2585143 2763771 2752911 2615287 2585510 2572196 2666011 2637697 2809065 2814699 2813585 2972585
5702 2972585 3106445 2909661 2831004 2813881 2974905 3271988 3317204 3326632 3272982 2992066 2732215
5691 2732215 2767657 3190950 3447887 3338915 3309991 3066516 3382863 3370849 3222640 3456727
5681C456727L22160m2979o1427J56396j25990Q9958J55205o5424j73539M5312
5671C756399J53793J68221j15897M2474n1425K84800P2658k3184J7349J24155
5661D429343J97980K10756Q9254m7647J93363k8855j51466K80815J94376J25169
5651E493088k01628M550K83988Q0798j87966M9962L42647J34712K40722O6931
5641F307804L7185J7108J30454L6003J04092J09672j09797R4119J73921p1767
5631F828794P0430J72253K7830J51330k6108M26005L65304j04061n6293p5907
5621G779577J87909K76143M00318L49628r1102l0363J23810K11035R256M61598
5611I677809L26040p3823J92322N23609Q86Q152K74139J65936l7260K12337L70641
$$ plain form
5681 3456727 3778887 3735908 3674481 3830877 3704887 3794845 3950050 3884626 3711087 3756399
5671 3756399 3910192 4078413 3962516 4004990 3953565 4238365 4311023 4287839 4305188 4429343
5661 4429343 4627323 4838079 4927333 4879686 5073049 5044194 4892728 5173543 5367919 5493088
5651 5493088 5291460 5296010 5579998 5660796 5472830 5522792 5865439 6000151 6240873 6307804
5641 6307804 6344989 6362097 6492551 6528554 6632646 6742318 6632521 6726640 6900561 6828794
5631 6828794 6899224 7071477 7099307 7250637 7224529 7650534 8015838 7911777 7855484 7779577
5621 7779577 7967486 8243629 8643947 8993575 8902473 8872110 8995920 9206955 9216211 9677809
5611 9677809 10003849 9930026 10122348 10645957 10646843 10654995 10929134 11095070 11057810 11270147 11640788
5600A1640788l9673L58477J02228J33026L25145M09375J61978K21006K93759M97792
5590A4103901L44437N2800N77418K11272P8714M87883M23120L13888L59822O17201
5580A7570456M22361N58299K99356Q67192P06791P53322O13784O74365O34405
5571B3100331P83179N48154J080940J110773Q73970Q77588Q74900J007045J124182
5562C1381062J021119J084496J079007P67858J339701J229419J233579J116850
5554D0253091J388287J397724J799245J824719K174094K180465K127251K520750
5546E5665626L295184L567319L622764M226204M478464N005148N410701N812384
5538I1083794N998806O244663O365178O499342O579214O023179N234068M662443
$$ plain form
5600 11640788 11601115 11959592 12061820 12194846 12519991 12929366 13091344 13312350 13606109 14103901
5590 14103901 14448338 14501138 15078556 15289828 15368542 15856425 16279545 16593433 16953255 17570456
5580 17570456 17992817 18551116 18850472 19717664 20424455 21177777 21791561 22465926 23100331
5571 23100331 23883510 24431664 25512604 26623377 27497347 28374935 29249835 30256880 31381062
5562 31381062 32402181 33486677 34565684 35333542 36673243 37902662 39136241 40253091
5554 40253091 41641378 43039102 44838347 46663066 48837160 51017625 53144876 55665626
5546 55665626 58960810 62528129 66150893 70377097 74855561 79860709 85271410 91083794
5538 91083794 97082600 103327263 109692441 116191783 122770997 128794176 134028244 138690687
5530A38690687L710460K165358Q11774m26954k022250l377373m575099n618338
5522A29358265o331388o624955o334856o822083o712506o847343o244979n805377
5514G7634778n291589n390878m828694m164251l776706l520833l135622l262394
5506D4263811k465939k390742k420333j674406j566725j783332j541159j352720
5498B9068455j439091j072264j182391j131194r32802m08146r35179p31323n75931
5489B0660134q46827q09065n62554n51077n25856m49234k05156n56788l76813
5480A5776764k95410j83168p51733j46731r8158l45830j21843q9355l01856q1953
5470A3360727k46963l14213l50253l39481j1061J06182O682l72494l46173j61206
$$ plain form
5530 138690687 142401147 144566505 145378279 144951325 142929075 139551702 134976603 129358265
5522 129358265 123026877 116401922 110067066 103244983 96532477 89685134 83440155 77634778
5514 77634778 72343189 66952311 62123617 57959366 54182660 50661827 47526205 44263811
5506 44263811 41797872 39407130 36986797 35312391 33745666 31962334 30421175 29068455
5498 29068455 27629364 26557100 25374709 24243515 23310713 22902567 21967388 21236065 20660134
5489 20660134 19813307 19004242 18441688 17890611 17364755 16915521 16710365 16153577 15776764
5480 15776764 15481354 15298186 14546453 14399722 14301564 13955734 13833891 13744536 13442680 13360727
5470 13360727 13113764 12799551 12449298 12109817 12098756 12204938 12211620 11839126 11492953 11331747
5460A1331747J97951q2274l10536L38028n3598k17269Q5603o2076j83126l60873
5450A0683577J42213m7186q0235j03952J29963j80058K9897J09833j49940K2589
5440A0556701l6025n0242L00027j20609k2194K03596P6081J07695k31197K05066
5430A0988899O4716N6902q6265P272M6768n9273j01750K7903J3894j21261j78226
5419A0659579p7367j62619j99998j03916j84826K15896o1516j38272j42673r5802
5409I708486k38474k1107K3811p085K4080J35727j88342R4435q7610l8148J16475
5398I522248k21493K03144mj15537K05695K78902Q9629j74709k96462J32991L08792
5387I933196l59175l27039J24239j18678n1339K0165l28438J34083M2252k17519
$$ plain form
5460 11331747 11529698 11447424 11136888 11474916 11421318 11204049 11289652 11227576 11044450 10683577
5450 10683577 10825790 10778604 10698369 10594417 10724380 10544322 10574219 10684052 10534112 10556701
5440 10556701 10520676 10470434 10770461 10649852 10627658 10831254 10907335 11015030 10783833 10988899
5430 10988899 11053615 11110517 11024252 11031524 11078292 11019019 10917269 10945172 10959066 10837805 10659579
5419 10659579 10582212 10419593 10219595 10115679 9930853 10146749 10085233 9946961 9804288 9708486
5409 9708486 9470012 9448905 9472716 9465631 9489711 9625438 9437096 9531531 9443921 9405773 9522248
5398 9522248 9300755 9503899 9503895 9388358 9594053 9872955 9962584 9787875 9491413 9624404 9933196
5387 9933196 9574021 9246982 9371221 9252543 9201204 9221369 8892931 9027014 9069266 8851747
5377H851747L2008J14379K25559L8227J33701J00381l6542o202N2775m245L0006
5366I531794M6112P5629J45309J03294J18463J67785J6489m2165K33800J09171
5356A0505681K99940k35044j44363M11800L75059N7958N2114j55473K165O0488
5346A1230325n7966J39164J61190N02999L70518q7723J29423K88775J16800K701
5336A2796206K92425K99095L39391K46124K8605J78578K56227L81207J32919L10621
5326A5261398J92289L67465M15438M14696J08797M54431M35476N26806N45506
5317A8722302N83909M22707M07955N24670O13437N56250L77097N70644L76657
5308B3155628L21900L75248K24545M61817K90147L58233J3142j72534k03347j67382
$$ plain form
5377 8851747 8883755 8998134 9223693 9261920 9395621 9496002 9459460 9453258 9506033 9501788 9531794
5366 9531794 9577906 9653535 9798844 9902138 10020601 10188386 10204875 10162710 10396510 10505681
5356 10505681 10805621 10570577 10426214 10838014 11213073 11271031 11323145 11167672 11169837 11230325
5346 11230325 11172359 11311523 11472713 11975712 12346230 12258507 12387930 12676705 12793505 12796206
5336 12796206 13088631 13387726 13727117 13973241 14001846 14180424 14436651 14817858 14950777 15261398
5326 15261398 15453687 15821152 16236590 16651286 16760083 17214514 17649990 18176796 18722302
5317 18722302 19306211 19728918 20136873 20661543 21274980 21831230 22208327 22778971 23155628
5308 23155628 23477528 23852776 24077321 24539138 24829285 25187518 25200660 25028126 24824779 24657397
5298B4657397j68616k72569n60051o22817l23608j45252m66274q71623l50927
5289B0875660k03276m49634o38318o00949m99589m05722o8929j50893n79787n82060
5279A6696503l62337l17217l58102j90164j44989m15181l17456j91964N5870l70729
5269A4084234j70275K6281n56246Q5409k01691O5329P7824k71886M8255j30657
5259A3056577m04340q9729n5600K51240j24884l5362P4533j56623k0541k3310
5249A2471961J05540k13857O638j94732Q4040j76766q006K42873j29310K16540
5239A2404921l14478j12156K32271L14721j26055l67576n1922K65237o291j89682
5229A2048990k44408J88418K1615j89632K70008J60379J38158k96651J2209p8927
$$ plain form
5298 24657397 24488781 24216212 23656161 23033344 22709736 22564484 22098210 21226587 20875660
5289 20875660 20672384 20222750 19584432 18983483 18483894 18078172 18009243 17858350 17278563 16696503
5279 16696503 16334166 16016949 15658847 15468683 15323694 14908513 14591057 14399093 14454963 14084234
5269 14084234 13913959 13940240 13383994 13469403 13267712 13333041 13410865 13138979 13187234 13056577
5259 13056577 12652237 12562508 12506908 12758148 12633264 12597902 12672435 12515812 12495271 12471961
5249 12471961 12577501 12363644 12370282 12175550 12259590 12082824 12074818 12317691 12188381 12404921
5239 12404921 12090443 11978287 12210558 12525279 12399224 12031648 11979726 12244963 12238672 12048990
5229 12048990 11804582 11993000 12014615 11824983 12094991 12255370 12393528 12096877 12109086 12030159
5219A2030159J5006j40834N6712m4272k54729j01224k71975k4029K20285J16459
5209A1601558p9173O0882k81992P8634P818K14273j06620l35118l28759N3048
5199A0884551n2655k0331P4579J15725k8123l52857k12108L3207J42653j31023
5189A0453618J81603J165k17782l47495M4690L8520N786q9476j30343N6975q0258
5178I917003j4863L59454m7616l97335n4570L0441J13322k1563L1663j84545J4123
5167I745514k0924j57593K16079J94870k97970j48648J93687j52184j23332j92681
5157I256818p3033j91287L6280n6247j84846K43467J32975k7586q8575o7381J33495
5146I114080K92272j83623N2580p1574k17960q7659k02462L3876j56933j59501
$$ plain form
5219 12030159 12045165 11904331 11961043 11916771 11662042 11560818 11288843 11264814 11485099 11601558
5209 11601558 11522385 11583267 11301275 11379909 11387727 11602000 11495380 11160262 10831503 10884551
5199 10884551 10831896 10811565 10886144 11001869 10973746 10620889 10408781 10441988 10584641 10453618
5189 10453618 10635221 10636386 10418604 10071109 10115799 10154319 10160105 10070629 9940286 9997261 9917003
5178 9917003 9902140 10261594 10213978 9816643 9762073 9792514 9905836 9884273 9915936 9731391 9745514
5167 9745514 9724590 9566997 9783076 9977946 9679976 9531328 9725015 9572831 9449499 9256818
5157 9256818 9183785 8992498 9028778 8972531 8787685 9031152 9164127 9136541 9047966 8980585 9114080
5146 9114080 9406352 9222729 9275309 9203735 8985775 8898116 8695654 8729530 8572597 8413096
5136H413096J40626K29863K52944K5535k54211L5452M0407k04385J04311P6226
5126H859864k96481J0791j3618n6881j48602k6266r6714R007J02460m9614J94743
5115H488689J87883l96743k91704m1626j00236K3677Q1957l70364Q9622R692J91438
5104G872285j9463M3620M480k04190J99305p2653j85386n5176k889j91918j67779
5093G220236j74190L37566J2472J3505j13884l628O4161L7086J64858K6767M0815
5082G625764j04114j15534j37645N0359O1536k16697j52549k41669K41225M6970
5072G057646n4594R6140j98975j4544r883l4951k00286K14319K1374J53216K76139
5061G305601k66878O198K41945l56543l08521J11408J17362L31538P8267l13955
$$ plain form
5136 8413096 8553722 8783585 9036529 9062064 8807853 8843305 8883712 8679327 8783638 8859864
5126 8859864 8563383 8574174 8560556 8503675 8355073 8328807 8232093 8241100 8343560 8293946 8488689
5115 8488689 8676572 8279829 7988125 7946499 7846263 7869940 7951897 7581533 7671155 7680847 7872285
5104 7872285 7852822 7896442 7900922 7696732 7896037 7823384 7637998 7582822 7579933 7388015 7220236
5093 7220236 7046046 7383612 7396084 7409589 7295705 7292077 7356238 7393324 7558182 7584949 7625764
5082 7625764 7521650 7406116 7268471 7318830 7380366 7163669 7011120 6769451 7010676 7057646
5072 7057646 7003052 7099192 6900217 6885673 6875790 6840839 6640553 6854872 6876246 7029462 7305601
5061 7305601 7038723 7044921 7286866 6930323 6621802 6733210 6850572 7182110 7260377 6946422
5051F946422n4727P3017q6750R2681j41355J13720R9015p2371n4309P0760n1856
5040F934247j51132J80242J26411k71019p2855J56066p1872J32120k22774k84383
5030F455051K28020k02654j17785K08293m8587R266J171J38055J03022k78916
5020F494936Q5401K82744j84173j55228k1765J82945j23645k47008M1060J33899
5010F489166K31283J19405J50633j63756J00130P9429j65275k13161K8505j1531
5000F644828J28754K05352j19774j55028j89741K24432Q1927m8573J31040R8168
4990G001385R5948R0429K0623O7461l6240m48224j18131L07739O3039J35132J76551
4979G355712K713J49180L76899l22747k03255J36328j34462j48659K82132J28603
$$ plain form
5051 6946422 6891695 6964712 6877962 6970643 6829288 6943008 7042023 6969652 6915343 6986103 6934247
5040 6934247 6783115 6963357 7089768 6818749 6745894 6901960 6830088 6962208 6739434 6455051
5030 6455051 6683071 6480417 6362632 6570925 6522338 6531604 6532775 6670830 6773852 6494936
5020 6494936 6580337 6863081 6678908 6523680 6501915 6684860 6561215 6314207 6355267 6489166
5010 6489166 6720449 6839854 6990487 6826731 6926861 7006290 6841015 6627854 6656359 6644828
5000 6644828 6773582 6978934 6859160 6704132 6514391 6738823 6820750 6772177 6903217 7001385
4990 7001385 7097333 7187762 7208385 7275846 7239606 6791382 6673251 6980990 7044029 7179161 7355712
4979 7355712 7358425 7507605 7884504 7561757 7358502 7494830 7360368 7211709 7493841 7622444
4969G622444J23313K55340R9078j74140K3809l2312K34179J97278k26162J25032
4959H247859j1093J27940j43489J68274O880J67613K92210J22462L13112j45353
4949I146415k4456L36699R6517L9959M8413n0058K7286J71831L32690J62522J88335
4938A0476153j24071k48091J56506J99683J48385r1027J85255L28325J63223J59343
4928A1353684R5729M4328N4593L69079K27673Q8056L58987J82929M66412r7579
4918A3143891J4119M48545J97746K65434Q7389K50081K87528L47173Q2041L89624
4908A5513571N72502L1774J16436M53696J54230L14558P45352M28194K57296M23234
4898A9010843K82260N00959J006996O38127M77647P09795Q18701Q14172J012067
$$ plain form
4969 7622444 7745757 8001097 8100175 7926035 7949844 7917532 8151711 8348989 8122827 8247859
4959 8247859 8236766 8364706 8221217 8389491 8396371 8563984 8856194 8978656 9291768 9146415
4949 9146415 9121959 9458658 9555175 9595134 9643547 9593489 9620775 9792606 10125296 10287818 10476153
4938 10476153 10352082 10103991 10260497 10460180 10608565 10517538 10702793 11031118 11194341 11353684
4928 11353684 11449413 11493741 11548334 11917413 12145086 12233142 12592129 12775058 13241470 13143891
4918 13143891 13158010 13606555 13804301 14069735 14157124 14407205 14694733 15041906 15123947 15513571
4908 15513571 16086073 16117847 16234283 16687979 16842209 17156767 17902119 18330313 18587609 19010843
4898 19010843 19293103 19794062 20801058 21439185 21916832 22626627 23445328 24259500 25271567
4889B5271567Q20931Q57581R66694Q36312J075595Q65622R82178J172013J074140
4880C3922633R99395J125885J292746Q50077R63816J390152J130511J319140J125385
4871D4119740J339094J502007J062791J561813J286883J448428J432205J612826
4863E5365787K081258J715000J734512K368196K533638K166575K495393K801666
4855G3262025L052132L168294L309969L013833L426443L666251L636561L532975
4847A00068483L837736L791907L928793L740092L659285L942252M075373L791336
4839A30835257L769884L754935L827044M042174L976328M101719L970931M339846
4831A62618118M153711L961773L573119L518766L269754K410696J786190J250228
$$ plain form
4889 25271567 26092498 26950079 27916773 28753085 29828680 30694302 31676480 32848493 33922633
4880 33922633 34922028 36047913 37340659 38190736 39154552 40544704 41675215 42994355 44119740
4871 44119740 45458834 46960841 48023632 49585445 50872328 52320756 53752961 55365787
4863 55365787 57447045 59162045 60896557 63264753 65798391 67964966 70460359 73262025
4855 73262025 76314157 79482451 82792420 85806253 89232696 92898947 96535508 100068483
4847 100068483 103906219 107698126 111626919 115367011 119026296 122968548 127043921 130835257
4839 130835257 134605141 138360076 142187120 146229294 150205622 154307341 158278272 162618118
4831 162618118 166771829 170733602 174306721 177825487 181095241 183505937 185292127 186542355
4823A86542355K66771n69589j364537j871447l195321l652053m712081n203816
4815A66240282n229714n481931n278964n085230m209517m053415l589479l386286
4807A29925746l374089l496844l752854m501121m520557n195205n260838n595689
4799I4228549n592558n033894m475131l958405l747080l346732l274802l228572
4791F1571375k470436k198499j925817j701756j985057j600053j190169j278864
4783D7220724j386701j402402j285803j170573j321616j281085j423096j083093
4775C6866355j033245j270521j038636j093924j184448q62881j028157q64660
4767B8489883p57282n62283p87248r04795j203429p39850p86230p47671o67057
$$ plain form
4823 186542355 186809126 186239537 184875000 183003553 179808232 176156179 171444098 166240282
4815 166240282 161010568 155528637 150249673 145164443 140954926 136901511 133312032 129925746
4807 129925746 126551657 123054813 119301959 114800838 110280281 105085076 99824238 94228549
4799 94228549 88635991 83602097 79126966 75168561 71421481 68074749 64799947 61571375
4791 61571375 59100939 56902440 54976623 53274867 51289810 49689757 48499588 47220724
4783 47220724 45834023 44431621 43145818 41975245 40653629 39372544 37949448 36866355
4775 36866355 35833110 34562589 33523953 32430029 31245581 30382700 29354543 28489883
4767 28489883 27732601 27170318 26383070 25478275 24274846 23534996 22748766 22001095 21334038
4758B1334038p00470l57693m57198q20957n70815n18845n37958m78633n18153
4749A6373316n36389k58531k80616k92355m49550l73132j93347o8680l75583l62150
4739A3182983j33582k47334l94089j22181j89211j61926o6265l98275j87967j45330
4729A1136823k17698o2420j89756O1281J32994n00175q9587l2327k45107j65731
4719I828297j83219j05439P7460j68180J56819k84591k8710l1136j8179j12118
4709I131004j78989K04621q0508l88673N0739k1741J72305K76842M112L7033o9761
4698I136984Q7987L6143j11286j8705j7755l54933n8964J26869r3351o2883L19628
4687H989734j01108j15507J28563K21185R0185k84617L057K04495N00696l13696
$$ plain form
4758 21334038 20633568 20275875 19818677 18997720 18426905 17908060 17370102 16891469 16373316
4749 16373316 15836927 15578396 15297780 15005425 14555875 14182743 13989396 13920716 13545133 13182983
4739 13182983 13049401 12802067 12407978 12285797 12096586 11934660 11868395 11470120 11282153 11136823
4729 11136823 10919125 10856705 10666949 10728230 10861224 10361049 10271462 10239135 9994028 9828297
4719 9828297 9645078 9539639 9617099 9448919 9605738 9321147 9292437 9261301 9243122 9131004
4709 9131004 8952015 9156636 9076128 8687455 8738194 8716453 8888758 9165600 9169712 9206745 9136984
4698 9136984 9224971 9261114 9149828 9131123 9113368 8758435 8699471 8826340 8732989 8670106 8989734
4687 8989734 8888626 8773119 8901682 9122867 9213052 8928435 8931492 9135987 9636683 9322987
4677I322987p0772J86506P1207K1335L31043j9848j35488L93159o9745M6953K84339
4666A0361676M32677L654R445J79261K14595J5115M9054L50229L76571L18480
4656A2310757J08784J05188L52201M58928K52837L09872J82683M17639L39540
4647A4838429K00462N96409M69041N16021M01923K72992L71720K94216M58331
4638A8419544N32484M59708L83775O96136O15160P81200O29183N81272R93446
4629B4091908P87227Q81541Q12648R35408Q93092J157347J380301J147643J246996
4620C3334111J594038J818812J951229J569517J907748K123824K205623K078353
4612D8583255K195875K248998J755116J419511J082133J407674J631300J725828
$$ plain form
4677 9322987 9252215 9438721 9509928 9531263 9862306 9842458 9706970 10100129 10030384 10077337 10361676
4666 10361676 10794353 10798007 10807452 10986713 11201308 11216423 11265477 11615706 11992277 12310757
4656 12310757 12419541 12524729 12876930 13335858 13588695 13898567 14081250 14498889 14838429
4647 14838429 15038891 15635300 16104341 16620362 17022285 17295277 17666997 17961213 18419544
4638 18419544 18952028 19411736 19795511 20491647 21106807 21888007 22517190 23098462 24091908
4629 24091908 24879135 25760676 26573324 27508732 28401824 29559171 30939472 32087115 33334111
4620 33334111 34928149 36746961 38698190 40267707 42175455 44299279 46504902 48583255
4612 48583255 50779130 53028128 54783244 56202755 57284888 58692562 60323862 62049690
4604F2049690J934331J967218K295457K670869K862652L056869L640768M228218
4596H4706072M459416N017797M936774N747423O548814O834150P745164Q758888
4588A34754498R413420R784814J0781046J2248052J2479391J3154148J4034551
4581B16649920J4227045J3574301J1597576Q609860M402917k11081n839536j1683085
4573B51327917j5983827j7149644j6008294j4647879j3323339j2293929j1305103
4566A50615902j0315436r475435q419328p459435o862043o024388n433955n287431
4558I1338451m652132m594166l736642l556121l564536l682107l215757k885260
4550F1451730k908007k624936k368141k347483k287602k208953k087408j753214
$$ plain form
4604 62049690 63984021 65951239 68246696 70917565 73780217 76837086 80477854 84706072
4596 84706072 89165488 94183285 99120059 104867482 111416296 118250446 125995610 134754498
4588 134754498 144167918 153952732 164733778 176981830 189461221 202615369 216649920
4581 216649920 230876965 244451266 256048842 264658702 269061619 268850538 263011002 251327917
4573 251327917 235344090 218194446 202186152 187538273 174214934 161921005 150615902
4566 150615902 140300466 130825031 122405703 114946268 108084225 102059837 96625882 91338451
4558 91338451 86686319 82092153 78355511 74799390 71234854 67552747 64336990 61451730
4550 61451730 58543723 55918787 53550646 51203163 48915561 46706608 44619200 42865986
4542D2865986j800906j682475j178725j280235j608576r64411r05524j155967
4534C2289167j247043p10446o91944q81212r96246q63733r77522o96868n51889
4525B4672264j115697m70117p78924q95571n07463n32983n98688m33435l48313
4516A8991073m69101l99164p99499n10149n08146j80830k00272l12273l45806
4507A5265833m99983j76517n02860l71171l06639k30118l04665j92832l17345
4498A2363703k17358J41310n54703l36858r5182j97619l00599m62679j20549k08048
4488A0011418l18617j28082k28522l80716j42823O9992J32002j70199k19536L2138
4478H657055j47542j26294o9029j1859q0288R472j52669K22837O7768J61024J60400
$$ plain form
4542 42865986 41065080 39382605 38203880 36923645 35315069 34350658 33445134 32289167
4534 32289167 31042124 30331678 29639734 28758522 27762276 26898543 25921021 25224153 24672264
4525 24672264 23556567 23086450 22307526 21411955 20904492 20371509 19772821 19339386 18991073
4516 18991073 18521972 18122808 17323309 16813160 16305014 16124184 15923912 15611639 15265833
4507 15265833 14765850 14589333 14086473 13715302 13408663 13178545 12873880 12681048 12363703
4498 12363703 12146345 12287655 11732952 11396094 11300912 11103293 10802694 10340015 10219466 10011418
4488 10011418 9692801 9564719 9336197 8955481 8812658 8882650 9014652 8844453 8624917 8657055
4478 8657055 8509513 8383219 8314190 8302331 8222043 8231515 8078846 8301683 8369451 8530475 8690875
4467H690875k57827J24504n6631p4091J47326k84158O6322l80551j37032J8168
4457G856905l85635k32223P482j03832r1113k62769j59454j61009p6992N7389
4447F448749j87043K69544K4935p6857j61615O5870N3254k1329J5905J11551Q4950
4436F627914M19551q3406j07795J31266J77764k05774k21662J81347N8883J711
4426F979799K84723K3517k3070J52512J32885L23492L66149J56963L11569N40004
4416I248543L66685M15537N60177O67564N08554O19931N78722Q70515P79404O59719
4406A5275351J143947J402362J001346R30976P25487K87559L6312l38889r75998
4397A9488453j418166j332966j308410j199514j040755r15626p74176n30613m60738
$$ plain form
4467 8690875 8433048 8557552 8500921 8426830 8574156 8289998 8356320 7975769 7838737 7856905
4457 7856905 7471270 7239047 7246529 7142697 7051584 6788815 6629361 6468352 6391360 6448749
4447 6448749 6261706 6531250 6556185 6479328 6317713 6383583 6436837 6415508 6431413 6542964 6627914
4436 6627914 7047465 6964059 6856264 6987530 7165294 6959520 6737858 6919205 6978088 6979799
4426 6979799 7264522 7288039 7264969 7417481 7550366 7873858 8240007 8396970 8708539 9248543
4416 9248543 9615228 10030765 10590942 11258506 11767060 12386991 12965713 13836228 14615632 15275351
4406 15275351 16419298 17821660 18823006 19753982 20479469 20767028 20803340 20464451 19488453
4397 19488453 18070287 16737321 15428911 14229397 13188642 12273016 11498840 10968227 10507489
4388A0507489o32392p76074l42339k42614m66812k66145l81329l48779j66214
4379F884791m20321l23305q4080k95579q6067k12933k36305Q5712r8420k59487
4369D954006m2579l36984q8487J88480k01451J6583j84197m42334m8100J78775
4359C993712l3260j30275j05071O8850J39203k56318j89563k1106J22373j02205
4349C486340m01000J43489k01710j57974J2094m8177n2138j44232J77897l5696
4339B778893k21072j66201J21176J04526L3218q9583K5560P7612k6789Q7527k16402
4328B508465p088N0258L0652n8302m4488m1748j48822J8974j80271j20041j3411
4317A994178j2216O9756L5432N7180K1313M3950j16070J67709j04528k49499L18433
$$ plain form
4388 10507489 9875097 9099023 8756684 8514070 8047258 7781113 7399784 7051005 6884791
4379 6884791 6464470 6141165 6057085 5761506 5675439 5462506 5226201 5311913 5213493 4954006
4369 4954006 4911427 4574443 4485956 4674436 4472985 4489568 4305371 3863037 3814937 3993712
4359 3993712 3960452 3830177 3725106 3793956 3933159 3676841 3487278 3466172 3588545 3486340
4349 3486340 3085340 3228829 3027119 2869145 2881239 2833062 2780924 2636692 2814589 2778893
4339 2778893 2557821 2391620 2512796 2617322 2650540 2560957 2586517 2664129 2637340 2724867 2508465
4328 2508465 2501377 2551635 2582287 2523985 2479497 2437749 2288927 2307901 2127630 2007589 1994178
4317 1994178 1981962 2051718 2087150 2144330 2165643 2209593 2093523 2261232 2156704 1907205 2225638
4306B225638m7970R3606j1396k52467k40594p7240j6854J42828J65050j54719
4296A825882j01469J73014J56700Q8073K08963m3641P4863k32508K45917o8178
4286B327616j24052K5244K65334J17281k11491J22617J8031j6717J56523K8624
4276B709010J43835j896J57149K2539k39006p7111O8319k32900j35975k182l38320
4265B073462L45585j56496j86416k09253l5908l1022P1250k16930J09509J43896
4255A907677j90993O9278j24294k72862k271l1934k62040J37421J94650J82504
4245A607136k22006j03516L26363J8612k2217j49418o4454r1461k71957L0099
4235A057181j05707J84365P7236j02612K6874P9886j5273k44698Q1950R7003o2282
$$ plain form
4306 2225638 2177668 2271274 2259878 2007411 1766817 1689577 1672723 1815551 1980601 1825882
4296 1825882 1724413 1897427 2054127 2142200 2351163 2307522 2382385 2149877 2395794 2327616
4286 2327616 2203564 2228808 2494142 2611423 2399932 2522549 2540580 2523863 2680386 2709010
4276 2709010 2852845 2850949 3008098 3030637 2791631 2714520 2782839 2549939 2413964 2411782 2073462
4265 2073462 2419047 2262551 2076135 1866882 1830974 1799952 1871202 1654272 1763781 1907677
4255 1907677 1716684 1785962 1661668 1388806 1386535 1354601 1092561 1229982 1424632 1607136
4245 1607136 1385130 1281614 1607977 1626589 1604372 1454954 1390500 1299039 1027082 1057181
4235 1057181 951474 1135839 1213075 1110463 1137337 1217223 1201950 957252 1039202 1136205 1073923
4224A073923n7747J08384r9387L864K1607p8623k64686K53511N2570n5651K60184
4213A217949j00961J66021r6803J6643j3347j68010P4880j61974J31142J87419
4203A252959r3462J04258N2936k45219R372j45760l8800R6207m27085P9150K36976
4192H81532j00293R3744J20239J98731n9937j20498O615j6758j92030o7634m1208
4181G02503K09070K39910j56584p0342J13401K77615j10319j18794K7565p9547
4171A034478J38312j66667j41239K00629P5472k1460m9565l7271K35622l6771
4161A231540k70560J87979P9158J83328k0350L7724j28344N432j44011L2342J81801
4150A376039o9991R3256Q864q1577O8676P3464K2214j58509Q9219j67595k18873
$$ plain form
4224 1073923 1016176 1124560 1025173 1029037 1050644 972021 707335 960846 1013416 957765 1217949
4213 1217949 1116988 1283009 1186206 1202849 1189502 1021492 1096372 934398 1065540 1252959
4203 1252959 1159497 1263755 1316691 1071472 1080844 935084 896284 992491 565406 644556 881532
4192 881532 781239 874983 995222 1193953 1134016 1013518 1020133 1003375 811345 743711 702503
4181 702503 911573 1151483 994899 924557 1037958 1315573 1205254 1086460 1114025 1034478
4171 1034478 1172790 1006123 864884 1065513 1140985 1119525 1069960 1032689 1268311 1231540
4161 1231540 960980 1148959 1228117 1411445 1391095 1428819 1300475 1305907 1161896 1194238 1376039
4150 1376039 1306048 1399304 1408168 1326591 1395267 1468731 1490945 1332436 1421655 1254060 1035187
4139A035187l0288J59005N9684k20310K20782k3570p1290N3161j16204N0731O0490
4128A177378k16850L2837Q0090K18619J02788j54483n1488J58941J72820j17548
4118A403104p5943k666O6694N6892l5401k22717j11209j46294K4320K5014R061
4107I90855J400j1509J43424K04450j99651j35676J46387K1700J76989j81890
4097A156479j44246Q6529P1702L6776m1033J38434m4296m12934k05733J23571
4087G65249K92113j80389J41489l6001j1099j2264Q3035j80931P281J14838j13102
4076H70219L08295j14046J51583j97723k2458J85911r7836j41299M34782l0440
4066A346988j50431K46934J11988l1890m6006K05486k25102n7863k41109n9482
$$ plain form
4139 1035187 1004899 1163904 1223588 1003278 1224060 1200490 1129200 1182361 1066157 1116888 1177378
4128 1177378 960528 993365 1073455 1292074 1394862 1240379 1188891 1347832 1520652 1403104
4118 1403104 1327161 1324495 1391189 1448081 1412680 1189963 1078754 932460 956780 981794 990855
4107 990855 992255 980746 1124170 1328620 1128969 993293 1139680 1161380 1338369 1156479
4097 1156479 1012233 1098762 1170464 1207240 1166207 1304641 1260345 847411 641678 765249
4087 765249 1057362 876973 1018462 982461 971362 959098 1042133 861202 868483 983321 870219
4076 870219 1178514 1064468 1216051 1018328 995870 1181781 1083945 942646 1377428 1346988
4066 1346988 1196557 1443491 1555479 1523589 1477583 1683069 1457967 1400104 1158995 1099513
4056A099513K25324j302l6183J9193p6085R1499r4001j10037R9324o0664l33437
4045H23144o1155J68384J17738j37508l0058j54101O664M82335j42652j09420
4035I63371p932J69711j43237k49111m956J5949j6802J11322o4713L13J76516
4024I50431m6221r1096o9792R6617k19334K8051J26144K21320j5418j16717j37532
4013G26453l93734K79254J08569j59805J04344O2077j28011k32223L3006K04070
4003F04000K08735k20904j91387M0571J02545K10929k7183k43797N2179R7673
3993F33361o7364J16179K28797n7286k37008o4398J72391J80472j4633j81545
3983G08966J00741r2959O8750j0353l58211j90658Q7888R5957M60385P6241m59090
$$ plain form
4056 1099513 1324837 1323535 1287352 1306545 1230460 1321959 1227958 1117921 1217245 1156581 823144
4045 823144 761989 930373 1048111 910603 880545 726444 733108 1215443 1072791 963371
4035 963371 955439 1125150 981913 732802 727846 743795 726993 838315 773602 773915 950431
4024 950431 904210 813114 743322 839939 620605 648656 774800 996120 980702 863985 726453
4013 726453 332719 611973 720542 560737 665081 727158 599147 366924 399930 604000
4003 604000 812735 591831 400444 441015 543560 754489 727306 483509 535688 633361
3993 633361 565997 682176 910973 853687 616679 552281 724672 905144 890511 708966
3983 708966 809707 716748 785498 775145 416934 226276 314164 410121 870506 946747 487657
3972D87657p5351N7468J33054K5166J235q9347J46638L0150J4071L0319k741J77326
3960I35645O7664k05640L1779K6315j96217j67380N6441J41663M1324N7028j39651
3949F48971j20086L21006J41001j43919k68666K81169m1356r4196k50611j39568
3939C33745M4706L20689J88633k00652j88636L12396J43230q134n1460J38925
3929A033442j88736o4103J38504o866L59909p6347j5865j34452N2283j39901j34936
3918H22932m513k7865m7442J75603N938q2739J22783l05211n8417L5677R2002
3907G28748P1408j98711j132r9440L02257k54845j3553K67942j04646Q5656o9460
3896G14224k08838O4247j74029N7814p712M7156P0996q1005M8523J18426R0988
$$ plain form
3972 487657 412306 469774 602828 627994 629229 539882 686520 716670 730741 761060 758319 935645
3960 935645 1003309 797669 829448 855763 659546 492166 548607 690270 731594 788622 648971
3949 648971 528885 849891 990892 846973 578307 859476 818120 723924 473313 333745
3939 333745 378451 699140 887773 687121 498485 810881 954111 945977 894517 1033442
3929 1033442 844706 780603 919107 912241 1272150 1195803 1179938 1045486 1097769 957868 822932
3918 822932 818419 790554 743112 918715 924653 841914 964697 659486 601069 636746 728748
3907 728748 800156 601445 600313 500873 803130 548285 534732 802674 698028 783684 714224
3896 714224 505386 569633 395604 453418 445706 492862 563858 482853 531376 649802 740790
3885G40790k42229k22284J39715n3171J61659Q6105j64585o1619J7633N6114L99365
3874H57493K52314n21847p9818R164Q7744L838K18824J04170j89616M2183J00587
3863H85036J26916k29530m977j57687P0414K00472o3638J77118k17046j42569
3853F44509K02427j89425q3348l65386p8848J04761K22864J37003J2731J30538
3843G37826R8125j81165k32085P7069m2392R6319o4845j64187Q1315K15328j10773
3832E10535J33940j31753N8988m9222J01265R87P4939N950m8931j16822J50209
3821F90085J72071j64866q9624J430L301o0338K19357n9525J52491n4219k48330
3810E61833K31696K62929j95460k4836J82876o4562j72242N1013L29207j63958
$$ plain form
3885 740790 498561 276277 415992 362821 524480 610585 446000 384381 402014 458128 857493
3874 857493 1109807 587960 508142 517306 605050 608888 827712 931882 742266 784449 885036
3863 885036 1011952 782422 777445 619758 690172 890644 827006 1004124 787078 644509
3853 644509 846936 657511 574163 208777 129929 234690 457554 594557 607288 737826
3843 737826 835951 654786 422701 499770 457378 553697 488852 324665 405980 621308 510535
3832 510535 644475 512722 571710 522488 623753 624740 699679 705629 656698 539876 690085
3821 690085 862156 697290 607666 609096 612397 552059 771416 711891 864382 810163 561833
3810 561833 793529 1056458 860998 836162 1019038 954476 782234 833247 1162454 998496
3800I98496j32278o0606j03796J13736K03559j84108j94312J53864K08808l7901
3790I65462k2080L1333j03923k18455R1528J91497j3561J49376j32894j36775
3780H01508l9211J06664K48177M1216l55435P2632J36426R0134m0418j14118J5428
3769I63003l6712K7589n373L49438K14202k72815r7100j6013r879J65507O8079
3758A349926J53375j83464q4189L7672j78868J48858J42563j0174N0146n9938
3748A365907n871n855P1476l08715j54948J39916L53702J38394r6270j35497N4171
3737A416410P3735k07302j54132j33J48772j23469O2635j11163k093j7283m6995
3726A038982p1194j70685j63522K00562N9900M8956Q7361L9236L537J69952j9470
$$ plain form
3800 998496 866218 805612 701816 815552 1019111 835003 640691 794555 1003363 965462
3790 965462 943382 974715 870792 652337 743865 935362 921801 1071177 938283 801508
3780 801508 762297 868961 1117138 1158354 802919 875551 1011977 1102111 1061693 947575 963003
3769 963003 926291 953880 948507 1297945 1512147 1239332 1142232 1126219 1116340 1281847 1349926
3758 1349926 1503301 1319837 1235648 1273320 1094452 1243310 1385873 1375699 1425845 1365907
3748 1365907 1360036 1354181 1425657 1116942 961994 1101910 1455612 1594006 1497736 1362239 1416410
3737 1416410 1490145 1282843 1128711 1128578 1277350 1153881 1216516 1105353 1103260 1085977 1038982
3726 1038982 967788 797103 633581 834143 894043 942999 1030360 1069596 1073133 1243085 1223615
3715A223615j03894q0706j86650K7447K73552J71910k16820q1741K35461M9812
3705A311986l28350q6311L34188n0741j31105J16470j09721k72959J50583o306
3695I27734Q7244j00507n9147j12113P712K55629K65178K4725l12601o5394K50681
3684A169141Q1579l38497j90661J10330J43427n2862m4181k33693j8855K85017
3674I10745m3105p7503L3583p4115N4560j27197J0339K9925J31733L4524Q9477
3663I72966P7682k71241l697J28894j88431j7400J13093l0199L03956K6970k98773
3652H13820L3078k09963L8799n2860L73574O4956k77321j61010j44217J37058
3642F15914L27400K15132k31238j90235N4381m1611M6217m7824k201N1240j33639
$$ plain form
3715 1223615 1119721 1039015 852365 879812 1153364 1325274 1108454 1026713 1262174 1311986
3705 1311986 983636 897325 1231513 1180772 1049667 1166137 1056416 783457 934040 927734
3695 927734 1014978 914471 855324 743211 750923 1006552 1271730 1296455 983854 918460 1169141
3684 1169141 1250720 912223 721562 831892 975319 922457 878276 644583 625728 910745
3674 910745 867640 790137 823720 749605 804165 676968 687307 717232 848965 883489 972966
3663 972966 1050648 779407 775710 904604 716173 698773 811866 781667 1085623 1112593 813820
3652 813820 846898 636935 675734 622874 996448 1061404 784083 623073 478856 615914
3642 615914 943314 1158446 927208 736973 791354 749743 795960 748136 745935 797175 663536
3631F63536J15999j09168k2392K03240j05778J92098K00168j65063Q1416J52154
3621A206210n65764k57349L35009J50293k9665m984k81516O176N5936J37566J59322
3610I11234O0963k1968l9105j39673J28721R4208j31477Q9210k0604o6418j45361
3599G19730J74332J94834j26596k60309J2589K526n0035N0868m3679j37991m4526
3588D91743J27050R7758r3414K94263o389O1469k0647r8293j63040K52793p963
3577I35330R6792J44496n5405o1311J85884L7040k88828r4977j17536K1348J01577
3566I04410J0706j33990R3922J72545R3381j08711m7808J05631J50602l32196
3556I08492j08536J06819J8750J99859R5758J5137j50391K77446J80684j31784
$$ plain form
3631 663536 779535 670367 647975 851215 745437 937535 1137703 972640 1054056 1206210
3621 1206210 640446 383097 718106 868399 838734 833750 552234 558410 614346 751912 911234
3610 911234 972197 950229 911124 771451 900172 994380 862903 952113 931509 865091 719730
3599 719730 894062 1088896 962300 701991 714580 717106 667071 717939 674260 536269 491743
3588 491743 618793 716551 623137 917400 911011 972480 951833 853540 690500 943293 935330
3577 935330 1032122 1176618 1121213 1059902 1245786 1282826 993998 899021 781485 802833 904410
3566 904410 915116 781126 875048 1047593 1140974 1032263 984455 1090086 1240688 908492
3556 908492 799956 906775 925525 1125384 1221142 1236279 1085888 1363334 1544018 1412234
3546A412234K46994N3952j8113j04642k27729J7506J58708l1396o8661q4188j25823
3535A228842j83296k54822L10276J88370R2905J90270j59725n6281J0349j13774
3525A253114k1152J32208j06034J9441n0669k35470q1978N7856L91092p0586l9752
3514A248070n1056o1408J22686R4197O6079L4971M7563r7353k43085l7706j73
3503A122785K03829R4462m9100M5736J530k05673j03503J62066M8060j24517k01057
3492I94618J13787J7917l8381j33963L61971j52938j00540r2531J1311K42788
3482A224039J84150j7617J0418N148n0508J9529J02004q3767K01022K00440j80289
3471A614569J54124j1762j50134p6693O814k2057l1685L36036K22060M162j33018
$$ plain form
3546 1412234 1659228 1713180 1695067 1590425 1362696 1380202 1538910 1507514 1438853 1354665 1228842
3535 1228842 1045546 790724 1101000 1289370 1382275 1572545 1412820 1356539 1366888 1253114
3525 1253114 1231962 1364170 1258136 1277577 1226908 991438 909460 967316 1358408 1287822 1248070
3514 1248070 1197014 1135606 1258292 1352489 1418568 1453539 1501102 1403749 1160664 1122958 1122785
3503 1122785 1326614 1421076 1371976 1417712 1419242 1213569 1110066 1272132 1320192 1195675 994618
3492 994618 1108405 1126322 1087941 953978 1315949 1163011 1062471 969940 981251 1224039
3482 1224039 1408189 1390572 1400990 1406138 1355630 1375159 1477163 1393396 1594418 1794858 1614569
3471 1614569 1768693 1756931 1606797 1530104 1536918 1514861 1483176 1819212 2041272 2045434 1912416
3460A912416J23538J11576R8424m7970n0441N0880J25695J46877K13451J36136
3450B820582k32871J97130K16290J42005n8154m0466J52206p5433j13899N15173
3440C522563j88941J81547K06214K12986J04730R6057n1664K46880L18178L27966
3430D976516j82709N3086N0800p915K21697K37169j8284j69210K38394K67365
3420E666909L94688Q8206L60438K55306K38375K91730K61537J60712J08908J96165
3410H022974L14324m8165L5918l8253m217O4483K9920K74943P7868j13003K53861
3399H870653k08442l42621R29m49021l36939j17395j52862k69563m59275l26779
3389F208685k34365j16122l90902k18272j69624m81301j81038k8218j80340n0988
$$ plain form
3460 1912416 2035954 2147530 2245954 2197984 2147543 2198423 2324118 2470995 2684446 2820582
3450 2820582 2587711 2784841 3001131 3143136 3084982 3044516 3196722 3121289 3007390 3522563
3440 3522563 3333622 3515169 3721383 3934369 4039099 4135156 4083492 4330372 4648550 4976516
3430 4976516 4793807 4846893 4897693 4889778 5111475 5348644 5330360 5161150 5399544 5666909
3420 5666909 6061597 6149803 6510241 6765547 7003922 7295652 7557189 7717901 7826809 8022974
3410 8022974 8337298 8289133 8325051 8286798 8282581 8347064 8376984 8651927 8729795 8616792 8870653
3399 8870653 8662211 8319590 8320519 7871498 7534559 7417164 7264302 6994739 6535464 6208685
3389 6208685 5974320 5858198 5467296 5249024 5079400 4598099 4417061 4388843 4208503 4157515
3379D157515k14618m5056j10221p4556j24689j49560o5300J4940l4404l9305Q3813
3368C398559j10638p6630K17083p3204n5458M2127K13309o1574j25483k64170
3358C103921p4959R7670j89952J17052k27148K4003j02394j63368n8172L8771
3348B565424K00692m16744N2881k6487k96395K57842K9708l5140Q4953J03184
3338B519918j10114j96139n2560J3609Q2245k46653M2181k32754K42338j0689
3328B051382k12661j04003k7863O8871k05779J3015k00760R1213J0320o9018k3542
3317A391175o7850m5526J08772q3123j74697L9890m3320k5488L866J81930l510
3306A282119k42822j55555k10895L16050O5144m32067P3490O0817l14935M0893
$$ plain form
3379 4157515 3942897 3897841 3787620 3713064 3588375 3438815 3373515 3388455 3354051 3314746 3398559
3368 3398559 3287921 3211291 3428374 3355170 3299712 3341839 3555148 3493574 3368091 3103921
3358 3103921 3028962 3126632 2936680 3053732 2826584 2850587 2748193 2584825 2526653 2565424
3348 2565424 2766116 2349372 2402253 2375766 2079371 2337213 2366921 2331781 2416734 2519918
3338 2519918 2409804 2213665 2161105 2174714 2256959 2010306 2052487 1819733 2062071 2051382
3328 2051382 1838721 1734718 1706855 1775726 1569947 1582962 1382202 1473415 1483735 1414717 1391175
3317 1391175 1323325 1277799 1386571 1303448 1128751 1168641 1125321 1099833 1103699 1285629 1282119
3306 1282119 1039297 883742 672847 988897 1054041 621974 695464 756281 441346 482239
3296D82239p2512L12037Q5464K2432o8305m4147l3005j73486j815K37354k8870
3285G17386j38783M5279J32875N277k4697q9020p390o224r3923J39731J67280
3274H47791p1361k03022J02940K20018P4286q4970l59045l45717j49906L69181
3264D00195K3464K34808P0867j8058k32816j28446O5472Q6718P6573j50725J77796
3253F05848J39512k34105k33003J70107L11632m1831l56560P1245n1043J21910
3243E03712k06807o438N8409l4566k6340n9783N099r3115J39158L27063j81472
3232D24920k59864q3803P4083R3462L4810K37353l29111j30718J81760j96438
3222D6454n6096J96004j248p6095J35720K7348l5687P0357M0334k66984j4469
$$ plain form
3296 482239 409727 721764 807228 829660 761355 717208 684203 510717 508902 746256 717386
3285 717386 578603 623882 756757 762034 737337 648317 640927 634703 540780 680511 847791
3274 847791 776430 573408 676348 896366 970652 885682 526637 180920 31014 400195
3264 400195 423659 658467 729334 711276 478460 350014 415486 502204 578777 428052 605848
3253 605848 745360 511255 278252 448359 759991 718160 361600 432845 381802 503712
3243 503712 296905 290467 348876 314310 287970 228187 233286 140171 279329 606392 424920
3232 424920 165056 81253 155336 248798 283608 520961 191850 61132 242892 46454
3222 46454 -9642 186362 185114 109019 244739 272087 236400 306757 347091 80107 65638
3211F5638P5145m0744j92260L41575L59566n3737m93145m9278K62362K7277k43821
3200E8578j01083K04786j73710K32428p2167j51744k8509j07695J26383L3906
3190B1173O7582O7116j05905R7070J11783q6455L4012k34783M975R5026J95772
3179B67366l342o0602O6735M4374j91146R161J96132O248L41417j15883o1882
3168D98578m0732k06451m52137J30657M18571o6090r0281O1892q3721j76890j900
3157h504Q1235J03550K79053J87679m3551r0107j85014L057J8541J92232M3862
3146E82033l01215k09066J23435J29593J16170K8767n4607j0463J11226Q2636
3136E98509M6752j96843J18689J70512p7620j52389j47241p7931J27437O3377
$$ plain form
3211 65638 140783 100039 -92221 249354 608920 555183 62038 12760 275122 302399 58578
3200 58578 -42505 162281 -11429 220999 148832 -2912 -31421 -139116 -12733 21173
3190 21173 88755 155871 49966 147036 258819 172364 206376 -28407 -23432 71594 267366
3179 267366 264024 203422 270157 314531 123385 132546 328678 334926 676343 560460 498578
3168 498578 457846 251395 -200742 -70085 348486 282396 192115 254007 170286 -6604 -8504
3157 -8504 72731 176281 455334 643013 599462 509355 324341 327398 345939 538171 582033
3146 582033 280818 71752 195187 324780 440950 469717 415110 404647 515873 598509
3136 598509 645261 448418 567107 737619 659999 507610 360369 282438 409875 473252
3126D73252j3276j14082j57799R4556L46472J41970L81875r2508n4415q8644q3018
3115H34383O4673p5551O3254p071j66459J2376L54309K45690j9527j0616l336
3104A292125r5378J47199K17514O2698j1384K23061j90395l47927J58068L74352
3094A829933n8663n8456J31635j10279J61240K92609R3450o8733r501j06969J19728
3083B215994K05375l60276L7086J54129J43988J05223q0393k58856K48341J20962
3073B531573K51557p152J33818K46753J42588k13418K81420p9426j11884r6898
3063C078931K04975j49112j45434J10750j20216j7188k38404j08260o8044k55630
3053B292368j05269j43031p335J8802O9608P6764j76503k30964J30779K50964
$$ plain form
3126 473252 459976 345894 188095 282651 629123 771093 1152968 1060460 1006045 917401 834383
3115 834383 899056 823505 886759 879688 713229 725605 1079914 1325604 1306077 1295461 1292125
3104 1292125 1196747 1343946 1561460 1624158 1612774 1835835 1645440 1297513 1455581 1829933
3094 1829933 1771270 1712814 1844449 1734170 1895410 2188019 2281469 2212736 2203235 2096266 2215994
3083 2215994 2421369 2061093 2098179 2252308 2396296 2501519 2421126 2162270 2410611 2531573
3073 2531573 2783130 2775978 2909796 3156549 3299137 3085719 3367139 3287713 3175829 3078931
3063 3078931 3283906 3134794 2989360 3100110 2979894 2962706 2724302 2616042 2547998 2292368
3053 2292368 2187099 2044068 2036733 2055535 2125143 2201907 2025404 1794440 1925219 2176183
3043B176183k85774o5072m9357L3202j3448k66237J23999R3912n6447P2855L61440
3032B125256j35297k17484K2569j93428n0214J04042j19287k8144J4630q2803
3022A439840k2526j97495P1575k98782j23921L3745j56367j19690J7919Q9032
3012G33330r0544o951J9752q8086m0783j25318N9197j90310K73332m0203N4288
3001E57704N7117K78349o3415P9488K3979k04904j84458l7520n5787l28806J35495
2990B57242K34137p8225j48699K02970j66525k95722J77191J5357m7397J04955
2980B55284J03269p8582j77572k01664J57892o5229K5715L7465n8164J6606j02850
2969h7830j1889J52675J51428m4712j02730O5776K47341n4690l5458o8252K7658
$$ plain form
3043 2176183 1890409 1825337 1775980 1809182 1795734 1529497 1653496 1747408 1690961 1763816 2125256
3032 2125256 1989959 1772475 1795044 1601616 1551402 1655444 1536157 1508013 1522643 1439840
3022 1439840 1417314 1219819 1291394 992612 868691 902436 746069 626379 644298 733330
3012 733330 642786 635835 655587 567501 526718 401400 460597 270287 543619 503416 557704
3001 557704 614821 893170 829755 909243 933222 728318 543860 506340 450553 121747 257242
2990 257242 491379 413154 264455 467425 300900 5178 182369 197726 150329 255284
2980 255284 358553 279971 102399 -99265 58627 -6602 19113 56578 -1586 15020 -87830
2969 -87830 -99719 52956 204384 159672 56942 122718 370059 315369 279911 211659 239317
2958B39317k50058Q5011L18027l1813J40888l74752j65859O8765j10608o0548
2948a41630M31055j59302j18978K16163k28455j53281K56630p0005j74857K8081
2938a14579J29053Q3025j37407K59417P1219j29913j67010k2426K9723N8429R7004
2927A56535k57671j80532J64992L48461p9639j55545k12373k24112L29191N0063
2917f0630J40307r3349r3796J85610K9132l8219j01303N354k19869O0125L67496
2906A80858o0949l1260M7994L8092j11488l5358j04825l04675J5404K27001q3462
2895b22668O7282j98404R1641K22817J456J16873N3020j36207R3170J5029j85829
2884h1820K02551q8800l37051K39031P9671J36293k57551N9178n2180R4944m2241
$$ plain form
2958 239317 -10741 74270 392297 360484 501372 126620 -39239 29526 -81082 -141630
2948 -141630 289425 130123 11145 227308 -1147 -154428 102202 32197 -142660 -114579
2938 -114579 14474 97499 -39908 219509 290728 160815 -6195 -28621 1102 59531 156535
2927 156535 -101136 -281668 -116676 231785 152146 -3399 -215772 -439884 -110693 -60630
2917 -60630 79677 -13672 -107468 78142 107274 69055 -32248 -26894 -246763 -186638 180858
2906 180858 119909 88649 136643 174735 63247 27889 -76936 -381611 -366207 -139206 -222668
2895 -222668 -155386 -353790 -262149 -39332 -37876 78997 132017 -4190 88980 104009 -81820
2884 -81820 120731 31931 -305120 -66089 13582 149875 -107676 -48498 -100678 -5734 -47975
2873d7975j44120J0491L74126J67830k74783k61491m0270L9100K09323L7812j6965
2862E3078Q2906q6096j09464j35100M1043q8240O2240J33182L4212j04371K61508
2851A44898O7034r2204j59672o0253l0207Q2618l9907o4810j75739J10040K2740
2840a95462P9052J68969P5520j62808q0129K76414p8024j84095j64294K07519
2830e7338O0822j38093N0715K04085J11630j10722r6637j20375J7372L6041o9958
2819a12458j56405J71143J77265J45925Q1892q1120q2898j23213j27768q3973
2809a91610J40865r2451p8942J46540k08226K05015J22401k51376p5141M9466
2799b33459J70118J56801n1196l93247J32018J79949L6503l943J14400M6660j95566
$$ plain form
2873 -47975 -192095 -181604 192522 360352 85569 -175922 -216192 -177092 32231 70043 53078
2862 53078 135984 49888 -59576 -194676 -153633 -241873 -179633 -46451 -12239 -116610 144898
2851 144898 211932 119728 -39944 -100197 -130404 -47786 -87693 -152503 -328242 -218202 -195462
2840 -195462 -116410 52559 128079 -34729 -114858 161556 83532 -100563 -264857 -57338
2830 -57338 3484 -134609 -83894 120191 231821 121099 24462 -95913 -78541 -42500 -112458
2819 -112458 -268863 -97720 79545 225470 307362 226242 143344 20131 -107637 -191610
2809 -191610 -50745 -143196 -222138 -75598 -283824 -78809 43592 -207784 -282925 -233459
2799 -233459 -63341 93460 42264 -350983 -218965 -39016 -2513 -6456 107944 154604 -40962
2788d0962r4560j61075J9027J33834J74163J20917K4738k18827j7481L30300N7964
2777C28038l63788M5418J2501n219p409k23396m9499O7493K61778j82686p1222
2766a87991J33377j8483O412k51982J76602J01893L1736R3615q2461n7336J38549
2755H3931j26018j17889K08933j33021j33528K21579J72351n969J51075r2228
2745B29216k13653k5205J27196Q0701k09859N1890L6859O3024r8755L3382J38554
2734B13350L0098l8301j94490k7487J59437k11840O4823O4520k89004j01430J11912
2723b18412m2908J47516l3843j75642K22563o6425K19570j17758j0077j56233
2713b31649J5389J8867j18065K38805l1107j13351j3017J93552j35729K3029o1770
$$ plain form
2788 -40962 -135522 -296597 -277570 -143736 30427 151344 176082 -42745 -60226 270074 328038
2777 328038 -35750 9668 22169 16950 9541 -213855 -263354 -195861 65917 -116769 -187991
2766 -187991 -54614 -73097 -66685 -318667 -142065 -40172 -8436 85179 2718 -54618 83931
2755 83931 -42087 -159976 48957 -84064 -217592 3987 176338 170369 321444 229216
2745 229216 15563 -9642 117554 198255 -11604 40286 77145 140169 41414 74796 213350
2734 213350 243448 205147 10657 -16830 142607 -69233 -4410 60110 -228894 -330324 -218412
2723 -218412 -261320 -113804 -147647 -323289 -100726 -167151 52419 -65339 -75416 -231649
2713 -231649 -216260 -197393 -315458 -76653 -107760 -221111 -234128 -40576 -176305 -153276 -215046
2702b15046k0255J33653J59723k15992n5982n1107j25720K9653R6490L18761K81707
2691C35885j35810k19772N2149j31098l1646J64614J48364j88241m7816M330j51417
2680b00458K05635j08340j88867J16648k3839p5983n3258M10572J1835j64761
2670g0816K27594O6424j50430M8080l02894o1879N7577R2195p4460K46749q016
2659G0124j50737n3037P2968J72671o2267j74872j06045N4319p6555j09035L20785
2648d1681J11912n826M073j11713o3747P0197p2509o7463K58017J65043j39737
2637A06566j29506k1577j08081k5094j592l2679J85754J37038J3684K1210j18045
2626B7678K162k41607J87089K2662r548J05272q2098Q2917K07217J26310j85957
$$ plain form
2702 -215046 -235301 -101648 58075 -157917 -213899 -265006 -390726 -361073 -264583 54178 335885
2691 335885 200075 -19697 32452 -98646 -130292 34322 182686 -5555 -53371 -49041 -200458
2680 -200458 5177 -103163 -292030 -175382 -199221 -275204 -328462 82110 93945 -70816
2670 -70816 156778 223202 72772 120852 -182042 -243921 -186344 -94149 -168609 78140 70124
2659 70124 -80613 -133650 -60682 111989 49722 -125150 -231195 -176876 -253431 -362466 -41681
2648 -41681 70231 64405 68478 -43235 -106982 -36785 -109294 -176757 81260 246303 106566
2637 106566 -22940 -44517 -152598 -177692 -179284 -211963 -26209 110829 124513 145723 27678
2626 27678 29840 -211767 -24678 -2016 -11564 93708 11610 94527 301744 428054 242097
2615B42097q9044j31869j59039j32844K15449L3970j37862j26613J26398J34729
2605b4628l6544q4975K7279K08203j02201n1828M6153P0379j63847o5993R0493
2594h7509J58591j95791J48078Q1281n3122q2778l1706k45544j04359L61892J29299
2583G8332l7547M2079K5804k85992j85640m6924P0576J11081o6988K63412L0354
2572a453K723J91482k31536j20002M3053L38204P226k49465k8003J94592j03902
2561D2919j29294J22342J58408M1488j53172k34779P0282P9485j05269Q2760j38872
2550a63702J73847M32496j53986l27958R7199k11856J6168J83395j52884R270
2540i8011J41665J03058j23563J00328j31839J29285K33686k87595J82954Q1698
$$ plain form
2615 242097 153053 21184 -137855 -270699 -55250 -21280 -159142 -285755 -159357 -24628
2605 -24628 -61172 -146147 -118868 89335 -12866 -64694 -18541 51838 -112009 -178002 -87509
2594 -87509 71082 -124709 23369 104650 51528 -31250 -62956 -308500 -412859 -50967 78332
2583 78332 40785 82864 108668 -177324 -362964 -409888 -339312 -228231 -295219 -31807 -1453
2572 -1453 1270 192752 -38784 -158786 -115733 222471 229697 -19768 -47771 146821 42919
2561 42919 -86375 35967 194375 235863 82691 -152088 -81806 -2321 -107590 -24830 -163702
2550 -163702 10145 442641 288655 -39303 57896 -153960 -137792 45603 -107281 -98011
2540 -98011 43654 146712 23149 123477 -8362 120923 354609 67014 249968 331666
2530C31666o4581j72940K4175O3655Q819l2746j29362R2576j7224j9894K03025
2519B87169k36892n8305M6937k9758k62065K51678M555l3797N899m7792K31820
2508A59449l25102L3423P6573K60272J55759o9092j97930n643j9211l9364J43908
2497A73042m9579P6744k58767l6407L1718J10386j02543m0240J32220R102m1376
2486D300k99756J46371K08244J49234r9814n7677J69256j108j02043m3549o602
2475F6856J898j33370J25162j15769m2235l9985K05477K9006j76347O4620J6269
2464A582r8426R0391j94398l2407j72008j0845L36084o888J00819P7555o1824
2453B9635j01486O5075N5880k10238j06842J72797Q0626N7632O5503J69189k28066
$$ plain form
2530 331666 267085 94145 118320 181975 190794 158048 28686 121262 104038 84144 287169
2519 287169 50277 -8028 38909 9151 -252914 -1236 3319 -30478 -24579 -72371 159449
2508 159449 -165653 -132230 -55657 204615 360374 291282 93352 87709 68498 29134 173042
2497 173042 123463 200207 -58560 -94967 -63249 47137 -55406 -95646 36574 45676 4300
2486 4300 -295456 -149085 59159 208393 108579 50902 220158 219050 117007 73458 66856
2475 66856 68754 -64616 60546 -55223 -97458 -137443 68034 97040 -79307 -14687 1582
2464 1582 -96844 -6453 -200851 -233258 -405266 -416111 -80027 -86915 13904 91459 29635
2453 29635 -71851 -6776 49104 -161134 -267976 -95179 -14553 43079 108582 277771 49705
2442D9705n1909p3995J81441j87699M7211n1657k49622K82107j29800J8708J50489
2431a5021p6259n5398J15447J15463k99834J11374K13314K24863k2623k64379
2421D6947j72323R116K57085L49034k2649k72155K934j22880J47719J4717J73922
2410D11467j56158j32987j53918L84981n1877Q5826J20741k33703r0238l0568
2400A53566K13387K7234R6254j4152r7148k70537j22j19733J07519K57219J08830
2389D62317j51380l93217J61989J61915K45861m8470m3901M9757r9776k10693
2379A34402J78426J92127r2193l3607J04175M008p6043J1331L7736J02909M4975
2368F08246N6380J98803j17596j43049P5826Q3770J18371o7872N8869k35385o9727
$$ plain form
2442 49705 -2204 -76199 105242 -82457 -35246 -86903 -336525 -54418 -184218 -165510 -15021
2431 -15021 -91280 -146678 -31231 84232 -215602 -104228 109086 333949 311326 46947
2421 46947 -125376 -116260 140825 489859 467210 195055 197989 75109 222828 237545 411467
2410 411467 255309 122322 -31596 353385 301508 387334 508075 274372 184134 153566
2400 153566 366953 394187 490441 476289 379141 108604 108482 -11251 96268 353487 462317
2389 462317 310937 -82280 79709 241624 487485 439015 395114 444871 345095 134402
2379 134402 312828 504955 412762 379155 483330 487338 411295 422626 460362 563271 608246
2368 608246 664626 863429 745833 602784 678610 762380 880751 812879 871748 636363 566636
2357E66636q1242n1937K77465K4363j90064j6001O8625j90338k572j3125j10304
2346B81506K24118J04136n0954K1187J39668J26152J502k53895L26473J48753
2336A068646p4461j38303l8074P8451j31772L24388K48223k52452J53279k6939
2326A210986O0940J66379k4390J89087J66859K4656k1747J55415L1711Q5576q7736
2315A957736K21469J68385R5479K19577N0205j19995k62698L34485N84655K40874
2305C490172K41562J02219L3210K10053N31742O82447J94926M33373L23689r6625
2295F146768P5445L24949J62459K83136J83772K51726M45863N69544K47543P18416
2285I409621O60622O94610P47362N35711O99511N74914J198348J012361J418491
$$ plain form
2357 566636 485394 433457 710922 735285 545221 529220 597845 407507 404935 391810 281506
2346 281506 505624 609760 558806 579993 719661 845813 847315 593420 919893 1068646
2336 1068646 994185 855882 817808 896259 764487 1088875 1337098 1084646 1237925 1210986
2326 1210986 1271926 1438305 1413915 1603002 1769861 1794517 1772770 1928185 1959896 2045472 1957736
2315 1957736 2179205 2347590 2443069 2662646 2712851 2592856 2330158 2664643 3249298 3490172
2305 3490172 3731734 3833953 3867163 4077216 4608958 5291405 5486331 5919704 6243393 6146768
2295 6146768 6222213 6547162 6709621 6992757 7176529 7428255 7874118 8443662 8691205 9409621
2285 9409621 10070243 10764853 11512215 12047926 12747437 13322351 14520699 15533060 16951551
2276A6951551J272452J437530J753110K204628K184281K443903K416336K839417
2268C3503208L426304L433361K893479J938064J520490O66264k88601l150649
2260D3941920m548895m419367l553085l298509k573651k022789k141697j918460
2252A9465467j730500j490271j439697j320037o48879p39989r82502r56236j050840
2243I106516o05881n51740o38256l10874k97523o11345k97317l29667j20303l05610
2233E038000l05464m26316k21955j03633n22609j798k19190q6121l98298k31596
2223B521020O1832J35924L1455r9295j10138l91967j21023m2593k25804J2836
2213A772247K90092l47193m6617k69759J23822J52991q2596j60117j76983R4749
$$ plain form
2276 16951551 18224003 19661533 21414643 23619271 25803552 28247455 30663791 33503208
2268 33503208 36929512 40362873 43256352 45194416 46714906 47381170 47092569 43941920
2260 43941920 39393025 34973658 31420573 28122064 25548413 23525624 21383927 19465467
2252 19465467 17734967 16244696 14804999 13484962 12836083 12096094 11113592 10157356 9106516
2243 9106516 8500635 7948895 7310639 6999765 6702242 6090897 5793580 5463913 5343610 5038000
2233 5038000 4732536 4306220 4084265 3980632 3458023 3456225 3237035 3150914 2752616 2521020
2223 2521020 2582852 2718776 2750231 2650936 2540798 2148831 2027808 1985215 1759411 1772247
2213 1772247 2062339 1715146 1668529 1398770 1522592 1675583 1592987 1432870 1255887 1350636
2203A350636L01036k20792r2070p0895m5794R9819k10694j93859K3721J34056
2193A075164k62881j8697P438L3755K80340j19201j32692J43048m4493k19345
2183G42436k04267R1501r3546P3474L64096m56692M7984J90868k58911J16195
2173F13138j65911m5024K0373n668J46309R9426P1851k46029j25038L8461K74078
2162F75966k9006k51718j97949M0263J95831k61138j46204L35778P5677K19564
2152F57064k6589j63212l94299j75911J28715M417K13156J33504j16490k1080
2142B39275j04579k29228m1222J12883k1578o7687K43600l20472j15791q0133
2132c84932J80290K09740J16282J01818l8704P1618m2177K7040r2833J59818k77444
$$ plain form
2203 1350636 1651672 1430880 1338810 1267915 1222121 1321940 1111246 917387 941108 1075164
2193 1075164 812283 793586 801024 834779 1115119 995918 863226 1006274 961781 742436
2183 742436 538169 629670 536124 609598 973694 517002 564986 755854 496943 613138
2173 613138 447227 402203 422576 416908 563217 662643 734494 488465 363427 401888 675966
2162 675966 646960 395242 197293 237556 433387 172249 26045 361823 437500 657064
2152 657064 630475 467263 72964 -102947 25768 30185 243341 376845 260355 239275
2142 239275 134696 -94532 -135754 -22871 -44449 -112136 131464 -189008 -304799 -384932
2132 -384932 -204642 5098 121380 223198 184494 256112 213935 240975 148142 307960 30516
2121C0516m4513J12825q1839J25333k16170J18143K97237j73690l52837J63589
2111b1406J17223N9758J9059J40956k18657l69820K4685J69687l0351L39783m9812
2100A81105o8717J01181N3048M876m1779m4503j81016J12143J88556k52840n3565
2089a511j4242j15268j4084Q7097J64798j58208k6427R3084k3599K3730p6013
2078f0643Q4678L3243q4454R6608K38228l29481J363J60469O4570J56505j53337
2067B07749k81941J1116q236N9969J64180j10640L4714k32332O4933l7893k189
2056a30570J99239P6946p7038O0346o5278J22680K9300k30071j06880J35311Q8174
2045A02159L15324j09934r0920j08655J4337P079l0613q336k00888P2793q7651
$$ plain form
2121 30516 -13997 98828 16989 142322 -73848 44295 341532 167842 -184995 -21406
2111 -21406 95817 155575 174634 315590 96933 -272887 -248202 -78515 -108866 230917 181105
2100 181105 112388 213569 266617 271493 229714 185211 4195 116338 304894 52054 -1511
2089 -1511 -15753 -131021 -145105 -58008 106790 -51418 -77845 15239 -8360 15370 -60643
2078 -60643 24035 57278 -27176 69432 307660 -21821 -20458 140011 204581 361086 207749
2067 207749 -74192 -63076 -71312 -11343 152837 42197 76911 -155421 -90488 -128381 -130570
2056 -130570 68669 145615 68577 128923 63645 186325 215625 -14446 -121326 13985 102159
2045 102159 417483 307549 216629 107974 122311 129390 98777 90441 -110447 -37654 -125305
2034a25305L1720j14376N7055K3804r9567L03156K64731L4394p5142R181R9148
2023D08799m19725J24659J25457j03771j46565r9415j29016K45343K70936J5323
2013B92025J3295n490j01897J01728k17705k44819K74859P1391R3718k05555j58945
2002h7395K3926Q470K19134M064L8190j2723j83390q7652J06262J89990m4168
1991A74708k13713O6471J64674M8378j49071k00695K43067J25907j93187j50457
1981h3918K71875j41159l084j4711k0245q5992m5604J26565K16799K3695J53416
1970C97637j07639j13070Q0269j14726j06102J53977j02066l53939j1019K63037
1960a3641l7208P5167R3340j58560J97264K31511j27782q7000j74754p7662j12226
$$ plain form
2034 -125305 -93585 -207961 -150906 -127102 -226669 76487 341218 375612 300470 309651 408799
2023 408799 -10926 113733 239190 135419 -11146 -110561 -239577 5766 276702 292025
2013 292025 305320 299830 197933 299661 81956 -162863 111996 183387 277105 71550 -87395
2002 -87395 -63469 -54999 164135 168199 206389 193666 10276 -77376 28886 218876 174708
1991 174708 -39005 27466 192140 240518 91447 -109248 133819 259726 66539 -83918
1981 -83918 187957 46798 43714 29003 8758 -77234 -122838 3727 220526 244221 397637
1970 397637 289998 176928 257197 142471 36369 190346 88280 -265659 -276678 -13641
1960 -13641 -50849 24318 117658 -40902 156362 387873 260091 173091 -1663 -79325 -191551
1949a91551J31157l9088J50721K47288N4645o6299k95906r1482p3326q526m0215
1938b22582J28462L7441N5417k10467P2417J18351O2978k14853N0356J22728j72899
1927a72651r4729J26538j35659O1484J42075J07380j59681n0896Q983o7998K70673
1916C5519j3732m8365j52007k27512p8393L32098l2381M01876j88048r1387J0870
1905e1462j53596J24613q7180n1108o7062L08911q5099o7828L25830k01380p0996
1894g6357j31975L6094J34690j7322K14832o6415k35294q22j19150p7877J84696
1883a54900j36866J6604K476j64588J50414J43025L1933N1887J40545K5709k05499
1872i9260K79153o5711J54089k43048p069m7931O5923r0190N9328m6752j50056
$$ plain form
1949 -191551 -60394 -99482 51239 298527 353172 286873 -9033 -100515 -173841 -182367 -222582
1938 -222582 -94120 -56679 -1262 -211729 -139312 -20961 42017 -172836 -122480 248 -172651
1927 -172651 -267380 -140842 -276501 -215017 -72942 34438 -125243 -176139 -167156 -235154 35519
1916 35519 21787 -26578 -178585 -406097 -484490 -152392 -184773 217103 29055 -62332 -51462
1905 -51462 -205058 -80445 -167625 -218733 -285795 23116 -61983 -129811 196019 -5361 -76357
1894 -76357 -208332 -172238 -37548 -54870 159962 93547 -141747 -142569 -261719 -339596 -154900
1883 -154900 -291766 -275162 -272686 -437274 -286860 -143835 -111902 -60015 80530 106239 -99260
1872 -99260 179893 114182 268271 25223 18154 -29777 36146 -54044 5284 -41468 -191524
1861a91524j8640K56743J86856O7749m3227q8379k25226q6309K07886l4660J030
1850C2299n7328k5368M1387J21703l34094N7641O6765r7870q7881j539j9844J55989
1838a48140R9493J67838p0486L2665j62446j09386j73117J9330J10723K58013
1828B4487K3667o9110J9886j5896J74049j5198j33142k52050K99354k8160l62486
1817c34599J22355J12853l7826K06935l6847P5955j71469N8152j09725j13828
1807b28044J78027J95074j21369m2682j19341K4020o0558J23919J25791k0968
1797E3869j51257j53333P046O9688J85611n2710q9769J11755R5672k13589K9015
1786a08002O3352J26094J08161j9687k68368o8159L1775K23257k59170k8661J39861
$$ plain form
1861 -191524 -210164 46579 233435 301184 257957 169578 -55648 -141957 65929 31269 32299
1850 32299 -25029 -50397 -9010 112693 -221401 -163760 -96995 -194865 -282746 -284285 -304129 -148140
1838 -148140 -48647 119191 48705 81370 -81076 -190462 -363579 -344249 -233526 24487
1828 24487 48154 -20956 -1070 -16966 157083 141885 8743 -243307 56047 27887 -334599
1817 -334599 -212244 -99391 -137217 69718 32871 108826 -62643 -4491 -114216 -228044
1807 -228044 -50017 145057 23688 -18994 -138335 -114315 -174873 -50954 74837 53869
1797 53869 -97388 -250721 -243675 -173987 11624 -41086 -130855 -19100 76572 -137017 -108002
1786 -108002 -44650 81444 189605 169918 -98450 -166609 -134834 88423 -170747 -199408 -59547
1775e9547q3871J4922K59022j6397K9524k20251j27482M692l0802n3980J85781
1764i8389J85524j21892O5690l55560j56618L65313J80160l6832j86734J43309
1754a6029m4644j11601K508K4509j23710L35831k66210L7445L2956q4913J54587
1743e9271p7080J58000j58808J10970k94948M0459J64146J13182J8384N3284j74060
1732a05742O2812j63060J85082q8394j26591j3287q4944J82268K15129j99421
1722a36148J15057J78288m98522q285Q9165K55603m8958j04641n6016J59243N9891
1711D677j22769J70127m5747k39649M5907j75506J60228K84998J02365m3617o03
1700A40411n5231j09370M9183J9548N9295m3910j68376M30297l88669l33000Q3493
$$ plain form
1775 -59547 -143418 -128496 130526 114129 143653 -76598 -204080 -199388 -230190 -284170 -98389
1764 -98389 87135 -34757 30933 -324627 -481245 -115932 64228 27396 -159338 -16029
1754 -16029 -60673 -172274 -169766 -145257 -268967 66864 -199346 -161901 -128945 -213858 -59271
1743 -59271 -136351 21649 -137159 -26189 -321137 -280678 -116532 -3350 15034 68318 -105742
1732 -105742 -42930 -205990 -20908 -109302 -235893 -249180 -334124 -151856 63273 -136148
1722 -136148 -21091 157197 -341325 -349610 -260445 -4842 -53800 -158441 -214457 -55214 4677
1711 4677 -118092 52035 6288 -233361 -187454 -362960 -202732 82266 184631 141014 140411
1700 140411 85180 -24190 24993 44541 103836 59926 -108450 321847 -66822 -399822 -316329
1689c16329q1920J42047l3880M64885j78899M2284M6695R1631q7792j77085j28755
1678b17118j75035J80343J85016J02115j03996o9230k61232j56764J27778L01349
1668h6774P7486k02689J17508J54717L4739J5637j22782j87787j03775Q798L15978
1657B1056J30204o7926J33956m7845j66539k3587j99255k01548J62051J37092
1647a22341N7943p7872J88662J70491j77915l72807p1870m2919L83257r5951n3708
1636b15030J2572M8682J58541j64690m1739J97172j22418j11126K7807j38067
1626c48296J53158l4609L5375p128Q0681n0968J64560J12123j82645o3053O1853
1615g8949l44585J97611J3300M7770K3983k38138L8335M66442M9249k16876o6411
$$ plain form
1689 -316329 -398249 -256202 -290082 174803 -4096 38188 84883 176514 88722 -88363 -217118
1678 -217118 -392153 -211810 -26794 75321 -28675 -97905 -359137 -515901 -388123 -86774
1668 -86774 -9288 -211977 -94469 60248 94987 110624 -12158 -199945 -303720 -294922 21056
1657 21056 151260 83334 217290 169445 2906 -20681 -219936 -421484 -259433 -122341
1647 -122341 -64398 -142270 46392 216883 38968 -333839 -405709 -448628 -65371 -161322 -215030
1636 -215030 -202458 -153776 4765 -159925 -201664 -4492 -126910 -238036 -210229 -348296
1626 -348296 -195138 -229747 -194372 -201500 -120819 -171787 -7227 104896 -77749 -140802 -78949
1615 -78949 -423534 -225923 -212623 -164853 -140870 -379008 -340673 125769 175018 -41858 -108269
1604a08269N5334J89751k1483k4361N2736J426m56734M614J17357Q2083L10970
1593B03424Q2834k27024m30710K39353R3985l56838j4787L46642L6613J52515
1583A26007K7538j21329o7554l7410j9557j51262j6653J46812N0381N5569r0571
1572i8029J1442q7639P0591j30819m7145O9670N0329R1012j04118J34836k23855
1561b63725J81466J28313L5191N6938j22986j48978J75859q1852j07288L6592
1551a10470j34320o069L37939K2049k55039J36973K3451N4296J79241K03218k13814
1540B37455k80497p7948J3223m8843j7656P0687r182J01945J15854j14018j65073
1529a74053J28800J37664q1319L0399N2674R7387Q7607j72786L3564j58845o7921
$$ plain form
1604 -108269 -52935 136816 115333 90972 143708 145134 -311600 -306986 -189629 -107546 203424
1593 203424 286258 59234 -371476 -132123 -38138 -394976 -409763 -63121 -26508 126007
1583 126007 153545 32216 -35338 -72748 -92305 -243567 -260220 -113408 -63027 -7458 -98029
1572 -98029 -86587 -174226 -103635 -234454 -281599 -211929 -161600 -70588 -174706 -39870 -263725
1561 -263725 -82259 46054 81245 138183 15197 -133781 42078 -39774 -147062 -110470
1551 -110470 -244790 -250859 87080 109129 -145910 -8937 14514 68810 248051 451269 237455
1540 237455 -43042 -120990 -107767 -156610 -174266 -103579 -112761 -10816 105038 -8980 -174053
1529 -174053 -45253 92411 11092 41491 94165 191552 279159 106373 139937 -18908 -86829
1518h6829j48361J21010j07017N6142l3405J89578j56897O657J99591j7240M0459
$$ plain form
1518 -86829 -235190 -114180 -221197 -165055 -198460 -8882 -165779 -159122 40469 23229 63688
$$ [...]
##END NTUPLES=NMR SPECTRUM
##END=
