##TITLE=1H_CA-9317
 200.13MHz, CDCl3,
 8 sc
 
 10.2.2025
##JCAMPDX= 6.0         $$ Bruker NMR JCAMP-DX V2.0
##DATA TYPE= NMR SPECTRUM
##DATA CLASS= NTUPLES
##ORIGIN= UXNMR, Bruker Analytische Messtechnik GmbH
##OWNER= pz
$$ XWIN-NMR		Version 3.5
$$ Mon Feb 10 14:19:14 2025 Russian Standard Time (UT+4h)  she@DPX200
##.OBSERVE FREQUENCY= 200.1313
##.OBSERVE NUCLEUS= ^1H
##.ACQUISITION MODE= SIMULTANEOUS
##.ACQUISITION SCHEME= undefined
##.AVERAGES= 8
##.DIGITISER RES= 18
##SPECTROMETER/DATA SYSTEM= spect
##.PULSE SEQUENCE= zg30
##.SOLVENT NAME= CDCl3
##.SHIFT REFERENCE= (INTERNAL, CDCl3, 0, 15.4725)
##AUDIT TRAIL= $$ (NUMBER, WHEN, WHO, WHERE, WHAT)
$$ ##TITLE= Audit trail, XWIN-NMR		Version 3.5
$$ ##JCAMPDX= 5.01
$$ ##ORIGIN= Bruker BioSpin GmbH
$$ ##OWNER= she
$$ F:/spectra/data/she/nmr/H-C/1/pdata/1/auditp.txt
$$ ##AUDIT TRAIL=  $$ (NUMBER, WHEN, WHO, WHERE, WHAT)
(   1,<2025-02-10 14:17:49.68 +0400>,<she>,<DPX200>,
      <created by zg, POWCHK disabled, PULCHK disabled
       configuration hash MD5:
       00 E9 B6 7A A2 85 ED C7 34 08 36 98 17 FE 4E 26
       data hash MD5: 16K
       CB F7 56 68 AA 78 ED 3F 0D 25 FC 5A 8A 38 6E 6E>)
(   2,<2025-02-10 14:17:52.03 +0400>,<she>,<DPX200>,
      <Start of raw data processing
       efp BC_mod = 2 LB = 0.25 FT_mod = 6 PKNL = 1 PHC0 = -469.7299 PHC1 = 9.592205 SI = 16K 
       data hash MD5: 16K
       D1 F8 DE C1 4E 3F 98 04 96 2B C9 7A 34 A2 EF 44>)
(   3,<2025-02-10 14:18:20.76 +0400>,<she>,<DPX200>,
      <pk PHC0 = 4.934337 PHC1 = -3.4 
       data hash MD5: 16K
       45 01 E1 FB 79 8D 71 8C BE 11 69 27 0E 68 80 1A>)
(   4,<2025-02-10 14:18:25.06 +0400>,<she>,<DPX200>,
      <abs ABSG = 5 
       data hash MD5: 16K
       B0 A2 EC 28 68 61 5F F1 25 99 13 A3 6B 73 35 6A>)
$$ ##END=
$$ 
$$ hash MD5
$$ 53 F7 F2 6A 37 8F 15 74 9E CD 90 93 BF AC A5 A4
##$RELAX= 
##$RELAX= 
##$RELAX= 
##$RELAX= 
##$RELAX= 
##$RELAX= 
$$ Bruker specific parameters
$$ --------------------------
##$DU= <F:/spectra>
##$EXPNO= 1
##$NAME= <H-C>
##$PROCNO= 1
##$TYPE= <nmr>
##$USER= <she>
##$AMP= (0..31)
100 100 100 100 100 100 100 100 100 100 100 100 100 100 100 100 100 100 
100 100 100 100 100 100 100 100 100 100 100 100 100 100 
##$AQSEQ= 0
##$AQ_mod= 1
##$AUNM= <au_zg>
##$AUTOPOS= <>
##$BF1= 200.13
##$BF2= 200.13
##$BF3= 200.13
##$BF4= 200.13
##$BF5= 200.13
##$BF6= 200.13
##$BF7= 200.13
##$BF8= 200.13
##$BYTORDA= 1
##$CFDGTYP= 0
##$CFRGTYP= 5
##$CHEMSTR= <none>
##$CNST= (0..31)
1 1 145 1 1 1 1 1 1 1 1 1 1 1 1 1 1 1 1 1 1 1 1 1 1 1 1 1 1 1 1 1 
##$CPDPRG= <>
##$CPDPRG1= <>
##$CPDPRG2= <>
##$CPDPRG3= <>
##$CPDPRG4= <mlev>
##$CPDPRG5= <mlev>
##$CPDPRG6= <mlev>
##$CPDPRG7= <mlev>
##$CPDPRG8= <mlev>
##$CPDPRGB= <>
##$CPDPRGT= <>
##$D= (0..31)
0 0.7 0 0 0 0 0 0 0 0 0 0.03 0 0 0 0 0 0 0 0 0 0 0 0 0 0 0 0 0 0 0 0 
##$DATE= 1739182669
##$DBL= (0..7)
120 120 120 120 120 120 120 120 
##$DBP= (0..7)
150 150 150 150 150 150 150 150 
##$DBP07= 0
##$DBPNAM0= <>
##$DBPNAM1= <>
##$DBPNAM2= <>
##$DBPNAM3= <>
##$DBPNAM4= <>
$$ [...]
##$SUBNAM3= <"">
##$SUBNAM4= <"">
##$SUBNAM5= <"">
##$SUBNAM6= <"">
##$SUBNAM7= <"">
##$SUBNAM8= <"">
##$SUBNAM9= <"">
##$SW= 18.0517328524113
##$SWIBOX= (0..15)
0 0 2 0 0 0 0 0 0 0 0 0 0 0 0 0 
##$SW_h= 3612.71676300578
##$TD= 16384
##$TD0= 1
##$TE= 0
##$TE2= 300
##$TE3= 300
##$TEG= 300
##$TL= (0..7)
0 120 120 120 120 120 120 120 
##$TP= (0..7)
150 150 150 150 150 150 150 150 
##$TP07= 0
##$TPNAME0= <>
##$TPNAME1= <>
##$TPNAME2= <>
##$TPNAME3= <>
##$TPNAME4= <>
##$TPNAME5= <>
##$TPNAME6= <>
##$TPNAME7= <>
##$TPOAL= (0..7)
0.5 0.5 0.5 0.5 0.5 0.5 0.5 0.5 
##$TPOFFS= (0..7)
0 0 0 0 0 0 0 0 
##$TUNHIN= 0
##$TUNHOUT= 0
##$TUNXOUT= 0
##$USERA1= <user>
##$USERA2= <user>
##$USERA3= <user>
##$USERA4= <user>
##$USERA5= <user>
##$V9= 5
##$VALIST= <valist>
##$VCLIST= <CCCCCCCCCCCCCCC>
##$VD= 0
##$VDLIST= <DDDDDDDDDDDDDDD>
##$VPLIST= <PPPPPPPPPPPPPPP>
##$VTLIST= <TTTTTTTTTTTTTTT>
##$WBST= 1024
##$WBSW= 4
##$XGAIN= (0..3)
0 0 0 0 
##$XL= 0
##$YL= 0
##$YMAX_a= 205899
##$YMIN_a= -225763
##$ZGOPTNS= <>
##$ZL1= 120
##$ZL2= 120
##$ZL3= 120
##$ZL4= 120
##$ABSF1= 15.42957
##$ABSF2= -2.622279
##$ABSG= 5
##$ABSL= 3
##$ALPHA= 0
##$AQORDER= 0
##$ASSFAC= 0
##$ASSFACI= 0
##$ASSFACX= 0
##$ASSWID= 0
##$AUNMP= <proc_1d>
##$AZFE= 0.1
##$AZFW= 0.1
##$BCFW= 0
##$BC_mod= 2
##$BYTORDP= 0
##$COROFFS= 0
##$CY= -3
##$DATMOD= 1
##$DC= 0
##$DFILT= <>
##$DTYPP= 0
##$F1P= 0
##$F2P= 0
##$FCOR= 1
##$FTSIZE= 16384
##$FT_mod= 6
##$GAMMA= 0
##$GB= 0
##$INTBC= 1
##$INTSCL= 3.241238e-09
##$ISEN= 128
##$LB= 0.25
##$LEV0= 0
##$LPBIN= 0
##$MAXI= 10000
##$MC2= 0
##$MEAN= 0
##$ME_mod= 0
##$MI= 1.114404
##$NCOEF= 0
##$NC_proc= -6
##$NLEV= 6
##$NOISF1= 3.799351
##$NOISF2= 2.8
##$NSP= 0
##$NTH_PI= 0
##$NZP= 0
##$OFFSET= 15.47254
##$PC= 1
##$PHC0= -464.7956
##$PHC1= 6.192205
##$PH_mod= 1
##$PKNL= yes
##$PPARMOD= 0
##$PSCAL= 0
##$PSIGN= 0
##$REVERSE= no
##$SF= 200.130009838977
##$SI= 16384
##$SIGF1= 3
##$SIGF2= 2
##$SINO= 0.751879
##$SIOLD= 32768
##$SREGLST= <19F.Aceton>
##$SSB= 0
##$STSI= 16384
##$STSR= 0
##$SW_p= 3612.71676300578
##$SYMM= 0
##$S_DEV= 0
##$TDeff= 16384
##$TDoff= 0
##$TI= <>
##$TILT= no
##$TM1= 0
##$TM2= 0
##$TOPLEV= 0
##$USERP1= <user>
##$USERP2= <user>
##$USERP3= <user>
##$USERP4= <user>
##$USERP5= <user>
##$WDW= 1
##$XDIM= 16384
##$YMAX_p= 315389686
##$YMIN_p= -417952
$$ End of Bruker specific parameters
$$ ---------------------------------
##NTUPLES= NMR SPECTRUM
##VAR_NAME=  FREQUENCY,     SPECTRUM/REAL,   SPECTRUM/IMAG
##SYMBOL=    X,             R,               I
##VAR_TYPE=  INDEPENDENT,   DEPENDENT,       DEPENDENT
##VAR_FORM=  AFFN,          ASDF,            ASDF
##VAR_DIM=   16384,         16384,           16384
##UNITS=     HZ,            ARBITRARY UNITS, ARBITRARY UNITS
##FACTOR=    0.220516191357247, 1,           1
##FIRST=     3096.51956276787, 0,            0
##LAST=      -516.197200237911, 0,           0
##MIN=       -516.197200237911, -417952,     0
##MAX=       3096.51956276787, 315389686,    0
$$ Real data points
##PAGE= N=1
##DATA TABLE= (X++(R..R)), XYDATA
$$ [...]
9017B02780J30425k5865P2176O16n9779m9375L6669R9891m6198L0303n638K5786
9005D11791P0972j51452K434n3812Q2401l0856l4669L3586l6591M5235Q1419j1822
8993D08636J03161K0412j61170O336J09203R3200q4011q2142j0483O0034K4580
8982D87756J52122l4510k2750N5135j48022J04780j5474j18191R3147J50687n4388
8971F50292P4715l183m1476K6545J38046M5384l04R1286k3731Q1923J30279J2334
8959A182110K4781J28015l4928N1232R2613J9984J70958J14271P3134Q2386J5380
8948A919936n6848P7945J33800J34988Q3876j6801J57783K91248K26012J19520
8938C071459L26827L25188J45149K37501M54553M18277M61232N92533O05136Q28458
$$ plain form
9017 202780 333205 307340 379516 380132 320353 270978 307647 407538 361340 391643 386005 411791
9005 411791 482763 331311 333745 279933 362334 331478 296809 330395 293804 339039 420458 408636
8993 408636 511797 532209 371039 377375 486578 579778 495767 413625 403142 463176 487756
8982 487756 639878 605368 582618 637753 489731 594511 579037 460846 553993 704680 650292
8971 650292 725007 721824 680348 706893 844939 890323 890019 981305 957574 1039497 1169776 1182110
8959 1182110 1206891 1334906 1299978 1351210 1443823 1463807 1634765 1749036 1822170 1904556 1919936
8948 1919936 1863088 1941033 2074833 2209821 2293697 2276896 2434679 2725927 2951939 3071459
8938 3071459 3398286 3723474 3868623 4106124 4560677 4978954 5440186 6032719 6637855 7466313
8928G466313J048446J305444J648164J860470J482046L70682o95495j517426j785700
8919A1182944j796797j511898j037612r08632p55560m59594l74427l28913n16992
8910C492519l61065p8526l36253j85263q8034k54367r8940j14635k12592j17021
8900A645823K2934p0530j57823l3925J11027J26995j97868j48581n5175j5203
8890A227674k7476j32720K7401j16395N6173J2564j34329R1034O881n0685Q9475
8879A049597O603p5475m0322R7885J08842q6842M0676j31511l4122P0373m9734
8868I55970p6378L8567L7255J6947M5688L5808j3984j03566j37440L0215J54681
8857I83763l0971n6476Q3926k8123m311K111n2429J32o3898Q9660P3134K9298
$$ plain form
8928 7466313 8514759 9820203 11468367 13328837 14810883 15181565 14486070 12968644 11182944
8919 11182944 9386147 7874249 6836637 5928005 5172445 4712851 4338424 4009511 3492519
8910 3492519 3131454 3052928 2716675 2531412 2443378 2189011 2090071 1975436 1762844 1645823
8900 1645823 1668757 1598227 1440404 1406479 1517506 1644501 1446633 1298052 1242877 1227674
8890 1227674 1200198 1067478 1094879 978484 1034657 1047221 912892 1003926 1010807 960122 1049597
8879 1049597 1056200 980725 940403 1038288 1147130 1060288 1100964 969453 935331 1005704 955970
8868 955970 879592 918159 955414 972361 1018049 1053857 1039873 936307 798867 829082 983763
8857 983763 952792 896316 980242 952119 947808 949919 897490 897622 833724 923384 996518 1025816
8845A025816j8852O1922R7060J66473n4156j21862j19154N6465R9111l1741J36702
8834A297784k6248k0656J00496j20058r177J28003p8442L7607l2391j0367K2034
8823A288585J21920J85892r0441j03658j31465J0077J35754K1162r5801m5425
8813A296600J81659J56290O1314N5880O2906Q653k3303j829M2097Q303J29809
8802A978379j5250R9974R0876o0291Q5219R0723J19086J24462O0248J24482n0493
8791B647415J55099Q153N4139K35273R2032J74106J89024J89869J25622J83135
8781D053867K60223Q3945N8146K62536K85842K08495K06810L23903J57515L76117
8771F277399K80183K87119L26892K94558L96114N05908L51411L57114M66239L39405
$$ plain form
8845 1025816 1006964 1068886 1165946 1332419 1278263 1156401 1037247 1093712 1192823 1161082 1297784
8834 1297784 1271536 1250880 1351376 1231318 1222141 1350144 1271702 1309309 1276918 1266551 1288585
8823 1288585 1410505 1596397 1505956 1402298 1270833 1280910 1416664 1437826 1342025 1296600
8813 1296600 1478259 1634549 1695863 1751743 1814649 1823302 1799999 1798170 1840267 1848570 1978379
8802 1978379 1963129 2063103 2153979 2093688 2178907 2269630 2388716 2513178 2573426 2697908 2647415
8791 2647415 2802514 2810667 2864806 3100079 3192111 3366217 3555241 3745110 3870732 4053867
8781 4053867 4314090 4398035 4456181 4718717 5004559 5213054 5419864 5743767 5901282 6277399
8771 6277399 6557582 6844701 7171593 7466151 7862265 8368173 8719584 9076698 9542937 9882342
8761I882342M21253L76860N47880P83509Q90680R82744R21449J019720J461566
8752A7288003J613826J771844K156561K388203K796748L291360L640226L769059
8744C8715830L496886K355848P61124j069557k400874l500671l854717l464497
8736C1039372l039814k477735k003269j720392j433012r60004p73451n87156m55397
8727A7589142l74807k78131k25024M4642J39253M5461K84609K00778M33602P76110
8717A8635635P57290R00979J190641J408527J473523J943178K215757K695651
8709C1221181L311037L607975M178788M691258M545585L426880J595825n94237
8701E5984292k812637m421560n308380n356537m785162m196710l415580k893198
$$ plain form
8761 9882342 10303595 10680455 11228335 12011844 12902524 13885268 14806717 15826437 17288003
8752 17288003 18901829 20673673 22830234 25218437 28015185 31306545 34946771 38715830
8744 38715830 42212716 44568564 45329688 44260131 41859257 38358586 34503869 31039372
8736 31039372 27999558 25521823 23518554 21798162 20365150 19405146 18631695 18044539 17589142
8727 17589142 17214335 16936204 16711180 16755822 16895075 16940536 17225145 17425923 17859525 18635635
8717 18635635 19392925 20293904 21484545 22893072 24366595 26309773 28525530 31221181
8709 31221181 34532218 38140193 42318981 47010239 51555824 54982704 56578529 55984292
8701 55984292 53171655 48750095 43441715 38085178 33300016 29103306 25687726 22794528
8693B2794528k553775j930976j693322j385512j248552j066710j101536r74454
8685A0839691p92435n52576n13714n36771l68965m20238l77008l51917j92663
8676F733404l48599l46938k89283l47439l25018j29537j91617j13716j95017j13759
8666D332481j90420j53918M6586j00142j38139p6143p7084r0122j10730o3391
8656C378978k111J1834p6280q0950j0205K2576k07966L7783K1168o4036j13756
8645B917035K13J6155k392R9485j51699M405J69482n1440m7915k5468m3990J3974
8633B897845N1494J47222M4290m7943j7430n0770Q5235J25721N7291J62879K2143
8622C477977k7483o2187P2757J15521J68841M186J48885P0481p2531J60298K49926
$$ plain form
8693 22794528 20240753 18309777 16616455 15230943 13982391 12915681 11814145 10839691
8685 10839691 10047256 9494680 8980966 8444195 8075230 7654992 7277984 6926067 6733404
8676 6733404 6384805 6037867 5748584 5401145 5076127 4946590 4754973 4641257 4446240 4332481
8666 4332481 4142061 3988143 4034729 3934587 3796448 3720305 3643221 3553099 3442369 3378978
8656 3378978 3376867 3388701 3312421 3231471 3221266 3243842 3035876 3073659 3094827 3030791 2917035
8645 2917035 2917248 2933403 2931011 3030496 2878797 2883202 3052684 3001244 2953329 2927861 2883871 2897845
8633 2897845 2949339 3096561 3140851 3092908 3075478 3024708 3109943 3235664 3292955 3455834 3477977
8622 3477977 3450494 3388307 3461064 3576585 3745426 3749612 3898497 3968978 3896447 4056745 4306671
8611D306671J65846J33320K58281L5475Q3767K02800J82347K64955J80831K05661
8601F019954L15551L31572L20819L30277L06906L54511M36424L91688M42619N18268
8591I768589N24735M75282M48532O32884M95808P10943O90415P08024Q76909P12958
8581A6045079Q10701J062412J126999J216787J357239J553616J663191J859372
8573B6695396K298862K602094K990225L287295L919024M244580M259942M142845
8565E4440263L607217K640037J361584M43192m62305o65827m88461J33381Q22831
8556F1831912J152234J319279O31839n32301j736231l373633m686778n151653
8548D9454668n308982n013646m628893l929950l286856k798475k343160j865290
$$ plain form
8611 4306671 4472517 4605837 4864118 4899593 4983360 5186160 5368507 5633462 5814293 6019954
8601 6019954 6335505 6667077 6987896 7318173 7625079 7979590 8416014 8807702 9250321 9768589
8591 9768589 10293324 10768606 11217138 11850022 12345830 13056773 13747188 14455212 15332121 16045079
8581 16045079 16855780 17918192 19045191 20261978 21619217 23172833 24836024 26695396
8573 26695396 28994258 31596352 34586577 37873872 41792896 46037476 50297418 54440263
8565 54440263 58047480 60687517 62049101 62492293 62029988 61364161 60875700 61009081 61831912
8556 61831912 62984146 64303425 64935264 64402963 62666732 59293099 54606321 49454668
8548 49454668 44145686 39132040 34503147 30573197 27286341 24487866 22144706 20279416
8540B0279416j675595j622606j280234j239571r33771o80331q77136o93730o62127
8531A0614315m87533l82617n70771k83598k38133k63012l38683k49156l61760
8522G439052k36601j26893k6288j22281k44556r8388j15065p830j74041k9590
8512F257519K2466p6040q6524P0241L0131Q2038N2237l1054j42440l0609K50439
8501F398404J84666J57823K17812J25336J39615J41153K21804L17124K76167K72643
8491H452547L71529K35141K95891L64448L68063M30212N13503M08996M04827N30310
8481A2375467N99486P65815Q86055R89896R66570J171470J359958J527704J750960
8472B2393381K085778K508730K703545L113883L387771L116263K433490Q73754
$$ plain form
8540 20279416 18603821 16981215 15700981 14461410 13527639 12847308 11970172 11276442 10614315
8531 10614315 10126782 9744165 9173394 8889796 8651663 8388651 8049968 7800812 7439052
8522 7439052 7202451 7075558 7049270 6926989 6682433 6584045 6468980 6461150 6287109 6257519
8512 6257519 6279985 6203945 6117421 6187662 6217793 6299831 6352068 6321014 6178574 6147965 6398404
8501 6398404 6583070 6740893 6958705 7084041 7223656 7364809 7586613 7903737 8179904 8452547
8491 8452547 8824076 9059217 9355108 9719556 10087619 10517831 11031334 11440330 11845157 12375467
8481 12375467 12974953 13740768 14626823 15616719 16583289 17754759 19114717 20642421 22393381
8472 22393381 24479159 26987889 29691434 32805317 36193088 39309351 41742841 42616595
8464D2616595o03986j383719j862426j655600q50140j68449L02247Q44736Q61168
8455C8100426L56296o52978j676441k523372k919916k708493k357255j969904
8447B3648363j641505j308264j111936p76161o56240n01036j98760l8053r26L03265
8437A7718747K58679M58709P44223R53174J135697J243895J577662J880648K225370
8428B8196804K188941J799704J033302j41950j010242j507123j493435j166334
8420B7899667o16628k18042M06267O76397K29433l57069j241789j957831k431335
8411B2389070k435055k340648k042253j678977j452353j210489r63546p46570
8403I519179p80291o66276o79688m71581m90307l11368l10553m15705l11935j75413
$$ plain form
8464 42616595 42012609 40628890 38766464 37110864 36260724 36092275 36394522 37239258 38100426
8455 38100426 38456722 37803744 36127303 33603931 30684015 27975522 25618267 23648363
8447 23648363 22006858 20698594 19586658 18810497 18154257 17653221 17454461 17416408 17415482 17718747
8437 17718747 17977426 18436135 19180358 20133532 21269229 22513124 24090786 25971434 28196804
8428 28196804 30385745 32185449 33218751 33076801 32066559 30559436 29066001 27899667
8420 27899667 27283039 27064997 27471264 28147661 28377094 28020025 26778236 24820405 22389070
8411 22389070 19954015 17613367 15571114 13892137 12439784 11229295 10265749 9519179
8403 9519179 8738888 8072612 7392924 6921343 6431036 6119668 5809115 5393410 5081475 4906062
8393D906062j35928j86625l07619k73681l0835j49697j86051j52988M490k58258
8383C228870n0093q3228j26602Q579j31870q2676k4635j55324o0716K2339N1402
8372B596046J6487r3606k44961j8852j19607p5097o6522j59988K20532n4481j46219
8361A853732j18675k12721N0730K9708Q977K973j30488k2518k5498k874o3556
8350A369790r0745P2580J332M1851j19680L1312L32j44096p6903J4294r435n1144
8338A039488K8383L8681O3226m4649P1804n1222n9203n0196n3273j03766O1822
8327I41095J04693j09753q4473k2885j10014q1232J18703n2903r9746J985L1776
8316F37246O8478J457j679l4193j30783P045J6506m7365q5833n0863R9242N516
$$ plain form
8393 4906062 4770134 4583509 4275890 4002209 3971374 3821677 3635626 3482638 3487128 3228870
8383 3228870 3178777 3095549 2968947 2977526 2845656 2762980 2738345 2583021 2522305 2544644 2596046
8372 2596046 2612533 2518927 2273966 2255114 2135507 2060410 1993888 1833900 2054432 1999951 1853732
8361 1853732 1735057 1522336 1573066 1602774 1611751 1614724 1484236 1461718 1436220 1433346 1369790
8350 1369790 1279045 1351625 1352957 1394808 1275128 1306440 1306772 1162676 1085773 1100067 1090632 1039488
8338 1039488 1067871 1106552 1169778 1125129 1196933 1145711 1086508 1036312 983039 879273 941095
8327 941095 1045788 936035 851562 828677 718663 637431 756134 703231 603485 605470 637246
8316 637246 705724 707181 705502 671309 540526 547571 564077 516712 430879 380016 479258 484774
8304D84774J24133r4658r6398O4241o475o3289l792J6290R2944n1748m5752L8083
8292D58353j02969L7617o5479p3827p3959M2047J6323R922K145N2379O4066o1493
8280C05125l8800m3846M6105Q9969l7596k7274J30424r931J4196m2826p9530p2051
8268B33965J13561j0859n4827N7754r867M8338j21860j85976R8351L3248o217
8257A95611L3757J18677k3864P0693m6717m0856K6392r1889n934j63056J37653
8246B10467J39089o5295j65987k4394J34127L7452q2560O3653M8231P5239L7657
8235D07679k743m2774k6440P4200p1902k684l0045n2636J3760P242R1007K3332
8223C87996m9050j5693J5298j32723k1272J1424J46880P9941j14442j2347O806
$$ plain form
8304 484774 608907 514249 417851 482092 475617 412328 408536 424826 517770 466022 420270 458353
8292 458353 355384 393001 327522 253695 179736 221783 238106 248028 250173 302552 366618 305125
8280 305125 266325 222479 268584 358553 320957 293683 424107 414176 428372 385546 306016 233965
8268 233965 347526 336667 281840 339594 329727 378065 256205 70229 168580 201828 195611
8257 195611 229368 348045 324181 394874 348157 307301 333693 241804 235870 72814 210467
8246 210467 349556 284261 118274 93880 228007 265459 182899 246552 294783 370022 407679
8235 407679 404936 362162 335722 409922 338020 335336 305291 252655 266415 273657 364664 387996
8223 387996 338946 323253 338551 205828 184556 195980 342860 422801 308359 296012 302818
8212C02818p2953J40866J88351l0544L0366l5530j1382K5611k5417l0529l0644
8201D51013o9145N5309j7795j6670r1983L8166n4979n566k05700j68364L47352
8190B61638j6235j2134k398l4499P7954N6567l1391p2381j06408o7987k3455R8683
8178A27954k9901k2606L4851m3855M4451l1118p399R4153L0224l7963j19217j7063
8166B2511k4923M3371P3579j775L0018L3740m4490P0500M0401M3108J2545o2782
8154B35803j30578N2040r794L6834J76414j64779j3730p4383J3938n9454q617
8143E3694l822O6213k0780n1571K2574K6719n2371k8703J54704m3228K0769m590
8131A39608p2371n4803P8615J08000N407r4616k20721N6677K7202p0725J28421
$$ plain form
8212 302818 229865 370731 559082 528538 558904 523374 511992 537603 512186 481657 451013
8201 451013 381868 437177 419382 402712 310729 348895 293916 288350 82650 -85714 261638
8190 261638 245403 233269 230871 196372 274326 330893 299502 227121 120713 52726 29271 127954
8178 127954 98053 75447 110298 66443 110894 79776 72377 166530 196754 158791 39574 22511
8166 22511 -2412 40959 114538 112763 142781 176521 132031 202531 242932 286040 298585 235803
8154 235803 105225 157265 147471 184305 360719 195940 182210 107827 121765 62311 53694
8143 53694 49872 116085 95305 43734 66308 93027 40656 11953 166657 123429 144198 139608
8131 139608 67237 12434 91049 199049 204456 109840 -110881 -54204 -27002 -97727 30694
8120C0694k2483J19558L3968M096L707k2091m895J4293r3557O7767J50791k2204
8108B59644L7984K0553K8859p4579n0519l0826j4899R3068j616p9118n1913M8672
8096A85310J2662m0288j5000O5537k8920p1205Q6280n0491K1758m8365L959O5756
8084A86993o5334K4453o5852j3202J21753J6291m8175l5621q4574j9642j17325
8073a00235K18682L5729o7882O2214n2777K6539q3257P8772m527N3210J3611N4780
8061B34859j35724r2721P6981Q1579n1361m393j03226O9728p998k3387l9683M3701
8049D8355j03021R0207J1934p7019J43812j8819j1133n0623p2672k7076K9675
8038c6380O4671J8065J9353j9839m156j12255N4550J0694K0991N7002n1944M2089
$$ plain form
8120 30694 8211 127769 161737 165833 169540 147449 142554 156847 63290 131057 281848 259644
8108 259644 297628 318181 347040 272461 221942 191116 176217 269285 267669 188551 136638 185310
8096 185310 197972 157684 142684 208221 179301 108096 194376 143885 165643 117278 121237 186993
8084 186993 121659 146112 80260 67058 188811 205102 156927 121306 36732 17090 -100235
8073 -100235 118447 154176 86294 148508 95731 122270 39013 117785 113258 166468 180079 234859
8061 234859 99135 6414 83395 164974 113613 109220 5994 75722 67724 44337 4654 48355
8049 48355 -54666 35541 47475 -29544 114268 95449 84316 33693 -38979 -66055 -36380
8038 -36380 28291 46356 65709 45870 41714 -70541 -15991 -5297 15694 72696 20752 62841
8026F2841Q955N2989L4465q7579N4592o9861j89365K6761P1811J986q8755k4303
8014a45463O8296P7330P4303M60r5395m3584j02886l9328K7757R5834q5386O1291
8002a06771N1153J19883j54141L4528j1905N4103L3849k1346q5070j5696J0540
7991i0873J11078Q3943o5121o4584N8735j42484Q1547L7206k6454j5891j1975
7980d4873j85991M5602K6270M6757K4727m1348L4172J2873j0168r2306K20211
7969C5926J77673l0668j33110K2312J6338l3451k0229L4966l4219O0110o4347
7958C1301m8792n1977K9348L4216r1454o8202M9475O2380J87070j4713q5288q2749
7946d9385N5106j39692n6825L2292K7887O3115p5708K6307J04172K2647P1789
$$ plain form
8026 62841 71796 124785 159250 71671 126263 56402 -132963 -106202 -34391 -32405 -121160 -145463
8014 -145463 -77167 163 74466 74926 -20469 -64053 -166939 -206267 -178510 -82676 -168062 -106771
8002 -106771 -55618 64265 -89876 -55348 -67253 -13150 20699 -647 -85717 -101413 -90873
7991 -90873 20205 104148 39027 -25557 33178 -109306 -27759 9447 -17007 -32898 -44873
7980 -44873 -230864 -185262 -158992 -112235 -87508 -128856 -94684 -81811 -91979 -184285 35926
7969 35926 213599 182931 49821 72133 88471 55020 34791 69757 35538 95648 31301
7958 31301 -17491 -69468 -40120 -5904 -97358 -165560 -116085 -53705 133365 118652 33364 -49385
7946 -49385 5721 -133971 -190796 -158504 -130617 -67502 -143210 -116903 -12731 9916 81705
7935H1705J31915j04165j40504O8535j9702q3793K9744Q032j8956J06141m7349
7924A1603j04839L0275M1197n4594m5357M3945k4537O6621R4628q3248N4615l1150
7912h41p0572p8594R124Q1053N16J16406j17377j7953j8379m1757Q9787P524m0500
7899h1563k2070m8711J1597K2497P8935P7073j19267j15533O2227J51452p8266
7888f1629n3415P1810J14821q4371p9954Q2268P6309j61865j035J43895R4155
7877A40989m6911k63350q0893R1314N6479M7261m0993j4502K0687R1831J8477
7866B0389o1715R3503K2892k24120P0630J35909o4444k6J955o5871Q3093L7763
7854D9958L039J6145j81613j02868P9114R6959j6950K704K2012J4480j15537K4083
$$ plain form
7935 81705 213620 109455 -31049 37486 17784 -66009 -36265 -28233 -47189 58952 11603
7924 11603 -93236 -62961 -21764 -76358 -121715 -77770 -102307 -35686 58942 -24306 30309 -841
7912 -841 -71413 -150007 -140883 -59830 -59314 57092 -60285 -78238 -96617 -138374 -48587 -41063 -81563
7899 -81563 -103633 -152344 -140747 -118250 -39315 37758 -81509 -197042 -134815 16637 -61629
7888 -61629 -115044 -43234 71587 -12784 -92738 -10470 65839 -96026 -97061 46834 140989
7877 140989 94078 -169272 -250165 -158851 -102372 -55111 -96104 -110606 -89919 1912 20389
7866 20389 -41326 52177 75069 -149051 -78421 57488 -6956 -6982 -5027 -70898 12195 49958
7854 49958 52997 69142 -112471 -215339 -136225 -39266 -56216 -53512 -31500 -17020 -132557 -108474
7842a08474J22991n3820m0942O9779M0225P8992q9066o522J19870L3446j57723
7831H756l7472N8434l1513q4582r6321L1973N2033p4493R3982K1722Q0703o4340
7819d1118j23684M8345r0944k7946J26668N4228L198j14967j42305o0180K71803
7808i6902K14743j05703j57347N4359J03329k5270m1543l6461P7003m7080J66456
7797A05584J8874k36766l6601L4668j01832P8916K9464O8041r015n815N3644j15014
7785a15852R2416L4671j19609k55O1821M4651M9051m5589q943k5438N6212J2267
7773C5403m8487r363J5421L6636j82385P8836L3798j04491L303J36168L291j82899
7761a84769J4958J16351M631p2657P8218j8042n1587k1838J49856j07410J07764
$$ plain form
7842 -108474 14517 -39303 -80245 -10466 29759 108751 19685 13163 133033 166479 8756
7831 8756 -28716 29718 -1795 -86377 -182698 -150725 -98692 -173185 -79203 -57481 23222 -41118
7819 -41118 -164802 -116457 -207401 -235347 -108679 -54451 -51253 -166220 -308525 -368705 -96902
7808 -96902 117841 12138 -145209 -90850 12479 -12791 -54334 -90795 -13792 -60872 105584
7797 105584 124458 -112308 -148909 -114241 -216073 -137157 -107693 -39652 -48667 -54482 -838 -115852
7785 -115852 -23436 11235 -108374 -108629 -46808 -2157 46894 1305 -7638 -33076 23136 35403
7773 35403 -13084 -22447 -7026 29610 -152775 -73939 -40141 -144632 -141329 -5161 -1870 -184769
7761 -184769 -169811 -53460 -48829 -121486 -43268 -61310 -112897 -134735 15121 -92289 15475
7750A5475r980j3887L6776p7013p7718n4124k6614J5636R0096J4559N9146K1426
7738f222j530J5882R733l2411Q8293j22856m5126R3839K3609k4415p0757n5674
7726a27635m4237K5971k0676O003L1297R9127L5580m5352J1552o2347j7171R1051
7714a6837M7325o1181P5288L0461p2765j76636O6621P5529q9809j1969p1184R6843
7702a08314J00551J8646n581j12849J21812J06219K3910o1901o6017Q708O9829
7691I5013n6396j57310o1265J11039J975k5391K2443J3511j8690l7646R5113K4747
7679G143l4557m8372m7299L8745q0858J46583J63058p0194O4346k1816r8988r3797
7667g6006o7038P0449o9357N2526M4926K612o850J02866N3379j52717K5985p5286
$$ plain form
7750 15475 5495 -8392 28384 -48629 -126347 -180471 -207085 -191449 -101353 -86794 -27648 -6222
7738 -6222 -7752 8130 17863 -14548 73745 -49111 -94237 -398 23211 -1204 -71961 -127635
7726 -127635 -171872 -145901 -166577 -160574 -129277 -30150 5430 -39922 -28370 -90717 -107888 -16837
7714 -16837 30488 -30693 44595 75056 2291 -174345 -107724 -32195 -122004 -133973 -205157 -108314
7702 -108314 -7763 10883 5302 -107547 14265 120484 144394 82493 16476 25184 95013
7691 95013 38617 -118693 -179958 -68919 -66944 -92335 -69892 -56381 -75071 -112717 -17604 7143
7679 7143 -27414 -75786 -123085 -84340 -165198 -18615 144443 74249 138595 116779 17791 -76006
7667 -76006 -143044 -72595 -141952 -89426 -44500 -41888 -48738 54128 107507 -45210 -19225 -94511
7655i4511J9374K3559M436O3841N981O4144k8825j04097J37003Q6166j17846m0950
7643A8275J19613p0632j01492J48179j6995m8263n589M699o0981m7018k5205K8084
7631e7325P0295p8766L3227L0761q0995J0393M3895m6278N3946j08057j04409
7620b33313J24886j6919o3704l2422R0631P3950q649n2343R2383m2354j1795k0972
7608a00621J8805R3282M4306q3496K3648O1447k20314N5918k0293L3097l2772
7597a26993k0681k0060O9733j21953j97998M9350P8047J55565J45287q7309J10364
7586C3352m2636p0650Q1668k7807K0115n318M7669N3309j07171j29280l1333l902
7574a81984R4083J09598o2802j57397N9808J4250J13693K8936L0772l5533j01006
$$ plain form
7655 -94511 -75137 -51578 -47142 16699 22680 86824 57999 -46098 90905 177071 59225 18275
7643 18275 137888 67256 -34236 113943 96948 48685 43096 47795 -13186 -60204 -85409 -57325
7631 -57325 12970 -65796 -32569 -1808 -82803 -72410 -28515 -74793 -20847 -128904 -233313
7620 -233313 -108427 -125346 -189050 -221472 -130841 -56891 -65540 -117883 -25500 -67854 -79649 -100621
7608 -100621 -81816 11466 55772 -27724 -4076 57371 -162943 -107025 -127318 -94221 -126993
7597 -126993 -147674 -167734 -98001 -219954 -417952 -368602 -290555 -134990 10297 -77012 33352
7586 33352 -9284 -79934 1734 -26073 -5958 -11276 36393 89702 -17469 -146749 -178082 -181984
7574 -181984 -87901 21697 -41105 -198502 -138694 -124444 -10751 18185 48957 13424 -87582
7563h7582p2237J85431K2720k38897k9864L6380J06985O6533m7140j01093J28678
7552c0086j65249l9219O1260R2585O298J32715P599j11462r2507J25075K2047
7541I056K3663j39370n1295N4747m8350Q83J7052N42Q2762l3431N255K00397j07192
7528A4719j9192r4119N118M4087J0672N8548j17977M0261j0475j9073J57523K006
7516G2098j11274j84868L0926J85875m5373j44637J96217m3984N3479m9968P3906
7505C2397R3975j13254r0177q1424J15283O8311o9969K076O1968l6465q7386K4725
7493g9940P1616N1925j50469O9234j0114l8459N0138M4448j40888O8240J1713
7482e2556o476j4013j08114K9129L7816O5412j40156m1540J84137L294l566j03702
$$ plain form
7563 -87582 -159819 25612 48332 -190565 -220429 -184049 -77064 -10531 -57671 -158764 -30086
7552 -30086 -195335 -234554 -173294 -80709 -74411 58304 65903 -45559 -138066 -12991 9056
7541 9056 32719 -106651 -157946 -103199 -151549 -150666 -133614 -133072 -50310 -83741 -78486 121911 14719
7528 14719 -4473 -98592 -93474 -49387 -38715 19833 -98144 -57883 -68358 -87431 70092 72098
7516 72098 -39176 -224044 -193118 -7243 -52616 -197253 -1036 -45020 8459 -41509 32397
7505 32397 126372 13118 -77059 -158483 -43200 25111 -44858 -42782 19186 -17279 -104665 -79940
7493 -79940 -8324 43601 -106868 -37634 -47748 -86207 -36069 8379 -132509 -64269 -52556
7482 -52556 -59032 -73045 -181159 -152030 -114214 -48802 -188958 -230498 -46361 -43067 -46633 -150335
7470a50335m93P9145K9820Q9952K1676p7849m8504J3506J3783j13114J2336P9516
7458e0561l9336M59n222Q4803K1006j2972q8754p3416K9010N4957k6101O2268
7446d3859l2874M0402N4434J06871j41868j08052j188R2830L2285l4419J12114
7435G6676q6254r9221q7888m68R5060P1319N4886n8859R5274k0597j17241m1543
7423a18856L1852j37371O3571K20033L3618j7496j64943O7540M3565m9318l1410
7412e9215n6655k7646K5936k0361M1706M8657K9618K2113r7464m7611L4144J05493
7400a285Q1621k14631L6972P50Q6627m1507k9911R9797n5630J9635J61j2415P303
7387b2513O0632J8848J8581j970p608k09195j2289O3672Q8532M4766n8404q1807
$$ plain form
7470 -150335 -150828 -71683 -41863 48089 69765 -8084 -56588 -43082 -29299 -142413 -130077 -50561
7458 -50561 -89897 -89438 -94660 -9857 11149 -1823 -90577 -163993 -134983 -80026 -106127 -43859
7446 -43859 -76733 -36331 18103 124974 -16894 -124946 -126134 -33304 -1019 -35438 76676
7435 76676 -9578 -108799 -196687 -197155 -102095 -30776 24110 -34749 60525 39928 -77313 -118856
7423 -118856 -87004 -224375 -160804 59229 92847 75351 -89592 -22052 21513 -27805 -59215
7412 -59215 -115870 -143516 -117580 -137941 -96235 -47578 -17960 4153 -93311 -140922 -106778 -1285
7400 -1285 80336 -134295 -97323 -96573 -9946 -51453 -81364 18433 -37197 -17562 -17401 -29816 -22513
7387 -22513 38119 56967 75548 73578 65970 -143225 -155514 -91842 -3310 41456 -16948 -98755
7375i8755j31539J05712K01932l2777j6211r9224m8784Q0889L9194M1077r5689
7364e4175n9552J45729k1684P5400P8729j3334k5254j18810p7982M0173r1117
7353a21877J47187j9251l1969O5694j6190K4010m8488J0400l06N2033K303P843
7341G1389M8112j32457j29573M2661N9053N7525o7988k15315O2104J57244J03394
7330E6149m584j18638M6539J48119j52220J583l2093m5928M0486m0524P7980n591
7318b8722L9954j20229J3919M3410M8660r5447o451J03658m6247N505J43200Q4319
7306A85529o4335j27309P447o6306j44542J07877L1668Q4475L9549j24004k1015
7295i0966k5103M0264J22918m8245r5322m6640M1999P3516p8637R1021K8351j3201
$$ plain form
7375 -98755 -230294 -124582 77350 44573 28362 -70862 -119646 -38757 437 41514 -54175
7364 -54175 -113727 32002 10318 85718 164447 151113 125859 7049 -70933 -30760 -121877
7353 -121877 25310 6059 -25910 39784 23594 47604 -884 9516 9210 61243 63546 71389
7341 71389 119501 -12956 -142529 -99868 -40815 16710 -51278 -266593 -204489 -47245 56149
7330 56149 51565 -67073 -20534 127585 -24635 -23052 -55145 -101073 -60587 -101111 -23131 -28722
7318 -28722 11232 -108997 -95078 -51668 -3008 -98455 -104906 -1248 -47495 -41990 101210 185529
7306 185529 121194 -6115 1332 -64974 -209516 -101639 -69971 14504 54053 -69951 -90966
7295 -90966 -116069 -75805 47113 -1132 -96454 -143094 -101095 -27579 -106216 -15195 13156 -45
7283d5Q308K5735q2073q2015q3199M7834K00769l6201k5960J6779o0429R614L8115
7270b2768R3598N4684j21051r9094Q3100r155l4797m6188k1387J9735J13062k1520
7258a1781J3758j9556O995j09194j9416m6139M9222K9071O489J32102k9786n3012
7246e1247p0788Q6203L1660m0744m6335M7374j6099k9327M3418j2407j09874j7767
7234a85933J12590N0901J4656K6730n2651j36579p207K687j24051J42301J07577
7223d8979p5048P4826j2475J5052J903j8026O3649L950j02476k1358O2338L5476
7211b1168R6269K0691q8242q4579r223n6577L9786J97386L5367o4458j9264J2277
7199E8265O1139R7820o6973p8080n3039k6274m5448K1413O9253o6686l7060Q516
$$ plain form
7283 -45 8263 33998 -48075 -130090 -213289 -165455 35314 -887 -26847 -10068 -70497 -60883 -22768
7270 -22768 70830 125514 4463 -94631 -11531 -20686 -55483 -101671 -123058 -103323 9739 -11781
7258 -11781 1977 -17579 -10584 -119778 -139194 -185333 -136111 -107040 -100551 31551 1765 -51247
7246 -51247 -122035 -35832 -4172 -44916 -91251 -43877 -59976 -89303 -45885 -58292 -168166 -185933
7234 -185933 -73343 -22442 -7786 18944 -33707 -170286 -177493 -174806 -298857 -156556 -48979
7223 -48979 -124027 -49201 -61676 -46624 -44721 -62747 902 4852 -97624 -118982 -56644 -21168
7211 -21168 75101 95792 7550 -77029 -86252 -142829 -103043 94343 129710 65252 45988 58265
7199 58265 119404 217224 150251 72171 19132 -7142 -52590 -31177 38076 -28610 -65670 -57154
7187e7154J11123l1440K0400k6268q6743R1714n8626m4921o5742L0183Q4497J180
7175c1797L5486o8000N8111m835j6713p2018q2399K8607r8341L4327J67268M710
7163d5594j06801l039O3904k2595R9037J5005P4882k08053K0777m757P7867q3042
7151a22409N3644N0809m00m2507J2189Q2803J2685j15788n074J23682n2204l3985
7139c6555n3993L0050M2911l1377M223N8692Q888J9210J50613l5014j53185J5365
7127A9828Q1331L1628j64953j28630O5706j0826K7224M6998P344J447N7482Q8284
7115A22863j57534M8400K0259L5595O6743k452j98977K8923L7899J43526m5775
7104I9470r5705n1532L1558m7173m5569M1976n1197J33340J26261n1424k5788
$$ plain form
7187 -57154 53969 22529 42929 16661 -70082 21632 -36994 -81915 -147657 -117474 -32977 -31797
7175 -31797 3689 -64311 -6200 -11035 -27748 -99766 -182165 -153558 -251899 -217572 -50304 -45594
7163 -45594 -152395 -155434 -91530 -114125 -15088 -83 74799 -133254 -112477 -117234 -39367 -122409
7151 -122409 -68765 -17956 -18356 -60863 -48674 34129 46814 -68974 -74048 49634 -2570 -36555
7139 -36555 -90548 -60498 -17587 -48964 -44741 13951 22839 42049 192662 157648 4463 19828
7127 19828 101159 132787 -32166 -160796 -95090 -105916 -78692 -31694 -24350 -22903 34579 122863
7115 122863 -34671 13729 33988 69583 136326 133874 -65103 -36180 1719 145245 99470
7104 99470 3765 -47767 -16209 -63382 -108951 -66975 -118172 15168 141429 90005 64217
7093F4217m1058j27J20121j15457j11224M3740M4533J0536j50597j9940J45821
7082i435N6269j09225n9504J30194p9210k2485Q8857J05027L5859r4563R1786
7071A33570n1343N2284o9412l1584j5915r425K3620n2779P5945j29255m0213k4774
7059a39281J00743Q0411j6960m3507M9840m1301J8966N1574j65090K02230J2241
7048A09866k8562j5324l161P9256p650j46185o7821m7421R077J23554k1041r3284
7036a08696J2280R4808o5220n5808m9470J07164J05368n2572Q3497j04081k4102
7025e6832k2165K7399p7653o0747J16738J34104n0287j5646o126M0005K7180q607
7013D7363j62728k6614M1824J2476Q8580m0581Q4528j14221R303p7441n9414J85518
$$ plain form
7093 64217 23159 23032 143153 27696 -83528 -39788 4745 15281 -135316 -155256 -9435
7082 -9435 46834 -62391 -121895 8299 -70911 -93396 -4539 100488 136347 41784 133570
7071 133570 82227 134511 65099 33515 17600 8175 31795 -20984 54961 -74294 -114507 -139281
7059 -139281 -38538 41873 24913 -18594 31246 -10055 8911 60485 -104605 97625 109866
7048 109866 81304 65980 62819 142075 134425 -11760 -79581 -127002 -117925 5629 -15412 -108696
7036 -108696 -96416 -1608 -66828 -122636 -172106 -64942 40426 -12146 71351 -32730 -56832
7025 -56832 -78997 -51598 -129251 -189998 -73260 60844 10557 -5089 -11215 28790 55970 47363
7013 47363 -115365 -141979 -100155 -87679 901 -39680 44848 -69373 -60070 -137511 -196925 -11407
7001a1407j8225k3374J08855r23j8806K2516j3587N1671r0939k841N5718j1196
6989D7462M0563j27845L1244n7867L069R1221M6363m2824J37864m78q2614j04386
6977a8228l0099J8427P0758m0520m37l479Q764L832N8117Q1451J4502o7928q3318
6964A1842o4377K4901M0167j25871O7586J41025p0015j2407J08767j42112j7684
6953c8178Q1463J3659m2402J3672Q0025j08802L2185K4734n2668q382Q0118m3222
6941C2202o1299n8200J28649K2083o3734K9178r152r2910Q2265P7731K2483k7843
6929H1453r5363J0407O5110Q4471M6189q4865j32013M5068J8N6088o129l7115
6917C3319j02334R4202R4264q4461j3168L8563l5810k3169J10332l7847q1454
$$ plain form
7001 -11407 -29632 -53006 55849 54926 36120 58636 45049 96720 5781 2940 58658 47462
6989 47462 88025 -39820 -8576 -66443 -63374 27847 74210 31386 169250 168772 86158 -18228
6977 -18228 -48327 -29900 40858 338 -99 -3578 5186 9018 67135 148586 163088 95160 11842
6964 11842 -52535 -27634 12533 -113338 -45752 95273 25258 12851 121618 -20494 -38178
6953 -38178 43285 56944 14542 28214 108239 -563 31622 56356 3688 -4694 75424 32202
6941 32202 -29097 -87297 41352 63435 -299 28879 19727 -73183 9082 86813 109296 81453
6929 81453 -13910 -3503 61607 146078 192267 107402 -24611 20457 20475 76563 70434 33319
6917 33319 -69015 25187 119451 34990 21822 60385 24575 1406 111738 73891 -7563
6906g563k7264N7988L6187p1667j2033J62810o8445p0577k5342K6851k811L1701
6894B9835o2073k021M1286K0688l2633R3127L6672j13343J7880l6995M98j6693
6882b3772J22693L7430p0072l1858P3894J4144o400q0352O1559l5293M3759l9267
6870F6465m3383P348N2143N5118M7686j80436n9380K1652K7906q0714n7958J25077
6858a8476L0412j28318K04867J8739o0897j11546r9167k9161J08213R7687L9122
6847E1475k7816O1931M9701o6329J8368K9903M7411r1425l7629j08530k9471J4931
6835h7480J98941k0447j52200R6068L1648k7473L0403K2800j7450R597k742O3881
6823A45546j63471l7083J06890K5138j40385L0720n0996J06466R9425L7235J07
$$ plain form
6906 -7563 -34827 23161 59348 -12319 -24352 138458 70013 -564 -25906 945 -1866 29835
6894 29835 -32238 -34259 7027 27715 -4918 88209 124881 11538 29418 -7577 -7079 -23772
6882 -23772 98921 136351 66279 34421 108315 122459 116059 35707 97266 61973 105732 66465
6870 66465 23082 30430 82573 137691 185377 4941 -54439 -32787 -4881 -85595 -143553 -18476
6858 -18476 11936 -116382 88485 107224 46327 -65219 -164386 -193547 -85334 12353 51475
6847 51475 23659 85590 135291 68962 87330 117233 164644 73219 35590 -72940 -102411 -87480
6835 -87480 111461 91014 -61186 34882 66530 39057 69460 92260 74810 84407 81665 145546
6823 145546 -17925 -55008 51882 77020 -63365 -32645 -83641 22825 122250 159485 159592
6812A59592m0550p0340m9894J79426p3446j5963N1407l5785l584m1079K8818m0871
6800D7731j14130m7700j5660L7074J15142K0397N7569J50340k32578l480j14226
6789i9521J83248q6779j28357L7013J46918k1939Q6352n9968p7408o2919m8211
6778a31571K2399P99J6697N2311P5276k6956n3404L8995J03247o617J7220l5817
6766G2579j12024J7201L1454l4664N6798m5580M5972K0287J9638J2919M2261J23929
6754B50770n5965q2413K9442O7703j01659m9107k2151l9346J6499q626N5623N5581
6742A16351N5845m0119r1139j05802k6035J93215J9291m4901j29209J4296K4673
6731a3534l0419L6672J29492k755m5788j8735o6389l0398j8441R246R5503p4522
$$ plain form
6812 159592 119042 48702 -1192 178234 104788 88825 140232 104447 100863 59784 88602 47731
6800 47731 -66399 -114099 -129759 -92685 22457 42854 100423 250763 18185 14705 -99521
6789 -99521 83727 -3052 -131409 -94396 52522 30583 116935 56967 -20441 -83360 -131571
6778 -131571 -109172 -108373 -91676 -39365 35911 8955 -44449 -5454 97793 91176 108396 72579
6766 72579 -39445 -22244 9210 -25454 31344 -14236 31736 52023 71661 84580 126841 250770
6754 250770 194805 112392 141834 209537 107878 58771 36620 -2726 13773 5147 60770 116351
6742 116351 172196 132077 40938 -64864 -90899 102316 121607 76706 -52503 -38207 -13534
6731 -13534 -43953 -7281 122211 119456 73668 54933 -11456 -41854 -60295 -51049 44454 -30068
6719c0068m4492P9780j21844J72367j10969P922M3395l6863R1101o6672M5999
6708B9656J5329K919j16332r8328R4738M8640P0359K7858J7563L8768L5064j12348
6696E3886N234M0412l7789j02175P6250J34415j39273j20667l890J34530M589
6685D5522J1925l6451R262R0249n3357K3828o1739M2685O9555K8090k0926m6326
6673A02317k5742R126N882p6578K0796J4217m1350m408N3293q6893M8888J12932
6661A32480j10747L4714l1766R937p1850P3163N3500j5963p451m124q7491O41
6649b4957J43444J351n3251P5431M1536j60792j67423J72426J18652j65658n5998
6638g5239q097J2603K26091j21131j66051Q4287Q4447R842R0460P2868J2861K2446
$$ plain form
6719 -30068 -74560 5220 -116624 55743 -55226 -47304 -3909 -40772 50329 -16343 29656
6708 29656 44985 47904 -68428 -166756 -72018 -23378 46981 74839 92402 131170 166234 53886
6696 53886 59120 99532 61743 -40432 35818 170233 30960 -89707 -93597 40933 45522
6685 45522 57447 20996 30258 120507 67150 90978 29239 71924 141479 169569 148643 102317
6673 102317 76575 85701 91583 15005 35801 50018 8668 4260 57553 -29340 19548 132480
6661 132480 21733 56447 24681 34618 -37232 35931 89431 73468 66017 61893 -25598 -24957
6649 -24957 118487 119838 66587 142018 183554 22762 -144661 27765 146417 -19241 -75239
6638 -75239 -83336 -70733 155358 34227 -131824 -47537 36910 46752 137212 210080 222941 245387
6626B45387l5747k9377r921o2199L2429n0239o1831o2298m5014N1413M2806L1762
6614D7171J03110p2941r1607n4584O8469O7045o2335O4572q8873M1142J8892O3081
6602A03142p0181K1724J2060J0077P8303j0235j10684M8730M9801o3471m2842
6591B6424J01300m1417k9577m6352o8826J6974J31044J58049Q97j06368l6235
6580A05913k4544L859K2479m947p6161N9643l1006J6379p8618k019J06776N6888
6568A54642j05184R5268M9307p1991L4829m9231l1446m4703K4471M4559J05421
6557B05942q8424J7859J7798k2244q4515K4052l9044m4313J0804J29502r6741
6546C0676j30428L7092P3751m4134K9474j3833M65J20463L3315k3418o3150J0921
$$ plain form
6626 245387 209640 180263 170342 108143 140572 90333 28502 -33796 -78810 -27397 15409 47171
6614 47171 150281 77340 -14267 -68851 -382 66663 4328 68900 -19973 21169 40061 103142
6602 103142 32961 54685 66745 76822 155125 144890 34206 82936 132737 69266 26424
6591 26424 127724 86307 56730 10378 -58448 -41474 89570 247619 248516 142148 105913
6580 105913 81369 85228 107707 102760 26599 86242 55236 71615 -7003 -9022 97754 154642
6568 154642 49458 144726 194033 122042 156871 107640 76194 31491 55962 100521 205942
6557 205942 117518 135377 153175 130931 46416 70468 31424 -12889 -2085 127417 30676
6546 30676 -99752 -62660 11091 -33043 -3569 -17402 -16937 103526 136841 113423 50273 61194
6534F1194j67081J25755J0066j33120l2998J98660P8150r9894K0694m6764O2095
6523G6757m3949P087N9191r2461J65183L1162j76561O3202o3585J8867N0473k982
6511I2384N0399J01354r6701j95965J03029R6903l9232r3064O0114J7190N7793
6500A54204j3699j8435R086L6467n6275j38477J8344N3621R6678Q6966l9799m6266
6488A42415P4147j3873r8753q4127j4484N4307K0039k6800R5183P7134R181p8603
6476A55766j66450N2979R4972j7780j27200O2214j0725k2555M1505R5299J28330
6465B86355q0838K6071j17596j50629J16973m1660j2854R243K228l3791k4685
6454b1183l0003O8897J52870p2903L4441o9381Q7273m031j38578K8908N0532m0406
$$ plain form
6534 61194 -105887 19868 29934 -103186 -136184 62476 140626 40732 61426 14662 76757
6523 76757 32808 39895 99086 6625 171808 202970 26409 89611 26026 44893 95366 92384
6511 92384 142783 244137 147436 -48529 54500 151403 112171 19107 79221 96411 154204
6500 154204 140505 122070 131156 167623 111348 -27129 -8785 44836 141514 228480 188681 142415
6488 142415 216562 202689 103936 19809 5325 59632 79671 52871 148054 225188 234369 155766
6476 155766 -10684 42295 137267 119487 -7713 54501 43776 21221 62726 158025 286355
6465 286355 205517 231588 113992 -36637 80336 38676 25822 35065 37293 3502 -21183
6454 -21183 -51186 17711 170581 97678 132119 62738 150011 145980 7402 36310 86842 46436
6442D6436L0162o6372O934L998L0174Q6570n9002k9567j8660N3582J07130o6899
6430A24486j10217j938Q9390P405m2542l4523R1524j4374M939k9460m9261k3402
6418A2027Q0255L1070R4695M0962r357j6104q559l0210j10811J56750R9169j35127
6406B04760J1410k3589l7328k2034M1130l6121j0063k3994M9314L1051L8263p601
6394B15198r7996m3454r6911J4954K5947J22208P3190L7109q7862J6241J6685
6383A95309o1133l78n5363j61165J47092J09318l26j1433K6628p2640M7107K7789
6371A90805N3393m5007k249k7670J00359r1674K3638n0931J4808q757p6298J81195
6359B61612m7788P6873J7936q9629j64635N0341J25802l8772k9705K8568R891
$$ plain form
6442 46436 76598 10226 17160 21158 51332 137902 78900 49333 30673 84255 191385 124486
6430 124486 14269 12331 101721 109126 66584 32061 123585 109211 114150 84690 35429 12027
6418 12027 92282 123352 218047 259009 249652 233548 224989 194779 83968 240718 339887 204760
6406 204760 216170 192581 155253 133219 174349 138228 128165 104171 153485 184536 222799 215198
6394 215198 117202 73748 -23163 -8209 17738 139946 213136 250245 162383 178624 195309
6383 195309 134176 133798 78435 -82730 64362 173680 173354 161921 188549 115909 163016 190805
6371 190805 244198 199191 196942 169272 269631 177957 201595 150664 165472 156715 80417 261612
6359 261612 213824 290697 308633 219004 54369 104710 230512 191740 162035 190603 200494
6348B00494k0747L8565p57J2760Q3459n7875j08899j40539J06601J54991J9896
6337B87949m415k1477K6577K9072j05289r0397J58971K2299j6177Q3j03485J17949
6325C01660j2587L2565m0176k2929m8615j20729l582J944J43689p371l7801L1373
6313B17441q3292Q1488k8756l6210o2022j5291R7529j31254P1162J04824l9163
6302A76456k999L0761l1592l5189L5234l432P8054J76873r9355j04255m9542J2975
6290A83989M4500K0329m1320K4300o6963k8867O9245r1542J22437Q0359M1525
6279C57992N9206j09564p8641k4434o4399J42239J0080n4536J47100m0454L0119
6268C74708l3570q2978O1393q7088K9038O1619p1897J15482q3733j09076P1771
$$ plain form
6348 200494 179747 218312 217555 230315 313774 255899 147000 6461 113062 268053 287949
6337 287949 283534 262057 288634 317706 212417 122020 280991 303290 287113 287196 183711 301660
6325 301660 289073 321638 281462 258533 209918 89189 85607 87551 231240 223869 186068 217441
6313 217441 134149 215637 186881 150671 88649 73358 170887 39633 110795 215619 176456
6302 176456 173457 204218 172626 137437 172671 169239 247293 424166 324811 220556 171014 183989
6290 183989 228489 248818 207498 231798 164835 135968 205213 113671 236108 316467 357992
6279 357992 417198 307634 228993 204559 140160 282399 292479 237943 385043 344589 374708
6268 374708 341138 258160 319553 232465 261503 323122 251225 366707 282974 173898 245669
6257B45669J16406M0689p0464K5809R544R540j57698p3827L5716J65730P5767
6246D22881k2624j6298j9687j09732M329l4386K2974J719O4183J93018j58488
6235C47889j31785J3487R8091J53307M6777j20217N250j70325Q3488R0574L2920
6224D49456j3165j6592r7032J3703n2758N9619j06651j5109J07656p3687J41793
6213C97233k798O4280j46941K2541R4059j01817Q1965Q6318q8323K2427L1553
6202D60497o811J729r7763k378R6203k0516J46989q2698r0938P1355m0710j397
6190D33562M7489k8358R4812l7445k9565J29433L828k869M4124k00428j14259
6179C40324J22059J37341n9233k7214M0048m7668N1585R9432l2379l475j3492
$$ plain form
6257 245669 362075 402764 332300 358109 367653 377193 219495 145668 181384 347114 422881
6246 422881 400257 383959 364272 254540 258869 224483 247457 249176 313359 506377 347889
6235 347889 216104 229591 327682 480989 527766 407549 412799 242474 325962 416536 449456
6224 449456 436291 419699 322667 336370 283612 343231 236580 221471 329127 255440 397233
6213 397233 394435 458715 311774 334315 428374 326557 408522 494840 406517 428944 460497
6202 460497 453686 455415 357652 355274 451477 430961 577950 495252 404314 475669 434959 433562
6190 433562 481051 452693 547505 510060 480495 609928 613756 610887 655011 454583 340324
6179 340324 462383 599724 540491 513277 553325 505657 557242 656674 624295 620820 607328
6168F07328J54526L3662J3143m4357l8463L300q050P9358n0365n328L8640o7740
6156G15654J51255J62683k8741K0101J04785J66922M1496P1953J21736K073m0600
6145A489317J02179J90504J87866Q3348p3493m8211j12673k65884j08978l2766
6135A411209j36053o3500J24353j99559j51241m5677k3384l5979M9991P7865j04064
6124I03961o2820j5030o5023n324Q068M0947n9595j0234k7719j37789m1979L5227
6112E62690J03486O1845L332L9554r441j1678k8931n1169K2906J20438k46940
6101E66092k7847J64609J24554m3454N4729l3599P3131J04196j10912j33285o507
6090G31707j2356K4890J28249N293j03705p9055n322J61113P8502k23297L4703
$$ plain form
6168 607328 761854 795516 808659 764302 725839 729139 721089 800447 750082 744754 783394 715654
6156 715654 866909 1029592 1000851 1020952 1125737 1292659 1334155 1406108 1527844 1529917 1489317
6145 1489317 1591496 1782000 1969866 2053214 1979721 1931510 1818837 1552953 1443975 1411209
6135 1411209 1275156 1211656 1336009 1136450 985209 939532 916148 880169 930160 1008025 903961
6124 903961 841141 826111 761088 755764 763832 804779 745184 734950 707231 569442 527463 562690
6112 562690 666176 728021 731353 770907 761466 749788 720857 669688 692594 813032 566092
6101 566092 538245 702854 827408 783954 838683 805084 878215 982411 871499 738214 731707
6090 731707 719351 744241 872490 877783 774078 695023 689701 850814 929316 706019 740722
6079G40722Q602r6522k4414K1774p0797R231R2082M5139m4347J6418N6286n8339
6067F95835R862q0591R962J05210L907K4829P6071p2287m3962P3955r8516k4778
6055F79497J620k002M4733L6618r7265R3931q1978M9166J40743P2174J0356O7684
6043A015277j26847J23639n7347r9480Q2145K4580l0568J6705J19600J28342r4924
6032A101122q7549k372L3496m8997N0471J71076n2355p3567L7862j2438p3929
6021A042820R0767K35390M1800o8603o8165l7217Q4238J9111o4661P1585j4493
6010A332572j52348J7744k7897J08130l6901k3431L6838N9433k3768m0324j23473
5999A126575J94665J29816J12589j12476L1066L0199J6500M2865Q3617o0692k6703
$$ plain form
6079 740722 749324 652802 628388 650162 579365 588596 680678 725817 681470 697888 754174 695835
6067 695835 705697 625106 635068 740278 744185 769014 845085 772798 728836 802791 704275 679497
6055 679497 681117 679115 723848 760466 663201 757132 675154 724320 865063 937237 947593 1015277
6043 1015277 888430 1012069 954722 855242 937387 961967 931399 948104 1067704 1196046 1101122
6032 1101122 1013573 1011201 1044697 995700 1046171 1217247 1164892 1091325 1129187 1116749 1042820
6021 1042820 1133587 1368977 1410777 1342174 1274009 1236792 1321030 1340141 1275480 1347065 1332572
6010 1332572 1180224 1197968 1170071 1278201 1241300 1217869 1254707 1314140 1290372 1250048 1126575
5999 1126575 1321240 1451056 1563645 1451169 1482235 1512434 1528934 1571799 1655416 1594724 1568021
5988A568021k0157J18441l875o2098K67207Q720j672k0566r2130n2279M9939K65747
5976B025298O1941m0380o1845O8889p7795J59664J57228k51785p6637K7545J95111
5965B187234J68262L9595j36527K46433P8804j17051J26134J25559J2451J79662
5955B910556l2135J60430R9760j44252r8772J25645j09513n8131L4125j04927
5945B782786J48702R2102p7315q733j3319J9824l4883j16753o1215o355p8989
5934B645852o210R8819j2618K4866Q4866R0331M1291m0404Q4422L9326K06036
5923C256577N6147N8035R0975J0123L6937L9835J32493P0010J8480O1764J13480
5912C944856k3110J44438K627N9476J06979J94226J21513L7429l2102J01439L9964
$$ plain form
5988 1568021 1547864 1666305 1662430 1600332 1867539 1876259 1874587 1854021 1761891 1709612 1759551 2025298
5976 2025298 2087239 2046859 1985014 2053903 1976108 2135772 2293000 2041215 1964578 1992123 2187234
5965 2187234 2355496 2395091 2258564 2504997 2583801 2466750 2592884 2718443 2730894 2910556
5955 2910556 2878421 3038851 3138611 2994359 2895587 3021232 2911719 2853588 2887713 2782786
5945 2782786 2931488 3023590 2946275 2937542 2924223 2944047 2909164 2792411 2731196 2724841 2645852
5934 2645852 2639642 2738461 2725843 2750709 2835575 2925906 2967197 2926793 3011215 3050541 3256577
5923 3256577 3312724 3370759 3461734 3471857 3508794 3548629 3681122 3751132 3769612 3831376 3944856
5912 3944856 3921746 4066184 4068811 4128287 4235266 4429492 4551005 4588434 4556332 4657771 4697735
5901D697735R1429J43305J84893K03133J63228J22825J43990K48941J98393J55201
5891F353073Q2819J09173J61713J53909K03743K23939L2683J57415J11615L73533
5881G963615J51751K72739L00877J25499K44445L52983M03051J58251L76629N09841
5871A0859681M09879M75989N71777M62595N44658N69367N55263N60299Q59664
5862A5869172Q58976R16919J010934J045294J187608J116741J303484J309368
5854B4618496J539837J560581J492703J630292J665622J679867J937085K107900
5846C8232383J995108K130246K133679K095813K222072K328020K357549K590910
5838E6085780K980359L277174L765540M553188N186791O159882P102068Q166852
$$ plain form
5901 4697735 4789164 4932469 5117362 5320495 5483723 5606548 5750538 5999479 6197872 6353073
5891 6353073 6435892 6545065 6706778 6860687 7064430 7288369 7321052 7478467 7590082 7963615
5881 7963615 8115366 8388105 8688982 8814481 9058926 9411909 9814960 9973211 10349840 10859681
5871 10859681 11269560 11745549 12317326 12779921 13324579 13893946 14449209 15009508 15869172
5862 15869172 16728148 17645067 18656001 19701295 20888903 22005644 23309128 24618496
5854 24618496 26158333 27718914 29211617 30841909 32507531 34187398 36124483 38232383
5846 38232383 40227491 42357737 44491416 46587229 48809301 51137321 53494870 56085780
5838 56085780 59066139 62343313 66108853 70662041 75848832 82008714 89110782 97277634
5830I7277634R420546J0946366J2551552J4280227J6498347J9549126K3128444
5823B03652242K7440876L1645541L1336166K0312739J002122j8154419l1677574
5816B65557693l5796487l3022034k8206776k3282961j9033818j5584781j2806752
5809I7824084j0729569r035509p935946o963978n925042n105869m557597m070521
5801D3500053l196050k759530k620770k070661j867648j812197j490136j455769
5793B6227292j300520j185861j177658j306041r43558q26677q87495p64348q15145
5784A7019989p03474o80719m80279n69058n08018m85644m53257m22125l11006
5775A2406409m20544m20645l40395n79784k48415k13149k41184k57611l46573
$$ plain form
5830 97277634 106698180 117644546 130196098 144476325 160974672 180523798 203652242
5823 203652242 231093118 262738659 294074825 314387564 315389686 297235267 265557693
5816 265557693 229761206 196739172 168532396 145249435 126215617 110630836 97824084
5809 97824084 87094515 78059006 70123060 63159082 57234040 52128171 47570574 43500053
5801 43500053 40304003 37544473 34923703 32853042 30985394 29173197 27683061 26227292
5793 26227292 24926772 23740911 22563253 21257212 20313654 19486977 18599482 17835134 17019989
5784 17019989 16316515 15635796 15155517 14586459 14078441 13592797 13139540 12717415 12406409
5775 12406409 11985865 11565220 11224825 10645041 10396626 10183477 9942293 9684682 9338109
5766I338109l57529k94558j73359j48089k08598j69234q8307l74269j24585j8828
5756G380753j06421j05952o2452r7092k6924j05196L5638K3115o5889k54193K6324
5745F641711R1605l6956N0364n338N6151K7010P039j5353r2777r1997p8314o8116
5733F485029J49410J67900M9964J23819K11286J3791l4402l1309P9869l9778L3948
5722G209527J31234N2965P2202M9363O8919J17731K63063j0225N5381J82486J92462
5711H385108J86291R0617L26311J28343K37261M8516J78787K97087J34472K46970
5701A0259763M99677L01964L72385L29270L66648N73986O80699O09536N08456
5692A4502384N65355O72950P98395P61078Q90548J037920R95684Q34135J154782
$$ plain form
5766 9338109 8980580 8686022 8512663 8364574 8155976 7986742 7898435 7524166 7399581 7380753
5756 7380753 7274332 7168380 7105928 7008836 6981912 6876716 6912354 6935469 6869580 6615387 6641711
5745 6641711 6733316 6696360 6746724 6741386 6797537 6824547 6831586 6816233 6723456 6631459 6553145 6485029
5733 6485029 6634439 6802339 6852303 6976122 7187408 7201199 7166797 7135488 7215357 7175579 7209527
5722 7209527 7340761 7393726 7465928 7515291 7584210 7701941 7965004 7954779 8010160 8192646 8385108
5711 8385108 8571399 8662016 8988327 9116670 9353931 9402447 9581234 9878321 10012793 10259763
5701 10259763 10759440 11061404 11433789 11763059 12129707 12703693 13384392 13993928 14502384
5692 14502384 15067739 15740689 16539084 17300162 18190710 19228630 20224314 21058449 22213231
5683B2213231J189796J121436J125627J157296J107454J277351J407957J539791
5675C2139939J612131J679296J859383K071327K222060K504131K714402L148080
5667D9950749L444018M024150M422616M970733N401390O019682O585560O857684
5659I1676582O950377O860142O517632O113506N784257N556803N085186L976415
5651A38520900K290413n465k587456m872220n902576o551120o973217p307015
5643A06612244p643093p998258p928430p704210p277308o625693n991025n254218
5635E0190009m634003m033496l517172l024239k720662k450827k066291j789270
5627B5954049j639595j521069j241958j366633j114972j032838q77583r06199
$$ plain form
5683 22213231 23403027 24524463 25650090 26807386 27914840 29192191 30600148 32139939
5675 32139939 33752070 35431366 37290749 39362076 41584136 44088267 46802669 49950749
5667 49950749 53394767 57418917 61841533 66812266 72213656 78233338 84818898 91676582
5659 91676582 98626959 105487101 112004733 118118239 123902496 129459299 134544485 138520900
5651 138520900 140811313 140805848 138218392 133346172 127443596 120892476 113919259 106612244
5643 106612244 98969151 90970893 83042463 75338253 68060945 61435252 55444227 50190009
5635 50190009 45556006 41522510 38005338 34981099 32260437 29809610 27743319 25954049
5627 25954049 24314454 22793385 21551427 20184794 19069822 18036984 17159401 16253202
5619A6253202q86868p16729p32038n57193o48648n57656o37833m96392m05528
5610A0614317n49059k51481l32440l10984m33567l91374l11615k37566k80709
5601G515522l10487l29296k71242k43608j25298k51938k62843k6000j39127k63834
5591E291849j41625q7460j03176j25068j87337j2838j00651k46521q1966j70563
5581D034644j13379k9212o4857j83371r1966O8570m6185p9458L3306j42213j24513
5570C261366r1558j20155R300j4101p0123j37185l0579m3868M0400j24259p6330
5559B602908N4846n6709k72701j49772J53831L4130p0950M5600n7283k9495k9867
5548B224538m0836L0086J0866o7248j09880j05366p480l4794J6276n2164N7014
$$ plain form
5619 16253202 15366334 14649605 13917567 13360374 12711726 12154070 11516237 11019845 10614317
5610 10614317 10065258 9813777 9481337 9170353 8736786 8345412 8033797 7796231 7515522
5601 7515522 7205035 6875739 6604497 6360889 6235591 5983653 5720810 5694810 5555683 5291849
5591 5291849 5150224 5062764 4959588 4834520 4647183 4634345 4533694 4287173 4205207 4034644
5581 4034644 3921265 3892053 3827196 3643825 3551859 3620429 3574244 3494786 3528092 3385879 3261366
5570 3261366 3169808 3049653 3058953 3044852 2974729 2837544 2806965 2763097 2803497 2679238 2602908
5559 2602908 2657754 2601045 2328344 2178572 2332403 2366533 2295583 2341183 2283900 2254405 2224538
5548 2224538 2183702 2213788 2224654 2157406 2047526 1942160 1934680 1899886 1916162 1863998 1921012
5537A921012p2134l7492n6783p0553L1942M4845j42087k9905O0136q5750o8780
5526A494451p6847m1300J48143J21241k16825J32340N5485k06827j27152N2353
5516A335062R2180p9787P6417p1876n0773J5035L366O8000j1854L1627J79047
5505A586444k0903j1525K3932k3379J86957J65284M9844L8643J12912L12187J30235
5494B550631L4673j7596n941q801k32481k69180p1266j62830j27365j11304k10257
5483A368283n8585j0047K2319n9100k0637N7811N4600j52315j06596m4173l4699
5472A016861m238q5506N5359N101q468j3605K5413k5907K0461L4434j9368P1396
5460A071933k9259p9477j46736J0301J52365K5255j0433L0682j80684j03962M6213
$$ plain form
5537 1921012 1848878 1811386 1754603 1684050 1715992 1760837 1618750 1588845 1648981 1563231 1494451
5526 1494451 1417604 1376304 1524447 1645688 1428863 1561203 1616688 1409861 1282709 1335062
5516 1335062 1427242 1347455 1423872 1351996 1301223 1316258 1319624 1387624 1375770 1407397 1586444
5505 1586444 1565541 1554016 1577948 1554569 1741526 1906810 1956654 1995297 2108209 2420396 2550631
5494 2550631 2585304 2567708 2561767 2552966 2320485 2051305 1980039 1817209 1689844 1578540 1368283
5483 1368283 1309698 1299651 1321970 1262870 1242233 1300044 1354644 1202329 1095733 1051560 1016861
5472 1016861 1012623 927117 982476 987577 979109 965504 990917 965010 985471 1019905 1000537 1071933
5460 1071933 1042674 963197 816461 826762 979127 1004382 993949 1024631 843947 739985 786198
5449G86198k5959m1532P5106j4873O0961r1875J7927P0536m8332J15598K4686
5438I28441k7832n4044K143Q7276r9125L9899m4026r0309k0925O1831j9447n5011
5426G08871p436m3034r7710J6799J174J24608P4830J9620r7361j18864k0846p426
5414E53225K2737J5238q689j6577k393J059K6823M948n8984J01136L896j03900
5402E38519L9427M4146N7126p6865r2849N1004l987J7562k6321j5617Q4719O8589
5390F85453O5061l6467n1632q0884M0959r2268j0223N5016j74408O9074M7187
5379E16868j14865J15102m7707K0950O3846J3572m1969Q3406O0569Q4877o6033
5368F88616j2564q295m9633J59835P6681r8306J08301l7561p4329O3392j41303
$$ plain form
5449 786198 760239 718707 793813 778940 839901 748026 765953 836489 788157 903755 928441
5438 928441 900609 846565 848708 935984 836859 876758 832732 742423 721498 783329 763882 708871
5426 708871 701435 658401 560691 577490 578664 703272 778102 797722 700361 581497 560651 553225
5414 553225 575962 591200 582511 565934 563541 564600 591423 596371 537387 638523 642419 538519
5402 538519 577946 622092 679218 602353 509504 560508 556521 574083 547762 532145 616864 685453
5390 685453 750514 714047 662415 581531 622490 530222 519999 575015 400607 469681 516868
5379 516868 402003 517105 469398 490348 554194 567766 525797 609203 669772 754649 688616
5368 688616 676052 667757 618124 777959 854640 756334 864635 827074 752745 816137 674834
5357F74834m6499J87179L4855l2265O624p2531M3273K26806Q3563n3509R5264
5346A147594J85314K8162J1040j97727m6315L7072j19140j04829J12901M8919
5336A102991r6094k2305p1849j49002l3144q8602k382R3760j33778k1883Q9160
5325F66872Q7280j16480k620O4506K3953o2034m9010o1401Q6478L4634J3116j40394
5313E44900j22358m6630J76716Q286n1462K5323O2003R048J0481p6597J3203J5188
5301E68101j12490M170L970O6M9723J43044o2463n2354M9525r360j63802n1492
5289C66638J73409M2815R4894m3161q4160j9139j18437J2806Q3638l4013j35598
5278C39692L7839J0094j0191O0394J3899m6266P8805o4385k355P0109l4086l2099
$$ plain form
5357 674834 628335 815514 850369 818104 824728 752197 795470 1022276 1105839 1052330 1147594
5346 1147594 1332908 1361070 1372110 1174383 1128068 1165140 1046000 941171 1054072 1102991
5336 1102991 1006897 984592 912743 763741 730597 641995 639613 733373 599595 577712 666872
5325 666872 754152 637672 635052 699558 723511 661477 612467 551066 637544 672178 685294 544900
5313 544900 422542 375912 552628 560914 509452 534775 596778 605826 616307 539710 552913 568101
5301 568101 455611 459781 463751 463817 513540 656584 594121 541767 591292 581932 418130 366638
5289 366638 540047 582862 677756 634595 550435 531296 412859 425665 509303 475290 339692
5278 339692 377531 387625 377434 437828 451727 405461 484266 419881 417526 487635 453549 421450
5266D21450K10405P4250j50430k5108J0726K5748j7886q2447p8907o5910O7074
5255C88965J24585k9850J14814q80o9223o0275p8071j8237l840P4142K575K9174
5243D73879M575L3630L8716l0316M363j2340m3034J56692k2462q0834m690L3173
5231E51352k1996o9432O0614J93060J8342l6550k79053L5613J48032K4402K2164
5220F46548j04780L1974L9375J12575L0223j7802r3961p1564n054n3272m5300
5209D68962R1769J29707l6648J12371J30244p4394o6337j20285J42321J22262
5199H99972o5648o1468k9904Q0722L33j0648N9336j02772k7726r9271Q1211J37540
5187H61677O1270R229O840k4438p0546J01015O1398r6268l631M5113l7346P974
$$ plain form
5266 421450 631855 706105 555675 530567 541293 567041 549155 466708 387801 321891 388965
5255 388965 513550 483700 598514 597634 528411 468136 390065 371828 367988 442130 444705 473879
5243 473879 478454 512084 550800 520484 524847 512507 469473 626165 603703 522869 518179 551352
5231 551352 529356 459924 520538 713598 731940 695390 416337 451950 599982 624384 646548
5220 646548 541768 573742 613117 725692 755915 738113 644152 572588 567534 514262 468962
5209 468962 560731 690438 653790 766161 896405 822011 755674 635389 777710 899972
5199 899972 834324 772856 742952 823674 824007 813359 872695 769923 742197 642926 724137 861677
5187 861677 922947 932176 939016 914578 844032 945047 1006445 910177 906546 951659 914313 922287
5175I22287N1553j03441m4480L4964J7137j28311O5374J72974Q3644N6749J27828
5164A256278O4974n4652j12511N8593K2302n8481P0146o4953o7279k8933p765
5153A077719q6655q239Q0026q2268r5112n1606P8462R2535l6468o0624L2194N697
5141I45661j16870J03846K3413p7852J06694O0742k85J800M5686L8617k765R2902
5129A221589Q5969j07350j73960n9252R7468M7861k01576l5862J22656Q0353l1286
5118A046610j17654O210J23483j1195J4697j28045L4621R0534l3121p4264M5916
5107I97792K0209N2729r7725n941J26930M2552K988r2432m553L4626L5684j5846
5095A097013J8821K9923o4438M5425J43054n5374k8649j3085j32677J1732J87638
$$ plain form
5175 922287 973840 870399 825919 860883 878020 749709 815083 988057 1071701 1128450 1256278
5164 1256278 1321252 1266600 1154089 1212682 1234984 1176503 1246649 1181696 1114417 1085484 1077719
5153 1077719 991064 982825 1062851 980583 885471 833865 912327 1004862 968394 907770 939964 945661
5141 945661 828791 932637 956050 878198 984892 1045634 1045349 1047149 1092835 1131452 1128687 1221589
5129 1221589 1307558 1200208 1026248 966996 1064464 1112325 910749 874887 997543 1077896 1046610
5118 1046610 928956 935166 1058649 1047454 1062151 934106 968727 1059261 1026140 951876 997792
5107 997792 1018001 1070730 973005 967064 1093994 1136546 1139534 1047102 1042549 1077175 1112859 1097013
5095 1097013 1115834 1145757 1081319 1126744 1269798 1214424 1185775 1172690 1040013 1051745 1239383
5084A239383J07188k5895j9313J6627p4601l6953J7528Q7558M5108L0833M8487
5073A435950j52068J56884P6255r6113O3546L9375M1046O5456P6450j95948R8473
5062A609306J9722n0213p6819j5195K6558N3465M9946m6832o5811J6422K0079
5051A540628n5655K5678L4411R9135J24096n1231l2301P7420p11j15098j20115
5040A526257O3450J38887Q6395j35246q5064n2323O9467J7127m6535J20871K9151
5029A732437M643l7260N7583l9064p9393p1025M5176K06537n8797n3901k9367
5018A677569J21567N0161k42159P8124J8063Q7333o261r6758j814J30929K72530
5007B089284j3727p2994j58045P6584O4013J2115k4294Q2051K04143o4459j15189
$$ plain form
5084 1239383 1346571 1320676 1301363 1317990 1243389 1206436 1223964 1311522 1356630 1387463 1435950
5073 1435950 1283882 1440766 1517021 1420908 1484454 1523829 1564875 1630331 1706781 1510833 1609306
5062 1609306 1629028 1578815 1501996 1486801 1513359 1566824 1616770 1569938 1504127 1520549 1540628
5051 1540628 1484973 1510651 1545062 1644197 1768293 1717062 1684761 1762181 1761470 1646372 1526257
5040 1526257 1589707 1728594 1814989 1679743 1594679 1542356 1611823 1628950 1582415 1703286 1732437
5029 1732437 1737080 1699820 1757403 1718339 1638946 1567921 1613097 1819634 1760837 1706936 1677569
5018 1677569 1799136 1849297 1607138 1685262 1703325 1790658 1784397 1687639 1685825 1816754 2089284
5007 2089284 2075557 2002563 1844518 1921102 1985115 1997230 1972936 2054987 2259130 2194671 2079482
4996B079482O276Q0886M7570K3505J25737L7043M0605p466J09994o0665m237P9988
4984B558718J26178J70490R3979R701J29129o5729l296K6917P9227P0437K29133
4973C424884L2754l2793J05426R6712K90855J87753j2053P7411J12665Q1602k4856
4962D340360j63528k8959Q4791R4156o5703q1575j20586P9345j49822J14415J53864
4951D256758j02414k863J07198j07737J20914P9844J01355K6272J36991k9175
4941D587143J7409K67226Q6582J12583J46578O4793J42930J06340R6739Q5363
4931E713686K14781K8129J55283R6453K47903L31305M7402K77145K85544J10742
4921G508373J99944L18913L12140K55884J23123L07852L24351K22637L13072L34531
$$ plain form
4996 2079482 2085758 2166644 2214214 2237719 2363456 2400499 2441104 2433638 2543632 2482967 2478730 2558718
4984 2558718 2684896 2855386 2949365 2959066 3088195 3022466 3019170 3046087 3125314 3195751 3424884
4973 3424884 3457638 3424845 3530271 3626983 3917838 4105591 4093538 4170949 4283614 4365216 4340360
4962 4340360 4176832 4147873 4232664 4326820 4261117 4179542 4058956 4138301 3988479 4102894 4256758
4951 4256758 4154344 4151481 4258679 4150942 4271856 4351700 4453055 4479327 4616318 4587143
4941 4587143 4604552 4871778 4958360 5070943 5217521 5282314 5425244 5531584 5628323 5713686
4931 5713686 5928467 5956596 6111879 6208332 6456235 6787540 6834942 7112087 7397631 7508373
4921 7508373 7708317 8027230 8339370 8595254 8718377 9026229 9350580 9573217 9886289 10220820
4911A0220820N04994N31226L14992M32935N53450N64404M75613O84685N33034
4902A4816153P32548P79635Q81923R40628J112730J071109J225052J296358J341177
4893B4197313J416325J474120J601579J497763J249037J203617J140709R29581
4885C4710044J096384J072559J007462R53329R62608Q22731O24824O05064P30247
4876D2585252O10442P17905R17888J126917J436848J638796J745397J980016K164220
4867E4923681K105508K183408K247764K306558K647748K768841L007060L251021
4859G5441589L374342L091054K247092J052484k75026j913823l042715l647284
4851G6327713l588978l248868k584325j903875j302037o02211J02561P09181J140258
$$ plain form
4911 10220820 10725814 11257040 11572032 12004967 12558417 13122821 13598434 14283119 14816153
4902 14816153 15548701 16328336 17210259 18150887 19263617 20334726 21559778 22856136 24197313
4893 24197313 25613638 27087758 28689337 30187100 31436137 32639754 33780463 34710044
4885 34710044 35806428 36878987 37886449 38839778 39802386 40625117 41249941 41855005 42585252
4876 42585252 43195694 43913599 44831487 45958404 47395252 49034048 50779445 52759461 54923681
4867 54923681 57029189 59212597 61460361 63766919 66414667 69183508 72190568 75441589
4859 75441589 78815931 81906985 84154077 85206561 84931535 83017712 79974997 76327713
4851 76327713 72738735 69489867 66905542 65001667 63699630 63097419 63199980 63909161 65049419
4842F5049419J661854J970548K445170K719771K830274K459361J724929R44857
4834H1806183P38j024448j885770k998831l589195l983599m152267l991192l680897
4825E6500722l248210k897055k389145k148736j732488j306087j207844p90637
4817D0780520o17717m46887k26566K7382Q3902L76880M90930N75398R79966J257160
4807D3280968J367452J578422J897422J998559K344030K340269K566277K659583
4799F0032982K552011K587149K429704K399041K158508J818605J424470J130595
4791G6533065N51294J29187l41579n83898p82577q80707j064412j045484r52638
4782G1562251q52429n00118k99734k9416K70817J82069L95195M08784M58898N69321
$$ plain form
4842 65049419 66711273 68681821 71126991 73846762 76677036 79136397 80861326 81806183
4834 81806183 81806921 80782473 78896703 75897872 72308677 68325078 64172811 60181619 56500722
4825 56500722 53252512 50355457 47966312 45817576 44085088 42779001 41571157 40780520
4817 40780520 40162803 39715916 39489350 39516732 39600634 39977514 40468444 41043842 42023808 43280968
4807 43280968 44648420 46226842 48124264 50122823 52466853 54807122 57373399 60032982
4799 60032982 62584993 65172142 67601846 70000887 72159395 73978000 75402470 76533065
4791 76533065 77084359 77213546 76871967 76288069 75505492 74624785 73560373 72514889 71562251
4782 71562251 70709822 70209704 69909970 69880554 70151371 70333440 70728635 71137419 71596317 72165638
4772G2165638M41569N85162J90116k46431m73544r71132j425522j380104j565569
4763F7320183j810885j816672k082491k070501k011417k171573k069684k016525
4755E1270435j836110j755860j564604j430170j232912j402055j102908r07973
4747D0037843q23807q07635q20958q51227p34088p30524q98659q00525o67506
4738C2902914q50917r13994p35516p85460r56865j096115q78533q34754q07365
4729B5043395q62361p00074p72945p12352m57169m52836m19399l30470l80998
4720A9954791j87431k00694r4750J20805N5787K01806J07611K65252M48353M33738
4710B1105268M61706M74757M32482N77423P07627R18007Q44586J022399J080926
$$ plain form
4772 72165638 72607207 73192369 73382485 73136054 72662510 71691378 70265856 68885752 67320183
4763 67320183 65509298 63692626 61610135 59539634 57528217 55356644 53286960 51270435
4755 51270435 49434325 47678465 46113861 44683691 43450779 42048724 40945816 40037843
4747 40037843 39214036 38406401 37585443 36734216 36000128 35269604 34370945 33570420 32902914
4738 32902914 32051997 31138003 30402487 29617027 28660162 27564047 26685514 25850760 25043395
4729 25043395 24181034 23480960 22708015 21995663 21538494 21085658 20666259 20335789 19954791
4720 19954791 19767360 19566666 19471916 19592721 19648508 19850314 19957925 20223177 20671530 21105268
4710 21105268 21566974 22041731 22474213 23051636 23759263 24677270 25521856 26544255 27625181
4701B7625181J280934J392781J291649J350918J443698J487317J569072J724891
4693C9166441J753575J950743K032591J963447K107527K245786K321559K496860
4685E6038529K731616K842800K999610L545412M189339M712549N234229N993757
4677H8287841O803312P643371Q667989R841939J1352788J2793075J4609868J6918424
4669A76918607J8995455K1036413K2113982K0090358J3291875J865996j0475968
4662B63836718j9798619k4696832k5150104k3334489k0543411j7432503j4905322
4655A17975438j2638871j0860483r141402p806340o811458o067643n642782m964803
4647E4041656m253715l707239l153401k889656k633854k165801j924096j911044
$$ plain form
4701 27625181 28906115 30298896 31590545 32941463 34385161 35872478 37441550 39166441
4693 39166441 40920016 42870759 44903350 46866797 48974324 51220110 53541669 56038529
4685 56038529 58770145 61612945 64612555 68157967 72347306 77059855 82294084 88287841
4677 88287841 95091153 102734524 111402513 121244452 132597240 145390315 160000183 176918607
4669 176918607 195914062 216950475 239064457 259154815 272446690 274312686 263836718
4662 263836718 244038099 219341267 194191163 170856674 150313263 132880760 117975438
4655 117975438 105336567 94476084 85334682 77528342 70716884 64649241 59006459 54041656
4647 54041656 49787941 46080702 42927301 40037645 37403791 35237990 33313894 31402850
4639C1402850j821669j680682j521330j437734j393448j107239r48032j057190
4631B0435526r60423p82152q80974o11599p19003p05555p03034p22717n34643
4622A3815426l14924m61526n70549m78244m57589m45918l95036l51611j79455
4613A0160574l68376l64848l41467l59636k81008k15092l07555k47866k65520
4604G409206j71271j63726j69739j31282k79866k03355o6649m6020j89379l03622
4594E684297j30749j54948P3288k1356j02296j04625j38442n1519k38113p6329
4584D739208m7707k1748j37758j31899n4493m5183j91293j01855k3417L6307L8475
4573D058637l8891j30413j08702q690k7270j10478p1292j54121j55534K0323k2426
$$ plain form
4639 31402850 29581181 27900499 26379169 24941435 23547987 22440748 21492716 20435526
4631 20435526 19475103 18692951 17811977 17200378 16481375 15775820 15072786 14350069 13815426
4622 13815426 13500502 13038976 12468427 11990183 11532594 11086676 10691640 10340029 10160574
4613 10160574 9792198 9427350 9085883 8726247 8445239 8230147 7922592 7674726 7409206
4604 7409206 7237935 7074209 6904470 6773188 6493322 6289967 6223318 6177298 5987919 5684297
4594 5684297 5553548 5398600 5471888 5450532 5348236 5243611 5105169 5053650 4815537 4739208
4584 4739208 4691501 4669753 4531995 4400096 4345603 4300420 4109127 4007272 3983855 4020162 4058637
4573 4058637 4019746 3889333 3780631 3771941 3744671 3634193 3562901 3408780 3253246 3273569 3251143
4562C251143J9124n1036m3825m053r6948J4150Q349N0161q7698q2477R7736l3796
4550C040830j3641k1990r2582k6688J9911j74495j81484n948q6494k8437o0688
4539B368294o0082j92253N3328J14391k3001k5002k3913q125l9457N3671q4015
4528B133836j34438K3036J52079k2469L7170P0888l1179L0647l2093l5557q4360
4517B107560j493o686j80189o2677o5269p9868n0245j42054K9017M6068l2531
4506A561633O6828Q1641o7738j07907j9733R720k468K3052o811J03828P206p9502
4494A569749P7555o9701k9688Q1508j42736q0272J04811O2404J31089Q510m1215
4483A672014q8696j34147J1891N9145j6876J8834j7795n9231J28824l3441k7703
$$ plain form
4562 3251143 3270267 3219231 3175406 3171353 3074405 3088555 3096904 3147065 3059367 2976890 3074626 3040830
4550 3040830 3027189 3005199 2912617 2885929 2905840 2731345 2549861 2543913 2457419 2428982 2368294
4539 2368294 2308212 2115959 2169287 2283678 2260677 2235675 2211762 2203637 2164180 2217851 2133836
4528 2133836 1999398 2022434 2174513 2152044 2189214 2260102 2228923 2259570 2227477 2191920 2107560
4517 2107560 2106067 2099381 1919192 1856515 1791246 1711378 1661133 1519079 1548096 1594164 1561633
4506 1561633 1628461 1710102 1642364 1534457 1514724 1524444 1521976 1545028 1538217 1642045 1649251 1569749
4494 1569749 1647304 1577603 1547915 1629423 1486687 1406415 1511226 1573630 1704719 1713229 1672014
4483 1672014 1583318 1449171 1461062 1520207 1503331 1522165 1504370 1445139 1573963 1540522 1512819
4472A512819l6429o1265J00848l2754j53802k4418Q7184J09713L7342l4573j59588
4461A345077K3401p27m2308l3471O1338j10648k4599M2O2788J31818N5972j15404
4449A353279j69130J24447m2805p7367P1985o9577j13609N0506P7972k2957m3509
4438A139235k4507N1550L1579o3295O5909K5961J30199j19865o9237L6880L7908
4427A242317k5732n9661p8138K18964J7497N7850k7704n3027L5801K4949j26348
4416A226768j12872J59654n7915J8702K3978J51667R2426n3291o1475L2970p8710
4405A341902L5746P5536J78194l6602O08m8410M372J3173n763J53111k3231J89998
4393A878634K0864R4527N9373r2325l4084N029Q1718K04463l0698L8627O2759
$$ plain form
4472 1512819 1476390 1415125 1515973 1483219 1329417 1304999 1392183 1501896 1539238 1504665 1345077
4461 1345077 1368478 1367751 1325443 1291972 1353310 1242662 1218063 1218105 1280893 1412711 1468683 1353279
4449 1353279 1184149 1308596 1265791 1188424 1260409 1190832 1077223 1127729 1205701 1182744 1139235
4438 1139235 1114728 1166278 1197857 1134562 1200471 1226432 1356631 1236766 1167529 1204409 1242317
4427 1242317 1216585 1156924 1078786 1297750 1315247 1373097 1345393 1292366 1328167 1353116 1226768
4416 1226768 1113896 1273550 1215635 1234337 1258315 1409982 1502408 1449117 1387642 1420612 1341902
4405 1341902 1377648 1453184 1631378 1594776 1595384 1546974 1551346 1564519 1558756 1711867 1688636 1878634
4393 1878634 1899498 1994025 2053398 1961073 1926989 1932018 2013736 2218199 2187501 2226128 2288887
4382B288887K0805J32239J31345O6030O5307Q2760K8445J09716R8915J23620J4103
4371C162172M9847K09710J86273J71845R3687J09942K33538J56590K24599J34154
4361D732357M9789N9896k4031j16853k6904L1639l6971l580m6724o6743Q9273
4350D641148O8854O904L24124q470m8894m2787K6209R136L6107M155K6844K3052
4338E066382P3144O0588j18475n3594p3651n7632k646m6172m9706k6038j22662
4327D649538m6720p8962L0333q1172j88679j23824j20895j81711L7105k2932k6988
4316C845093n6052k30786k69944k4190J31347q7788j47318k4349j2994r4298p3074
4305B955647p008j56344p9600p0838j04659j90716q9888M3292m4185j04470R976
$$ plain form
4382 2288887 2309692 2441931 2573276 2639306 2704613 2787373 2815818 2925534 3024449 3148069 3162172
4371 3162172 3212019 3421729 3608002 3779847 3873534 3983476 4217014 4373604 4598203 4732357
4361 4732357 4782146 4842042 4818011 4701158 4674254 4705893 4668922 4665342 4618618 4551875 4641148
4350 4641148 4710002 4716906 5041030 5032560 4983666 4940879 4967088 4976224 5012331 5016486 5043330 5066382
4338 5066382 5139526 5200114 5081639 5028045 4954394 4896762 4894116 4847944 4798238 4772200 4649538
4327 4649538 4602818 4523856 4554189 4473017 4284338 4160514 4039619 3857908 3895013 3872081 3845093
4316 3845093 3789041 3558255 3288311 3264121 3395468 3307680 3160362 3136013 3123019 3028721 2955647
4305 2955647 2948639 2792295 2712695 2641857 2537198 2346482 2256594 2299886 2255701 2151231 2161207
4294B161207n2713q5820J2882q9898j6697N8598O396r4769q504M2279k3130j40442
4282A769389j48179j27438q6087r0202P6327P0722J7215j24798p190Q4346j01426
4271A332679m3910J26437j38748P7845J06798k36058Q833o6865K0433J03680l19015
4260I72109j13002J52827q1062J10247q2562n0811K2121r3707R8798l0337n6179
4249H48442P2165j00095j38142j7270Q6478M9269l611p3569J0899r1831l3603
4238F09132l781o4707j6656P601n6854L5576N1399k4590m2412L6760M7842j5231
4226E64079L8139l2450m8879n4842O8245J38601J5606r6632j23008m6683j8453
4215D03723Q4614K28r744R8980m2074j16165k3715j24393M1895j09959R3209n5676
$$ plain form
4294 2161207 2108494 2022674 2035556 1945658 1928961 1987559 1993955 1899186 1890682 1932961 1909831 1769389
4282 1769389 1621210 1493772 1407685 1317483 1393810 1464532 1481747 1356949 1349759 1434105 1332679
4271 1332679 1288769 1415206 1276458 1354303 1461101 1225043 1233876 1167011 1187444 1291124 972109
4260 972109 859107 1011934 930872 1041119 958557 907746 929867 836160 934958 904621 848442
4249 848442 920607 820512 682370 665100 751578 800847 797236 723667 734566 642735 609132
4238 609132 605351 540644 523988 531589 474735 510311 561710 537120 494708 531468 579310 564079
4226 564079 602218 569768 520889 466047 534292 672893 688499 591867 468859 422176 403723
4215 403723 488337 488565 478821 577801 535727 419562 395847 271454 313349 203390 296599 240923
4203B40923P9499N3769N1404R28m1675l3333p1043P3587p45K4547N9162Q8141
4191E25164o5698O431O724r6098q4146K2106m931N6039j5085J12525J7111L6760
4179E16902j45788j7459o082o1486n0279P1944p9260j6205j5002P649Q4636m4430
4167B45140J9957P0975j69000m5038J37195M6863r0151l8967j05132j5758L9043
4156I5127J36690j6162L8260j10762j29824r107O0237L8064Q220J4715J6554M6810
4144A88822L1702O8311m3352O372j1450k7053K5947m1572P4596L7143o7106r0594
4132A51766r3292J9520P3320Q1875q1873j8373o1850J25830m6953P2264j01661
4121A20573n3748R5532p6390p03N7270j57593p2740O7949Q4537P2777j16416Q2196
$$ plain form
4203 240923 320422 374191 425595 426523 384848 351515 280472 354059 353314 377861 437023 525164
4191 525164 459466 465897 472621 376523 292377 314483 309552 365591 350506 463031 480142 516902
4179 516902 371114 353655 347573 286087 235808 307752 228492 212287 197285 204934 289570 245140
4167 245140 265097 336072 167072 122034 259229 306092 215941 176974 71842 56084 95127
4156 95127 231817 215655 253915 143153 13329 4222 64459 102523 110743 125458 142012 188822
4144 188822 220524 288835 245483 251855 240405 213352 239299 197727 272323 309466 242360 151766
4132 151766 58474 77994 151314 233189 151316 132943 71093 196923 149970 222234 120573
4121 120573 66825 162357 85967 85264 142534 -15059 -87799 -19850 64687 137464 21048 103244
4109A03244J8478k9206K3222j3704L087N4776J494N0059n1074j07981o600L7625
4097H3420o2365K3830N9312P9529L5361m0951q639o1318L5251l1106q8998O6163
4085H9489j9410N267M0331q2553P5005P7372l3626o1570n0722j1140K616M6072
4073G7131o3365J7147N9918k1338m514n1323k2338K9127L2770P596m8718J9890
4061C1983J9187p5365m2027j8301k3536n107J90142J2327L9291r8746m5090J95973
4049A80731j5084o9609M5095o9300M1089L0142k7288j73524R6482P9753K2013
4038A40500q3662K8671o206j47153L7932K0945M229j13867k660J15488J37499
4027A31716L3769j00386j8180l2881N9545p9619P3264k04803k3137J20727L3882
$$ plain form
4109 103244 121722 92516 115738 102034 105121 159897 161391 211450 160376 52395 45795 83420
4097 83420 21055 44885 104197 183726 219087 178136 169497 108179 143430 112324 23326 89489
4085 89489 70079 75346 115677 33124 108129 185501 151875 90305 39583 28443 31059 77131
4073 77131 13766 30913 90831 69493 64979 13656 -8682 20445 53215 60811 12093 31983
4061 31983 51170 -24195 -66222 -84523 -108059 -113166 76976 89303 128594 29848 -15242 180731
4049 180731 165647 96038 141133 71833 112922 143064 115776 -57748 38734 118487 140500
4038 140500 56838 85509 79303 -67850 -29918 -8973 -4744 -118611 -121271 -5783 131716
4027 131716 165485 65099 46919 14038 73583 -6036 67228 -137575 -160712 -39985 -6103
4016f103r9293K5356J48774o4650J37924m9634p239m0527n2622N0398l3119o3430
4004e4165l2943J15601K0015P8876n2618j35613K7581J07318O1508p701Ml6207
3992I1656m5036j18262n7527o6693J29969K4703q844L0636p0148j09980Q5534
3981a13992J05671p9753J29484j43150k19119J15489J43931J11534j30629j0413
3971i0947J9964M4836n9246k8375P267J4492P0683J17457j29028M155O446K9227
3959F931j1312j2047j8279R1617M2034o0144k5768j08701l2603J45324n3414J07582
3947G1220O3138M3056j12503M5748K6357m3878p8311J20509p3250j61889J02170
3936B367N0767K0434M55j15665m0875J40021R5144q6021j20974r6603O9088P3241
$$ plain form
4016 -6103 -105396 -80040 68734 4084 142008 92374 85135 44608 -8014 42384 9265 -54165
4004 -54165 -87108 28493 48508 127384 74766 -60847 -33266 74052 135560 127859 127863 91656
3992 91656 46620 -71642 -129169 -195862 -65893 -41190 -50034 -19398 -89546 -199526 -113992
3981 -113992 -8321 -88074 41410 -101740 -320859 -205370 -61439 50095 -80534 -90947
3971 -90947 -70983 -26147 -85393 -113768 -106501 -92009 -21326 96131 -32897 -28742 -22296 6931
3959 6931 -4381 -16428 -34707 56910 98944 38800 13032 -95669 -128272 17052 -36362 71220
3947 71220 134358 177414 64911 110659 137016 93138 14827 135336 62086 -99803 2367
3936 2367 53134 73568 74023 -41642 -82517 57504 152648 66627 -54347 -150950 -81862 -8621
3924h621J17637L7377j61869J02863L4437r3468r0945K7682L4489q4881j12773
3913a98072J6561J05770L5044q5888J66676J09464k9289k8492N3007j70293o1898
3902h7410J3241J04381j55144j49N3289O206j594P5433Q2520M732o144J0395j33119
3889c3363n7328L8289R6687k807P732j473n7324L15j4031O2100R969Q5390K3474
3876A57630r0348n7635j04635R5027Q7801j9646Q5467p5228r2460q0994M0158
3865e4863M0779k7891M5024q1391p2670J23959N3678l2977p5237m270L7376L3442
3853a5041L1051O632O7669n9684p8416q107R4967m4137M529r1779q3509M323M4149
3840a27353Q1721L9283k789N5647N3598O254j19055o4055R2474m7709K2454l1663
$$ plain form
3924 -8621 109016 146393 -15476 87387 121824 28356 -62589 -34907 -418 -85299 -198072
3913 -198072 -181511 -75741 -40697 -126585 40091 149555 120266 91774 144781 -25512 -87410
3902 -87410 -74169 30212 -124932 -125081 -71792 -65586 -67180 8253 90773 95505 89361 99756 -33363
3889 -33363 -90691 -52402 44285 41478 49210 47737 -9587 -9272 -23303 38797 48766 134156 157630
3876 157630 67282 9647 -94988 39 87840 68194 153661 78433 -14027 -95021 -54863
3865 -54863 -14084 -41975 3049 -78342 -151012 -27053 26625 -6352 -81589 -85859 -48483 -15041
3853 -15041 16010 22642 90311 30627 -47789 -55896 39071 -5066 -537 -92316 -175825 -171502 -127353
3840 -127353 -45632 -6349 -9138 46509 100107 106361 -12694 -76749 15725 -31984 -9530 -41193
3828d1193n0745k4745o8697j4002J55955J6067j27122P8391J15675K2839p7036
3817a4613j39589Q9582Q9661o199K3692K7421j01375j31686k5464L9328J76786
3806B7544L4241j91250n734O200O1023K3491J10889m9719j7429l9344K1962K03943
3794A85817J821p9778j9932L1808j10863p4128K0468P1666J03039m22q4305l3347
3782A1844j9076M2719q4111M0383N9256O850l9787R6580m2531j07173l4351N7264
3770a2133R4258k0353l5119R3220L8182j76438M2624j8713j5311J03326j08831
3759a5288K8588Q5458N5411M8692m0885r3765O7101o0760p5213J7830q2232o481
3747g1544L083P5745q5286j1305N0958j00973O3505n088r9677J57214L0348p4013
$$ plain form
3828 -41193 -91938 -116683 -185380 -199382 -43427 -27360 -154482 -76091 39584 62423 -14613
3817 -14613 -154202 -64620 25041 18842 42534 69955 -31420 -163106 -188570 -149242 27544
3806 27544 61785 -129465 -135199 -128999 -67976 -44485 66404 16685 -744 -40088 -18126 185817
3794 185817 187638 107860 87928 119736 8873 -65255 -44787 26879 129918 129496 45191 11844
3782 11844 -7232 35487 -48624 -8241 51015 57865 18078 114658 72127 -35046 -69397 -12133
3770 -12133 82125 61772 26653 119873 158055 -18383 24241 5528 -9783 93543 -15288
3759 -15288 13300 98758 154169 202861 161976 68211 135312 74552 -661 17169 -65063 -71544
3747 -71544 -68461 7284 -78002 -89307 -38349 -139322 -75817 -80905 -180582 -23368 6980 -67033
3735f7033n7070N6178j9854M9688Q9494N0158k3523j6065M878L1987j58967j6395
3723g6524J08698J10252o7023j4450k6640k4952J9047m9246K7158M8987J15847
3712A71154j56974k9088K0121J8394K8100k2090l7748o7466J56683K2151p6807
3701B6430K0043n6316P721K5990m5238m1435K3610O1273J3620K268j4310L9843
3689F3499o5505l8217j78595L0978l7410J43790J24559J4509L2862o7397J00113
3678A23186j97920j88645R4949J09457O9181R160k6724l6549j3184O944j51995
3667b02140m411O2922o59j1053N6306J11350M755P5705q0126j05828n634n0733
3655a49546J51141O306m8854j2330K4030P955k7922L557M9272r1335n9523J48672
$$ plain form
3735 -67033 -124103 -67925 -87779 -38091 51403 101561 78038 61973 66851 98838 -60129 -76524
3723 -76524 32174 142426 75403 60953 34313 9361 28408 -20838 6320 55307 171154
3712 171154 14180 -14908 5213 23607 51707 29617 -8131 -75597 81086 103237 26430
3701 26430 46473 -9843 -2122 23868 -21370 -62805 -39195 22078 35698 37966 23656 63499
3689 63499 -2006 -40223 -218818 -187840 -225250 -81460 43099 57608 90470 23073 123186
3678 123186 -74734 -263379 -168430 -58973 10208 19368 -7356 -43905 -57089 -50145 -202140
3667 -202140 -206551 -143629 -144288 -155341 -99035 12315 17070 92775 12649 -93179 -98813 -149546
3655 -149546 1595 7901 -40953 -53283 -29253 -21298 -49220 -45663 3609 -87726 -147249 1423
3643A423K7726J1237n717j17035p4923k5220k9795R0996P1500O5770N0300r7546
3631c1284j02315J7174J60845k1925P5980l9030j5833n4437J3694J0464L8355
3620E1688K4206q7110L2635Q3204q9998r0320P0472R5511o4665m127k0879J17657
3608A18274Q3472j20844j43647J8334J34348o4864r8498Q1417K1441k2437P7906
3597H4902o060j57566N7118J76657K3337n5575m6253N6578R043m4679o6847k565
3585B8090l583m5316R3193p3825l6428K8279q0111O2795J06787p9441Q7115m1479
3573D6076l548P6448m2981k1486m4816o5621J3777K0268l0796Q2928N3898J3892
3561I8039J6522j95518m063R2336N2583K1048q9616J11914o0008P8315J2632p1317
$$ plain form
3643 1423 29149 40386 34669 -82366 -157289 -182509 -212304 -121308 -49808 15962 66262 -31284
3631 -31284 -133599 -116425 44420 22495 98475 59445 43612 -10825 2869 13333 51688
3620 51688 75894 -11216 21419 104623 14625 -75695 -5223 90288 25623 21496 617 118274
3608 118274 201746 80902 -62745 -44411 89937 25073 -73425 7992 29433 6996 84902
3597 84902 78842 -78724 -21606 155051 178388 122813 76560 133138 142181 97502 30655 28090
3585 28090 24507 -20809 72384 -1441 -37869 -9590 -89701 -26906 79881 440 87555 46076
3573 46076 42528 118976 75995 54509 9693 -55928 -42151 -21883 -52679 30249 84147 98039
3561 98039 114561 -80957 -85020 7316 59899 80947 -8669 103245 43237 121552 134184 62867
3549F2867m9576j32669m6124J42157O6413J3144k7639j3161m8820N1596O4236
3538H2424J3064p88k4752J48068p754k35661L7668J6553J01631k8450M2113L8163
3526A82279j23021l3058R2480n0991o336L4280j15172N5040J0418l1346J02445
3515A17018P4685P542n5180L5929O7701K1333r1383J64188n8836Q790J37328j03832
3503C25283p3598j35950N221M0423J1057m1383j35820J36002J52860Q3848J0196
3492C78139N720m2192L2594M9805o347j4584J15660Q4473J1723L5876p7379N5496
3480F28984n6501p854M7784J7409J78588n1323k5724j1418j9568L8978R5426J85953
3468A020734J38330L4830N1418Q5217K12022K98146N5739m8524j95159q6864j91151
$$ plain form
3549 62867 13291 -119378 -165502 -23345 43068 56212 28573 15412 -33408 18188 82424
3538 82424 95488 94700 69948 218016 210262 -25399 12269 28822 130453 102003 144116 182279
3526 182279 59258 26200 118680 67689 61353 95633 -19539 35501 45919 14573 117018
3515 117018 191703 199245 144065 179994 247695 269028 177645 341833 282997 291787 429115 325283
3503 325283 251685 115735 120956 161379 172436 131053 -4767 131235 284095 367943 378139
3492 378139 383859 341667 374261 424066 417719 403135 518795 603268 614991 650867 573488 628984
3480 628984 572483 564629 612413 629822 808410 757087 731363 719945 700377 739355 834781 1020734
3468 1020734 1159064 1193894 1245312 1330529 1542551 1840697 1896436 1847912 1652753 1565889 1374738
3457A374738K295K7800j49236j59466k00527o908M7065m3420M2787p8944j6508
3446H39676l5212M1535J72307P8595R363R4872P9616O4053J70618J14585J50833
3435A780841K63571K23929L45812K98982J16098K0095k52827k05402k91667l64726
3425A934706j98430k71965j61550l1603M8972j58968j48581j57888n301K9070
3415H78462q6824r5288m403o4285J545J5698J01787J03208J53341q0428O07Q5797
3403A009217J64847O5048K02598J22514m1915N084j99943R780j06816k08699j12609
3392I09106j93736o7023k409j06359o5528j71892k0822l19L7996r250q686j56253
3380A44825j31609Q7768Q4317k9672r6481N5765N2408m691M8031r3741p8437k6680
$$ plain form
3457 1374738 1377033 1404833 1255597 1096131 895604 888696 935761 892341 935128 856184 839676
3446 839676 804464 845999 1018306 1096901 1106264 1201136 1280752 1344805 1515423 1630008 1780841
3435 1780841 2044412 2268341 2614153 2913135 3029233 3049328 2796501 2591099 2299432 1934706
3425 1934706 1736276 1464311 1302761 1271158 1320130 1161162 1012581 854693 849392 878462
3415 878462 791638 696350 691947 627662 629207 644905 746692 849900 1003241 922813 923420 1009217
3403 1009217 1174064 1239112 1441710 1564224 1522309 1527393 1327450 1337230 1230414 1021715 909106
3392 909106 715370 648347 645938 539579 474051 302159 281337 281018 319014 309764 301078 144825
3380 144825 13216 100984 185301 155629 59148 114913 167321 162630 210661 116920 38483 11803
3368A1803j4731J05086N1409M6636o3373r3758j8991J15420o9888j24259m9386
3357a04032J09374K9709o2911O3189J2210K6255n8266N5523j41205N4673M4632
3346B9151n9447Q1716m7852m6209j4645J50579L0902L2034p8928j26588M0679
3335h608q993R6489j7888K246j39634J26697O0293l0330r4629m5336J04204j8828
3323B5683r6547O8903K2924m2413K1676L9040Q235q2142M5850O9773K7347l8919
3311F9410J8291m81k1438q2093K2366j1873L4978R3962j8223j0500j17992j6249
3299c9842j8798n2482M671J08305k5258J97130j0521p0002J4283p6361p5603n0487
3287i4965J8859M4504m3157M5431O8382l9014m5190Q2968j5587J36323L5107j45059
$$ plain form
3368 11803 -2928 102158 153567 200203 136830 43072 24081 139501 69613 -54646 -104032
3357 -104032 5342 35051 -27860 35329 47539 73794 15528 71051 -70154 -15481 29151
3346 29151 -30296 51420 3568 -42641 -57286 93293 124195 156229 77301 -49287 -8608
3335 -8608 -17601 78888 61000 63246 -76388 50309 110602 80272 -14357 -59693 44511 25683
3323 25683 -70864 -1961 20963 -21450 226 39266 47501 -34641 11209 80982 108329 69410
3311 69410 87701 87220 65782 -16311 6055 -5818 29160 123122 104899 94399 -23593 -39842
3299 -39842 -58640 -111122 -106451 1854 -23404 173726 163205 93203 107486 31125 -44478 -94965
3287 -94965 -76106 -31602 -74759 -29328 39054 40 -45150 37818 22231 158554 193661 48602
3275D8602n6974j05394M5424J4775l5971k9696P3445P6769J22270m8567o7465
3264C7218J57743n9786j50058q7268p382J12700m5155m4384J04040N0427r1362
3253b3267L6911l4405M6095o882n809O5871n5367k00354O3679n8580R367O1960
3241a00781k9167p0731P7076m1802M3334R7115m885m981l353M8331l170j0184
3229c198j20226l2487J54960O0616r2431j5163m3290j7934L8075J00248l5607
3218f437J16305Q718o3886p2733N9856p7552j15966J08183k9446j0740P0998m163
3206a6863j7255N8471o9943n2479J3983p5937J3079J95428q536p9458n47l1467
3194g1524r3525M4181J87519M6187k3342l5317q8298k1311L6315Q5370L7449j05583
$$ plain form
3275 48602 -8372 -113766 -68342 -53567 -89538 -119234 -45789 30980 153250 104683 37218
3264 37218 194961 135175 -14883 -102151 -109533 3167 -41988 -86372 17668 68095 -23267
3253 -23267 13644 -20761 25334 18452 12643 78514 23147 -177207 -113528 -172108 -162741 -100781
3241 -100781 -129948 -200679 -123603 -165405 -122071 -24956 -29841 -34822 -38175 10156 6986 -3198
3229 -3198 -123424 -155911 -951 59665 -32766 -47929 -91219 -109153 -71078 29170 -6437
3218 -6437 109868 118586 54700 -18033 41823 -35729 -151695 -43512 -72958 -83698 -12700 -16863
3206 -16863 -34118 24353 -45590 -98069 -84086 -160023 -146944 48484 39948 -39510 -40057 -71524
3194 -71524 -165049 -120868 66651 112838 89496 54179 -34119 -55430 -19115 66255 103704 -1879
3182a879J0903n4555K2287N0795j40355M6738r02p2146N8664J34266j07184L4372
3170a8996m2215r8672l3911r43P539J0047j8520J94125J5245m5320n0735n8870
3158a41226P2652J33718J0255j4723j3526p4650J05863l3532j41718p7076J36547
3147c7416N6888J42746j63433L1768m5996j5264J19840r7041O4801m8491k268
3136F134J2435m667p9405J46363J21396j71083n473J18583l7704M6351j05477
3125D7453o8414j9062Q3343N2099j89656n8990L6974Q482J14359L3809j10799
3114g0402J32758m497j58632L1108M1922n4816O2069M5270j6213l2979K1087L676
3102C51M4086j79351m4756L7275k2920K9408O6578j9100M7992o0523N9271J2465
$$ plain form
3182 -1879 9024 -45531 -23244 27551 -112804 -66066 -66968 -139114 -80450 53816 -53368 -18996
3170 -18996 -61211 -159883 -193794 -194737 -187198 -177151 -195671 -1546 13699 -31621 -82356 -141226
3158 -141226 -68574 65144 75399 60676 47150 -27500 78363 44831 -96887 -173963 -37416
3147 -37416 19472 162218 -1215 30553 -15443 -30707 89133 -7908 56893 8402 6134
3136 6134 18569 13902 -65503 80860 202256 31173 25700 144283 106579 152930 47453
3125 47453 -20961 -40023 43320 95419 -94237 -153227 -116253 -107771 6588 40397 -70402
3114 -70402 62356 57859 -100773 -69665 -27743 -82559 -20490 24780 8567 -24412 -3325 351
3102 351 44437 -134914 -179670 -142395 -165315 -135907 -69329 -88429 -40437 -100960 -41689 -29224
3090b9224n9331k5119J21174L1463j16473p9916K9794M3500n7085k7458J0039
3079a58636J01670k8091m5456O7225j10697j2605O3096L7712m0305J4974O9779
3068d1334L1244O3511l2290q9191Q5160L6318O9372L6219k37603r1415R1556P2316
3056f137l3125o9559o661j3900k5037J10256o7979m9822J06136J3075K4697q892
3044b6948o3039M6347o2153J14013M8833j2216q2058N5252J0576O4544k2288R646
3032H0509L8855o5504Q1959j3950l5010n6131j23004L1729J01238o118P0436j31597
3020b6588m7529L6383K5504N2462o9577q2360J3769N4849j11529Q664Q3002P3527
3008A0577r5935J19405J31776k29708J5685O0976k019N16k4254m2362j956j7030
$$ plain form
3090 -29224 -88555 -113674 7500 38963 -77510 -157426 -127632 -84132 -141217 -168675 -158636
3079 -158636 -56966 -85057 -130513 -63288 -173985 -186590 -123494 -85782 -126087 -111113 -41334
3068 -41334 -10090 53421 21131 -68060 17100 53418 122790 159009 -78594 -170009 -78453 -6137
3056 -6137 -39262 -108821 -115482 -129382 -154419 -44163 -112142 -161964 -55828 -42753 -18056 -26948
3044 -26948 -89987 -43640 -105793 8220 57053 44837 -37221 18031 28607 93151 70863 80509
3032 80509 119364 53860 135819 121869 86859 30728 -92276 -60547 40691 34573 105009 -26588
3020 -26588 -74117 -37734 -12230 40232 -29345 -111705 -97936 -43087 -154616 -145952 -62950 10577
3008 10577 -85358 34047 165823 -63885 -48200 12776 10757 11273 -12981 -55343 -57299 -74329
2996g4329j23160N4546M0674J6232O6328j27661k1713j0611J25848L8911n4699
2985f9634j19325m5861L2753P6536J52371J31295j40904j6127K7544m2870M4737
2974C0515j18691N5289O2691J01854r5002M1379p474q3420m2398M5691P8527K998
2962G1959j35103n7459L991P4347n6036m608K0427L7285O0006M0041P6202P2364
2950B03416r8073j81728P9257L4806p338K2624p3017J03970Q3771m4511q1133
2939D2044j09313R598M2962q0561K2730J31409p3123k6647N8550q895j48871Q1015
2927e9102l484m0914J73107k5346j15441O3393N4288P9510R3986j80221q8501
2916d8725r1403O6668J1885j245J02022k4537j09451Q2532L71r0322J08132o2750
$$ plain form
2996 -74329 -197489 -142943 -102269 -86037 -19709 -147370 -169083 -179694 -53846 -14935 -69634
2985 -69634 -188959 -234820 -202067 -125531 26840 158135 17231 1104 28648 -14222 30515
2974 30515 -88176 -32887 29804 131658 36656 78035 70561 -12859 -55257 -9566 68961 71959
2962 71959 -63144 -120603 -116612 -42265 -98301 -102909 -82482 -45197 14809 54850 131052 203416
2950 203416 105343 -76385 2872 37678 30340 52964 -20053 83917 167688 123177 42044
2939 42044 -67269 -57671 -14709 -95270 -72540 58869 -14254 -40901 17649 8754 -140117 -59102
2927 -59102 -62586 -103500 69607 44261 -71180 -7787 46501 126011 219997 39776 -48725
2916 -48725 -140128 -73460 -61575 -62820 39202 14665 -94786 -12254 -11883 -102205 5927 -56823
2904e6823j06337M099P4053r6729N0063K8226J0883J82718n2194j04914Q1749
2893A4794j21255M4444k6504L8780p1749L4769J1798M397J3706m514M6719n9882
2881g4497K0250Q1023k1406m2868K3613M2818j41497j41355M0684P1270l5076
2870a77041K9338O5496m0120P3023L5929p5941J02225M2907p1045K8803M0168
2859E3742J02486j43660K187j08532J4454M7503l4715M062j9668J00850K7933
2848D6642M3150j52606j07388M1289R2151L7415l1031p5148j4839J06809N0497
2837C6941P4221J02936p8647j41187l9652m8929J08622p161j48622K5601k0649
2826a36526L2771J2227O2498j9371k7651L1853q6422J5366J99770j9678j09576
$$ plain form
2904 -56823 -163160 -159061 -85008 -181737 -131674 -103448 -92565 90153 37959 -66955 14794
2893 14794 -106461 -62017 -88521 -49741 -121490 -86721 -74923 -70526 -56820 -61334 -14615 -74497
2881 -74497 -54247 26776 5370 -37498 -13885 28933 -112564 -253919 -213235 -141965 -177041
2870 -177041 -147703 -82207 -122327 -49304 -13375 -89316 12909 55816 -15229 13574 53742
2859 53742 156228 12568 14755 -93777 -79323 -31820 -66535 -62473 -82141 18709 46642
2848 46642 89792 -62814 -170202 -128913 -36762 653 -30378 -105526 -120365 -13556 36941
2837 36941 111162 214098 135451 -5736 -45388 -94317 14305 7144 -141478 -115877 -136526
2826 -136526 -103755 -91528 -29030 -48401 -76052 -44199 -130621 -115255 84515 64837 -44739
2815d4739l0286o456k1979k1603N5509R1311m060p191o3196l8812q1715M4253
2803a28964J42421j04808p0476J25728r5602j2091J78131q6934m4691k1688J36953
2792A7979k0696p9349j23060N7879N9662J5966J06467L1713p378P0380O756k605
2780A33714j00501l6782m1231l6383Q8771m0998O6617R2619o4606J1253p0578
2769A895k5017l5080l539L0581Q0365l0146p902m6939L1540l4960J33657k2899
2757G1556m6123o6969m116N6723J8687N2374j78804P5681k5673J5112M1319p362
2745B405j5880J6732j60389O8145J13234J5498j3787q0541N573J9381q1244m9401
2733a60274R8992K1069M6378J6417j11432K7753n5295k7504P7465L3769p053K4254
$$ plain form
2815 -44739 -75025 -81481 -103460 -125063 -69554 21757 17697 10506 -52690 -91502 -173217 -128964
2803 -128964 13457 -91351 -161827 -36099 -131701 -143792 34339 -52595 -97286 -118974 17979
2792 17979 -2717 -82066 -205126 -147247 -87585 -71619 34848 66561 59183 129563 136319 133714
2780 133714 33213 -3569 -44800 -81183 7588 -33410 33207 125826 61220 72473 1895
2769 1895 -23122 -58202 -61741 -31160 49205 19059 11157 -35782 -4242 -39202 94455 71556
2757 71556 25433 -41536 -45652 11071 29758 82132 -96672 -20991 -46664 -31552 9767 2405
2745 2405 -13475 3257 -157132 -88987 24247 39745 25958 -54583 -49010 -29629 -110873 -160274
2733 -160274 -61282 -40213 6165 22582 -88850 -61097 -116392 -143896 -66431 -32662 -39715 -15461
2721a5461P9233r075N472K7076R0981q8132j18465L2021m5210M587j35406J3085
2709a59294p8387J51815J81174k1711j2135j24479p5484K585j5305J17611O6124
2698C2514r163j0520N1708j04040o958R669J670m179r9436J00961n0847J38361
2686D9740K3331k9579J292M199q4443q5460J8673J17067j04186J19290j5804n5076
2674d0956j00693N3172J2418K423q4641Q4839N3730n5159O9675P265J61422r6165
2662F7330q4417J7182r8285m6264M3096j02672J70363M7738J8889l5293R488j45023
$$ plain form
2721 -15461 63772 54697 60169 87245 178226 90094 -28371 3650 -41560 -36973 -172379 -159294
2709 -159294 -237681 -85866 95308 73597 61462 -63017 -138501 -135916 -151221 -33610 32514
2698 32514 23351 12831 64539 -39501 -46459 -36790 -35120 -39299 -138735 -37774 -88621 49740
2686 49740 73071 43492 44784 48983 -35460 -120920 -102247 14820 -89366 29924 14120 -40956
2674 -40956 -141649 -88477 -76059 -73636 -158277 -73438 -19708 -74867 -5192 2073 163495 67330
2662 67330 -17087 95 -98190 -144454 -101358 -204030 -33667 14071 32960 -2333 7155 -137868
$$ [...]
##END NTUPLES=NMR SPECTRUM
##END=
