##TITLE=1H_CA-9316-1
 200.13MHz, CDCl3,
 8 sc
 
 27.1.2025
##JCAMPDX= 6.0         $$ Bruker NMR JCAMP-DX V2.0
##DATA TYPE= NMR SPECTRUM
##DATA CLASS= NTUPLES
##ORIGIN= UXNMR, Bruker Analytische Messtechnik GmbH
##OWNER= pz
$$ XWIN-NMR		Version 3.5
$$ Mon Jan 27 16:30:26 2025 Russian Standard Time (UT+4h)  she@DPX200
##.OBSERVE FREQUENCY= 200.1313
##.OBSERVE NUCLEUS= ^1H
##.ACQUISITION MODE= SIMULTANEOUS
##.ACQUISITION SCHEME= undefined
##.AVERAGES= 8
##.DIGITISER RES= 18
##SPECTROMETER/DATA SYSTEM= spect
##.PULSE SEQUENCE= zg30
##.SOLVENT NAME= D2O
##.SHIFT REFERENCE= (INTERNAL, D2O, 0, 15.4692)
##AUDIT TRAIL= $$ (NUMBER, WHEN, WHO, WHERE, WHAT)
$$ ##TITLE= Audit trail, XWIN-NMR		Version 3.5
$$ ##JCAMPDX= 5.01
$$ ##ORIGIN= Bruker BioSpin GmbH
$$ ##OWNER= she
$$ F:/spectra/data/she/nmr/H-C/1/pdata/1/auditp.txt
$$ ##AUDIT TRAIL=  $$ (NUMBER, WHEN, WHO, WHERE, WHAT)
(   1,<2025-01-27 16:29:15.09 +0400>,<she>,<DPX200>,
      <created by zg, POWCHK disabled, PULCHK disabled
       configuration hash MD5:
       00 E9 B6 7A A2 85 ED C7 34 08 36 98 17 FE 4E 26
       data hash MD5: 16K
       A1 53 1C 32 19 7C 25 B3 95 C6 2E 28 1E 93 79 61>)
(   2,<2025-01-27 16:29:17.40 +0400>,<she>,<DPX200>,
      <Start of raw data processing
       efp BC_mod = 2 LB = 0.25 FT_mod = 6 PKNL = 1 PHC0 = 247.9967 PHC1 = 10.59223 SI = 16K 
       data hash MD5: 16K
       DA 69 CA EF 46 BD AB 44 8B 7A 82 E1 5E E8 37 63>)
(   3,<2025-01-27 16:29:36.21 +0400>,<she>,<DPX200>,
      <pk PHC0 = -156.6648 PHC1 = 3.2 
       data hash MD5: 16K
       EF AC 3C 01 20 A4 04 65 AD EA F0 F0 06 AD 50 74>)
(   4,<2025-01-27 16:29:38.95 +0400>,<she>,<DPX200>,
      <abs ABSG = 5 
       data hash MD5: 16K
       FB 11 3D 03 CA 1B 2B 1D 05 21 2D 55 60 3E 13 96>)
(   5,<2025-01-27 16:29:56.10 +0400>,<she>,<DPX200>,
      <abs ABSG = 5 
       data hash MD5: 16K
       FA 85 62 F3 67 BD 2B 06 43 D3 B0 CE 0B A2 26 54>)
$$ ##END=
$$ 
$$ hash MD5
$$ CA 4F CA F7 5D C2 14 62 5C 18 05 03 EC 1C 97 8C
##$RELAX= 
##$RELAX= 
##$RELAX= 
##$RELAX= 
##$RELAX= 
##$RELAX= 
$$ Bruker specific parameters
$$ --------------------------
##$DU= <F:/spectra>
##$EXPNO= 1
##$NAME= <H-C>
##$PROCNO= 1
##$TYPE= <nmr>
##$USER= <she>
##$AMP= (0..31)
100 100 100 100 100 100 100 100 100 100 100 100 100 100 100 100 100 100 
100 100 100 100 100 100 100 100 100 100 100 100 100 100 
##$AQSEQ= 0
##$AQ_mod= 1
##$AUNM= <au_zg>
##$AUTOPOS= <>
##$BF1= 200.13
##$BF2= 200.13
##$BF3= 200.13
##$BF4= 200.13
##$BF5= 200.13
##$BF6= 200.13
##$BF7= 200.13
##$BF8= 200.13
##$BYTORDA= 1
##$CFDGTYP= 0
##$CFRGTYP= 5
##$CHEMSTR= <none>
##$CNST= (0..31)
1 1 145 1 1 1 1 1 1 1 1 1 1 1 1 1 1 1 1 1 1 1 1 1 1 1 1 1 1 1 1 1 
##$CPDPRG= <>
##$CPDPRG1= <>
##$CPDPRG2= <>
##$CPDPRG3= <>
##$CPDPRG4= <mlev>
##$CPDPRG5= <mlev>
##$CPDPRG6= <mlev>
##$CPDPRG7= <mlev>
##$CPDPRG8= <mlev>
##$CPDPRGB= <>
##$CPDPRGT= <>
##$D= (0..31)
0 0.7 0 0 0 0 0 0 0 0 0 0.03 0 0 0 0 0 0 0 0 0 0 0 0 0 0 0 0 0 0 0 0 
##$DATE= 1737980954
##$DBL= (0..7)
$$ [...]
##$SUBNAM3= <"">
##$SUBNAM4= <"">
##$SUBNAM5= <"">
##$SUBNAM6= <"">
##$SUBNAM7= <"">
##$SUBNAM8= <"">
##$SUBNAM9= <"">
##$SW= 18.0517328524113
##$SWIBOX= (0..15)
0 0 2 0 0 0 0 0 0 0 0 0 0 0 0 0 
##$SW_h= 3612.71676300578
##$TD= 16384
##$TD0= 1
##$TE= 0
##$TE2= 300
##$TE3= 300
##$TEG= 300
##$TL= (0..7)
0 120 120 120 120 120 120 120 
##$TP= (0..7)
150 150 150 150 150 150 150 150 
##$TP07= 0
##$TPNAME0= <>
##$TPNAME1= <>
##$TPNAME2= <>
##$TPNAME3= <>
##$TPNAME4= <>
##$TPNAME5= <>
##$TPNAME6= <>
##$TPNAME7= <>
##$TPOAL= (0..7)
0.5 0.5 0.5 0.5 0.5 0.5 0.5 0.5 
##$TPOFFS= (0..7)
0 0 0 0 0 0 0 0 
##$TUNHIN= 0
##$TUNHOUT= 0
##$TUNXOUT= 0
##$USERA1= <user>
##$USERA2= <user>
##$USERA3= <user>
##$USERA4= <user>
##$USERA5= <user>
##$V9= 5
##$VALIST= <valist>
##$VCLIST= <CCCCCCCCCCCCCCC>
##$VD= 0
##$VDLIST= <DDDDDDDDDDDDDDD>
##$VPLIST= <PPPPPPPPPPPPPPP>
##$VTLIST= <TTTTTTTTTTTTTTT>
##$WBST= 1024
##$WBSW= 4
##$XGAIN= (0..3)
0 0 0 0 
##$XL= 0
##$YL= 0
##$YMAX_a= 380125
##$YMIN_a= -374098
##$ZGOPTNS= <>
##$ZL1= 120
##$ZL2= 120
##$ZL3= 120
##$ZL4= 120
##$ABSF1= 15.46924
##$ABSF2= -2.582609
##$ABSG= 5
##$ABSL= 3
##$ALPHA= 0
##$AQORDER= 0
##$ASSFAC= 0
##$ASSFACI= 0
##$ASSFACX= 0
##$ASSWID= 0
##$AUNMP= <proc_1d>
##$AZFE= 0.1
##$AZFW= 0.1
##$BCFW= 0
##$BC_mod= 2
##$BYTORDP= 0
##$COROFFS= 0
##$CY= -3
##$DATMOD= 1
##$DC= 0
##$DFILT= <>
##$DTYPP= 0
##$F1P= 0
##$F2P= 0
##$FCOR= 1
##$FTSIZE= 16384
##$FT_mod= 6
##$GAMMA= 0
##$GB= 0
##$INTBC= 1
##$INTSCL= 3.241238e-09
##$ISEN= 128
##$LB= 0.25
##$LEV0= 0
##$LPBIN= 0
##$MAXI= 10000
##$MC2= 0
##$MEAN= 0
##$ME_mod= 0
##$MI= 1.114404
##$NCOEF= 0
##$NC_proc= -6
##$NLEV= 6
##$NOISF1= 3.799351
##$NOISF2= 2.8
##$NSP= 0
##$NTH_PI= 0
##$NZP= 0
##$OFFSET= 15.46924
##$PC= 1
##$PHC0= 91.33191
##$PHC1= 13.79223
##$PH_mod= 1
##$PKNL= yes
##$PPARMOD= 0
##$PSCAL= 0
##$PSIGN= 0
##$REVERSE= no
##$SF= 200.130010499958
##$SI= 16384
##$SIGF1= 3
##$SIGF2= 2
##$SINO= 0.751879
##$SIOLD= 32768
##$SREGLST= <19F.Aceton>
##$SSB= 0
##$STSI= 16384
##$STSR= 0
##$SW_p= 3612.71676300578
##$SYMM= 0
##$S_DEV= 0
##$TDeff= 16384
##$TDoff= 0
##$TI= <>
##$TILT= no
##$TM1= 0
##$TM2= 0
##$TOPLEV= 0
##$USERP1= <user>
##$USERP2= <user>
##$USERP3= <user>
##$USERP4= <user>
##$USERP5= <user>
##$WDW= 1
##$XDIM= 16384
##$YMAX_p= 401545961
##$YMIN_p= -863593
$$ End of Bruker specific parameters
$$ ---------------------------------
##NTUPLES= NMR SPECTRUM
##VAR_NAME=  FREQUENCY,     SPECTRUM/REAL,   SPECTRUM/IMAG
##SYMBOL=    X,             R,               I
##VAR_TYPE=  INDEPENDENT,   DEPENDENT,       DEPENDENT
##VAR_FORM=  AFFN,          ASDF,            ASDF
##VAR_DIM=   16384,         16384,           16384
##UNITS=     HZ,            ARBITRARY UNITS, ARBITRARY UNITS
##FACTOR=    0.220516191357247, 1,           1
##FIRST=     3095.85920137062, 0,            0
##LAST=      -516.857561635164, 0,           0
##MIN=       -516.857561635164, -863593,     0
##MAX=       3095.85920137062, 401545961,    0
$$ Real data points
##PAGE= N=1
##DATA TABLE= (X++(R..R)), XYDATA
$$ [...]
6547h6583j0109L4156l0300j8915Q597J0291L4009J376J157j9919J2437q187K2480
6534d9510J2704p978j3965k8700J4654L4953J2954k9326N912J3246j7917k9310
6522h2283n385m861K2031j5280j5593L1705j8501J1571K5082J1137k3316m5035
6510a08728J8929K0735M166R988Q133k9780n104L9912j286Q651p950k963r056
6497e4353k6375N671J7321J6245M571p516l4519K3650p472L135K8073P449j5009
6484c9129l9882o254K3437j1766K8930o975J850q180k6543o68N360l1790L5245
6471g6365J5958M4223m5132j7583n353O62m780Q526L2588N873k8038R092Q703
6458e1626j1227N0891M331j0212m7118K5381j6775j2412M6210j7235l3687K6137
$$ y = [-86583, -96692, -62536, -92836, -111751, -103154, -92863, -58854, -57478, -56321, -76240, -63803, -71990, -49510, -36806, -44784, -58749, -87449, -72795, -37842, -24888, -54214, -48302, -35056, -52973, -82283, -87668, -92529, -70498, -85778, -101371, -69666, -88167, -76596, -51514, -40377, -63693, -108728, -89799, -69064, -64898, -54910, -46777, -76557, -81661, -41749, -43035, -34384, -42334, -45297, -54353, -80728, -75057, -57736, -41491, -36920, -44436, -78955, -55305, -62777, -59642, -31569, -24120, -39129, -79011, -85265, -61828, -73594, -44664, -51639, -49789, -57969, -84512, -85180, -79820, -111610, -76365, -60407, -16184, -61316, -78899, -84252, -83590, -88370, -79844, -47256, -41383, -69421, -60329, -51626, -62853, -11962, -7631, -17843, -64961, -39580, -56355, -68767, -22557, -39792, -73479, -47342]
6446d7342J2968k3989L9412J3523q078j7047k1155j748l8472L444K6857m531J647
6433f4511K4428J671j3267l796L8720k7867O038k0952j325K2615J8489k9318j994
6420e1069L4088j663k0067j1488k2247k5186O980Q578L6149j3352l781Q172J9997
6407c4889j1884m442J8769p181J492k1588J7425j7364j8552N9788j6858j4970
6395e0254J94l574K5464J3431k4110N105j1850r686J2299l5996N003L2179R490
6382c2305l8896R57j9493N2256K9275j9772J7444j8146n2603j6619M8286j1475
6370f1091L5024k2822k2588K7678k9330Q240K4353J6201o336k2346m1246L5112
6358e9151k1383r972L2316L7436p813o370K42k523L698M7263p381k387l0894n955
$$ y = [-47342, -34374, -58363, -18951, -5428, -13506, -30553, -51708, -53456, -91928, -88484, -61627, -66158, -64511, -40083, -38412, -51679, -55475, -16755, -44622, -38584, -59536, -60861, -38246, -19757, -49075, -51069, -16981, -18644, -38711, -50199, -72446, -97632, -90652, -82074, -45925, -59277, -63058, -54886, -34889, -46773, -51215, -32446, -39627, -38135, -59723, -42298, -59662, -78214, -18426, -35284, -50254, -50060, -53634, -28170, -14739, -38849, -33744, -45594, -55280, -42981, -78977, -73974, -41795, -32305, -71201, -70244, -89737, -37481, -8206, -27978, -10534, -28680, -81283, -97902, -49616, -61091, -26067, -48889, -71477, -43799, -73129, -64889, -40536, -24335, -30671, -53017, -94263, -59151, -80534, -90506, -58190, -20754, -28567, -34937, -34695, -37218, -33520, 13743, 6362, 3975, -26919, -32874]
6344c2874K1530o317P415N847l967m1627K730K2844p876q275J4187K5802J4776
6331A4195l3272k1074p850J9373m545k4328J3684M1929l1067L6574N469l1592
6319b2504m5337M2641L7624J0004k3786j9618M610j6965J100l557P961r934j4317
6306e2078L0488J4969l7209j6047K0349N0383j222j9174n581j1937p299n826j5755
6293e5939j2946M5446J0010k284m7664J2451K4922n616N168j3445j7172k547P297
6280e2319K3847m679K6094K3054k8435k5410P211J9634Q699j1281j5781l296l7896
6267g0558N241M0454L742N866j2262n5247K7940J9278O86l2490P042l6733J5923
6254h1118K9515k209O828M104K4037K1365l2801k4001P894J1053l6253j2760L1508
$$ y = [-32874, -11344, -17661, -10246, -4399, -8366, -49993, -47263, -24419, -32295, -40570, -26383, -581, 14195, -19077, -40151, -48001, -28628, -33173, -57501, -43817, -1888, -32955, 3619, 9088, -22504, -67841, -25200, 12424, 22428, -1358, -20976, -16366, -33331, -32231, -35788, -27827, -37761, -52078, -21590, -6621, -43830, -59877, -39528, 10855, 9633, -9541, -15122, -27059, -34358, -40184, -55939, -68885, -23439, -13429, -15713, -63377, -50926, -26004, -31620, -26452, -39897, -57069, -59616, -52319, -28472, -33151, -7057, 15997, -12438, -37848, -30637, -11003, -2304, -13585, -29366, -32662, -70558, -65317, -24863, -21121, -15255, -27517, -82764, -54824, -35546, -34860, -67350, -60308, -97041, -81118, -51603, -53812, -46984, -42880, -18843, 2522, -30279, -54280, -46386, -35333, -71586, -84346, -52838]
6241e2838k0822j0092K5453J5483j1789r190K3252o880k8778J504j6945K3212
6229f8430N415J3358o768J7275p606l5097L840J9654J6819J4608m8710Q921J4852
6216e1869j943r462R166L1601k2647k4217J0096Q88O831J2533P106K8641l6967
6203d0243j7740k0603K6484L5365j4486m856j8630M358o149P618J9370j4129J8756
6190b4885k4560n29k065k3204p304j2688M7923J0040k6329M893o40L016R289j4604
6176f1647L0606J6417k4122k3118O102K0035j7698L3930j5359K716Q315j8166
6164d1989L602k40M707L2837m4711k651N129K4289J9379l0149k185P11o849j4967
6150e3087K7405J9054q651j3589l1660K1195K9242j4558o985l4068L6311p96J4133
$$ y = [-52838, -73660, -83752, -58299, -42816, -54605, -63795, -40543, -47423, -76201, -74697, -91642, -68430, -63015, -49657, -56425, -39150, -46756, -81853, -78013, -58359, -41540, -26932, -75642, -66721, -51869, -53812, -63274, -54108, -22507, -45154, -69371, -59275, -58387, -51556, -39023, -31917, -3276, -40243, -57983, -78586, -52102, -16737, -31223, -36079, -54709, -50351, -56500, -48882, -29512, -43641, -24885, -49445, -49974, -52039, -75243, -82547, -95235, -47312, -37272, -63601, -58708, -59348, -56332, -47043, -61647, -31041, -14624, -38746, -61864, -55762, -35727, -53425, -19495, -34854, -32138, -23823, -41989, -38387, -38627, -33920, -1083, -45794, -48445, -43316, -19027, 352, -29797, -31982, -31271, -38120, -53087, -25682, -6628, -15279, -28868, -60528, -39333, -10091, -24649, -31634, -65702, -29391, -30187, -16054]
6137a6054K2710n603j458M39m295n489L092j6047J6831M0928q636m0361J2388
6124a555k1457K4064J9396l1388j1243K8217P365j2271K3884j7247Q860j730L09
6111A5204p327J0739r775l975j9603J1701K5483j5836J2453P909k480j0663o06
6098A3224j1907j6129M4643J276j4831L3705l3507n1581K4333L9576K58O805j0825
6085B5040O372K0414k0584K0084J0217j8704j8549O129M370K2538L553m0501N403
6072B5782k0433O992Q801l6840M2589M4192l5707q316K853P349o072J3334J3292
6059E7816Q702q236j8395o280K3466k2428j4914j7348M265K576k8046K8815Q626
6046A8619o819J2117p774Q515l4195l8731M3894L2100J1220j5520P14p252l475
$$ y = [-16054, 6656, 1053, -405, 34, -4261, -9750, -6658, -22705, -5874, 35054, 26418, -13943, -1555, -23012, 1052, 20448, -10940, -22183, 6034, 13399, 1128, 25012, 7765, 16625, 14895, 15204, 7877, 18616, 8841, 4866, -14737, -3036, 22447, 6611, 19064, 26973, 24493, 13830, 13224, 1317, -14812, 29831, 31107, 16276, 49981, 16474, -35107, -10774, 28802, 29060, 35865, 25040, 31412, 51826, 31242, 51326, 61543, 42839, 24290, 30419, 34789, 57327, 60880, 20379, 25782, 5349, 12341, 21142, -15698, 26891, 71083, 35376, 27060, 29913, 37262, 31190, 44524, 57816, 66518, 58282, 39887, 33607, 57073, 34645, 19731, 2383, 6648, 9224, -18822, 9993, 18619, 11800, 23917, 16143, 24658, -9537, -48268, -4374, 27726, 38946, 23426, 24140, 16888, 13413]
6033A3413k3670k3468N070J4934j903J383P646l478j4045k3981o211L7072k1461
6020c8699j4168J3864n758o22j4458M0447L2976l3105l9824M7054J4289n4657
6008e2661Q320L0753K810Q334J2372R140j0249k2134K83j1695J8416o05k09l7254
5994d4379J517O3857J5220J6927m7394l8006J3969K4700k8950J4723L5074q778
5982A8480j8119l3852K36M146R971j760k17J4203J183Q103K8338k2807j4773j5582
5968b2450k3616J781Q023j4367L0888j4881N551R829J258K6593P305K105j1208
5955F811j472k8825o726J3527j1456n386K4457m172O695q18l2578K7044R736O78
5941b485j1369l5520J5459J7014M0526j3220k8457P790j501j6847M2001j8133
$$ y = [13413, -10257, -33725, -28655, -13721, -15624, -14241, -6595, -10073, -24118, -48099, -54310, -17238, -38699, -52867, -39003, -44761, -45383, -59841, -19394, 13582, -19523, -59347, -12293, 1996, -52661, -44341, -13588, -10778, -2444, 9928, 19068, 8819, -13315, -13032, -24727, -6311, -6916, -7125, -44379, -42862, 20995, 36215, 53142, 5748, -32258, -18289, 6411, -22539, -7816, 27258, 18480, 361, -33491, -33255, -29109, -19138, -20898, -21115, -6912, -5729, 2374, 30712, 7905, -6868, -22450, -46066, -44285, -36262, -50629, -19741, -34622, -29071, -19242, -17984, 8609, 15914, 18019, 6811, 5339, -23486, -30212, -16685, -28141, -33527, -9070, -13242, -6547, -7365, -39943, -12899, -3163, -2485, -13854, -49374, -33915, -16901, 23625, 10405, -18052, -10262, -11763, -28610, 13391, -4742]
5929d742J0676P370j8630k039J5132J6399k0753J6310Q285K2888J3780l0133n0262
5916a5719k727L1751m043j9813j631j51k6395K8473K7461J6832M194j0433J4017
5903D1816J1244L473j8687o965o92j3077j0918P800j7323N945K3295J2060m808
5890C3163K482k7486p427K1764K0439j8800K1589J2120j8394J975N304k190M962
5877D9501l187M025m157k2324K8368j5205j1309r02J3579K30K6993M0927k0471
5864H6068L40M705k539l608n4019K4419k2936l109M550Q573R816K1099K2412n2984
5850D2787l7776m543L2454L3053J428j3402l575L7430j0154j2782j1018m0103
5838A3799j3135M3411K0477J0674K2034j4447j5966O804J4965K5112L513k8048
$$ y = [-4742, 5934, 13304, -5326, -7365, 7767, 24166, 3413, 19723, 28008, 50896, 64676, 34543, -15719, -18446, 13305, 9262, -10551, -12182, -12333, -38728, -10255, 17206, 34038, 38232, 27799, 41816, 53060, 56533, 37846, 30881, 30189, 17112, 6194, 13994, -3329, 2616, 25911, 37971, 33163, 35645, 8159, 732, 22496, 42935, 24135, 45724, 57844, 39450, 41425, 46729, 44539, 49501, 46314, 50339, 46182, 23858, 52226, 37021, 25712, 24810, 38389, 38619, 65612, 106539, 86068, 86408, 91113, 88574, 84966, 30947, 55366, 32430, 29321, 33871, 42444, 52260, 73359, 95771, 42787, 5011, 468, 32922, 65975, 67403, 54001, 50426, 87856, 77702, 64920, 53902, 13799, 664, 44075, 64552, 75226, 97260, 82813, 66847, 73651, 88616, 113728, 117241, 89193]
5826H9193j3779O663J9423P566M619l4951l7578N544Q828J0664J2680j0670m269
5813F3933j2358m783p93K3464l886r812q083R178P520J4385R294K342j0638m9525
5799C0238j5653L1347l2407N9214k4923j2393K0470L7872j3583Q958p580L85K9759
5786A11704l8249O858k2015l2817J2243R04K2714J1656J5606p420k9877j4436
5774C6871K2436j1346j1713M6519K1193n362m9983Q684k5664J6466M1503M312
5762I3916Q243r574N256k2146J0757P1429q6j3359l9804K676r531J7956k519J6202
5748A29416J4239j8145O717O939J6505r864j6411L2206J9609j7704q703l0463
5736A24341R08K5596J2446n894l2425J8422j0934J4534K065R521l9310L2105J4256
$$ y = [89193, 75414, 82077, 101500, 109066, 113685, 78734, 41156, 46700, 55528, 66192, 78872, 68202, 63933, 51575, 46792, 45999, 69463, 65577, 55765, 47682, 56860, 64380, 78765, 88059, 90401, 79763, 30238, 14585, 45932, 13525, 72739, 47816, 35423, 55893, 93765, 80182, 89140, 81560, 81945, 111704, 73455, 80313, 58298, 25481, 37724, 38628, 61342, 72998, 88604, 81184, 51307, 36871, 59307, 47961, 36248, 82767, 103960, 98598, 48615, 57299, 31635, 48101, 89604, 93916, 102159, 92585, 97841, 75695, 86452, 157881, 157795, 144436, 104632, 107308, 97777, 115733, 113214, 129416, 143655, 125510, 132227, 139166, 155671, 145807, 129396, 161602, 181211, 163507, 154804, 124341, 125249, 150845, 163291, 157397, 124972, 143394, 132460, 146994, 149059, 158580, 119270, 151375, 165631]
5723A65631l4263k4430J8122L4638k0335L500J7286k49o2155Q738L9235M95j1152
5710A35061j0244K0959j2956k8631J4482L4524k2689j1366P084m021J9047k0554
5698A20696l929k6146Q139K5446m588j0167K6098m1676J4487J4088J6409Q090
5686A46947l2028o060k8535K6782p508J8672m95j3597K0483P95L0514j3294K955
5673A45631O920k9838J1241o03l954M233k6315l864J2977j9042j982N413q433
5660I2384k8113K1900M1252j3416j6724j958j9145j2813J3225O643J6347j2755
5648H6827O085R739m373Q273l4307j2904L3401k8826p177J2200j6404J1445j6477
5635D7502k0203K5940O346K5596j5795l1014k5606K8045K2206K0636o385l0679
$$ y = [165631, 131368, 106938, 125060, 159698, 139363, 142863, 160149, 159900, 97745, 106483, 145718, 146213, 135061, 124817, 145776, 132820, 104189, 118671, 153195, 130506, 119140, 126224, 122203, 141250, 120696, 116767, 90621, 98760, 124206, 119618, 109451, 135549, 93873, 108360, 122448, 138857, 146947, 114919, 108859, 80324, 107106, 99598, 118270, 117775, 104178, 124661, 125456, 155970, 142676, 145631, 152551, 122713, 133954, 133351, 129397, 133630, 107315, 103451, 116428, 97386, 95404, 100817, 92384, 64271, 86171, 127423, 114007, 97283, 95325, 76180, 63367, 76592, 83235, 99582, 86827, 92912, 102651, 98278, 106551, 72244, 59340, 92741, 63915, 56738, 68938, 52534, 63979, 47502, 27299, 53239, 59585, 85181, 69386, 38372, 12766, 40811, 63017, 83653, 77268, 46589]
5623D6589o788k8931q44K1782l510J9616L5412k1933l49k2128l8031j839L4607
5610C3653L0804P572l8283l1290j8621j5853N4332J5871j6066R148j3499p71k6548
5597i551L2001J5707l927l7904j8729K887J5062K0834j6903K036K367n596L4286
5584C2570n472j0292k8900L2289j1720k917K0362p303O86r662J0137K7772K375
5571D9925l2915L5537k9990r733O509N853N101j4066l2393J0506J2541M9656m793
5558E1738k3130J7863J0497k1697k678M242j2654j3636J9675J9264j2277l0350
5546F857Q477j855K8100J6766J2358m6526K6659K1701n2448K9550K1359k5165
5534D5833k2903L4854l2340j2919P718M621K430l623K3489j7643k9940J4613j3959
$$ y = [46589, 39801, 10870, 10026, 31808, 28298, 47914, 83326, 61393, 61044, 38916, 885, -954, 33653, 64457, 72029, 33746, 2456, -16165, -32018, 22314, 38185, 22119, 31267, 17768, 16997, -9551, 22450, 38157, 34230, -3674, -22403, -19516, -4454, 16380, -523, 1513, 3880, -1716, 32570, 27098, 16806, -12094, 20195, 8475, 5558, 25920, 18617, 19303, 9641, 19778, 47550, 49925, 17010, 52547, 22557, 12824, 19333, 25186, 30287, 16221, -16172, -5666, 6875, 56531, 51738, 28608, 46471, 56968, 35271, 32593, 36835, 24181, 10545, 30220, 49484, 37207, 6857, 15334, 13479, 41579, 58345, 70703, 24177, 50836, 72537, 20089, 49639, 70998, 45833, 22930, 57784, 25444, 12525, 20243, 24864, 27294, 23671, 47160, 29517, -423, 14190, 231]
5521B31N003P035L7806J9811m7069J075O165k6537k5778J4041J1215j0994N257
5508b739L591r815k3500J0735k729L3069K4688l5129R883J2929j4360m781K0239
5495B2081J2457j1027M298Q196l6018J6834j731m7513J3161O25K3163M246J340
5482A0112L1613M503j1412L900l7330R623j6679R098p154K640j7874K3945J5235
5469B0220k424L9468k2108j0895m496M048j5107j2178k4007J6089K7019k6076
5457a0447K6354Q623j9466k6518K679O045M435J8010q571m060n952K8879J5152
5444C5163k4990l0478J4666K3220K4792p353m2488j3446j174K9030K7502p118
5432B7326K5808J7481m967j6904k1730k1753k0666J0647j013K5504J3816l3379
$$ y = [231, 5234, 12269, 50075, 69886, 22817, 23892, 30057, 3520, -22258, -8217, 2998, -7996, -2739, 852, -8963, -32463, -21728, -24457, 8612, 33300, -1829, 8054, 20983, 6623, 1842, 22081, 34538, 23511, 27809, 36005, -13, 16821, 15090, -32423, -19262, -18637, 4526, 8772, 10112, 41725, 46228, 34816, 38716, 1386, 11009, -5670, 3428, -3726, -1086, -18960, 4985, 20220, 17796, 57264, 35156, 24261, 19765, 23813, 8706, -3472, -27479, -11390, 15629, -10447, 15907, 24530, 5064, -21454, -18775, -12730, -8295, 9715, 1144, -2916, -8868, 20011, 35163, 10173, -20305, -5639, 17581, 42373, 35020, -7468, -20914, -22088, 6942, 34444, 27326, 53134, 70615, 65648, 48744, 27014, 5261, -15405, -4758, -5771, 19733, 33549, 170]
5420A70k2291P34m470j4038p014K6787n889k644K7540P868P16M515J0626j7813
5406D797L0460J9874k8546n4935j4097K8244M7158l818n556j5360q257j8097L3012
5393A4879R528r277J1776q487k9154o219j2957L3473J5032j0019n986J344M12
5380D345O036J6300p942j2232j7456L482o318j8195K9894K0369o260o371j460
5367D192o021r512r472l214K0808k3053P452M0347j0041j3836K4379k0417r727
5354h115Q159R926k0420j1011J7815j5216j3956L2315J812m226m995l165K199
5341h878J2821l1208J7457l126O093K178O673l750r509J9945k909l8478L9466
5328F775J0630m6157O389j193O722J6125K2538n3104K917K8171j0789j6539l420
$$ y = [170, -22121, -21387, -25857, -39895, -46909, -20122, -26011, -28655, -1115, 6753, 7469, 11984, 22610, 4797, 35257, 55131, 26585, -28350, -42447, -14203, 32955, 29137, 23581, 8221, -36, -18133, 14879, 24407, 15130, 26906, 18419, -10735, -16954, -29911, 3562, 18594, 8575, 2589, 3933, 4345, 10381, 26681, 18739, 6507, -10949, -7467, -13785, -31980, -2086, 18283, 12023, 5652, 4192, -1829, -11341, -20813, -24027, -3219, -26272, -18820, 21527, 11486, -2350, 22029, 1612, -8115, 44, 9970, -10450, -21461, -3646, -18862, -32818, -503, 1309, -2917, -7912, -11077, -8878, 3943, -27265, -9808, -12934, -6841, -4663, 2010, -1740, -11249, 8696, 5787, -32691, 6775, 17405, -28752, -22363, -23556, -16834, -709, 21829, -31275, -28358, -187, -10976, -27515, -30935]
5315c0935K9409o255k7291J7731J7247j3467n142M981J1799m95J7051j523l9127
5302b6017M2707r93k2591j2567K178Q837j9314O989K8596P723k4731Q859l936
5289d260j8594o416k7888J9442N0187J2559j903J1280n06j2155l5361M445R561
5276C91j7256j1592J226J0864J983k072q091K5524m0136K9534L6736j3138J6710
5263C0683N972m1482k8389q251M880R924J3932L2586k2401J5226k323k9980n0976
5250g0599p732M1490L4588Q318k8532k5848M6700k7826k7475K5695J5759M466
5238a0996r678J9034j7184J1560J9856k837O333k375m640n387J9248J9210m0835
5225A309N611L033k523M972l500l3792q712K4279J9403J057L671J5637k9293J3451
$$ y = [-30935, -1526, -7781, -35072, -17341, -94, -13561, -18703, -13722, -1923, -2418, 14633, 13110, -26017, 16690, 15697, -6894, -19461, -17283, -8446, -27760, -20771, 7825, 15548, -9183, -324, -4260, -22854, -29270, -57158, -37716, 12471, 25030, 23127, 34407, 33901, 21746, -13615, -9170, 391, -16865, -28457, -27231, -16367, -14384, -16456, -24547, 977, -39159, -9625, 27111, 13973, 30683, 36655, -4827, -33216, -41467, -36587, -26663, -12731, 19855, -2546, 12680, 10357, -19623, -70599, -78331, -36841, -2253, 6065, -22467, -48315, -1615, -29441, -56916, -31221, -15462, -10996, -20674, -1640, -18824, -7264, 12592, 9755, 16088, 13713, 9073, 3686, 22934, 42144, 1309, 6920, 9953, 7430, 12402, 8902, -24890, -33602, -9323, 10080, 11137, 14808, 30445, 1152, 14603]
5211A4603J7011k64j1515k1325M5396L1315k3209m2458m3387L5287K4676J527
5199B7657j8644j0720k019M93J0372R240k7213j4849Q665J960k9403j784M5423
5186h22K034J1906k8095O265k340R777L224J2717L665j1534O147N228l2024j4639
5172b8491M621N969k6565J2159J1717k0840L1528O847J9509m2730L683K2335k7316
5159b7574M997K4860k1967l9345J4643L692K3119L4066q148j5629l0083k3513
5147f0882K3801L5042l050j0756j6896j6813K612J6900J1961m303K508L0798j1755
5134h33l093o55J1173o671j6699O280J4864j3876j8325J5322R975K9009J2332
5121C8803q793r310o567K5757k7061l8045L0971J7940j0041k5414k558R426J4739
$$ y = [14603, 31614, 31350, 19835, -1490, 43906, 75221, 52012, 9554, -33833, 1454, 26130, 27657, 9013, -1707, -3726, -3233, 7139, 16379, -10834, -25683, -17018, -15058, -44461, -46245, -822, 1212, 13118, -14977, -8712, -11052, -1275, 1949, 14666, 18331, 6797, 12944, 18172, -13852, -28491, -23870, -17901, -44466, -32307, -20590, -41430, -9902, -3055, 16454, -26276, -22593, -258, -27574, -22577, 2283, -19684, -59029, -44386, -40694, -17575, 16491, 8343, -7286, -37369, -60882, -37081, -2039, -5089, -15845, -32741, -49554, -46942, -30042, -18081, -22384, -19876, 10922, -833, -3926, -4581, 6592, -79, -16778, -10498, 4366, -9510, -27835, -12513, -2538, 26471, 38803, 30010, 20700, 14133, 39890, 12829, -25216, 5755, 23695, 13654, -11760, -14318, -4892, 9847]
5108I847p351k8764J5642J9171J6787m35K550j9033n7077K3856K1145j3337K8860
5095A1861l3303J0391L2279J5031j4463l294j1384j6174L4953j1980j937j9443
5083g463m3308K5359M5418K5768L0322o9207J529l3842K3539J6221k6288J8544
5071F592R87o080j9040n853j4841l945R594J8478m561j8804r661L5475j3504K6442
5057A279L8492m4219J1837l778j0376K0862O290L115o415j4175L0389k1834r837
5044A630J5909j8810k429p806K8318j3560o286j2078Q45j9521J5301K0687k747
5031e47j5285j9207J6936M1238p914j3480n881K527J5891l8469K6606j7659N0437
5018C5193l744k3582n817l346q735j4761J2780L153L2525l469p36q738L7102j3243
$$ y = [9847, 2496, -26268, -10626, 8545, 25332, 24897, 27447, 8414, -48663, -24807, -3662, -16999, 11861, -21442, -11051, 21228, 36259, 21796, 18502, 7118, -9056, 25897, 13917, 11980, -7463, -50771, -25412, 20006, 45774, 76096, 6889, 8418, -25424, -1885, 14336, -11952, 6592, 7579, 1499, -17541, -23394, -38235, -42180, -32586, -14108, -18669, -37473, -47134, -11659, -25163, 1279, 39771, -4448, 7389, 3611, -6765, 14097, 20387, 23502, 17087, 2912, 33301, 11467, 1630, 17539, -1271, -3700, -11506, 16812, 3252, -3034, -15112, -14267, -33788, -18487, 2200, -547, -15832, -35039, -18103, 23135, 15221, 1741, -4140, -1613, 14278, -24191, 2415, -15244, 35193, 31449, 7867, 2050, -1296, -10031, -24792, -12012, -8859, 23666, 20197, 19461, 10723, 47825, 34582]
5004C4582n3888K3527J3072n2026J7127n209K8890M7636K08n540O050j8969P360
4991D2820j7209j6867L7690p534j0105k3153k3992K5519P570K3922K91p088j2895
4978A8969J5645Q911m6535J7528n15J0845J5423n498J7344J7216k4092j2419q955
4965B3867j8619N4368j4464j2427O539l1242j456L4115K0830l367P645l2097O100
4952C9792l6487J9588J3752M2426k3890k3033j8825k357K7808k7827k219L6677
4940D5405l400j0101j5333M657R484l2649K6762q921n841P077j1687J4184q0k7669
4926h112J552O3570k960L92l4730q237L0289j8205r189j5599j4080K6520K2600
4913C3811r297P410j1234K4390p583j5225j2533J5593M1274j0262k2582p147o38
$$ y = [34582, -19306, 4221, 17293, -34733, -17606, -22815, 6075, 53711, 53919, 48379, 54429, 35460, 42820, 25611, 8744, 46434, 38900, 28795, 5642, -18350, 7169, 14739, 38661, 38952, 31864, 18969, 34614, 43525, -3010, 14518, 14003, 24848, 40271, 34773, 52117, 69333, 45241, 32822, 23867, 5248, 59616, 45152, 32725, 39264, 8022, 6566, 40681, 61511, 58144, 65789, 33692, 39792, 3305, 22893, 36645, 79071, 55181, 32148, 13323, 10966, 38774, 10947, 8728, 45405, 42005, 31904, 16571, 21228, 30712, -1937, 24825, 15904, 10063, 17140, 5453, 19637, 19557, -8112, -6560, 57010, 54050, 54442, 19712, 11475, 41764, 23559, 14370, -1229, -15309, 11211, 33811, 24514, 31924, 20690, 45080, 37497, 22272, 9739, 25332, 66606, 56344, 33762, 26615, 25977]
4900B5977J8110m6878K3233L3557j7542j2148K288m330J2204L171Q091J2476k4099
4887C4110P019L4251n618k5369P83k91K8234N0817K0089k2545p1612m727J0182
4874E5323R723j9610O23L1056m401o715L240m8726j1052L3987k4814J8348J0810
4861D7792m1193j1551M8012p694m0059O042K2059L7221j5854N276j4320k3808
4849A1923N455K629K1085L0578j8133k4431R534K2305J5861j3169l0129j6002
4837A7506K6194K2693J6913k8497p736K0577n790k4546K1472m2424N915K7438
4825D9715j745l0002j3178r39J86K3273n223J0038K7908k6046n099n16K0682n309
4811D3745o281J3115k7608K6811K763O618j9412J9825m875m859j5695j5619J9997
$$ y = [25977, 44087, -2791, 20442, 53999, 36457, 24309, 26597, 22267, 34471, 37642, 45733, 58209, 34110, 41129, 75380, 69762, 44393, 45176, 44885, 73119, 123936, 144025, 121480, 49868, 45141, 55323, 65046, 45436, 46059, 77115, 72714, 65999, 69239, 20513, 9461, 43448, 18634, 36982, 47792, 6599, -4952, 43060, 35366, -4693, 1349, 23408, 60629, 44775, 50051, 35731, 11923, 17378, 20007, 41092, 71670, 53537, 29106, 38640, 60945, 76806, 63637, 33508, 17506, 43700, 66393, 83306, 54809, 47073, 67650, 61860, 37314, 58786, 16362, 22277, 49715, 47970, 17968, 4790, 3851, 4037, 27310, 22087, 32125, 60033, 33987, 28888, 28372, 49054, 43745, 37464, 50579, 22971, 49782, 52545, 59163, 39751, 59576, 54701, 49842, 34147, 18528, 38525]
4798C8525R259J0789q683j9094j1172j9853L1388J5461K1851j8207k4396q840
4786A7028k5555M3268k0801J3173K7261K0694k4710K063J0589J7720q652j3952
4774E8126j5383p814J3006R858m007r061j806J8225k0660J525m917m951K1660
4761E3801J2637j637l9107J1065K4273k7381M649J2016J4120J1688K884L0198
4749A09206p967K303j3477k1768j3055P85k0359k5544j1842M3179J2319J1958
4737F5738M964j0348J6907r582l544l702l365K7599J9914j1947j7898M535j2976
4724F6295J418J6175J5848j1641m2814J7711P903K5621J8294k1768K2509J5686
4712A31237k9376l0445J1009J1441j995m37K6112J2138j5923o581J1889m941j6391
$$ y = [38525, 47784, 58573, 49890, 30796, 19624, -229, 31159, 46620, 68471, 50264, 25868, 17028, -8527, 34741, 13940, 27113, 54374, 75068, 50358, 52421, 63010, 80730, 72078, 58126, 42743, 34929, 47935, 57793, 53786, 44725, 42919, 61144, 40484, 42009, 37092, 32141, 53801, 66438, 64801, 25694, 36759, 61032, 33651, 38300, 50316, 64436, 76124, 79008, 109206, 101239, 103542, 90065, 68297, 55242, 56027, 35668, 10124, -1718, 41461, 53780, 65738, 70702, 60354, 77261, 67679, 64135, 60433, 57068, 84667, 104581, 92634, 74736, 79271, 66295, 67713, 83888, 99736, 88095, 45281, 62992, 70895, 96516, 114810, 93042, 115551, 131237, 101861, 71416, 82425, 93866, 91871, 91434, 117546, 129684, 113761, 107180, 119069, 114128, 97737]
4699I7737l8581K5152O23L596J7451p735o482L3486j7648k58j5640L502R39k6741
4685F9401m13K1858K5137J4606m90m3072l043q755K8137j1494q211r686K4284
4672I8259J7201j5356k2728N3436o884j8908P615L939J4201K630k1153n572M940
4659A11620p829J6440m359m482q022J475l422O197m011K0258K0317J320j9097
4646A26405K099n261o060p063j7375q583p417K8990J6740K5282k4450j7880M412
4633A09839K7380j0506P128K0015k7929p442m8369N328J0208n948M4693k4477
4621I9920J880J2860J972j0093q860L1363j5214n491M295K4393k7201J8500J4888
4608A43212j10P47j8462j453m0342k1011J0502J8637L4091k1628J0688R8J0673
$$ y = [97737, 59156, 84308, 84931, 88527, 105978, 98243, 91761, 125247, 107599, 107341, 91701, 95203, 96142, 69401, 68988, 90846, 115983, 130589, 130099, 87027, 83984, 75229, 103366, 91872, 83661, 73975, 98259, 115460, 100104, 77376, 130812, 123928, 105020, 112635, 116574, 130775, 133405, 112252, 106680, 111620, 103791, 120231, 115872, 111390, 103368, 104843, 101421, 107618, 103607, 123865, 144182, 145502, 126405, 128504, 123243, 117183, 110120, 92745, 84162, 76745, 105735, 122475, 147757, 123307, 105427, 109839, 137219, 126713, 133841, 153856, 125927, 118485, 70116, 75444, 85652, 79704, 124397, 99920, 101800, 114660, 116632, 106539, 97679, 129042, 113828, 108337, 112632, 137025, 109824, 128324, 143212, 143102, 143849, 125387, 123934, 83592, 62581, 73083, 91720, 125811, 104183, 114871, 114969, 125642]
4595A25642o125n3606J0602K3880J3897K806j7506J443j7054J228K6162j953j1587
4582I7829N092J90k5660l370J6066L958j6036K2701R873O940j8299j3155p814
4569G8315L7278l189k2893L086J9293q884k2690l379J8900K0526j9288k6072J625
4556G2628J4667L0903k8259N48J3010j1282J0748j4369l5993r932J959J2888K1481
4543G8997M5658j008N621M5581j9440k5246O32p543k3062p133R948J6773J975
4530A21753K4516j2294m284q111p147R280j2095k002K2151j7588j8279j143K4137
4517A18894q653J5683k6883L0508P23m4935R082K8337J1485k3747J025L4646L4185
4504A80350j2819l3235m0719p858j1064K1943J8957J0093j2038o905L5135K4389
$$ y = [125642, 119517, 65911, 76513, 100393, 114290, 117096, 99590, 101033, 83979, 85207, 111369, 109416, 97829, 102921, 103111, 77451, 74081, 90147, 94105, 78069, 100770, 110643, 117583, 99284, 86129, 78315, 115593, 112404, 89511, 92597, 111890, 103006, 80316, 76937, 95837, 116363, 97075, 71003, 72628, 87295, 118198, 89939, 90487, 103497, 92215, 102963, 88594, 52601, 42669, 44628, 57516, 78997, 124655, 123647, 129268, 174849, 155409, 130163, 130795, 123252, 100190, 93057, 103005, 119778, 121753, 146269, 133975, 129691, 121580, 114433, 123713, 111618, 109616, 131767, 114179, 95900, 94757, 118894, 110241, 125924, 99041, 129549, 130272, 85337, 94419, 122756, 134241, 110494, 111519, 146165, 180350, 167531, 134296, 93577, 85719, 74655, 96598, 115555, 125648, 113610, 106705, 141840, 166229]
4492A66229P240k0783k9054J758K6547Q763l953l3343L487j8182J7101J5000j433
4479A39377J8150k4818K0955j0363l8765K4249M1547J657j3108r681J9607J9741
4467A88548J7548k6757p077p875K9852N477p157j3653J2554M5171L421j0529k477
4454B27046K3567r589k4996M356N035q576L2151J6670Q830j0307P415j5469j6805
4441B39328L8603l621j7464K8015k9968o746j8418k3814P0084K1492q660p762
4429B81069L1450m571k6071j464N258j0984J204L0268R587j4135J6680n566M0306
4416C53031J9293M680J3383K0172L336J2758J9238l325j9926J0006K9929j5024
4404D47551J1701p745K2289J2347j2542j1622O134k8368k1382m3301l372j8136
$$ y = [166229, 173469, 152686, 123632, 125390, 151937, 160700, 156747, 123404, 126891, 108709, 125810, 140810, 139377, 157527, 132709, 153664, 143301, 104536, 128785, 170332, 171989, 158881, 149200, 168807, 188548, 206096, 179339, 172262, 164387, 194239, 199716, 192559, 178906, 191460, 236631, 240052, 229523, 227046, 250613, 241024, 216028, 220384, 225419, 216843, 248994, 265664, 274494, 264187, 271602, 256133, 239328, 277931, 274310, 256846, 284861, 254893, 248147, 229729, 205915, 275999, 297491, 288831, 281069, 312519, 307948, 281877, 280413, 285671, 274687, 275891, 306159, 315746, 301611, 318291, 312725, 353031, 372324, 377004, 390387, 410559, 413895, 426653, 445891, 442566, 422640, 432646, 462575, 447551, 459252, 451507, 473796, 486143, 473601, 461979, 468113, 439745, 418363, 375062, 371690, 353554]
4392C53554p88j2706J3256j29l3709J379L4202J145m524l847q74l0292k8585O428
4378B94510j6121j0866J1443L977l395j3302k5256K4343J0467j305j5104j0011
4366B49380J5497L2415j4914M712p707J2781j1918j5242l726q731j3085J051o79
4353B39834P05p152R120J9608K8587j6786n0825O983j3899k788L9340j943j9565
4340B31219J0705o838j0047j2391q681L6293J9071p143q929k4375j0519k1571
4328A86794J0813L150M2583k913j0523M994K0267j9466j2910R091K291K8657J3935
4315B76763j6932q951M781j3666o277m2443K1486J1044l0281k405J5558K684M4397
4302B55758k7815k8670p982L3451N0089l9336j6392Q789K5275L4831l5757k236
$$ y = [353554, 352766, 340060, 353316, 353187, 319478, 320857, 355059, 356204, 351680, 347833, 346959, 316667, 288082, 294510, 278389, 267523, 278966, 282943, 279548, 266246, 240990, 265333, 275800, 274495, 259391, 249380, 264877, 297292, 282378, 287090, 279383, 292164, 280246, 265004, 261278, 252547, 239462, 240513, 239834, 240539, 233387, 242507, 262115, 290702, 273916, 223091, 230074, 216175, 213387, 252727, 250784, 231219, 241924, 235086, 225039, 212648, 203967, 240260, 259331, 252188, 243259, 218884, 208365, 186794, 197607, 200757, 243340, 240427, 229904, 234898, 255165, 235699, 222789, 231880, 234171, 262828, 276763, 259831, 250880, 255661, 241995, 235718, 193275, 214761, 225805, 195524, 193119, 208677, 211361, 255758, 227943, 199273, 191291, 224742, 274831, 235495, 219103, 227892, 253167, 287998, 252241, 250005]
4290B50005K1561k902K6361n818n999j4163J4720j2567k8534Q771J0259j9439
4278B42255j9858M3880m127k5122j5225K0379j1669L1055K8069O032k1355m347
4266B69967L0551J244j828R618k006k1078j1920R331J0042r801O754n280J4069
4253B99663J0511Q281l4790Q550j6832J4657K4326l5427j0022R513K1629L736
4241C03795j1099r946n73j8007j0936N0383Q572R288j3298J6182J9136j3777j1233
4228C18487K9098k7570R182J2025k1759P712k7711L4520K0120n2864L1208M5568
4216C78016n2728K6826O403R678k0004o61M2680j5616j8980j577Q559J309j3377
4203C50528j5935R328L6285N330j3411O2409N819j8350k9710k3386R102o567J7993
$$ y = [250005, 271566, 268664, 295025, 289207, 283208, 269045, 283765, 271198, 242664, 251435, 261694, 242255, 222397, 266277, 262150, 237028, 221803, 242182, 230513, 261568, 289637, 295669, 274314, 269967, 300518, 301762, 299934, 309552, 307546, 286468, 274548, 283879, 293921, 284120, 290874, 285594, 299663, 310174, 318455, 283665, 292215, 275383, 290040, 314366, 278939, 268917, 278430, 300059, 303795, 292696, 282750, 282177, 264170, 253234, 303617, 312189, 321477, 308179, 324361, 343497, 329720, 318487, 347585, 320015, 329197, 341222, 319463, 327175, 299464, 333984, 354104, 301240, 332448, 378016, 325288, 352114, 358517, 368195, 348191, 347530, 390210, 374594, 355614, 354037, 362596, 363905, 350528, 334593, 343921, 380206, 385536, 372125, 434534, 440353, 422003, 392293, 368907, 378009, 371442, 389435]
4190C89435k0480j417M3888j7853n854K6369L840j6587r909k2148k3422L8373
4178C84235l630j5721K0494N603K602J5090J4108k0262L144Q826k332J0177l3986
4165C88348J9977J2861L3676P458k9089N948k0027N981m974j3145J01K5361K7487
4152D59963k1445k028J5850J1460o148r429j1807R001P813J0518r385p682l326
4139D43355R354K2799J7355J213k1456l1251J372J4122K7494j5645P419N5020
4127E31151l1975n623K794J8204K9420k6415l3480k5398M7366K4301l4912J0056
4115E05489K9418J9570J5272L6858l1007k9664M176K7231k2931M4009K2247k0221
4103F00447J6844J3044M934n3423N879O373q009M0822k970P61j222m7891J8133
$$ y = [389435, 368955, 367538, 411426, 393573, 387719, 414088, 417928, 401341, 391432, 369284, 345862, 384235, 380605, 364884, 385378, 390981, 393583, 408673, 422781, 402519, 405663, 414489, 412157, 422334, 388348, 408325, 421186, 454862, 462320, 433231, 439179, 419152, 425133, 420159, 407014, 407115, 432476, 459963, 438518, 436490, 452340, 463800, 457652, 448223, 436416, 445417, 453230, 463748, 454363, 446681, 443355, 452709, 475508, 492863, 494076, 472620, 441369, 442741, 456863, 484357, 468712, 476131, 531151, 499176, 493553, 496347, 514551, 543971, 517556, 484076, 458678, 506044, 530345, 495433, 505489, 534907, 554477, 569749, 606607, 575600, 545936, 550112, 577343, 554412, 598421, 620668, 600447, 617291, 630335, 635269, 581846, 587725, 594098, 586089, 626911, 623941, 624702, 623480, 575589, 593722]
4090E93722N2609p019m0356j0164M7107K2555J4476J3150n835j8700J5451L9628
4078G16624J248j2145j6306J4826j6037K8420J4008L2734Q170j4703K4959K7060
4066H08858j4001j2205K0437K6139J0292l17Q423n983k221K3341K2124R250l1195
4053H62942P959J3837j189M155k828k118l689j5883r119K9524K2301q174j9599
4040H78119K8898R895L2744L4872L1537k5474K034N1262M2581J6423L0435N239
4028A138565J4257L420L1519K9882l222l7481K1545L518o025K2326K335j0030
4016A210609q796o420O410K3501O329o777k5226K7661J0373K1616k043l0467p120
4003A219650K5260M4741K5813k3386J7660J9190K2582L3629P6390J7977m955J3905
$$ y = [593722, 646331, 639312, 598956, 588792, 635899, 658454, 672930, 686080, 680245, 661545, 676996, 716624, 717872, 705727, 689421, 704247, 688210, 716630, 730638, 763372, 771542, 756839, 781798, 808858, 794857, 782652, 803089, 829228, 839520, 839203, 847626, 841643, 839422, 862763, 884887, 894137, 862942, 870901, 884738, 883549, 887704, 884876, 882758, 879069, 863186, 854067, 883591, 905892, 897718, 878119, 907017, 916912, 949656, 984528, 1016065, 990591, 992625, 1043887, 1086468, 1102891, 1133326, 1138565, 1152822, 1156242, 1187761, 1217643, 1214421, 1176940, 1198485, 1202003, 1195978, 1218304, 1220639, 1210609, 1201813, 1195393, 1201803, 1225304, 1231633, 1224856, 1199630, 1227291, 1237664, 1259280, 1257237, 1226770, 1219650, 1244910, 1289651, 1315464, 1292078, 1309738, 1328928, 1351510, 1385139, 1461529, 1479506, 1474551, 1488456]
3991A488456J9792r780K5656J5586j6568K2521P162P06k3762K9357m4748m2954
3979A471424K00K0018J8654k1998k8293l283J3647O909M996k0016q545L2436M3021
3966A529170q324J3600k684J5927K8958k629M7201P411L1478M4774j3607q034
3954A683241n962K170k9942L4069K3959o459J4003l6296j692p212q02K4075L42
3941A693494o50K5459Q115k627k3367k3544k5366j9614K9090K047J1932P103N950
3928A688022O1519J1133r411J6899p67N0682M8005M6037J6100K7642L2819L1228
3916B019908K7901M6585R876N0002M2100K2129N6876J2671N4515L5216N1904N1455
3904B481138N7321R7158M9703R5925J17001O7414J06488J07225P6554R9742Q3573
$$ y = [1488456, 1508248, 1498468, 1524124, 1539710, 1523142, 1545663, 1552825, 1553531, 1529769, 1559126, 1514378, 1471424, 1471624, 1491642, 1510296, 1488298, 1460005, 1456722, 1470369, 1477278, 1482274, 1462258, 1453713, 1486149, 1529170, 1520846, 1534446, 1531762, 1547689, 1576647, 1574018, 1621219, 1628630, 1660108, 1704882, 1691275, 1683241, 1677279, 1679449, 1649507, 1683576, 1707535, 1701076, 1715079, 1678783, 1677091, 1669879, 1669077, 1693152, 1693494, 1692844, 1718303, 1726418, 1723791, 1700424, 1676880, 1651514, 1631900, 1660990, 1663037, 1674969, 1682072, 1688022, 1749541, 1760674, 1751263, 1768162, 1767395, 1818077, 1866082, 1912119, 1928219, 1955861, 1988680, 2019908, 2047809, 2094394, 2104270, 2154272, 2196372, 2218501, 2275377, 2288048, 2342563, 2377779, 2429683, 2481138, 2538459, 2635617, 2685320, 2781245, 2898246, 2965660, 3072148, 3179373, 3255927, 3355669, 3439242]
3893C439242P0326O2070O0686J01548M1799J3046K5806M9918O5384M1924Q9341
3882D061090P8921N1223O1180R6442J33033Q8519J32182J84217J47646J64111
3872E198564K00590K36423K60795K21095K67637K40677K37344K31613K95543K32267
3862G622548J63270Q9454J06510J31530J07820O6885K2624L8609L0774Q2197P2233
3851H534454P7521P1805J08567K9140O0297J35202J42137J11311J24443J60968
3841I555845J55189J66644J45851K00528J65543K17809K81413K37080K53958L09742
3831A1689602L29230L09272K56648K95563K73309K40978K06805R2270P6656Q664
3821A3778997k8284n3453o3995q2007p1184p3423j00917j7201J4799O1782M9322
$$ y = [3439242, 3509568, 3571638, 3632324, 3733872, 3775671, 3788717, 3814523, 3864441, 3929825, 3971749, 4061090, 4140011, 4191234, 4252414, 4348856, 4481889, 4570408, 4702590, 4886807, 5034453, 5198564, 5399154, 5635577, 5896372, 6117467, 6385104, 6625781, 6863125, 7094738, 7390281, 7622548, 7785818, 7875272, 7981782, 8113312, 8221132, 8288017, 8310641, 8349250, 8380024, 8462221, 8534454, 8611975, 8683780, 8792347, 8821487, 8881784, 9016986, 9159123, 9270434, 9394877, 9555845, 9711034, 9877678, 10023529, 10224057, 10389600, 10607409, 10888822, 11125902, 11379860, 11689602, 12018832, 12328104, 12584752, 12880315, 13153624, 13394602, 13601407, 13693677, 13770333, 13778997, 13750713, 13697260, 13633265, 13551258, 13480074, 13406651, 13305734, 13288533, 13303332, 13365114, 13414436]
3810A3414436N0109M7915N2483R8756P1014Q0605J24760Q8395J20403J76327J79482
3799A4504685K89471K81294L55610M20506L73159M01017M08698M38611M82183
3790A7955234M99317N40255N56251O39833P06471P27775N17182L29719K74220
3781B2746257L18320M66815N33026N12540L87112J69000k6565j36174j24527r959
3771B4835845K5611L1465Q6626P4780J87956L03196M61192O37922P66802Q84860
3761B8296255J032504J242972J392939J595262J889631K244392K589593K762210
3753D3045758K526481J969664J446437J083854R25446Q21395N77100J21635k52042
3744E2265728k61493j97555K7355J82968J44630J73007K28482K91132L66120M00240
$$ y = [13414436, 13464545, 13512460, 13564943, 13663699, 13734713, 13815318, 13940078, 14028473, 14148876, 14325203, 14504685, 14794156, 15075450, 15431060, 15851566, 16224725, 16625742, 17034440, 17473051, 17955234, 18454551, 18994806, 19551057, 20190890, 20897361, 21625136, 22142318, 22472037, 22746257, 23064577, 23531392, 24064418, 24576958, 24964070, 25133070, 25106505, 24970331, 24845804, 24835845, 24861456, 24892921, 24979547, 25054327, 25242283, 25545479, 26006671, 26644593, 27411395, 28296255, 29328759, 30571731, 31964670, 33559932, 35449563, 37693955, 40283548, 43045758, 45572239, 47541903, 48988340, 50072194, 50997640, 51819035, 52396135, 52517770, 52265728, 52004235, 51806680, 51834035, 52017003, 52161633, 52334640, 52563122, 52854254, 53220374, 53620614]
3734E3620614L44820J83795M2943k6502P8861L32911N79691P93062J013292J164264
3724E8127751J317739J645575K112062K469237K750246L084345L300186L303542
3716G8110683L352543L226514K553410J841648J153713L47988l43928p91495j113117
3707H8337959j225132j321418j452616j532135j478959j265131j046544r08350
3699G8107674p27645n13073l23695j97737k97188l61588l55095j92220J23180
3690G5262613M82261P67042R92175R32605P32104Q52759J256668J803134K237136
3681H5318497K011030J323068N88157m1413m13470o29010j050768j451697j626645
3672H4027749j597303j412317j175790j108464j334714j495587j450276j247794
$$ y = [53620614, 53965434, 54149229, 54192172, 54165670, 54244531, 54577442, 55157133, 55950195, 56963487, 58127751, 59445490, 61091065, 63203127, 65672364, 68422610, 71506955, 74807141, 78110683, 81463226, 84689740, 87243150, 89084798, 90238511, 90586499, 90242571, 89451076, 88337959, 87112827, 85791409, 84338793, 82806658, 81327699, 80062568, 79016024, 78107674, 77380029, 76866956, 76543261, 76345524, 76048336, 75686748, 75331653, 75139433, 75262613, 75744874, 76511916, 77504091, 78436696, 79168800, 80021559, 81278227, 83081361, 85318497, 87329527, 88652595, 89240752, 89199339, 88785869, 88156859, 87106091, 85654394, 84027749, 82430446, 81018129, 79842339, 78733875, 77399161, 75903574, 74453298, 73205504]
3664G3205504j059878j292251j733087j952778j932381j880750j758768j638044
3656E9957567j582920j512799j305368j010647n87428j86797J75446N13841P21043
3647E5181938P72228M91476J47310p537P7337N1759k13729o77385j156762j486562
3637E3180073j648755j659008j629030j528768j457589j424874j282101j103721
3629D1446227q92523p92438p47773o54207n21782m16111k78529k19774k15265
3620C6707825j54990l3983J40556K95001M78416N53596N93817M74529K73845N5069
3610C9383681n6874j16261j12622m7179r5764j18099j60194o2115L6089K02879
3600C8853541L42390N39213P89442R49134J105178J290799J427174J455598J440900
$$ y = [73205504, 72145626, 70853375, 69120288, 67167510, 65235129, 63354379, 61595611, 59957567, 58374647, 56861848, 55556480, 54545833, 53958405, 53771608, 53947054, 54460895, 55181938, 55954166, 56445642, 56592952, 56585415, 56662752, 56714511, 56500782, 55823397, 54666635, 53180073, 51531318, 49872310, 48243280, 46714512, 45256923, 43832049, 42549948, 41446227, 40553704, 39761266, 39013493, 38359286, 37837504, 37421393, 37142864, 36923090, 36707825, 36552835, 36518852, 36659408, 36954409, 37432825, 37986421, 38580238, 39054767, 39328612, 39383681, 39326807, 39210546, 39097924, 39050745, 38954981, 38836882, 38676688, 38614573, 38650662, 38853541, 39195931, 39735144, 40524586, 41473720, 42578898, 43869697, 45296871, 46752469, 48193369]
3591D8193369J561808J720079J948157K172760K500626K673653K809000K928493
3583F6507945K894468K683874K443130K229195J727970Q21799k4015m54902n31154
3574G8298310n70647p48755r27787j003600q98229p09112l75867l6349L64312
3565G3392276P48917J092168J426852J645743J829792K122772K293164K436896
3557H6988580K639766K838046K983364L199896L289267L304220L335836L116008
3549A11694983K497378J661479J034152Q00954K84073o00773j431971j982228
3541A13958047k257777k478491k655800k799076k712736k557705k285033j888232
3533I4323197j513148j137072p51837l89226n8483L13809O95735R77866J148251
$$ y = [48193369, 49755177, 51475256, 53423413, 55596173, 58096799, 60770452, 63579452, 66507945, 69402413, 72086287, 74529417, 76758612, 78486582, 79308381, 79284366, 78829464, 78298310, 77727663, 76978908, 76051121, 75047521, 74149292, 73440180, 73064313, 73027964, 73392276, 74141193, 75233361, 76660213, 78305956, 80135748, 82258520, 84551684, 86988580, 89628346, 92466392, 95449756, 98649652, 101938919, 105243139, 108578975, 111694983, 114192361, 115853840, 116887992, 117688946, 117973019, 117372246, 115940275, 113958047, 111700270, 109221779, 106565979, 103766903, 101054167, 98496462, 96211429, 94323197, 92810049, 91672977, 90921140, 90531914, 90473431, 90787240, 91482975, 92460841, 93609092]
3524I3609092J358551J641050J896368K125487K113826J836155J583609J367039
3516A07531177J295961J321067J109086M41710l22178j114955j919670k565723
3508A05776475k930906l163310l320364l404641l503561l472147l256115k960093
3500G9765338k636065k233534j822054j425511j084723q12462o74536n05238k79556
3491F8291659j18367R282J77389L59792O23947P57036Q04143P99683O32637L71034
3481G2708235K8537m13427j073874j692848k039520k168908k309582k443861k610651
3472E7984101k669109k514476k380712k210076j927047j669979j457017j290273
3464D1865412j106192r79009q77459p52765p12142p13733n83531n04649m46503
$$ y = [93609092, 94967643, 96608693, 98505061, 100630548, 102744374, 104580529, 106164138, 107531177, 108827138, 110148205, 111257291, 111699001, 111376823, 110261868, 108342198, 105776475, 102845569, 99682259, 96361895, 92957254, 89453693, 85981546, 82725431, 79765338, 77129273, 74895739, 73073685, 71648174, 70563451, 69750989, 69076453, 68571215, 68291659, 68173292, 68182574, 68359963, 68719755, 69343702, 70100738, 70904881, 71704564, 72337201, 72708235, 72736772, 72323345, 71249471, 69556623, 67517103, 65348195, 63038613, 60594752, 57984101, 55314992, 52800516, 50419804, 48209728, 46282681, 44612702, 43155685, 41865412, 40759220, 39780211, 38902752, 38149987, 37437845, 36724112, 36140581, 35635932, 35189429]
3455C5189429l24723k07382j32194j3078r9155m06970p70641r80323r76692r34484
3445C0343787r44932j034775j137206j198679j054347r99219r31615p99642o88630
3436B1554742o18751n40261n18422n08380n09601m93434m77379n07925n32783
3427A6847806m31697m53511n31904n20628n06490m65241l95997l60118l84624
3418A2797596l39501k93165k81704k54428k41440k53406k76733k12102k07558
3409A0437559k25814k31996j74974k14055j90413j57411j93075j77107j65604
3400H707110j56655j67722q8922j32110j21029j52738j36078j64484j08175r5304
3390G383893j23359j10366r2086j07456j11691r7672n7865r0459p5653q0196o0168
$$ y = [35189429, 34864706, 34657324, 34525130, 34512052, 34412897, 34005927, 33235286, 32254963, 31278271, 30343787, 29398855, 28364080, 27226874, 26028195, 24973848, 23974629, 23043014, 22243372, 21554742, 20935991, 20395730, 19877308, 19368928, 18859327, 18365893, 17888514, 17380589, 16847806, 16416109, 15962598, 15430694, 14910066, 14403576, 13938335, 13542338, 13182220, 12797596, 12458095, 12164930, 11883226, 11628798, 11387358, 11133952, 10857219, 10645117, 10437559, 10211745, 9979749, 9804775, 9590720, 9400307, 9242896, 9049821, 8872714, 8707110, 8550455, 8382733, 8293811, 8161701, 8040672, 7887934, 7751856, 7587372, 7479197, 7383893, 7260534, 7150168, 7058082, 6950626, 6838935, 6741263, 6683398, 6592939, 6517286, 6437090, 6376922]
3379F376922n9171n4915k0937p0214l3624p4594o2717j08890o9354m5385m5717
3368E731404J4l9723l6158k0943k9373r480l2746J9931K9407M0186l6823o740
3356E608956j4055k1034l4076n3073l5765r222l1581l1574k9885m6377k0475m7751
3344E234088j6547k960j4488l8892n713p013n865N48K371N7211N0627K4994N8474
3331E336835P7769R1556P1125O9030R7454Q3957J02990J07447Q4783J25236J73758
3320F421940J39846J51071J46129J97515J98741K00330K74309L01044L39878L64870
3310H735673L60297M29010L93593L72501M12587M03124L39698K93193K35037J75204
3300A2149917J50444Q7818J07394L7500M5522Q3699N4114L1027J12539N6416Q8812
$$ y = [6376922, 6317751, 6262836, 6241899, 6171685, 6138061, 6063467, 6000750, 5891860, 5822506, 5777121, 5731404, 5731418, 5691695, 5655537, 5634594, 5605221, 5595741, 5562995, 5582926, 5612333, 5652519, 5615696, 5608956, 5594901, 5573867, 5539791, 5486718, 5450953, 5441731, 5410150, 5378576, 5348691, 5302314, 5281839, 5234088, 5217541, 5214581, 5200093, 5161201, 5155488, 5148475, 5142610, 5143158, 5145529, 5202740, 5253367, 5278361, 5336835, 5414604, 5506160, 5577285, 5646315, 5743769, 5827726, 5930716, 6038163, 6122946, 6248182, 6421940, 6561786, 6712857, 6858986, 7056501, 7255242, 7455572, 7729881, 8030925, 8370803, 8735673, 9095970, 9524980, 9918573, 10291074, 10703661, 11106785, 11446483, 11739676, 11974713, 12149917, 12300361, 12388179, 12495573, 12533073, 12578595, 12662294, 12716408, 12747435, 12859974, 12916390, 13005202]
3289A3005202J25900J29170J99395K46733K49032L18249K96445L02427L95399
3280A5267952M44439M52047M20903M65591M20495L73202M10554L67721K94673
3271A8917577K14273J56095O5748J173m5538r5590j77145k02833k49796k24630
3261A8359334k01266k29203k05896j68305j85313j49653j17970o8785o6693m3517
3251A6922733j9796P391Q3502J24739J28427J38772J88016K30083K67972L56357
3241A8428196L51213L33051L83704L34405L60905L52152L46627K42577J65447
3232B1298277J50204J98005K11685J29221J49215J92569K49915L45556L70091
3223B3294738M57418N12492O20948P23062Q21993R45650J106596J167387J318722
$$ y = [13005202, 13131102, 13260272, 13459667, 13706400, 13955432, 14273681, 14570126, 14872553, 15267952, 15712391, 16164438, 16585341, 17050932, 17471427, 17844629, 18255183, 18622904, 18917577, 19131850, 19287945, 19353693, 19354866, 19309328, 19213738, 19036593, 18833760, 18583964, 18359334, 18158068, 17928865, 17722969, 17554664, 17369351, 17219698, 17101728, 17032943, 16966250, 16922733, 16902937, 16910328, 16993830, 17118569, 17246996, 17385768, 17573784, 17803867, 18071839, 18428196, 18779409, 19112460, 19496164, 19830569, 20191474, 20543626, 20890253, 21132830, 21298277, 21448481, 21646486, 21858171, 21987392, 22136607, 22329176, 22579091, 22924647, 23294738, 23752156, 24264648, 24885596, 25608658, 26430651, 27376301, 28482897, 29650284, 30969006]
3214C0969006J395300J488088J585086J735483J931743K158959K431437K726189
3206D6421291K961394L269906L678550M086598M496171M990030N580194O362125
3198H1846259P310713Q446151R833647J1347194J2713540J3496526J3357027J2299198
3190A70650255J1312393J1337617J1882475J1793860J0842407Q257156M267036
3183B40343199O73713k100165m104220m887921n487311o010038o159633o190154
3175B06077470n654275m547458l178279j684944k02953J027068K000454K973386
3167A96810469L953358M797430N439088O177394P089083Q198623R222406J0640781
3159B52328632J2732088J5328482J8297956K0882598K2327660K2112827J8989279
$$ y = [30969006, 32364306, 33852394, 35437480, 37172963, 39104706, 41263665, 43695102, 46421291, 49382685, 52652591, 56331141, 60417739, 64913910, 69903940, 75484134, 81846259, 89156972, 97603123, 107436770, 118783964, 131497504, 144994030, 158351057, 170650255, 181962648, 193300265, 205182740, 216976600, 227819007, 236076163, 240343199, 241016912, 238916747, 234812527, 229924606, 224437295, 218427257, 212267624, 206077470, 200423195, 195875737, 192697458, 191012514, 190809561, 191836629, 193837083, 196810469, 200763827, 205561257, 211000345, 217177739, 224266822, 232465445, 241687851, 252328632, 265060720, 280389202, 298687158, 319569756, 341897416, 364010243, 382999522]
3152C82999522J2776515N769924m28944n339009q161513j0369972j3012714j5255823
3144C48977986j7266898j8081312j7510531j6129470j4301921j2240857j0178589
3137B43268408q354610o787945n539025m669837l991575l433607k757046k016576
3129B05718187j246069l14598N37601J546070K988851M780612O401425P241572
3121B27653651P080531N204013J652968j690083l870709n598167p143362q613803
3113B14675039r908288j0696386j1059606j1056029j0607067r731561q753362
3106A42862740p660669o637893n817087n146702m664519m426336m226356m066364
3098A00216814l905957l743026l685644l674706l717726l871502l765273l499734
$$ y = [382999522, 395776037, 401545961, 401117017, 395778008, 387616495, 377246523, 364233809, 348977986, 331711088, 313629776, 296119245, 279989775, 265687854, 253446997, 243268408, 234913798, 228125853, 222586828, 217916991, 213925416, 210491809, 207734763, 205718187, 204472118, 204157520, 204695121, 206241191, 209230042, 214010654, 220412079, 227653651, 234734182, 239938195, 241591163, 239901080, 236030371, 230432204, 223288842, 214675039, 204766751, 194070365, 183010759, 171954730, 161347663, 151616102, 142862740, 135202071, 128564178, 122747091, 117600389, 112935870, 108509534, 104283178, 100216814, 96310857, 92567831, 88882187, 85207481, 81489755, 77618253, 73852980, 70353246]
3090G0353246l328017l050273k745744k488230k263420j992088j792264j634736
3082E1058474j385875j217394j078420j054444j071836r78440r05425q66789j029810
3073D1470041j191031j274128j289326j245121j179789j146571j124707j052028
3065C1967340r67807q84968q08808p09449o24903n56848m83554m07055l72535
3056B6151413k86498k48952k99029k40741j76178j51127j53013r9941j35264j36145
3046B4224525j6178K4011J13359R3643L7420l3089j5254l45L267j09023k56933
3035B4065403l81008m06515m07789m69108m70116n44677o30109o41959n60984
3026A9553138n61897n29263n22693n15972n05361m25786l37731l34400l23261
$$ y = [70353246, 67025229, 63974956, 61229212, 58740982, 56477562, 54485474, 52693210, 51058474, 49672599, 48455205, 47376785, 46322341, 45250505, 44272065, 43366640, 42499851, 41470041, 40279010, 39004882, 37715556, 36470435, 35290646, 34144075, 33019368, 31967340, 30999533, 30114565, 29305757, 28596308, 27971405, 27414557, 26931003, 26523948, 26151413, 25864915, 25615963, 25316934, 25076193, 24900015, 24748888, 24595875, 24495934, 24360670, 24224525, 24208347, 24232358, 24345717, 24439360, 24476780, 24443691, 24428437, 24428092, 24431359, 24322336, 24065403, 23684395, 23277880, 22870091, 22400983, 21930867, 21386190, 20756081, 20114122, 19553138, 18991241, 18461978, 17939285, 17423313, 16917952, 16492166, 16154435, 15820035, 15496774]
3017A5496774l08125k56019k24487j77407j29965r9555l1988L2796Q5926J21334
3007A4509284J42692P9545N0707N9620L6867J1892j58763k83485l80058m38475
2997A3629826l95635m62320m62701m81857m68132m29673m35762m05340l40367
2988I748039k95113k83806k56626k15894k12927k05291k29484k18624k11537k14903
2978G403834j69401k12280k18920j58563j21257j93439j98619j50600j22705j22888
2968E735162q7936r8958j32804q6684q7497p8135q9512j05217j06539q1241o9454
2957D711185m5938q7952j10725o5518n9984o7466j00085q8158m4250l7694p5959
2946C927456o4694p2784l4451n4771p9195k3376m7055n4095m423J0833n6313l5917
$$ y = [15496774, 15188649, 14932630, 14708143, 14530736, 14400771, 14301216, 14269228, 14302024, 14387950, 14509284, 14651976, 14731521, 14782228, 14841848, 14878715, 14890607, 14731844, 14448359, 14068301, 13629826, 13234191, 12771871, 12309170, 11827313, 11359181, 10929508, 10493746, 10088406, 9748039, 9452926, 9169120, 8912494, 8696600, 8483673, 8278382, 8048898, 7830274, 7618737, 7403834, 7234433, 7022153, 6803233, 6644670, 6523413, 6329974, 6131355, 5980755, 5858050, 5735162, 5647226, 5548268, 5415464, 5328780, 5241283, 5163148, 5073636, 4968419, 4861880, 4780639, 4711185, 4665247, 4577295, 4466570, 4401052, 4341068, 4273602, 4173517, 4085359, 4041109, 4003415, 3927456, 3862762, 3789978, 3755527, 3700756, 3621561, 3598185, 3551130, 3497035, 3492612, 3503445, 3447132, 3411215]
2934C411215k5842m7404m0017m5334l9573O839p431l5148m1807j6443p663m2800
2922C068592l5294l9480k0009j5497K0122j3004k1929r564K6109J145P957J9808
2910B988956M8166J8759P0439O8475O3645P3085J04305Q0107O1190M2070j2054
2899C607143j5708p2654k7446p8838q3266o9015o4914q1802r5146o1890k9191
2888B927273n6938l4215K308l46J5856J3812K0687J000K6242J4192L1252O6888
2876C028011K1243R0355O7198O5202J08194J66486J30601Q6745L8314K1892J1883
2865C836124k6204n8084l1629p0034r2216j20646q0309j44018j50488r3615n2804
2854B916077n7493n3819n9032m0103o7438n8052l0135l1204j6189m4405m504o1391
$$ y = [3411215, 3385373, 3337969, 3297952, 3252618, 3213045, 3219884, 3212453, 3177305, 3135498, 3119055, 3111392, 3068592, 3033298, 2993818, 2973809, 2958312, 2978434, 2965430, 2943501, 2933937, 2960046, 2961191, 2969148, 2988956, 3037122, 3055881, 3126320, 3194795, 3258440, 3331525, 3435830, 3515937, 3577127, 3619197, 3607143, 3591435, 3518781, 3491335, 3412497, 3329231, 3260216, 3195302, 3113500, 3018354, 2956464, 2927273, 2870335, 2836120, 2838428, 2838082, 2853938, 2867750, 2888437, 2889437, 2915679, 2929871, 2961123, 3028011, 3049254, 3139609, 3206807, 3272009, 3380203, 3546689, 3677290, 3764035, 3802349, 3824241, 3836124, 3809920, 3751836, 3720207, 3650173, 3557957, 3437311, 3357002, 3212984, 3062496, 2968881, 2916077, 2858584, 2804765, 2745733, 2705630, 2638192, 2580140, 2550005, 2518801, 2502612, 2458207, 2453703, 2392312]
2842B392312N18P221K458L342l1018J2856Q188m601L5976k1268m788m79m6320
2829B354397l8361n7399r8157q3845q4738l3060o7854n6200o9247n7338j6695
2818A691503n5282p4716k8425L124k6619k3005n1888o0577m6897o077j7105n6083
2806A247953m2520o2683k2191m4916J2072M979k9240l2152j6496k328K196k6800
2794I87874m2907L1318J551m6673m1913j5521J1052J2376L569k8155L727n4571
2782H21727k0076k0032L083k6047k0075m966q356L032m6850j4319J126k2781Q278
2769F53744M845k5223O6297j1900k6004K2655J7200O675k0788l7860Q030j2375
2757F45296N905K4428J1679m3446P877J686J395k4011k3674K7711j3049j8245
$$ y = [2392312, 2392830, 2400051, 2402509, 2405851, 2374833, 2387689, 2395877, 2391276, 2427252, 2405984, 2401196, 2400717, 2354397, 2316036, 2258637, 2160480, 2076635, 1991897, 1958837, 1890983, 1834783, 1765536, 1708198, 1691503, 1636221, 1561505, 1533080, 1536204, 1509585, 1486580, 1434692, 1374115, 1327218, 1321141, 1304036, 1247953, 1205433, 1142750, 1120559, 1075643, 1087715, 1092694, 1063454, 1031302, 1014806, 1012478, 1014674, 987874, 944967, 976285, 977836, 931163, 889250, 873729, 884781, 897157, 900726, 872571, 876298, 821727, 801651, 781619, 784702, 758655, 738580, 733614, 725258, 728290, 681440, 667121, 668247, 645466, 653744, 658589, 633366, 699663, 687763, 661759, 684414, 701614, 708289, 687501, 649641, 657671, 645296, 651201, 675629, 687308, 643862, 651739, 653425, 654820, 630809, 607135, 634846, 621797, 603552]
2745F03552k1589R09Q300k5584q762O5j2954j5817J9356j1441k9370O333o319
2732E06679l0883M3171K5480l4644j4051j7719J0150j6324n930K3011l474q846
2720D76620N92K1195L900m479j0587j2791J6290K7790J1856M206O237j9116k6522
2707D95191l6078m0213O647o782m1567L0795K3895j6604m798j657k8231j5073
2695C65525K6863q497k7953J3567j5696j4752m201m1756K3179L6242Q65l1620
2683C21766K5232Q653k0996J351j9459K4023j0305j7716n015o066q968k2818L0996
2670C00678L7955j4375m7474m1434M1159r785p989J5747J2387J3182m5000j8117
2658B36934j1331l1818J1955O237M4772R89l262j2248m805M656J7639K3942j5784
$$ y = [603552, 581963, 582872, 591172, 565588, 556826, 556891, 543937, 528120, 547476, 536035, 506665, 512998, 506679, 475796, 518967, 544447, 509803, 495752, 478033, 488183, 471859, 465929, 488940, 485466, 476620, 477212, 498407, 502307, 497828, 487241, 474450, 490740, 518530, 530386, 534592, 540829, 521713, 495191, 459113, 418900, 425547, 418765, 377198, 407993, 431888, 415284, 410486, 408829, 380598, 365525, 392388, 383891, 355938, 369505, 353809, 339057, 334856, 293100, 316279, 352521, 353386, 321766, 346998, 355651, 334655, 336006, 316547, 340570, 330265, 312549, 307534, 301468, 292500, 269682, 300678, 338633, 324258, 276784, 235350, 276509, 266724, 258735, 274482, 286869, 300051, 255051, 236934, 225603, 193785, 205740, 211977, 256749, 257738, 254476, 242228, 237423, 242079, 259718, 283660, 267876]
2645B67876j954q566k7496l7242J8498J7854K1175k4893j1446K3203N498K9534
2633B72041J9343n4515M964j8487J1548L0918k803m4702m00K7020j2700L636j2810
2620B23053J2407K7214L0315p624k6638j5245j0800K8800J2080o355N669P236
2608B80112J3766l1574k1044L7829j268O419j4123J2293k221j7089P904J1631
2596B82635r199j5090J4966j9387J5314Q722k3301M807j782K3320J6150j0160
2584B86995k3985k7411J6131K7300J8583q858j2425k7575K268J089R977l7376
2572B24713Q892r354j0545J295J0784K1117j6545K5216J1310k3963j984R854o755
2559B44035J4248o943J9038j8019n3602K1868K741K3381R60j1680j395N446m6296
$$ y = [267876, 265922, 257356, 229860, 192618, 211116, 228970, 250145, 225252, 213806, 237009, 242507, 272041, 291384, 236869, 241833, 223346, 234894, 265812, 263009, 218307, 217907, 244927, 232227, 235863, 223053, 235460, 262674, 292989, 285365, 258727, 243482, 232682, 261482, 273562, 267207, 272876, 280112, 293878, 262304, 241260, 279089, 277821, 284240, 270117, 282410, 280189, 263100, 271004, 282635, 273436, 258346, 273312, 253925, 269239, 277961, 254660, 259467, 257685, 281005, 297155, 286995, 263010, 235599, 251730, 279030, 297613, 288755, 276330, 248755, 251023, 252112, 262089, 224713, 233605, 224251, 213706, 215001, 225785, 246902, 230357, 255573, 266883, 242920, 240936, 250790, 244035, 258283, 251340, 270378, 252359, 198757, 220625, 223366, 246747, 247707, 236027, 234632, 240078, 193782]
2546A93782J3420J0823J5211L689J8274j5171m3898L7336k6387k5770K0756J2
2534B02077J1920j629J4019p215n045m654o33J0377K671q428K836r96m402K2029
2520B32927l945Q959k0163j2198j5199k0478J3561O750P781K0591k3890l1496
2508A63200J3014Q203L529j9427N527Q119K8132K7500k5254L779l9876K490J902
2495A80838L0903n770j9991j2728o991N83K0701L9507j3737p750L0799l6587p014
2482A92763n62n791j3876J2195J0444J1676r511o536J7243L484k4127J3810L469
2469B04681k3385K5697r63j4304J129j5298j2606K4238n517j804j7830N796M0801
2456B10635j8094M812Q042l1684l708K9692Q096K0420k7634k0449l0038Q666J110
$$ y = [193782, 207202, 218025, 233236, 236925, 255199, 240028, 196130, 233466, 207079, 181309, 202065, 202077, 213997, 212368, 226387, 219172, 214127, 209473, 208840, 219217, 221888, 213460, 216296, 215300, 210898, 232927, 228982, 237941, 217778, 205580, 190381, 169903, 183464, 190214, 197995, 218586, 194696, 163200, 176214, 184417, 187946, 168519, 174046, 182165, 210297, 237797, 212543, 216322, 176446, 178936, 180838, 211741, 205971, 185980, 173252, 166261, 166844, 187545, 227052, 213315, 205565, 236364, 199777, 192763, 192201, 186410, 172534, 184729, 195173, 206849, 197338, 190802, 208045, 211529, 187402, 201212, 204681, 181296, 206993, 206030, 191726, 192855, 177557, 164951, 189189, 183672, 181868, 164038, 169834, 210635, 192541, 197353, 205395, 173711, 170003, 199695, 207791, 228211, 200577, 180128, 150090, 158756, 159866]
2443A59866j9725m159O341M314J4146R039L855l0458r509K3316p528K2749k0465
2430A51782L9445k9536l3893j4256j4544N2125M329l7387r26K5135J4383j9849
2418A36808J579J891k1713k3774L1606L9931J3454j4390J2481R516k9298m77L0816
2405A88430k0086O917N7702j537j4511k211l702K378k9652j579K7987P865M55
2392B18456k7845J5230L7766k0520n1249j7047O0129k5200L3152L3173J071K0793
2380B77909j9575P025J6224L3193K0939R50L2717K022M627N9109J0364L6519O4392
2367E46415K5896N9356O0302O0566O2686J15851R0356Q0180R5815J29367R7897
2356A424687J04966J34527J25238J91239J88777K21451L44185M61007N07001O62811
$$ y = [159866, 140141, 135982, 142323, 146637, 160783, 169822, 173677, 143219, 133710, 157026, 149498, 172247, 151782, 191227, 161691, 127798, 113542, 98998, 151123, 155452, 118065, 117139, 142274, 156657, 136808, 138387, 140278, 118565, 94791, 126397, 166328, 179782, 165392, 177873, 187389, 158091, 157614, 188430, 168344, 175261, 232963, 231426, 216915, 214704, 211002, 213380, 183728, 182149, 210136, 218001, 218456, 190611, 205841, 243607, 223087, 171838, 154791, 214920, 189720, 222872, 256045, 257116, 277909, 258334, 265359, 281583, 314776, 335715, 336665, 369382, 371404, 376031, 435140, 445504, 482023, 546415, 572311, 631667, 691969, 752535, 815221, 931072, 1021428, 1101608, 1197423, 1326790, 1424687, 1529653, 1664180, 1789418, 1980657, 2169434, 2390885, 2735070, 3196077, 3703078, 4365889]
2346D365889P83423N36611N17j83865j47137p0564m2973j85636l14852l41054
2336D400359m34972l56465k76001k68545j90550j60592q4845p5880p3218q0913
2326B398378o1465j11367r1497n9801r6803o7320q7855j47122j15471j45539q7048
2315A327090r9465p6944m7951k5377p5774n9862k3691q5062k767k5950l7693m8726
2303G17828o0745l2578J0956k5195o5874l3090N180K5123j5006o7616k7228r810
2291D21945j5454j9854l0252m9631K823J0496J0468j9775K725J3273M900m0093
2279B91571k6981K5414r680k4684m4145L7486L5604n5246j0266J7141k2413r253
2267B04548L634N80m4827J2851q405M646j066l8213J461k1682L509K7250J6955
$$ y = [4365889, 5149312, 5685923, 5686440, 5502575, 5355438, 5284874, 5241901, 5056265, 4741413, 4400359, 3965387, 3608922, 3332921, 3064376, 2873826, 2713234, 2628389, 2552509, 2479291, 2398378, 2336913, 2225546, 2134049, 2074248, 1977445, 1910125, 1822270, 1675148, 1559677, 1414138, 1327090, 1227625, 1150681, 1102730, 1077353, 1001579, 941717, 918026, 832964, 830197, 804247, 766554, 717828, 657083, 624505, 635461, 610266, 544392, 511302, 516482, 541605, 526599, 458983, 431755, 421945, 406491, 386637, 356385, 306754, 309577, 320073, 330541, 310766, 313491, 326764, 331664, 291571, 264590, 290004, 280324, 255640, 211495, 248981, 284585, 229339, 219073, 236214, 213801, 204548, 208182, 208762, 163935, 176786, 168381, 173027, 171961, 133748, 135209, 113527, 117036, 144286, 161241]
2254A61241m2476J5221J0642N28l204K764o073j2059K98l493q587j9044k363J8730
2240A12125l134J6704k9576m148R528J7318q833l56P463k3886K020K2543l2171
2227H5597J6647J441l3183L53K4733K00k1138k4454J8486J9315p063J6838k5197
2214G2575J5823J9392J4201l3085J3920j5859m287J1819j919j5029j3658l023
2202F0870K4949J1747r025j375J5225N557n999l289n50o262q761j0239j2040m108
2188E6700j2199J6264k786j545J1493J6400k340j4732J0645j0640r312M4259o819
2175I5388P78K193l9435L643m12m918p060p119j550L1314k8513J3701l1570n407
2161B1033J3031j0320L2260M435J3043Q065j3030l8646k2670J9309L401J6013
$$ y = [161241, 118765, 133986, 144628, 145156, 141952, 144716, 138643, 126584, 126882, 123389, 114802, 95758, 93395, 112125, 108991, 125695, 96119, 91971, 101499, 118817, 109984, 109628, 117091, 93205, 95225, 117768, 85597, 102244, 103685, 70502, 70855, 95588, 95788, 74650, 50196, 68682, 87997, 80934, 97772, 72575, 88398, 107790, 121991, 88906, 102826, 86967, 82680, 94499, 92580, 77551, 63893, 60870, 85819, 97566, 88541, 87166, 102391, 107948, 101949, 98660, 98110, 91848, 83087, 72848, 60808, 56700, 44501, 60765, 57979, 56434, 67927, 84327, 81987, 67255, 77900, 67260, 57948, 102207, 95388, 96166, 98359, 58924, 62567, 62155, 57237, 50177, 43058, 41508, 72822, 44309, 58010, 26440, 21033, 34064, 23744, 56004, 60439, 73482, 81547, 68517, 29871, 7201, 26510, 29911, 45924]
2149D5924r14k5203M180J6747J3952j5712k6922j3729k1055K5811q891J9688Q671
2136B2547K7051j8304j2924L1092K6733Q144j9090R011k4097r939j4148k708Q659
2123C2027J28K3941j6902n937K617M340K1508r676n521r669J689L2286j6680j1896
2109D2255m464J7221L4890J7235n653m9078L039l3440J7723J6052n034k0660L87
2096C0473K0999l861R362o410k1562k573L9086j8266K1455J7881l7066k4711k6416
2083a609L7051R100K213N520M4446O911L948k159K324k426J8818j9456Q397l5258
2069G7820j5571m584J4320K080j2568k135R726k6064Q747J3425j5782k4300k2335
2056B779k234L6582K0600j6499m204K8455L657j2986J2777k7617J1713L392K5793
$$ y = [45924, 45010, 19807, 23987, 40734, 54686, 38974, 12052, -1677, -22732, 3079, -5812, 13876, 22547, 49598, 31294, 18370, 49462, 76195, 84339, 65249, 74260, 50163, 40224, 26076, 23368, 32027, 32155, 56096, 39194, 33257, 35874, 40214, 61722, 52046, 46525, 36856, 38545, 70831, 54151, 42255, 37791, 55012, 89902, 107137, 101484, 52406, 55445, 22005, 39728, 55780, 50746, 30086, 30473, 51472, 47611, 56973, 50563, 29001, 26428, 65514, 47248, 68703, 86584, 49518, 24807, -1609, 35442, 44542, 46755, 52275, 96721, 103632, 107580, 105421, 107745, 105319, 124137, 104681, 113078, 77820, 62249, 57665, 71985, 74065, 61497, 59362, 69088, 43024, 51771, 65196, 49414, 25114, 2779, 545, 37127, 57727, 41228, 37024, 65479, 69136, 56150, 68927, 41310, 53023, 56415, 82208]
2043H2208k8504k767j3982Q351k781j2027n803L4255Q164k4499k4380J0403K302
2030C0940j7431Q953M12j8766j5827j2601J4823K2610J8344m501L539j8643J3901
2017B5753J458K5570j902j7218K240m286L948j8950j4597J0429J8084j4845R852
2004B5536l2642L2259L8162n484m1544M917J620j2055J2723k063n313P681j7363
1991F434P97K2853K2121J185m1088J5748r362l0337r76L4829L209j310k7394R072
1977E781K7544l05O57J6139k2446n994l426k2091K1916k705k2174j9527J4500
1964a2131K466j5231L189L0926n962L7551j3601k792J8100k2678K5453K071m4812
1951B549k1151Q259K0374Q354J9338j1430q671N779j4558l0110O373N063K3946
$$ y = [82208, 53704, 50937, 36955, 45306, 42525, 30498, 24695, 58950, 67114, 42615, 18235, 28638, 30940, 13509, 22462, 22874, 4108, -11719, -24320, -9497, 13113, 31457, 26956, 30495, 11852, 25753, 27211, 52781, 50879, 33661, 35901, 31615, 35563, 16613, 2016, 12445, 30529, 15684, 25536, -7106, 25153, 63315, 57831, 16287, 21204, 22824, 10769, 23492, 21429, 16116, 23797, 6434, 7231, 30084, 52205, 53390, 12302, 28050, 18688, -11649, -12625, 22204, 25413, 24103, -3291, 5781, 33325, 33020, 33677, 49816, 27370, 21376, 17950, -4141, 17775, 15070, -7104, -26631, -12131, -9665, -24896, -21707, 9219, 3257, 40808, 27207, 24415, 42515, 19837, 45290, 47361, 2549, -18602, -10343, 10031, 18385, 37723, 26293, 17622, 23401, 8843, -21267, -14894, -9831, 14115]
1938A4115J8806j9563K1307L705j9851K2092m321j4272q821J8780Q266j6383j4390
1925I470k0881J6744P119q662l976M200J142N272j0169K1747j8220k876J2009
1912A2919N298n560l34l0104k4450N5746K6835O145n1154n941L1045j2758j0020
1899b333j6834K2701k1301K2314k5056K4382J277L149k1667l8622J5608L8927
1887B545k7549p620J8925M940K2016k9116o067J0807K9744k4656k6668J2559K8919
1874H779M87m3519J1475K5306k0213j7538L8479J4018K146K748l4547J3561J9361
1861B0543m088J331M25J5207n216p0J7578k1130j1262k1776j8634R167q378Q432
1847a7871J2523K1796J5958k1250l0862k0142K9488L5978k1310k6958O785L1546
$$ y = [14115, 32921, 13358, 34665, 38370, 18519, 40611, 36290, 22018, 13197, 31977, 40243, 23860, 9470, -11411, 5333, 12452, 3790, -186, 4014, 5156, 10428, 259, 22006, 3786, 910, 12919, 18217, 12657, 12323, -17781, -42231, 13515, 40350, 46495, -4659, -10600, 20445, 7687, -2333, -19167, 3534, -17767, 4547, -20509, 3873, 5150, 8299, -13368, -51990, -36382, 2545, -25004, -32624, -13699, -8759, 13257, -15859, -21926, -11119, 18625, -6031, -32699, -20140, 8779, 9266, -34253, -22778, 2528, -17685, -35223, 3256, 17274, 19420, 22168, -12379, 1182, 20543, 16455, 17786, 18211, 33418, 28202, 28132, 45710, 24580, 13318, -8458, -27092, -17925, -26303, -17871, -5348, 16448, 32406, 11156, -19706, -39848, -10360, 25618, 4308, -22650, -15865, 15681]
1835A5681K9203k5871k566m1035K8950J1832L0066p709j6090K1321l241n999j1240
1822B3302l0537R834r752L9624L28j9193J947m361j5725O072L3453j703k5321
1809G968j0123J1845j4999j575J1745J0428l963j8127R355L4868k2133r148n188
1796I53j1946N529M949m720j5421q509L2994q510j3613Q098L9834k7540j7074
1783a4976L8716J786k1004k6897L0778L1052j810m3728k8614n444K7241J6005
1771C105K5737K0571k6303l1977k3031j3965J6851J1095L1580k761p163N424J2903
1758B2066k5949k902M2708O124l6622J476K5809j5967K1758o166l3899K5842j0428
1745A3850n968j6065k678M156k005p830p762K2083L529q461j9170J5360K1416
$$ y = [15681, 44884, 19013, 16447, -24588, 4362, 16194, 46260, 38551, 22461, 43782, 40541, 34542, 23302, -7235, 2599, -7153, 32471, 32799, 13606, 15553, 11192, -4533, 1539, 34992, 33289, 7968, -2155, 9690, -5309, -6884, 4861, 15289, 11326, -6801, 2554, 37422, 15289, 6141, 953, -10993, -5464, -515, -5235, -20656, -29165, 3829, -4681, -18294, -10196, 29638, 2098, -14976, 23740, 25526, 4522, -22375, 8403, 39455, 37645, -6083, -34697, -40141, -12900, 3105, 28842, 49413, 23110, -8867, -31898, -45863, -29012, -17917, 13663, 10902, 3739, 9163, 22066, -3883, -6785, 35923, 42047, 5425, 6901, 32710, 16743, 38501, 32335, -1564, 24278, 13850, 7882, -8183, -10861, -6705, -8710, -16540, -24302, -2219, 1310, -7151, -26321, -10961, 10455]
1732A0455J0576l5030J3515j089K6235j1460r447K372R022j5097k3959k2878L5148
1719a1637k1073k038K4378J754J4139K0387K1283O969m9244l1956J9229j4389
1707b2198K5497K3176m417k6566q729J1108l5472L1823k312L3403m825k927J7534
1694C5095J1601j8972l854L271j7990m2234J348K0540n847K7793L0262k5427j1592
1681C994L499k4980K5549k4636k0795L3033O559J8447l061m4498K0685K9597k6898
1668c505J329L515k2812j3107N495L4570r981l355k7191j731P400J788j2029M4627
1654E013R073j8470q699o110L379j464j4632K3497J1172m0598k4317j2142N446
1641f8852L4319J4394r529J5487K3837J1518o455j1417O525j5639K2057R64k1840
$$ y = [10455, 21031, -13999, -484, -1573, 24662, 13202, 3755, 6127, 15149, 52, -23907, -46785, -11637, -32710, -34748, -10370, -8616, 5523, 25910, 47193, 54162, 4918, -27038, -7809, -22198, 3299, 26475, 22058, -4508, -13237, -2129, -37601, -5778, -8090, 25313, 20488, 17561, 35095, 46696, 27724, 23870, 27141, 9151, -33083, -31735, -11195, -17042, 10751, 41013, 15586, 3994, 7493, -17487, 8062, -16574, -37369, -4336, 2223, 20670, 17609, -26889, -6204, 23393, -3505, -2176, 1339, -21473, -34580, -29085, 5485, -4496, -7851, -35042, -36773, -29373, -27585, -39614, 5013, 14086, -4384, -13083, -19193, -15814, -17278, -31910, -8413, 2759, -37839, -62156, -74298, -68852, -34533, -20139, -29668, -14181, 9656, 21174, 14719, 3302, 9827, -5812, 16245, 17209, -4631]
1628d631l3662N319O437l3410p582L0887K4621j0390K0554J6447k0485l59M148
1615b106R703m857L7680k6511j5709m973l888K3935o825o77j7529n006Q681m66
1601h548l451p013J8123o0708M3824J1545o866P174k3521k7709J9196M5467J2689
1588B0202k0367p552k5559l82K159J8120L7176j8417k4502k1830L2905O032l7876
1575c9891K3982j3434j6433J6093R254J7108J886M642r442J990m7968J9028K7079
1562f106l945p965j547J1311Q022k1955o873p284j2161Q964j5360l1503L3035
1549e3367K1616J8934j7440Q226R385J4400k0653j1494J9188L7044K0517m1298
1537E058m1618K0599L682K3514l86m2100m8320J7280K759J8063K411J924J5030
$$ y = [-4631, -38293, -32974, -26537, -59947, -67529, -36642, -12021, -22411, -1857, 14590, -5895, -6254, -2106, 7597, 2740, 40420, 13909, -1800, -6773, -10661, 13274, 6449, 5772, -11757, -16763, -8082, -8548, -11999, -19012, -889, -61597, -17773, -6228, -13094, -5920, -29441, -57150, -37954, 7513, 20202, -165, -7717, -33276, -33658, -31499, -13379, 23797, 5380, -19122, -40952, -8047, -2015, -39891, -15909, -29343, -45776, -29683, -20429, -3321, -1435, 3207, -6235, -4245, -52213, -33185, -6106, -10051, -18016, -19563, -8252, -230, -22185, -29058, -36342, -48503, -39539, -54899, -86402, -53367, -31751, -12817, -30257, -22031, -12646, 1754, -18899, -30393, -11205, 25839, 46356, 5058, -36560, -15961, -12279, 11235, 10849, -31251, -79571, -62291, -59532, -41469, -39058, -37134, -22104]
1524b2104J608l327k3794K141K1805M6524j273k3842j8167r299K7256O840K4225
1511B8593j1632K540l9093k959P893M766l3645R609k123P491j2416J9982N744
1498a5250J0755K6695j9823j8899O714J0904P392K2148l4454o30n808K5521m2536
1485b7271j5741k8995J4726L6372L4682r307k1308n2985R74M8827m2792J1319
1473e1499L1279J8335j9071L849L4559O746J4469j2280j7084l544j3134l1668
1461c9043p721q548L1854L1603J4223m0266k035J0089n014P80k3798j5224j4351
1448f7451K3099O5046O61k6290j651k3530L603J9584q891J1626J5281l305n206
1435B576j7764k1638L1504J5935M401l7269N3401j2348K4542l7249k2111N517
$$ y = [-22104, -20496, -23823, -47617, -45476, -23671, 22853, 21580, -2262, -20429, -29728, -2472, 4368, 28593, 16961, 19501, -19592, -22551, -14658, -9892, -43537, -33928, -36051, -28560, -40976, -20994, -15250, -4495, 22200, 2377, -16522, -9808, 1096, 8488, 30636, -3818, -4448, -10256, 15265, -27271, -43012, -72007, -57281, -20909, 13773, 4466, -16842, -69827, -68853, -20026, -62818, -51499, -20220, -1885, -20956, -17107, 17452, 24198, 38667, 26387, 9303, 5759, -7375, -39043, -46764, -55312, -23458, 8145, 22368, -17898, -19933, -9844, -14858, -14078, -37876, -53100, -67451, -44352, 20694, 21355, -4935, -6586, -30116, -26513, -6929, -15820, -4194, 11087, 7782, 2576, -15188, -36826, -5322, 10613, 15014, -22255, 31146, 18798, 43340, 6091, -16020, -10503]
1423a0503K5218Q482Q300j3139j1455j5143k6084J1827K8458K8414j6366k5579
1411g570k6706O234J8799O527j6306K074J2085J3748R05j1891j1268L4269j9465
1398A435m3400r769M5441M358O900J0377l06J3156k4283l1834J5178M95J341l0674
1384d1585J6939K0220J5935J3652l9323N169k133J5972K354l0447o219j3856m44
1371d3766L7681K5977k1205k8048J5484L1892j0987j9518j8124O809n269J9203
1359i871k4231j4378m39O6990k364l0865j8138K2435M95j3054K302J4682N463
1346i73l71q386K7870k2052L0097K418k8940R888K535J483l7310K1922L8115j680
1332C4616l371j5755n445j8753n554J2781l588R361J5237O714j0655j8008J7482
$$ y = [-10503, 14715, 23197, 31497, 18358, 6903, -8240, -34324, -22497, 5961, 34375, 18009, -7570, -34276, -28042, -9243, -2716, -19022, -16948, -4863, 8885, 9790, -2101, -13369, 20900, 1435, -41965, -51734, -6293, -1935, 4965, 15342, 15036, 28192, 3909, -27925, -12747, -12252, -10911, -41585, -24646, -4426, 11509, 25161, -14162, -8993, -11126, 4846, 7200, -23247, -29466, -43322, -43766, -6085, 19892, -1313, -29361, -13877, 18015, 7028, -12490, -30614, -23805, -29074, -9871, -34102, -48480, -48919, 18071, 15707, -15158, -33296, -10861, -10366, -23420, -21118, -6436, -973, -1344, -9730, 18140, -3912, 26185, 28603, -337, 9551, 12086, 13569, -23741, -1819, 36296, 34616, 31245, 15490, 10045, -8708, -14262, -1481, -5069, 4292, 19529, 26243, 15588, -2420, 15062]
1319A5062J1387j2475j311j9195K4779j8196K4448j9220k2128K2170P976k4726
1307a1429J1309J1715j8715l7518R562L9288J1804p176K1981o223J2854j7778
1295A9674J3695k3850l6225K5505L0024m3946L995K2257k3987R502Q06J9599l8642
1282b1593j629o513k7611J0839j043K2100K6735k3363R32K6156m090k304L930
1269B546m015r587O807J9776J0364j6448k8673M846J1358n741L3981j1488k9407
1256a5681r419m532L5157r816j0623j2173J4823M653n686J1857J3965j8J9765
1243C2272k9010k2229k6039J0218K3039n531K6765O230M732q947l62j0103k2181
1230b1146K1978J4962l5749j2033J3296K4866k7082j2430L0399k339J98J577k7388
$$ y = [15062, 26449, 13974, 12663, -6532, 18247, 51, 24499, 5279, -16849, 5321, 13297, -11429, -120, 11595, -7120, -44638, -35076, 4212, 16016, 8840, 30821, 24598, 37452, 19674, 33369, 9519, -26706, -1201, 28823, -15123, -11128, 11129, -12858, -3356, -2550, 17049, -21593, -23222, -29735, -57346, -46507, -47550, -25450, 1285, -22078, -21146, 5010, 920, -1384, 2546, -1469, -11056, -4249, 15527, 25891, 9443, -19230, -14384, -3026, -8767, 25214, 13726, -15681, -25100, -29632, 5525, -4291, -14914, -27087, -12264, -7611, -13297, -1440, 12525, 12507, 32272, 3262, -18967, -45006, -34788, -11749, -17280, 9485, 15715, 20447, 11500, 11138, 1035, -21146, 832, 15794, -19955, -31988, -18692, 6174, -20908, -33338, -2939, -5278, -5080, -3503, -30891]
1217c0891J9981N51K8299K2285m6686J5272k4558j1094L4719k5577q525l701J3943
1204a5982K3435J3614k7347j5405J7898J103j945j8027j929J8349J1749O221l7796
1191b6062q206K816r25K6654j1926j6870k943M50k334L2024r376L7857Q12k3997
1177b026q619l7828j0935Q3L0251j4296M262N07J6666j8479J9223J3622J3565
1164E996O788j0526O973N885k212j4603J167j6538K1263o257L127Mk3681l2359
1150e4973J3125k555R616J4432q132J1133K2841M332R048j5470j7967j5782O333
1137b4019J2096P290M303r263L455q997j3125O4652L49j8144K4277K8820l9401
1124C2293m4218J7394l4800q701J3078L39J7165k3503q489K0145l788q031n704
$$ y = [-30891, -10910, -10359, 17940, 40225, -6461, 8811, -15747, -26841, 7878, -17699, -26224, -29925, -15982, 7453, 21067, -6280, -21685, -3787, -2684, -4629, -22656, -24585, -6236, 5513, 11734, -26062, -34268, -31452, -32377, -5723, -17649, -34519, -37462, -37012, -39346, -7322, -16698, 21159, 21971, -2026, -10645, -48473, -59408, -59325, -29074, -43370, -39108, -38601, -21935, -40414, -21191, -7569, 5996, 12784, 2258, 9231, 15116, 12904, -1699, -532, -17070, 4193, -2064, 1063, 1067, -22614, -54973, -41848, -44403, -34787, -20355, -28487, -17354, 5487, 9819, 18867, 3397, -14570, -30352, -24019, -11923, -4633, -330, -9593, -6138, -15135, -28260, 36392, 36741, 18597, 42874, 71694, 32293, -11925, 5469, -29331, -38032, -24954, -24615, -7450, -30953, -39442, -19297, -23085, -31116, -36820]
1111c6820L2592P792Q942j7718j3651m7778NN0828O526J6266k709K794K0337m354
1097B3052j2891K518J9238j6194l7615N319K8219l420J4099L164o470k4140j0763
1084a5884j1495j9241j664l202j1636J7505J6740J1526J4327K3061n986r811J9197
1071B3437m1094k3040j4844J1579J8953L0119l607j3887q07k2599r371J9661M7027
1058B1527l4627R097L367M0775J4903l0180j4213j3795J2032l2334N098j8253
1046c6603K808K9315K158j1809K1071K1998j3641J8703J0305l8465M362m449N183
1033A0936J0921R297K319N012J7005m0091J9338j1154N01J9238O664j3512m6235
1020i761J671j0492K53K378k2364J4655N6963j88m4432k4485K2572L4007l4656
$$ y = [-36820, -4228, 3564, 12506, -5212, -18863, -66641, -66636, -15808, -9282, 6984, 4275, 7069, 27406, 23052, 10161, 12679, 31917, 15723, -21892, -16573, 11646, 8226, 22325, 25489, 19019, -5121, -15884, -27379, -46620, -48284, -51486, -63122, -45617, -28877, -17351, -3024, 20037, 14051, 4240, 23437, -17657, -40697, -55541, -43962, -25009, 5110, 1503, -12384, -13191, -35790, -45161, -25500, 21527, -13100, -4003, -636, 40139, 55042, 24862, 10649, -3146, 8886, -23448, -18350, -36603, -33795, -4480, -2322, -14131, 6940, 28938, 15297, 34000, 44305, 5840, 10202, 5753, 10936, 21857, 31154, 33473, 38485, 55490, 15399, 34737, 23583, 24084, 43322, 49986, 36474, -9761, -8090, -18582, -18329, -15951, -38315, -23660, 33303, 33115, -11317, -35802, -13230, 20777, -13879]
1007a3879N585N351J6065K7547j8771m231l8670r638j3792N65L527J5214J5400
994i727K6365n0414j3377Q316J5294J7336P626l863j1282J0620P05k2582K3136
981a847K7866R702R378k8936k4956j1907J3401k301j3041P866J4857j5461P428
968g951O10J8019L0915m080l4091K2831P461M96k6329r89k963J3262N63J2238
954B9992m0725O312J4424J686Q469j0910k728l902O798k6547K4986k8117K0051
941b11k416l2715J7142m928J0554J1041O835L247N458l3193q36J2551J0762j7218
927a3927p06K4786j5939q244J5375K4227j9105j331r160q242K7195l498q24q632
913A975J0628K9089J8216q769l3832N194m438j5547j1534J1323R894k7388O2037
$$ y = [-13879, -8294, -2943, 13122, 40669, 21898, 17667, -21003, -30641, -44433, -43868, -40341, -25127, -9727, 16638, -33776, -47153, -38837, -23543, -6207, 1419, -2444, -13726, -3106, -2401, -24983, -1847, 26019, 35721, 45099, 16163, -8793, -20700, -7299, -9600, -22641, -14775, 82, -15379, -7951, -7341, 10678, 41593, 37513, 3422, 26253, 33714, 34210, 7881, 6892, 3929, 17191, 17754, 29992, -10733, -4421, 10003, 11689, 20158, 9248, 6520, 2618, 9416, -17131, 7855, -20262, -211, -2627, -35342, -18200, -23128, -12574, -1533, 5302, 8549, 14007, -19186, -20022, -7471, 3291, -13927, -14633, 10153, -5786, -14030, 1345, 25572, 6467, 5136, -4024, -12266, 14929, 11431, 10607, 1975, 12603, 41692, 59908, 51139, 17307, 22501, 18063, 2516, -9018, 2305, 12199, -15189, 46848]
900D6848j4265n633J2838J445O364j2947j8430P77k472k4941J2905n904J0953
887G538l7462m171k218M213o425L4597M626j855Q55L0241j9160n17j9282K8279
873A9259k4037j3131k6162j5190K3816Q184k521J3693J2369L279Q512Q449k6586
860a0066l0228L1825K5090n596k3732K958k386j632l2636K1380j1739N058J383
847c0321J4317k304l578J0065Q020l5816M1265J2949r576n183j9466j6531M6785
834A0626N813k5165J4679K6935j2461m6291o778M172k871q680J4867L6163p693
821C316k857k501m015K7952o103k3895O251j3670j9526K8393k7092L8020k0638
808a6365j3929J7810J5069M461K757J3468o23K305j4263R170j5517j8397k0214
$$ y = [46848, 32583, 26950, 39788, 41233, 47597, 34650, 16220, 16997, 14525, -10416, 2489, -3415, 7538, -29924, -34095, -36313, -32100, -38525, -3928, 698, -1157, -302, 29939, 10779, 10262, -9020, 19259, -4778, -17909, -44071, -59261, -35445, -27261, -29782, -16089, -3720, -441, 8071, 16520, -10066, -40294, -8469, 16621, 11025, -12707, -9749, -12135, -13767, -46403, -25023, -36762, -31704, -30321, -16004, -18308, -21886, -11821, -3801, -39617, 1648, 14597, 5021, -162, -19628, -36159, 10626, 16439, -8726, 5953, 32888, 20427, -25864, -32642, -28470, -31341, -40021, -25154, 11009, 3316, 459, -2042, -6057, 21895, 15792, -8103, -1852, -15522, -35048, -6655, -33747, 4273, -16365, -30294, -12484, 2585, 7046, 9803, 23271, 22648, 24953, 10690, 19860, 4343, -14054, -34268]
795c4268L3847K4797j739K08N499k6106q964N84j4826K745r787k8507K8281K7714
781e22Q923Q905j8284l0460k0098K1921M5919J4993k6210j3545o01L8922j4459
768A5404j5588q135j3841R460l120k1926j608Q495K4861J940O232R312J1322J0554
754C3362l970j026k1798j6245j7301K1590K1366j373k9100J0335K3999Q563k3824
741D578n0868K9934K5301j6394O885j6628O26K5503q065k2689J4936K4926k2351
728d306P256J1440K947k1939P493Q035k4522j3201K4930M87l297J5593P474k3433
714e043j4836K9492O533j1913L841o578m8577K262K6939Q952O475J3052R908q353
700A2154j1916k2737K0955R861j3785l514o098O700j6394L6742J4787k9846K1575
$$ y = [-34268, -421, 24376, 22637, 22845, 28344, 2238, -6726, -6142, -20968, -18223, -28010, -56517, -28236, -522, 8401, 17306, -978, -31438, -51536, -29615, 16304, 31297, 5087, -8458, -9059, 29863, 15404, -184, -8319, -22160, -12700, -15820, -37746, -39354, -30859, -5998, -4058, 2174, 11486, 22808, 33362, 29392, 28366, 6568, -9677, -26978, -5388, 15978, 14605, -14495, -4160, 19839, 28402, 4578, -46290, -16356, 8945, -7449, -564, -17192, -16566, 8937, 872, -21817, -6881, 18045, -4306, 2950, 14390, 17337, -4602, 2891, 10926, -13596, -26797, -1867, -1380, -4677, 10916, 18390, -5043, -19879, 9613, 16146, 4233, 8074, 1496, -47081, -44819, -17880, -8928, -2453, 10599, 20507, 12154, 238, -22499, -1544, 8317, -5468, -8982, -15080, -8380, -24774, 11968, 26755, -3091, 18484]
687A8484n077m9774J7623L7180r193m1021k5012K0019J9038p263K9587N116j4762
674e055K1575j2493R00r217l2537N7295J90j7710q941j4009j8136K0521P390j1241
660b1468n705J63N1475o141P116J818l619j9490o15J5449k3128j8406M1410j5354
646C505K0946N538k4799J6975r88k4103k6262J0239K6911P105j8763K0901M65
633A7670j8706K8193p70j4791o874k0014M0335J3614k8218j4753M397K4739m7448
620b2626K3530o387r101J6371J5640J4730j4088j4293K5605L79l2667J6264j4115
607g58J0457K1571k6761l198M293J2877Q819k4571j4648k8107L2015l368N162
594f217q621P541k9557K7822L1605J0620k7514p558J6369j8029r275Q158N987
$$ y = [18484, 13407, -36367, -18744, 18436, 9243, -31778, -56790, -36771, -17733, -24996, 4591, 9707, -5055, 16520, 4027, 4927, -4290, -36827, 20468, 20658, 2948, -5993, -20002, -38138, -17617, -10227, -21468, -27173, -27010, 24465, 18324, 25440, 27258, 23639, 4149, 3534, 18983, -4145, -22551, 18859, 3505, 24451, 29989, 5190, 22165, 21177, -2926, -29188, -18949, 7962, 15067, -3696, 17205, 17670, -1036, 27157, 26387, 11596, 4722, -15292, 25043, 38657, 10439, -4314, 83, 24822, -22626, 904, -5483, -14584, 1787, 17427, 32157, 18069, 3776, 29381, 29760, -2907, 13357, -758, 9699, 31270, 4509, 1311, 5604, 18481, 27300, 2729, -11919, -40026, -8011, -11379, -6217, -14838, -7297, -36854, -9032, 22573, 33193, 5679, -1879, 14490, -3539, -12814, -4656, 1331]
581A331j6037j3803l700M13L8192J5971j3924k0534j0679K7342P671r09l7769
568b6435L4033J4919L0783k0992k5088J768j0601j501o061L497j9173P921J225
555a5705J948M4712k2887k5770j4008R551L9263l8536L2457L7583j3802n864k2263
542F679k1963k5229k340N3692k2589o668K3620j0553k3271N91L7815j672l8433
529c0321o127M6690j13j7118L687J6930N803r607J1625l191r680k745l0114J7957
515f324K0619j6109J2742P087l0694L7151l8263K2312L1357k3703Q677j6278J6620
502B5194j2690N452k1085Q290o774r034J0533O90M447q498N125r834R846k9825
488b8163N3104j5341k8681K3167J0659Q894o520l2708N235J5033Q426O918k4108
$$ y = [1331, -14706, -28509, -32209, -31796, 6396, 22367, 8443, -12091, -22770, 4572, 12243, 11334, -26435, 7598, 22517, 53300, 32308, 7220, 8988, -1613, -3114, -9175, -5678, -24851, -16930, -15705, -13757, 30955, 8068, -17702, -31710, -22159, 17104, -21432, 11025, 48608, 34806, 28942, 6679, -15284, -40513, -42853, 10839, -11750, -18418, 5202, -5351, -28622, -28031, 9784, 8112, -30321, -36448, 10242, 10129, -6989, -3302, 13628, 19431, 9824, 21449, 18258, 8578, 5833, -24281, -6324, 14295, -1814, 10928, 18015, -12679, 24472, -13791, 8521, 39878, 16175, 24852, 8574, 25194, 12504, 17956, -3129, 5161, -1613, -10647, -114, 576, 5023, -3475, 1650, -8184, 1662, -28163, 24941, 9600, -19081, 4086, 14745, 23639, 17119, -15589, -10354, 4679, 13105, 20023, -4085]
475d085O269Q765j4801j6465M1365P902J3641L791l7163R012M1072r824j8055
462C1424l615J2460j6404l0663K788R387J2788k4k6152l251K08p937Q088R031
448a872K1386j81J2445L194k3256J4443K783o48j4923r059j0124l262J8706k2571
434a2939j446K8036J2798k5995j0636J5694J5343j6668J5184R662k1184j1446
422c597J1824K7410j6950L2901M907o434l3257P509J143k6525K6051J2585O54
409C8221j0165j6131J1056j8966j4424N890J3297J9297J1615j5145j4848j412
397H285L7123m6191k7931L4677M587Q593N665m3053M911p743K8922p946j9607
384a9708J3814J0188N0109l0332j0255J3512j1695K1083q383n6050J6906L1733
$$ y = [-4085, 2184, 10949, -3852, -20317, 21048, 28950, 42591, 46382, 9219, 18231, 59303, 49479, 31424, 27809, 40269, 23865, -6798, -4010, 5377, 18165, 18141, -8011, -11262, -11054, -18991, -10903, -1872, 19514, 19333, 31778, 34972, 11716, 26159, 28942, 28294, 13371, 4312, -5812, -9074, 9632, -12939, -14385, 13651, 26449, 454, -10182, 5512, 20855, 4187, 19371, 29033, 7849, -3597, 8227, 35637, 18687, 51588, 56495, 50061, 16804, 24313, 25456, -1069, 24982, 37567, 38221, 28056, 11925, 22981, 4015, -10409, -4519, 8778, 28075, 39690, 24545, 9697, 8285, 45408, -783, -28714, 5963, 10550, 19143, 24808, -18245, -13334, -21077, 7845, -101, -19708, -5894, 4294, 54403, 24071, 13816, 27328, 15633, 36716, 28333, -27717, -10811, 20922]
372B0922J1074N790q614P64J5231K790k1474j9607J2441q508j4907J2711M293
359A2906j6522L5711j498M841l2057j3068K0936N4926j9056n5555j798J4050j4394
346a0578M679J1011J0074P402k342l019J3597j3496L870P24j5976k9550l842J4678
332a2768M496O927j6442K3593j9634O749K5151J9096j6880o837M3132l5329R831
319C1085O421k3355l1962L5608K2922R099r767l7572Q48r859J9746k9323K2887
306F778K1381o677j4709K5126J0169J0887j2148l2316j4377l045M356j1071L3733
293A8087L4223j5237l7224p632M2231J5633l1548m3782J2668L8932j5913k0962
281a0524J4837J340K2338L9596l6756j0047R09P715L216J6310l6834k0054L1370
$$ y = [20922, 31996, 37786, 29172, 29936, 45167, 47957, 26483, 6876, 19317, 10809, -4098, 8613, 12906, -3616, 32095, 30597, 35438, 3381, -9687, 11249, 66175, 47119, -8436, -10234, 3816, -10578, -5899, 5112, 15186, 22588, 20246, 17227, 30824, 17328, 21198, 21922, 5946, -23604, -27446, -12768, -8272, -1345, -17787, 5806, -13828, -7079, 18072, 37168, 20288, 13451, 56583, 21254, 31085, 37506, 14151, -17811, 17797, 40719, 49818, 40051, 2479, 3327, -6532, 13214, -16109, 6778, 28159, 21482, 6773, 31899, 42068, 52955, 40807, 8491, -5886, -8931, -4575, -15646, 18087, 52310, 37073, -151, -7783, 34448, 50081, 18533, -25249, -12581, 26351, 10438, -10524, 4313, 5653, 27991, 67587, 30831, 20784, 21693, 29408, 32624, 48934, 12100, -7954, 23416]
268B3416j8021K2238K0690l633O30l2061j1281K0005m0401j421J2337j1063P350
255a1215J1638K7835j2751j9152K8568J3834R86l1358J3584J9906J1504l6063
243A7316p236R435j2375k971K3335j077J0864J7643l5808J8545j2342l5491J2381
230B219J1181K905L387L3178K5680m8334j4154J2430l3082J5017k0727l4745L5802
217i243j0306Q413J7993k2260L8532l076K741M349K0616l208j1221K755k4856
204A1229j0689k2838K6609J4414N142K5430q618l5994J625J35K1537L96m702Q1
190B3757j9997j4430K4712l7159J3480M5666j3933K1549k2280j977q089j3712
178b413J6496P00J0341K1878J2154j2185o017j6581j0149j9216k4260K0888J0458
$$ y = [23416, 5395, 27633, 48323, 44690, 45320, 13259, 1978, 21983, -18418, -19839, -7502, -18565, -11215, 423, 28258, 15507, -3645, 24923, 38757, 39743, 8385, 21969, 41875, 53379, 17316, 10080, 19515, 7140, 4169, 27504, 26427, 37291, 54934, 19126, 37671, 25329, -10162, 2219, 13400, 16305, 19692, 52870, 78550, 30216, 16062, 28492, -4590, 10427, -10300, -45045, -9243, -19549, -11136, 6857, -15403, 23129, 20053, 22794, 27143, 47759, 44551, 33330, 36085, 11229, 540, -22298, 4311, 18725, 23867, 49297, 40679, 4685, 6310, 6445, 27982, 28378, 23676, 23757, 3760, -10670, 14042, -23117, -9637, 36029, 22096, 43645, 21365, 19388, 11299, -2413, 14083, 14783, 25124, 47002, 59156, 46971, 40954, 24373, 14224, -4992, -29252, -8364, 2094]
165B094q41K2697R67J6133k157j1983k404J6555j4226k8686m059m183L0769Q942
151B9618J666J2046j3584L608K4893r020o761k4630L207p397k1537J0905J9244
138B2258J9066J840l2691J235M820O003P254o538p134k8459K1773P66J3115L7309
124F0617K1605k0904m306l5930l4066l79N1185j4433l902L271q373J5767j7388
111A2764n582J6334J763k554J1116J5890l5443l1431J2266J6224L3403L209j4926
98C3033j0818R304J1145j6888R572j3187j6273M5622j5256k6817P754L923l595
85A7519P257j6950ro446j1306J5390J1617Q51L0430j5737r320l476p379j1011
71A430l570J086O568L1181Q533l2357J620J9722j0938k7057K4026J4745k3266
$$ y = [2094, 1253, 23950, 24917, 41050, 38893, 26910, 24506, 41061, 26835, -1851, -5910, -10093, 20676, 29618, 31284, 43330, 29746, 33354, 58247, 49227, 42466, 17836, 21043, 13646, -7891, 3014, 22258, 41324, 43164, 10473, 11708, 16528, 22531, 29785, 23247, 16113, -12346, 9427, 10193, 23308, 60617, 82222, 61318, 57012, 21082, -12984, -13363, 37822, 23389, 19487, 22758, 14385, 30152, 12764, 7182, 23516, 25279, 22725, 33841, 49731, 14288, -17143, -4877, 11347, 44750, 47959, 33033, 22215, 31519, 42664, 25776, 35348, 22161, 5888, 51510, 36254, 9437, 17191, 21114, 17519, 24776, 7826, 7817, 1371, -9935, 5455, 17072, 17923, 48353, 32616, 23296, 19820, 12441, 1430, -2140, -1054, 5514, 36695, 45228, 12871, 14491, 34213, 23275, -3782, 20244, 34989, 11723]
58A1723O589J8324m106O339Q369K36l023j7069l34K667J805o995l878J511K584
43B4742j2476n642J0204R687M344p799j8689K2592J9361k1370j3468J8678O533
30C6697r738J1169j2361q64J8986r096o899j2719n152R975j3917J8355j3082J4959
16B6313J3622k2452P633M365j5482N422J9151j3997q083R819N052K204j4941J3279
2C1905j0118J2264
0C4051
$$ y = [11723, 18312, 36636, 32530, 38869, 47238, 47474, 44451, 27382, 27048, 29715, 31520, 24525, 20647, 22158, 24742, 12266, 6624, 16828, 26515, 30859, 23060, 4371, 26963, 46324, 24954, 11486, 30164, 36697, 26959, 38128, 25767, 24903, 43889, 34793, 27894, 15175, 10023, 19998, 6081, 24436, 11354, 26313, 39935, 17483, 25116, 29481, 13999, 19421, 38572, 24575, 16492, 26311, 31363, 33567, 18626, 31905, 21787, 34051]
$$ Imaginary data points
##PAGE= N=2
##DATA TABLE= (X++(I..I)), XYDATA
16383a795295L1129R841J6770L5834K9615M9912L1415n459R94J2959M0935J4516
16371a526834L7623J5323J9292L2406J4660L8614L1304j0903K9385L5669P654
16360a275807K6501K3686K2606J9576M059J2260K4120R168L2805L0177R175K0871
16348a040803K8270J9564K9481J9805N160K4348K7142J9097J9419L1086R619M3172
16336g64640K7463j9165K2804M8581P695j3053J1450L4614K7642P666J2030N9856
16324e37057K7830J9306q892J1708M2498J9597K8795k304Q204K3416J6335K6092
16312c24472o965M0029K9699k6251K1663M1011L9218K9997K1735K399P744J1793
16300a12400L0080J1275N124J6722L9723O71K0080n432J7242J5700K1475L5131
$$ y = [-1795295, -1764166, -1754325, -1737555, -1701721, -1672106, -1622194, -1590779, -1596238, -1595244, -1582285, -1541350, -1526834, -1489211, -1473888, -1454596, -1422190, -1407530, -1368916, -1337612, -1348515, -1319130, -1283461, -1275807, -1249306, -1225620, -1203014, -1183438, -1179379, -1167119, -1142999, -1133831, -1101026, -1070849, -1061674, -1040803, -1012533, -992969, -963488, -943683, -938523, -914175, -887033, -867936, -848517, -817431, -807812, -764640, -737177, -756342, -733538, -684957, -677262, -690315, -678865, -644251, -616609, -608943, -596913, -537057, -509227, -489921, -498813, -487105, -444607, -425010, -396215, -398519, -390315, -366899, -350564, -324472, -331437, -291408, -261709, -287960, -266297, -225286, -186068, -156071, -134336, -131937, -124193, -112400, -82320, -71045, -65921, -49199, -9476, -8805, 11275, 5843, 23085, 38785, 60260, 95391]
16288I5391K3456L0608m751J572K6061Q566n671K6904L4531K3543P660K540R961
16275B80371K8733Q256J5265J0823K5558L1480k9103J5472L4990K0209j2736K4839
16263D54157K8878J3128k1434L883l877N0129L5914M839R496N962j350M4101J5782
16250F39608J961N2416j4100j154R051k6235K9752L0006j679J1748N739J5687
16238G52800L1181K8358K0578J7323j3857K1465Q296l2972J0318K0619M297K2658
16226H91064J7623K8267r611J8000P752M56m193J7144J2553K7332K4600O641j2193
16213A025435K1904J1533k0691K7067n277j4713K0903N5813j0415j3981K5574
16202A123152J9051M048j644O816l3688K4432K2491J3208k255K0460r755R735
$$ y = [95391, 118847, 149455, 144704, 146276, 172337, 180903, 175232, 202136, 236667, 260210, 267870, 270410, 280371, 309104, 317360, 332625, 343448, 369006, 400486, 371383, 386855, 421845, 442054, 429318, 454157, 483035, 496163, 474729, 478612, 474735, 524864, 560778, 565617, 575113, 581075, 579725, 623826, 639608, 641569, 693985, 679885, 678731, 687782, 661547, 691299, 721305, 719626, 731374, 737113, 752800, 783981, 812339, 832917, 850240, 836383, 857848, 866144, 833172, 843490, 864109, 868406, 891064, 908687, 936954, 927343, 945343, 953095, 953551, 949358, 966502, 979055, 1006387, 1030987, 1037628, 1025435, 1047339, 1058872, 1038181, 1065248, 1059971, 1045258, 1066161, 1121974, 1111559, 1097578, 1123152, 1142203, 1146251, 1144607, 1151423, 1117735, 1142167, 1164658, 1177866, 1175611, 1196071, 1186316, 1196051]
16190A196051L194K0318n158Q506J7754j8765L0068j9275n009K1744K0483R551
16178A279462L441K569O982j0733M3830J0792n117j9984J0332k3561J7814L0736
16166A346563K1948O31k7545K0248K176K4979m762l682l4285M8828J1503j1520
16154A395082o578K540Q383L1548L6820P548k8311O434L5295l2455J9776J040
16142A477122k3909K2105j3131m960j0720J3689K0869j3614r325M8843P70j4284
16130A493455j225J5105j24m7344N344K7212J5439k8585P967k9419O2818L3070
16118A553713J483k2656j1618L8082j04p591J413L3268k455l8427K317p283q937
16105A531205K6762j4530J3006J4654j0518k346J254j195J0839J6478j5283r798
$$ y = [1196051, 1199245, 1219563, 1214405, 1222911, 1240665, 1221900, 1251968, 1232693, 1227684, 1249428, 1269911, 1279462, 1282903, 1285472, 1292454, 1281721, 1325551, 1336343, 1331226, 1311242, 1321574, 1298013, 1315827, 1346563, 1368511, 1369142, 1341597, 1361845, 1364021, 1389000, 1384238, 1380556, 1346271, 1395099, 1406602, 1395082, 1388504, 1391044, 1399427, 1430975, 1467795, 1475343, 1447032, 1453466, 1488761, 1456306, 1476082, 1477122, 1453213, 1475318, 1462187, 1457227, 1446507, 1460196, 1481065, 1467451, 1458126, 1506969, 1507739, 1493455, 1492230, 1507335, 1507211, 1459867, 1465211, 1492423, 1507862, 1479277, 1487244, 1457825, 1520643, 1553713, 1555196, 1532540, 1520922, 1559004, 1558900, 1551309, 1552722, 1585990, 1583535, 1545108, 1547425, 1540142, 1531205, 1557967, 1543437, 1556443, 1571097, 1560579, 1558233, 1559487, 1558292, 1569131, 1585609, 1570326, 1560528]
16093A560528J2227N855Q063o095k7337J9556J4782n582N932k4684k0045J7372
16081A560572j0786N220K3842k808j5130j4008L0618K9574j9582k1895m445J2588
16069A573760j515j5098K0766J3625K774K5960m529J1566k5750j7702m085J9826
16057A599598k3737j3000K5939K5151p009L81J3219j3060J8608j8923k408J5013
16045A619772j0476J9788r053J3212Q845J8525j1278l7884J8737l540j6679K7559
16033A637528j1249k1941J6945J036j8899k891J4783J3280k8184r334K6229J5125
16021A632428J0837p071J5648k3596j925m6715J6774n064Q71J7241L344k1200
16009A591572J1243K1818j0534j1257K784j195O906r602k0368N588L4422K3848
$$ y = [1560528, 1572755, 1578610, 1586673, 1580578, 1553241, 1572797, 1587579, 1581997, 1587929, 1563245, 1543200, 1560572, 1549786, 1555006, 1578848, 1576040, 1560910, 1546902, 1577520, 1607094, 1587512, 1565617, 1561172, 1573760, 1572245, 1557147, 1577913, 1591538, 1594312, 1620272, 1615743, 1627309, 1601559, 1583857, 1579772, 1599598, 1575861, 1562861, 1588800, 1613951, 1606942, 1607323, 1620542, 1607482, 1626090, 1607167, 1604759, 1619772, 1609296, 1629084, 1620031, 1633243, 1642088, 1660613, 1649335, 1611451, 1630188, 1626648, 1609969, 1637528, 1626279, 1604338, 1621283, 1622319, 1603420, 1600529, 1615312, 1628592, 1600408, 1591074, 1617303, 1632428, 1643265, 1636194, 1651842, 1628246, 1626321, 1579606, 1596380, 1591316, 1592187, 1609428, 1612772, 1591572, 1602815, 1624633, 1614099, 1602842, 1605626, 1604431, 1611337, 1601735, 1581367, 1586955, 1621377, 1645225]
$$ [...]
##END NTUPLES=NMR SPECTRUM
##END=
