##TITLE=1H_CA-9315
 200.13MHz, CDCl3,
 8 sc
 
 27.1.2025
##JCAMPDX= 6.0         $$ Bruker NMR JCAMP-DX V2.0
##DATA TYPE= NMR SPECTRUM
##DATA CLASS= NTUPLES
##ORIGIN= UXNMR, Bruker Analytische Messtechnik GmbH
##OWNER= pz
$$ XWIN-NMR		Version 3.5
$$ Mon Jan 27 16:12:44 2025 Russian Standard Time (UT+4h)  she@DPX200
##.OBSERVE FREQUENCY= 200.1313
##.OBSERVE NUCLEUS= ^1H
##.ACQUISITION MODE= SIMULTANEOUS
##.ACQUISITION SCHEME= undefined
##.AVERAGES= 8
##.DIGITISER RES= 18
##SPECTROMETER/DATA SYSTEM= spect
##.PULSE SEQUENCE= zg30
##.SOLVENT NAME= CDCl3
##.SHIFT REFERENCE= (INTERNAL, CDCl3, 0, 15.5552)
##AUDIT TRAIL= $$ (NUMBER, WHEN, WHO, WHERE, WHAT)
$$ ##TITLE= Audit trail, XWIN-NMR		Version 3.5
$$ ##JCAMPDX= 5.01
$$ ##ORIGIN= Bruker BioSpin GmbH
$$ ##OWNER= she
$$ F:/spectra/data/she/nmr/H-C/1/pdata/1/auditp.txt
$$ ##AUDIT TRAIL=  $$ (NUMBER, WHEN, WHO, WHERE, WHAT)
(   1,<2025-01-27 16:11:32.95 +0400>,<she>,<DPX200>,
      <created by zg, POWCHK disabled, PULCHK disabled
       configuration hash MD5:
       00 E9 B6 7A A2 85 ED C7 34 08 36 98 17 FE 4E 26
       data hash MD5: 16K
       5A 8E E9 7F C3 7C D3 8E C6 27 45 07 DB 9F 99 F6>)
(   2,<2025-01-27 16:11:36.06 +0400>,<she>,<DPX200>,
      <Start of raw data processing
       efp BC_mod = 2 LB = 0.25 FT_mod = 6 PKNL = 1 PHC0 = 248.4549 PHC1 = 10.59223 SI = 16K 
       data hash MD5: 16K
       B7 04 F7 5A 6E 33 9A 90 58 05 8D 0E F3 9D 67 49>)
(   3,<2025-01-27 16:11:59.07 +0400>,<she>,<DPX200>,
      <pk PHC0 = 2.097784 PHC1 = 0 
       data hash MD5: 16K
       09 8A A9 31 3B 96 C6 E5 E9 51 49 28 44 DC 86 98>)
(   4,<2025-01-27 16:12:02.81 +0400>,<she>,<DPX200>,
      <abs ABSG = 5 
       data hash MD5: 16K
       BA ED FC 66 8F 97 1E F3 3F 29 B6 39 4C 78 E8 5C>)
$$ ##END=
$$ 
$$ hash MD5
$$ 00 3D 59 E0 30 88 69 E5 70 81 3F 49 A5 2D 7C CB
##$RELAX= 
##$RELAX= 
##$RELAX= 
##$RELAX= 
##$RELAX= 
##$RELAX= 
$$ Bruker specific parameters
$$ --------------------------
##$DU= <F:/spectra>
##$EXPNO= 1
##$NAME= <H-C>
##$PROCNO= 1
##$TYPE= <nmr>
##$USER= <she>
##$AMP= (0..31)
100 100 100 100 100 100 100 100 100 100 100 100 100 100 100 100 100 100 
100 100 100 100 100 100 100 100 100 100 100 100 100 100 
##$AQSEQ= 0
##$AQ_mod= 1
##$AUNM= <au_zg>
##$AUTOPOS= <>
##$BF1= 200.13
##$BF2= 200.13
##$BF3= 200.13
##$BF4= 200.13
##$BF5= 200.13
##$BF6= 200.13
##$BF7= 200.13
##$BF8= 200.13
##$BYTORDA= 1
##$CFDGTYP= 0
##$CFRGTYP= 5
##$CHEMSTR= <none>
##$CNST= (0..31)
1 1 145 1 1 1 1 1 1 1 1 1 1 1 1 1 1 1 1 1 1 1 1 1 1 1 1 1 1 1 1 1 
##$CPDPRG= <>
##$CPDPRG1= <>
##$CPDPRG2= <>
##$CPDPRG3= <>
##$CPDPRG4= <mlev>
##$CPDPRG5= <mlev>
##$CPDPRG6= <mlev>
##$CPDPRG7= <mlev>
##$CPDPRG8= <mlev>
##$CPDPRGB= <>
##$CPDPRGT= <>
##$D= (0..31)
0 0.7 0 0 0 0 0 0 0 0 0 0.03 0 0 0 0 0 0 0 0 0 0 0 0 0 0 0 0 0 0 0 0 
##$DATE= 1737979892
##$DBL= (0..7)
120 120 120 120 120 120 120 120 
##$DBP= (0..7)
150 150 150 150 150 150 150 150 
##$DBP07= 0
##$DBPNAM0= <>
##$DBPNAM1= <>
##$DBPNAM2= <>
##$DBPNAM3= <>
##$DBPNAM4= <>
##$DBPNAM5= <>
$$ [...]
##$SUBNAM3= <"">
##$SUBNAM4= <"">
##$SUBNAM5= <"">
##$SUBNAM6= <"">
##$SUBNAM7= <"">
##$SUBNAM8= <"">
##$SUBNAM9= <"">
##$SW= 18.0517328524113
##$SWIBOX= (0..15)
0 0 2 0 0 0 0 0 0 0 0 0 0 0 0 0 
##$SW_h= 3612.71676300578
##$TD= 16384
##$TD0= 1
##$TE= 0
##$TE2= 300
##$TE3= 300
##$TEG= 300
##$TL= (0..7)
0 120 120 120 120 120 120 120 
##$TP= (0..7)
150 150 150 150 150 150 150 150 
##$TP07= 0
##$TPNAME0= <>
##$TPNAME1= <>
##$TPNAME2= <>
##$TPNAME3= <>
##$TPNAME4= <>
##$TPNAME5= <>
##$TPNAME6= <>
##$TPNAME7= <>
##$TPOAL= (0..7)
0.5 0.5 0.5 0.5 0.5 0.5 0.5 0.5 
##$TPOFFS= (0..7)
0 0 0 0 0 0 0 0 
##$TUNHIN= 0
##$TUNHOUT= 0
##$TUNXOUT= 0
##$USERA1= <user>
##$USERA2= <user>
##$USERA3= <user>
##$USERA4= <user>
##$USERA5= <user>
##$V9= 5
##$VALIST= <valist>
##$VCLIST= <CCCCCCCCCCCCCCC>
##$VD= 0
##$VDLIST= <DDDDDDDDDDDDDDD>
##$VPLIST= <PPPPPPPPPPPPPPP>
##$VTLIST= <TTTTTTTTTTTTTTT>
##$WBST= 1024
##$WBSW= 4
##$XGAIN= (0..3)
0 0 0 0 
##$XL= 0
##$YL= 0
##$YMAX_a= 468201
##$YMIN_a= -970318
##$ZGOPTNS= <>
##$ZL1= 120
##$ZL2= 120
##$ZL3= 120
##$ZL4= 120
##$ABSF1= 15.48576
##$ABSF2= -2.56609
##$ABSG= 5
##$ABSL= 3
##$ALPHA= 0
##$AQORDER= 0
##$ASSFAC= 0
##$ASSFACI= 0
##$ASSFACX= 0
##$ASSWID= 0
##$AUNMP= <proc_1d>
##$AZFE= 0.1
##$AZFW= 0.1
##$BCFW= 0
##$BC_mod= 2
##$BYTORDP= 0
##$COROFFS= 0
##$CY= -3
##$DATMOD= 1
##$DC= 0
##$DFILT= <>
##$DTYPP= 0
##$F1P= 0
##$F2P= 0
##$FCOR= 1
##$FTSIZE= 16384
##$FT_mod= 6
##$GAMMA= 0
##$GB= 0
##$INTBC= 1
##$INTSCL= 3.241238e-09
##$ISEN= 128
##$LB= 0.25
##$LEV0= 0
##$LPBIN= 0
##$MAXI= 10000
##$MC2= 0
##$MEAN= 0
##$ME_mod= 0
##$MI= 1.114404
##$NCOEF= 0
##$NC_proc= -6
##$NLEV= 6
##$NOISF1= 3.799351
##$NOISF2= 2.8
##$NSP= 0
##$NTH_PI= 0
##$NZP= 0
##$OFFSET= 15.55518
##$PC= 1
##$PHC0= 250.5527
##$PHC1= 10.59223
##$PH_mod= 1
##$PKNL= yes
##$PPARMOD= 0
##$PSCAL= 0
##$PSIGN= 0
##$REVERSE= no
##$SF= 200.129993300329
##$SI= 16384
##$SIGF1= 3
##$SIGF2= 2
##$SINO= 0.751879
##$SIOLD= 32768
##$SREGLST= <19F.Aceton>
##$SSB= 0
##$STSI= 16384
##$STSR= 0
##$SW_p= 3612.71676300578
##$SYMM= 0
##$S_DEV= 0
##$TDeff= 16384
##$TDoff= 0
##$TI= <>
##$TILT= no
##$TM1= 0
##$TM2= 0
##$TOPLEV= 0
##$USERP1= <user>
##$USERP2= <user>
##$USERP3= <user>
##$USERP4= <user>
##$USERP5= <user>
##$WDW= 1
##$XDIM= 16384
##$YMAX_p= 519215142
##$YMIN_p= -437415
$$ End of Bruker specific parameters
$$ ---------------------------------
##NTUPLES= NMR SPECTRUM
##VAR_NAME=  FREQUENCY,     SPECTRUM/REAL,   SPECTRUM/IMAG
##SYMBOL=    X,             R,               I
##VAR_TYPE=  INDEPENDENT,   DEPENDENT,       DEPENDENT
##VAR_FORM=  AFFN,          ASDF,            ASDF
##VAR_DIM=   16384,         16384,           16384
##UNITS=     HZ,            ARBITRARY UNITS, ARBITRARY UNITS
##FACTOR=    0.220516191357247, 1,           1
##FIRST=     3113.05798832234, 0,            0
##LAST=      -499.658774683439, 0,           0
##MIN=       -499.658774683439, -437415,     0
##MAX=       3113.05798832234, 519215142,    0
$$ Real data points
##PAGE= N=1
##DATA TABLE= (X++(R..R)), XYDATA
$$ [...]
15679 47514 87508 161366 101593 -8722 37078 25192 10936 96209 145507 10681 -25864
15668 -25864 -10229 -702 40729 -33581 -60114 -77974 -68233 -49387 -67532 -14295 -52297 15195
15656 15195 -19470 -112866 -123988 -142955 -40907 10761 56248 111291 73429 48877 55224 5782
15644 5782 10618 -13894 -4076 -113105 -55919 25856 94665 -58905 -81432 -116882 -40876 102343
15632 102343 27677 -52220 -12218 -112591 -142464 -124159 -79189 -35379 -8875 39906 -97892
15621 -97892 -142778 -111716 37211 59324 -3134 12633 4646 -25754 -43698 -7294 20176 18883
15609 18883 -71167 -66453 -38955 36806 43504 91908 -95423 -159606 -80729 4433 -16073 -16571
15597 -16571 38464 -80945 -137645 -6991 50192 -5766 -84163 -39108 -9337 6534 10107
15586 10107 -21236 -51875 -23661 -48273 14229 -73065 -23569 53765 -40534 54680 36108 -26148
15574 -26148 -26410 -47997 8015 55524 76684 54736 49181 74204 -32391 -82029 -88534 86782
15562 86782 80959 42285 -52865 -9135 61881 29498 -23134 57994 112460 43723 51915 38484
15550 38484 -40223 35201 7378 57076 120258 151937 73600 76925 96699 25661 -30216 39055
15538 39055 51966 12820 7306 45249 -61361 -89569 -101540 37639 41522 -55886 -100072 -110797
15526 -110797 -110106 -113281 -101457 1027 5148 -21866 -7990 -46551 -80643 -113640 -102870 -176378
15514 -176378 -223583 -141816 -15460 66419 87259 75786 67032 -87492 -38554 27947 7497
15503 7497 -26087 -18152 -116951 -101831 -37265 -44620 10476 50856 10029 -29006 -43797 -31142
15491 -31142 -81540 -36557 15402 10808 -30832 1018 -4156 -51457 -17297 -74167 57404 27743
15479 27743 -39840 -1625 3922 55440 4301 1584 20364 50861 -35266 -152626 -17168 -37685
15467 -37685 -135317 -82519 -38752 -12619 5436 3698 -78266 20937 -27881 -114699 -67989 4987
15455 4987 10714 -3353 76883 118867 11822 46234 19222 -5276 4063 -71669 -90862 -11687
15443 -11687 -28715 -25152 -47024 116803 158813 17933 61195 31247 86722 171976 53633
15432 53633 29884 170579 55854 -5644 -11612 -53205 29253 56246 102123 41647 -42897
15421 -42897 -30739 -12441 -41164 3580 34418 39153 -47302 -71205 -66723 -3852 23377 58807
15409 58807 80107 -10048 78062 394 21169 -974 30786 142768 171267 99799 189818
15398 189818 100386 86115 -19217 -11793 42056 -67233 -142920 -69457 69031 8684 -55431
15387 -55431 -28922 -59988 -40230 50893 45833 -2780 -47003 -46522 -23724 10326 -38234 1139
15375 1139 32656 97271 61604 -38908 -56059 64883 -7001 -72267 -14604 118430 205495
15364 205495 135768 9526 -1398 -20858 -27555 109783 19430 -9141 -39364 -66004 -138022
15353 -138022 -223179 -180565 -98185 12115 -106560 -53022 49691 -9073 25349 -50611 -38397
15342 -38397 -10391 16914 16254 -67973 -94881 -156073 -90606 -14178 -63945 11681 16295 -92614
15330 -92614 -138928 -75280 -10099 423 -13912 -32852 -53630 -81324 17555 71678 78313 100802
15318 100802 90490 94773 124282 7604 -33653 -2316 -78445 -46618 8882 -36324 -144254
15307 -144254 -53970 -106334 -77624 -10272 -33143 -7227 -94 43228 40749 89572 82731 -57639
15295 -57639 -63400 11822 24517 34516 75676 97425 70427 113473 104934 139972 50431 42838
15283 42838 -94833 -181544 -131199 -1511 48737 6481 116561 21705 -21004 113757 99513
15272 99513 93738 27166 -28369 4238 -64741 75662 137839 1774 42377 80329 94320
15261 94320 111925 121795 110509 51766 -8065 39651 70151 31722 45894 100629 128988 52083
15249 52083 24271 85386 158836 111982 56293 75066 -28101 -41788 75150 85592 25793
15238 25793 23916 -15390 -40332 -82467 -179083 -188977 -145223 -78045 -78447 -36742 -18154 -106175
15226 -106175 -61024 -32410 -27452 10254 -47836 -47547 -1926 18663 41215 14372 14263 26723
15214 26723 -35900 -21566 -16387 45871 73877 -12595 -63541 -82088 -38989 -22706 -59236 -50376
15202 -50376 -165756 -46649 -35141 -50295 81509 60966 15567 -150968 -152554 -135850 3847
15191 3847 46864 -51029 -27677 39277 -3858 -49657 27651 100006 83572 -27650 -23373 -44162
15179 -44162 -91319 -53712 -49693 31571 32705 24108 61327 83404 111060 36668 25314 4808
15167 4808 38435 -77633 -3037 82868 72972 1163 25492 -48506 -95467 -24779 14544 39395
15155 39395 80867 93638 125081 4401 -16155 47630 7885 18198 -20133 -6601 73886
15144 73886 200333 80328 -27373 36566 99667 -2799 26494 176859 50103 64113
15134 64113 58138 -28508 48891 97581 38229 -1286 26411 40455 48175 8156 -37481 -12249
15122 -12249 -22087 -128020 -19257 30049 -21725 35078 -19177 -52922 35449 49164 61996
15111 61996 18483 -76036 -45731 64035 5080 -81572 -57674 -36702 64324 125784 74291
15100 74291 152294 24474 -8206 100944 68446 14128 80543 54646 14116 -23204 34307
15089 34307 42337 20465 -41213 -53523 -95108 -15992 40041 -7101 -41616 -30939 -78455 9504
15077 9504 17363 65919 47319 28717 80912 101583 53990 -3420 14670 31590 -18756 -103334
15065 -103334 -2057 45157 61886 88902 118799 147543 141563 114182 113108 140170 99095 -65954
15053 -65954 -32454 61563 43048 -51410 6890 107945 62577 -3844 70887 29808 -21297
15042 -21297 51722 55688 47879 64573 28104 -2927 -119217 -99469 -16313 -67167 -68320 -27538
15030 -27538 -87877 18135 55353 -11459 -2010 109623 19186 -17067 25627 24496 25969 53795
15018 53795 -9477 -6712 67412 111404 20862 -20174 71482 50280 89601 127013 45322 -46872
15006 -46872 -48073 24650 6348 21787 5483 72582 18887 36963 75245 5131 -1703 -103777
14994 -103777 -67967 -113886 -88768 -13729 -98503 -29825 -25844 -108169 15028 151917 64447
14983 64447 92237 147216 40527 55909 118898 66780 13209 -60223 -6244 71451 29148
14972 29148 17853 -12823 20914 -17096 78376 -5570 -25400 -57010 -103251 -119640 -52552 81006
14960 81006 137000 85203 18508 -32171 10407 -15838 -3923 -934 -85475 -14605 3908 -86577
14948 -86577 -149015 56151 7822 10726 81644 92952 148650 130029 26047 -25665 5921
14937 5921 37453 109869 58332 85563 132179 9960 -11727 12029 58261 54515 81381 39034
14925 39034 141024 87927 -41946 58355 35674 -11795 904 -18624 8023 -14993 71891
14914 71891 146758 94723 75200 59299 14096 -55241 -73680 -65364 -42508 -125057 -62376 90879
14902 90879 54660 -6453 12669 7445 -52572 16179 96315 74593 18521 58570 189224 250595
14890 250595 162351 37686 82976 -13077 131969 45332 69369 121932 71001 -38164 -28855
14879 -28855 87495 -9730 -112027 -105038 18725 166376 148234 167764 65298 107856 17526
14868 17526 18687 5100 12848 56117 24505 -34833 -32217 22345 68810 64775 64829 63784 86322
14855 86322 16789 -50542 120685 140477 16839 39760 127651 43230 24326 -63191 -129427
14844 -129427 -179403 -89441 -54594 -74923 -49991 -20870 -83858 24177 92005 90626 23605
14833 23605 25451 -62806 -60651 -117621 -60363 24168 62301 71655 19415 -50078 -116671 -17130
14821 -17130 -12054 21434 27840 -45328 -16810 25761 37940 34888 87251 31850 15903 -75518
14809 -75518 -40060 31199 13149 7632 -47790 -52037 -3613 95909 49124 -28828 -10037 -33035
14797 -33035 5135 -81001 -77564 20917 23944 19845 49176 82115 -70664 -81761 71528 25034
14785 25034 -4254 -19418 6561 23640 32027 -24290 42177 87994 98810 117847 80362 120738
14773 120738 104557 73079 28052 5566 26745 47430 27002 10027 -14706 40598 71020
14762 71020 48955 -26473 68167 31066 -52205 -31219 -123865 -78001 -16554 -72365 -34363 -42567
14750 -42567 -100842 -32343 57636 104842 96486 34386 -30849 10580 37163 31272 86592 121557
14738 121557 131796 -1932 57179 161972 134159 46523 68615 47079 -916 -35454 -36991
14727 -36991 47279 9534 90985 187262 133962 51022 186994 226392 186417 113394 51571
14716 51571 33530 22431 36018 36828 42806 29315 -64676 -51212 -39447 -139122 17548 70166
14704 70166 41621 19651 166825 150375 69013 -20969 -8603 17762 -6313 -18181 20926
14693 20926 -16507 51876 -28120 -25552 140931 28360 -15675 27074 -21751 6439 87782
14682 87782 -53907 -46190 -20281 -29045 30897 171573 116208 54919 116694 4005 -20301
14671 -20301 2479 924 86194 96042 120124 92874 147753 85487 -10639 -53423 -85909 -96552
14659 -96552 -55275 104338 24157 24829 -44995 -75776 25984 61357 -11437 -11320 77083 93727
14647 93727 76748 -33818 -40938 -51782 44958 34097 71504 65123 74372 53135 103746 84616
14635 84616 -17665 -60660 -58687 -67080 -128602 -36198 -53736 29874 15296 29335 -566 27330
14623 27330 145239 119310 124716 126196 47776 24975 -73079 7497 73263 37708 -15742 42644
14611 42644 99619 2400 11757 15995 10683 -5782 -9050 -21338 -87839 -12379 -43559 21335
14599 21335 -12648 -39443 -9291 25150 46392 26269 71895 101649 114267 94190 113757 -19875
14587 -19875 31491 16751 28272 -103007 -56066 -55374 -109302 -99018 -87104 -142205 -107250 -68474
14575 -68474 -17237 101251 69635 35170 91453 138289 186872 68311 63353 -11600 -39959
14564 -39959 21568 86890 88806 26669 -27272 16563 63254 21053 -33332 -162614 -149338 -64572
14552 -64572 16174 6550 20350 14240 10373 21453 8413 29570 90390 53893 73877 5959
14540 5959 109200 -30032 -2330 87157 27613 -57643 -195066 907 67171 -1383 68342
14529 68342 14539 -56046 -46610 63278 81610 -31146 5936 100915 124873 120015 40838 66357
14517 66357 100275 50009 19992 57844 52033 89116 20885 32969 83584 24119 20674 -15523
14505 -15523 58133 59742 45750 -2976 -80663 7095 -59037 -72303 -45126 -122683 -95636 -5879
14493 -5879 -35733 -107670 17940 -70245 58275 165223 202875 145529 76374 50546 -74106
14482 -74106 -105253 -57109 -51571 -21472 -6879 -47795 -103805 -24603 -65874 -82999 11975 62297
14470 62297 62160 35329 7188 -45051 85721 63794 11706 -31369 -105023 -22017 -49004 10829
14458 10829 42523 82100 97020 19835 -14306 -75443 34486 16260 -63378 -77905 -87897 50684
14446 50684 7105 -131742 -174910 -149239 -26147 19183 -70583 -50726 37008 7314 -62317
14435 -62317 -8203 70005 14150 98613 35769 22135 -10903 20195 -55837 -103758 -12349 35133
14423 35133 -10009 -30907 2067 -880 -6067 -26283 -63616 -12067 -41496 -46347 16541 370
14411 370 -17920 20892 14302 114459 10286 -50378 -17246 46794 6049 -133780 -35345 138407
14399 138407 111977 31509 85247 86429 3365 34831 116602 32547 14951 19521 63516 16503
14387 16503 47399 64839 14115 -2018 22650 37111 -803 -34144 6179 -26365 -58865 -39705
14375 -39705 -42785 26638 328 4383 14403 -19878 -17301 -31710 -547 17229 18356 -141690
14363 -141690 -158769 60412 91844 68953 46161 1432 -7806 -92813 -110771 -38113 43958
14352 43958 -72897 12420 27024 -3779 57924 41484 -125411 -145420 -73433 -23417 24776
14341 24776 56720 129570 170797 16057 -11796 62572 18640 46412 -6426 -7231 13915 23086
14329 23086 7786 -56293 -55512 -14461 40461 -716 47284 152314 20862 93612 83419 44310
14317 44310 51813 -56324 47609 90573 34037 30932 72070 -18161 60724 135644 96045 84376
14305 84376 149645 209669 92852 37855 57202 78515 -5865 -18582 188951 237145 133543
14294 133543 146383 61917 135534 134877 78195 50580 -2056 -29537 16937 37560 -9592 -11259
14282 -11259 52451 129297 48514 -69148 -90526 21648 184165 59148 66989 140580 35766
14271 35766 133144 101986 72224 116499 28388 27935 83708 59792 53452 74236 3305 -68124
14259 -68124 -28206 38601 112592 87673 19797 41543 5851 -62013 32612 -95927 -87084 17555
14247 17555 34248 98648 56388 117471 77178 -28129 -2159 -52208 -25291 -12989 -37514
14236 -37514 -16086 -53093 -2926 21617 4860 15385 -38448 -23176 -9954 -55129 -37383 -30377
14224 -30377 29380 65322 -39998 91625 70643 -27198 16816 -8545 -22099 -85799 -112923
14213 -112923 -1576 -14292 -87571 -19725 -15120 43509 118797 182117 155980 171941 107714
14202 107714 84820 36505 65227 59300 72075 61097 93267 81256 134224 179386 37798
14191 37798 -68257 -70035 -103324 -86835 -79195 -26518 70126 125278 138469 15400 -22582 86486
14179 86486 124447 -4616 78104 97464 -2126 -41314 -43450 -61044 -89222 -73192 -19501 19965
14167 19965 74936 161066 16517 -28615 63333 105361 98066 34871 -38389 -19465 -148344
14156 -148344 -94432 -6494 -19026 48867 31527 76056 137015 95415 77200 21203 -11782
14145 -11782 40506 -38926 -26061 60348 24869 -37849 -46368 -5086 -11545 -130883 -98762 22371
14133 22371 81041 -3267 -14345 -45002 -62485 -43161 -54564 -51780 -57028 -43108 32774 88318
14121 88318 25283 -35618 -578 -26518 42272 10770 -60881 -73337 -63147 -40186 -39836 -5088
14109 -5088 -24474 -69729 -61802 56971 143757 -7299 -123341 -68011 -11268 -53998 -51766 68233
14097 68233 138716 83454 69124 65875 49463 85432 5622 39535 122393 -19334 -39585 38508
14085 38508 16034 31592 98398 13853 13398 71062 6589 -120647 -181066 -159405 -48770 -2816
14073 -2816 -42104 -28855 59324 47306 -114499 -139654 -54099 46365 9279 -55366 13835
14062 13835 -56043 8678 23014 9494 -27143 18227 5719 -107738 -57889 54742 -10575
14051 -10575 -81249 -69518 -38805 -30302 -20470 9844 103354 -32067 -33105 -10271 -18865 9977
14039 9977 -75613 -25713 37600 29588 24359 91644 56537 74646 68935 69779 73155 49061 7033
14026 7033 -20834 -104173 12887 92738 91429 59834 -8079 -5368 86866 53975 9817 33873
14014 33873 -44002 30310 148002 129134 154072 150682 220082 135564 123941 -22665 -71874
14003 -71874 -62902 -33148 4333 71874 22598 17796 -69301 57566 -14615 -124440 -89362 -24209
13991 -24209 24533 42351 17576 -30615 50164 103918 83424 53397 67641 75519 3414 -28050
13979 -28050 -42482 -120012 -68546 -114413 -137979 -143448 -109260 -131473 -79937 -90780 -44731 -37442
13967 -37442 -82965 -36981 46325 98817 156557 186751 154778 11869 49848 45915 -4713 -10547
13955 -10547 -11643 80825 41413 -37558 40331 12093 -8428 54161 -29832 -88825 -50017 17001
13943 17001 84420 -3350 -51370 -94126 20413 31049 8296 14659 -37948 -23055 3129 65840
13931 65840 47817 13553 12050 27598 -65555 -96739 -46787 -7456 59486 32033 -93855 -72946
13919 -72946 -3786 -10373 12065 -58602 -20289 32192 -19017 31028 -4342 -11589 -50879 -75157
13907 -75157 -44127 -67519 -106373 -106331 -94714 -76007 -545 -2833 -55325 -70078 -25212 68305
13895 68305 61674 -48497 -78010 -84471 -81447 -51555 -71484 -66447 25357 19629 -7066 -36356
13883 -36356 -7707 -35098 27349 31800 -5962 -137221 -117165 13612 -20156 -34933 -8613
13872 -8613 69864 -18842 6685 24906 53877 73415 -35148 -28392 10683 22169 -60437 -90664
13860 -90664 -22491 55118 119824 23820 52181 8641 64536 63048 62427 56201 19598 30771
13848 30771 12471 13027 -61627 -100873 -59357 65798 72480 5737 44673 -2334 -38512 104930
13836 104930 38916 78538 56659 7990 9787 -17594 -28025 31178 -47247 -95691 -20688 57615
13824 57615 26434 69237 8232 -55811 -41797 31036 42179 29124 21207 -60732 -19892 42269
13812 42269 130187 85456 -23827 54724 105529 33325 82353 153491 58107 16368 42733
13801 42733 14436 35159 -24968 -18479 145535 129052 42053 42089 -24177 -5799 25187 -4393
13789 -4393 -67583 -117517 -72807 -74223 -131899 -73751 -56195 119457 123717 24247 19116 -78261
13777 -78261 -49030 -6397 -11654 26321 46443 -17961 -68003 -38031 40817 122055 -46672 -103269
13765 -103269 -91662 -27851 -12026 26327 46005 33160 -40272 6160 -66473 -36587 90036
13754 90036 91046 56806 16597 48278 63237 57925 108788 66275 79680 56045 71834 57849
13742 57849 2863 -81891 -49798 51014 149772 102021 37557 -13386 -60213 82847 88538
13731 88538 89604 38372 26517 -46514 -14625 123777 187524 42712 14204 -5910 -31106
13720 -31106 11543 24397 70502 7961 18444 10698 -41856 -67574 -33602 -88578 -108950 -16107
13708 -16107 -25584 -79328 -31245 -76345 -22316 19802 -25126 -118221 -83824 -26677 -40204 6874
13696 6874 -54888 -82016 -160850 -796 37613 84895 15101 -56595 -6130 -56940 -45668 -42190
13684 -42190 -54443 53321 8735 7475 -38886 -45240 -51026 -14091 47819 53642 -80191 -72451
13672 -72451 56818 16485 -7753 115388 63646 18809 138105 92619 9665 41427 94334
13661 94334 76317 -73004 -66152 -8544 -42057 -20352 110211 63443 71473 105822 3021
13650 3021 44391 14803 -32815 -36116 10864 -1110 51818 -33444 -38239 -64827 -66256 -685
13638 -685 25176 28759 56484 157661 127459 89528 970 49469 19571 -21926 -1734 -21955
13626 -21955 -28000 -8780 -3959 -29274 21420 132813 73124 79687 179017 191633 130981 39993
13614 39993 53123 75294 -8965 12668 -67821 -54399 -144795 -129997 -79205 -20877 -15469 18994
13602 18994 -14816 -37124 95725 7890 77392 -47754 -115229 -42824 -25332 -22394 17051
13591 17051 -128829 -63961 -185313 -7569 32655 -22804 -18389 46958 72479 -70284 -12199
13580 -12199 -8972 -11101 49988 45937 90697 23958 -8790 -12526 14352 72511 48605 53037 -50424
13567 -50424 14488 -13195 44634 72820 93452 39919 62667 5522 -14625 60400 4828 -30689
13555 -30689 -89603 -77495 1674 6229 -161134 -26703 42143 14223 -29991 -68737 -33395
13544 -33395 49029 82019 42813 49756 101972 117045 24015 -80145 -23561 -94314 -80172 -4755
13532 -4755 -35226 -13389 1980 24084 93243 31017 34206 116268 155670 90744 117091 190797
13520 190797 128350 123998 76899 26425 10634 -21543 -889 -10938 -66436 -68135 -24396 98162
13508 98162 53995 -14855 35378 -55852 -105878 -59547 -22011 -71150 -110221 -25391 52844 31255
13496 31255 -48836 -1947 33425 1374 27000 58257 23987 -16282 -97211 -174554 -67992
13485 -67992 76842 -37937 -88624 -136760 -31794 -13448 -19690 29042 44155 18266 62750
13474 62750 20227 -76914 25553 5113 -84002 39985 -24016 -15654 102549 96822 60402
13463 60402 77651 43953 3837 58607 37201 123822 87167 40042 -19197 -76242 -108207 -150649
13451 -150649 -79510 -102769 -23796 76114 98245 147091 94164 70219 118348 -630 61225
13440 61225 68906 25004 47118 105481 46007 -2139 -14345 36994 25308 -44332 -86121 -66600
13428 -66600 -23373 -20256 -24186 -81970 -31862 -61638 -13279 -95675 -51787 4934 -49413 10532
13416 10532 34534 -49893 -22292 33301 -46397 15182 73143 85318 84369 50055 -9749 -42619
13404 -42619 8828 -67313 -97712 -66511 -6916 41353 -25991 -8751 -15394 -7043 38623 -23837
13392 -23837 -43815 -15177 -44704 10110 82849 123605 33638 -35141 -86873 -64864 19776 57588
13380 57588 -59127 -43333 38047 15183 24757 37153 30558 15429 14762 41929 67534 17293
13368 17293 59078 71062 102957 153168 182601 12292 4015 -88613 25027 29785 -12320 -25331
13356 -25331 20278 16212 38624 -2397 -36975 98473 24300 -56868 50567 47896 10206 92164
13344 92164 60623 34905 -28965 8259 10997 -22061 -21684 41417 96134 57272 -3038 -41525
13332 -41525 -68383 -13510 -34019 -92498 -34066 37562 79868 70065 68204 -96342 -146232 -116310
13320 -116310 -27710 41307 56648 46146 51339 -599 -35204 19013 -12132 -58442 -22007 3181
13308 3181 16510 -9218 -16299 -34751 28022 65489 36221 21925 -133527 -17814 52517 11891
13296 11891 13942 -71629 -63728 -138031 -153039 -90337 -33228 98724 77603 8156 -616 5871
13284 5871 48621 102393 -40459 -167237 -110426 -44268 -57902 28201 9881 63735 91527
13273 91527 70066 57904 60525 -4972 -61947 -140338 -33228 -96161 -39103 -7201 -81544 -75422
13261 -75422 -79090 -74537 -129679 -186609 -72281 31344 -9639 -39463 -101431 -67405 10203 75500
13249 75500 55668 -67570 -39431 -8423 -19548 -24032 -12465 118354 178983 122181 116744 90152
13237 90152 63574 -21363 122724 164419 141051 105527 26134 21721 -66036 -26570 -28549 28455
13225 28455 67154 -5190 -31597 73804 -16762 4645 -14059 22055 44709 90982 95016 54171
13213 54171 -9772 -23358 40927 81515 79258 141680 116676 98398 68129 -72854 -136262 -26239
13201 -26239 74656 131550 93672 41521 124980 139594 37388 -22529 -72808 8557 -47817
13190 -47817 -53445 54110 33149 80497 122918 48886 -23700 -25792 -27261 55158 143182 46310
13178 46310 -70278 -79666 -148270 -168456 -44471 36706 -85612 -23205 -47252 -116625 -157647
13167 -157647 -66099 -84946 -75208 -70884 -94457 -58695 -19504 -30635 31611 105292 48357 -38433
13155 -38433 -25630 -59082 9429 65960 9107 -81569 -39050 57913 -21205 -3634 -32588 -29900
13143 -29900 -44605 26517 -16336 -36196 -13500 81807 81507 19420 -59733 73963 122934 4753
13131 4753 -49099 -99644 -21473 49267 20434 58971 55729 1255 -9635 71261 45671 33608
13119 33608 77881 98122 136588 23146 -92552 -63268 -59136 -50855 -28207 -15237 -22499 18115
13107 18115 45219 100661 101640 85241 79810 3530 41449 16123 26834 106308 82549 -5730
13095 -5730 74463 -12793 -40171 41622 53551 42538 93814 59495 -48962 -122963 -70394 48309
13083 48309 56551 -20010 -55873 -60918 -113209 -3923 1092 3909 118689 82006 92148 -24047
13071 -24047 -64830 -16753 23989 -16119 8423 16902 24671 19699 1610 -60436 -55527 -85770
13059 -85770 -55855 -36919 46040 81448 82549 116581 16247 48335 131848 134459 10183 -75802
13047 -75802 -1993 37889 5291 22184 43799 30124 -57579 -129458 5311 65258 -36195
13036 -36195 39376 22380 -68064 -63493 -50296 -49143 832 31743 71237 -7817 23865 828
13024 828 -1182 -19222 -20482 -90014 -142906 -56766 -22699 31848 90583 123416 127011 39539 64907
13011 64907 23178 -100260 -149991 -122249 -64416 -129115 -42556 -44462 -30282 54658 -156106
13000 -156106 -107216 -112474 -75830 -46180 -33278 -40050 9296 -9516 -47259 21341 88901 118888
12988 118888 127600 159855 57606 40414 30874 -33512 3081 16641 9860 19897 5218 109177
12976 109177 134396 76041 -27216 -77808 -80179 -89793 -105391 -138870 -102903 -34827 -9210 18813
12964 18813 -54880 -9107 -30765 -22463 11696 -47475 -87799 -43015 13591 81849 6650 -6223
12952 -6223 -107097 -134654 -47545 4633 31314 85572 41256 -36317 -50581 -19408 26066 2768
12940 2768 -8222 -21482 12576 -55164 -96343 -73781 -92356 -183367 -144859 -17993 -3155 -130723
12928 -130723 -127849 -6767 143065 49904 -93487 9804 57598 83807 138355 61332 71420
12917 71420 65607 24969 17479 19036 7953 -27081 33970 60063 42839 -12072 -42357 -20955
12905 -20955 36940 15527 73818 -6723 -69053 -28251 -37380 34555 40627 95351 30512 45299
12893 45299 68462 42368 -12464 -89409 44486 21018 53653 60790 -42980 -7679 -77928
12882 -77928 -46769 -29865 -122548 -56047 -6628 -83473 -57496 -33411 -48986 -1795 11685 84807
12870 84807 -30426 -76325 -140186 -113449 -66172 -100732 -134917 -46885 -69027 -147971 -62369
12859 -62369 6279 33042 96344 52977 28233 -56539 -125587 -71148 -89570 -75252 -100547 -68901
12847 -68901 -35476 15898 2484 20649 46240 23626 75615 72556 87669 67255 40869 36816
12835 36816 32521 -17260 -64612 -64901 -84748 -81623 -164229 -1526 44486 26348 17949 -75533
12823 -75533 -30892 46576 61860 42629 -28894 -1805 0 24216 75923 7388 -88819 -19235
12811 -19235 -39067 -29753 -40808 14474 -1174 -44229 -126450 -41789 -16462 -1362 -37659 -13338
12799 -13338 26859 -41288 -84947 13023 129309 102081 22118 9495 130809 -2232 17236
12788 17236 -53198 149860 77476 -60944 8808 -32548 -19463 3774 -93221 -160678 -95168
12777 -95168 -162553 -104848 -153801 -165278 -97052 -70678 -19303 25868 -67007 -94005 -135958 -81760
12765 -81760 -57960 -47039 -2802 38151 -15022 -26954 -45905 -150220 -79408 -55322 -90210
12754 -90210 -70261 -81539 -94412 -85131 -62702 -111253 -205464 -158047 -62976 59075 85287 -19737
12742 -19737 -78046 -39617 -131988 -76291 -65880 -71013 -26944 73995 25721 -65749 -79798 -76649
12730 -76649 -70370 -20516 4386 61276 91390 73167 71952 -18400 1442 19205 -191 -23341
12718 -23341 -40429 36415 39945 -63096 -151925 -159851 -125525 -88963 -75580 -22080 -58357 -35938
12706 -35938 -217963 -163309 -27104 -8026 -42550 7150 -69506 -92092 -71923 -63630 -8281
12695 -8281 -80800 -84928 -89153 -15608 -32900 -137584 -182622 -89692 -70356 -122118 -57874 -83474
12683 -83474 -28197 -114347 -89613 -75580 -7332 55751 11718 38426 77313 92222 31383 10466
12671 10466 -33271 -25062 -26818 -80300 -129789 -16208 -77369 -14678 -48509 -111435 -145136 -43497
12659 -43497 -3807 -153486 -179664 -156176 -86673 -4180 -6935 -81686 -118911 -76032 19036 51114
12647 51114 50440 29796 -9025 -9289 21889 47952 6725 -3166 80575 37792 -55145 -21193 -768
12634 -768 -12130 -88426 -39852 -112233 -14964 -24340 -46800 22886 -3106 -7458 52088 20517
12622 20517 -2977 -66504 -111308 -111520 10896 63416 1853 -44710 7788 -37199 -60347 -39936
12610 -39936 -4578 1706 3216 -37241 -48711 7606 64604 2649 -32805 -126426 -78032 -48482
12598 -48482 -99855 -140815 -190970 -117808 -68468 -78148 -84327 -118069 -139479 -156364 -129683 24605
12586 24605 -29938 -35809 10762 107133 45658 -55732 -54729 -47516 -70937 -70871 -106039 -49232 -86855
12573 -86855 -202111 -131817 -111596 -49942 -52118 -112640 -71560 -201717 -96176 -54482 -64563
12562 -64563 -97134 -112973 -6866 7552 -37664 -29965 459 80530 59694 82585 38710 72616
12550 72616 63137 43674 -96214 -103152 -42732 11295 -36875 -42476 -65893 -35343 -28719 -83891
12538 -83891 10767 -9959 -63469 69114 20280 -60517 38013 32303 -1845 -96209 -10033 8
12526 8 -57066 -114577 -44149 24898 50794 -12765 -43344 42917 -1354 11891 -16671 30237
12514 30237 52401 -7171 -28722 62628 64272 46728 34213 5459 37992 -50919 -44693 84081
12502 84081 43795 5884 -16590 7587 -24170 -68490 -56701 -69165 -43603 -82575 -107224 -66013
12490 -66013 10588 -12309 -133293 -76674 39592 42178 26009 22792 134033 42129 27029
12479 27029 -40192 -35608 56575 136041 72678 -34591 -105303 -67441 -79267 -46551 49522 -14140
12467 -14140 -45073 -17436 53704 118896 30924 2010 23341 40736 -35667 -28717 -48318 -66025
12455 -66025 -5486 -10793 -55950 -150207 -206994 -75836 -135166 -87181 -42050 -51486 -133636 -77584
12443 -77584 32211 3944 54803 105366 144027 110037 102358 22014 -36474 -93257 -78883 -44715
12431 -44715 -3871 -56240 -74810 -72370 -174772 -126037 -76565 -64577 -41006 -120155 28188
12420 28188 29705 17960 41205 -32343 -75267 -26410 1866 -23377 -134363 18463 114666
12409 114666 -2998 -20710 -42756 9702 1844 21772 -5724 -144533 -94455 -89619 -6354
12398 -6354 9385 -89754 -90727 -29088 54477 79256 64231 -33011 -37544 -65853 -90031 -48652
12386 -48652 -1664 26666 76431 52887 31235 -13224 23695 -13628 -5625 -7431 -4265 54381
12374 54381 6634 -57589 -60499 24698 49024 47762 33170 78346 36291 8649 -124303 -158697
12362 -158697 -165622 -151850 -37205 16380 1442 48969 -53648 -49389 -13557 -65610 8846
12351 8846 -99028 -69999 -35160 20820 -58135 -137179 -127014 -100276 -76616 -106553 -80327 -39120
12339 -39120 -63515 -64532 62327 -131 -39683 -11227 -46902 -219466 -82968 -33096 468
12328 468 40975 -23951 -44297 -85215 -27720 -83594 -27193 -60388 -65099 -67930 -171207 -96655
12316 -96655 -140484 -124699 -51225 -34732 -23852 -71045 -52043 -8748 -4017 -37839 -73700 -133209
12304 -133209 -145008 -186003 -162486 -29734 -46104 -30142 -53492 -127996 -25841 -44362 -51343
12293 -51343 -32167 -52067 -46964 5113 -10332 5886 -18885 -1654 32452 -31267 -9539 1247
12281 1247 -54813 -95601 -117475 -87275 -122901 -120969 -154136 -62530 -16823 -86157 -63578 58389
12269 58389 83233 -29873 18708 -67818 -40074 21901 -26738 -126191 -204837 -79539 -97235
12258 -97235 -40686 -41873 7135 -7417 -34770 -92791 -37401 -62490 -51380 -32288 -10590 63282
12246 63282 -1697 -23189 -86592 908 105736 131142 60893 43686 -7452 61705 10703
12235 10703 28098 -136976 -208307 -60867 58177 23474 -35615 27881 37611 59668 10534
12224 10534 41842 145498 46674 8011 -10419 -4895 -11244 40400 57456 24812 -53904 -119064
12212 -119064 -113504 68954 -38999 -133407 -72455 -115986 -75421 -64770 29473 60494 42422
12201 42422 -35578 -20580 136373 206506 124954 11815 -75664 34880 -186 -43908 -37059
12190 -37059 -69797 -100811 -103711 -99664 -165374 -124159 -80031 -144745 -58219 -82136 -1762 47753
12178 47753 -13965 -65009 -86777 -121044 -118449 -97906 -38125 -60640 -74596 -102286 -123785 -115410
12166 -115410 -112610 -150409 -127866 29562 10242 -84368 -133821 -64737 78807 37757 56344
12155 56344 70648 -63324 -78699 -32156 -3548 -21936 100621 7837 14263 8232 -92506
12144 -92506 -26244 -53886 -25510 15608 88576 103371 -7749 -20538 -130126 -80736 -69242
12133 -69242 -20681 67268 97828 6639 -44250 -52126 -15591 22348 48385 90659 756 -59653
12121 -59653 -23784 5693 -101329 26535 110383 64050 122205 111810 77949 49247 41569
12110 41569 3186 41216 -11468 -8353 62896 55692 -26255 -35420 3563 1383 -90665 -61164
12098 -61164 -51060 -115726 -71932 -125871 4446 -32495 -34220 -38631 -1933 -16968 -51696 22529
12086 22529 67792 39185 -32849 -217523 -148288 -82062 -104600 -87698 -36500 14985 40820
12075 40820 -38291 -68946 -27633 -60693 54839 -33609 -37761 19474 -47609 -71962 -39050 26232
12063 26232 -5685 -115409 -71976 -170992 -121677 -64142 -23697 78791 62045 10596 31975
12052 31975 98121 -25939 -125711 -119491 -108525 -69343 -115824 -66607 -65307 -130749 -4464 53033
12040 53033 77484 81858 102999 -25245 -84311 -37976 3503 29499 17522 7669 4844 39970
12028 39970 620 -19448 -43904 -128758 10241 -22921 -7703 9245 -20488 28059 -14045
12017 -14045 17337 44364 29859 33099 65290 118609 20306 -47950 -103686 -70013 -4631 17037
12005 17037 66741 50734 44729 -4986 -6306 -7073 19249 63211 12557 -68086 -90667 -32938
11993 -32938 -36015 -30871 10378 -23110 -12826 -755 17 -38635 -11746 -51642 31183 26591 34749
11980 34749 87489 68102 -32391 -73418 -100995 -203097 -195167 -7793 52953 -15051 -29297
11969 -29297 26935 -37322 -151193 -110590 -53430 -40303 67258 72645 150243 6182 -176027
11958 -176027 -48639 -58624 -88669 -37347 -10133 8693 -81834 -168211 -78151 -78305 -69203 -21273
11946 -21273 -39064 -61442 -76744 -12190 28196 -49675 -35755 -72236 -154699 -58689 35409 18105
11934 18105 -132750 -55583 -108208 -161476 -148972 -238256 -155977 -17324 10323 3373 -65917
11923 -65917 -62069 -2232 -83237 -87212 -33282 3467 -59790 -41530 -23663 -63221 -544 96682
11911 96682 60994 63921 103940 119956 -1486 -67410 -90365 -139530 -84491 -57754 -87374 47525
11899 47525 -19912 -88861 -23770 109112 11288 -62632 -162362 -144673 -3016 -16573 -31533
11888 -31533 -54261 -176852 -176901 -39491 -23311 -8110 30850 146449 60096 55466 64981 -42430
11876 -42430 -36228 -6728 23107 -69461 -97793 -140688 -115758 -150004 -114027 -47593 -15755 16257
11864 16257 37545 10314 8905 58201 132153 59975 -123866 -101052 -61093 -139399 -106246 -98610
11852 -98610 -81681 -66076 -23389 50755 -4870 39295 -58385 -179582 -70923 -78866 -39885
11841 -39885 -29721 -16346 -12631 -73485 -74465 -173051 -76178 -29894 40026 -36120 -230483 -183679
11829 -183679 -89173 -67829 -31445 -18980 -66658 -86943 -59915 -90614 -66536 -52050 -7456
11818 -7456 32054 38821 -26570 -59211 -107193 -136969 -79704 -22265 -103702 -62378 17149 -31542
11806 -31542 -145421 -81103 -70451 -91944 -100948 -94059 -95601 -104339 -16668 -113730 -180994 -86309
11794 -86309 -97472 -84800 -73540 -4519 -25513 -132872 -120939 -49819 42963 171210 111888
11783 111888 54790 -51003 -41952 -54500 -120921 -35699 32462 59140 34606 -61149 -141853
11772 -141853 -37579 -118211 -23305 41944 -56156 1887 63292 42045 -114244 -165931 -148363
11761 -148363 -86850 -38820 -145115 -198213 -99148 -121794 -186062 -134442 -105630 -155116 -56034
11750 -56034 14190 -52440 59765 67073 -17907 -92521 -151132 -164356 -163176 -121487 -90633 -73491
11738 -73491 -9508 -69222 -38587 -159967 -182275 -75904 -30916 -44271 -102466 -180556 -80043
11727 -80043 -97840 -47029 -31156 -74220 -86976 -65244 5039 -40262 -139657 -60362 -9542 -50923
11715 -50923 -36603 -62336 -108389 -90991 -55666 -756 -50538 -101917 -77700 -68203 11117 -9900
11703 -9900 -116167 -248006 -176173 -155627 -150466 -108066 84926 4662 -23838 -182543 -126258
11692 -126258 4767 24869 -16331 -103118 -135904 -54213 -37943 -111438 -82138 -89810 -89981 -156454
11680 -156454 -93949 -58280 -3728 -77477 989 -25170 48683 19870 24241 -50392 -89279 -116821
11668 -116821 -12773 -50643 -57764 34765 -88913 -94675 -101075 -90580 -201407 -146054 -121879
11657 -121879 -148047 -37761 -8385 -62692 -86195 -33955 46737 -43361 -74231 -90985 -95624
11646 -95624 -69988 -46359 -82086 -99318 -49042 -51903 -7685 -87198 -199502 -60463 -65685 -163601
11634 -163601 -106192 -68326 -86023 -106992 -59104 -81799 -61784 -7991 59905 71807 31768
11623 31768 86707 53960 87734 43783 62870 46552 -25242 6094 -22666 -91135 -82189 -41467
11611 -41467 -41949 -48157 -15196 78547 46818 30373 -16744 -63823 -87189 -21654 -55836 -68019
11599 -68019 -54460 -89302 19017 -26118 -9410 -62735 -36175 -129678 -39788 4400 -44045
11588 -44045 9942 -4639 21621 36691 -49306 12144 24690 -36945 65133 -3442 -90648
11577 -90648 -74890 -55911 -45108 13601 67457 21684 -36897 -73427 -47430 -20994 -105575 -50490
11565 -50490 -4682 43438 -34435 -76050 -5765 -11043 52843 -34505 -74572 -100978 -94005 -49605
11553 -49605 -142261 -161822 -221169 -193110 -177731 -196801 -132128 29321 -46598 -90680 -130567
11542 -130567 -107374 -43401 -29185 30354 27716 -44158 -114146 -100262 -85221 -55553 44992
11531 44992 83235 -35241 -59300 -31579 6743 113794 94132 54939 9424 4503 76816
11520 76816 2459 -97883 -167132 -53595 -33929 -92428 -97129 -87380 -43951 -101622 -66752 -73732
11508 -73732 -47957 -93376 -26786 28606 50946 44301 65921 127327 15880 -33961 -60959 5262
11496 5262 7348 -50083 -38749 60014 1262 -7858 -4950 -23757 -63028 -60901 -47300 -65141 -15566
11483 -15566 21537 94449 116996 106136 91077 -44889 -62682 -64973 31529 2429 12210 47075
11471 47075 84663 39636 -82169 -78738 -92758 -64463 -14142 1419 -8597 -100799 -116198 -115182
11459 -115182 -77137 -17789 -67784 30229 -14069 39857 -1839 -50825 -58434 -144295 -66901 51650
11447 51650 62112 126318 116517 103347 42588 44169 5141 -9030 -109019 -89735 3138 81292
11435 81292 99257 99521 113361 11539 64601 42616 -8246 85435 50284 -15465 -13076 -10348
11423 -10348 47477 2185 -49110 24372 94184 33958 25069 20870 16497 4320 -63949 -105694
11411 -105694 -106325 -67913 31109 -71996 -19174 -12622 -40674 2227 31587 -55402 -26460 -8669
11399 -8669 -105730 -92490 -138603 -69208 -29788 -43660 -72132 -107889 -29063 -30080 -22594 -50741
11387 -50741 -77559 -7809 -48274 -37591 -145211 -95586 -18682 -5120 27770 126167 73009
11376 73009 -22983 -32183 21313 30100 -66248 -31863 7584 -133832 -139938 -73621 -106025 -18934
11364 -18934 -62229 -84856 -129123 -135635 -81853 1421 -6602 -35959 -48655 -63180 -83049 -19913
11352 -19913 13565 1987 -32499 -47851 12210 8008 131558 110697 58522 37222 -3349 -63195
11340 -63195 -101558 -89473 -21109 23881 43333 61665 61032 -9508 5001 -38504 24070 74488
11328 74488 13 67417 111093 -35681 -116606 14890 3880 70950 19192 -25437 8622
11317 8622 62850 82039 23012 1142 -43205 -74385 -42289 45427 61131 9223 -14205 -44390
11305 -44390 146955 129796 52014 -27954 -43252 -23154 -45632 -72602 20970 66160 -32190
11294 -32190 3584 -20829 -74294 -45776 -33786 -148970 -69725 -35146 -66131 -23569 -53501
11283 -53501 -15565 -10644 -27315 31878 89511 -84414 -48665 -32698 19012 79774 27300 96499
11271 96499 26367 79026 133260 173746 32139 34935 -1689 -32268 44326 41349 31643 100599
11259 100599 82221 -29885 121630 128035 12988 4551 -65997 14219 36409 -58232 27006
11248 27006 86738 -52180 -33222 -60830 -101778 -137219 13503 53022 -34567 -11217 29432
11237 29432 106449 5471 22418 -1041 20571 -5839 -25471 -13983 20270 52110 90123
11226 90123 -14205 32370 107080 -104340 -61911 -39285 56356 92492 18878 71505 72693
11215 72693 11476 -70322 -55618 27089 83353 63818 63850 59540 -621 13168 84353 94417
11203 94417 38858 33115 75608 -1701 6 56984 2980 35481 24542 30641 -85357 -99122
11191 -99122 -51306 53963 46469 -40039 -30068 -80006 -32730 -25721 -47978 -39998 -5366 -51329
11179 -51329 9235 60901 -8381 71267 95790 53128 32903 -13225 -50828 32323 2974 -59587
11167 -59587 34808 100040 130128 202442 201839 82175 119767 -8635 52073 135072 33241
11156 33241 -47971 -45558 16700 46834 49935 151715 57264 -22420 -61816 -92110 83023 131976
11144 131976 158574 109410 136481 97737 193528 114814 -26097 33645 -6072 81647 68071
11133 68071 45203 11898 -34475 1199 109092 67053 102941 26427 -14964 58650 -9052
11122 -9052 48536 13505 -57066 -83126 49064 92088 6503 12416 35699 -4011 17156 85778
11110 85778 125692 81645 9928 -2617 104326 84081 129908 151354 116917 -10258 -113354
11099 -113354 -56634 -5331 79083 -32639 -23990 -73423 -36747 5806 23062 -63892 2441
11088 2441 155778 67609 63396 73542 73281 67949 80964 132748 140677 80122 116489 29172 63611
11075 63611 126921 196090 91742 61606 143995 126138 8821 -83228 -20431 24559 983
11064 983 -27229 9164 88045 178821 152860 26627 -4745 -59405 -61832 -57306 -37220 43991
11052 43991 145652 101520 99786 103452 67351 29197 10535 44408 -37672 -37641 -59228 19959
11040 19959 42388 30811 4134 -57586 8922 52154 -7656 -6680 -24880 29750 81174 133841
11028 133841 176595 71685 -148854 -98024 -54675 -12785 -1572 29368 111331 57055 22128
11017 22128 110593 -12053 27732 99382 149342 -95 -74008 2137 71520 -18561 -90580
11006 -90580 9484 83032 57776 86659 52703 51613 174267 149277 170522 171853 105529 153055
10994 153055 109449 35007 49425 104252 19709 -73691 49064 -20779 39141 45659 56067
10983 56067 60588 51610 90429 191068 138037 45127 -10818 41074 34564 -25521 -89101 39119
10971 39119 59636 -17680 52214 114996 100113 148015 163735 193978 170051 152607 166053 130070
10959 130070 187940 226783 98346 162387 59790 59871 88054 32450 79608 57251 32415 44547
10947 44547 89352 135467 38566 79850 95417 45164 65227 109593 128918 101627 170491 228780
10935 228780 149166 133995 136751 115354 79728 70812 169589 76952 142743 144932 126700 35892
10923 35892 -13163 -24277 -66094 67570 58433 43341 38673 18504 101646 130030 121615 73156
10911 73156 69444 154915 176957 223845 325826 242148 93730 71529 141745 31745 -52051
10900 -52051 -43463 104492 23816 72928 98937 124775 126334 159531 164015 106205 152769 98911
10888 98911 125952 181757 99321 62733 105209 106992 152007 130901 134018 120099 155193 93228
10876 93228 90744 65495 75729 94457 76216 145333 175410 293202 260968 192826 240673 168033
10864 168033 146424 193479 257099 201115 219666 189046 175567 125567 88126 214996 106593
10853 106593 58518 77233 131653 135969 141421 197211 174542 116175 161114 146776 156197 168309
10841 168309 134838 139934 122552 96188 45655 26362 130947 205939 244864 362251 298011
10830 298011 140328 147042 205844 261601 215911 231490 216189 127755 229896 220821 238208
10819 238208 145951 123218 237500 114059 218346 185476 147119 214137 180261 165438 229937
10808 229937 256253 216346 261671 266720 297578 313019 323028 225375 131549 193391 212816 219955
10796 219955 260805 294117 259684 320013 272758 197996 210173 190125 187545 266796 281249 270991
10784 270991 407615 374472 319694 308086 291378 346921 369238 264908 290643 283070 333611
10773 333611 342344 255006 309361 249580 159198 185165 303966 266248 194889 236869 184181
10762 184181 243944 309116 293207 288851 350164 346925 336318 343594 296553 334085 331635 408281
10750 408281 449633 348120 310798 307464 338129 346248 300122 310412 418924 415895 376473 372255
10738 372255 415997 414904 458908 529581 503799 456822 508274 540679 510611 461821 491301 497110
10726 497110 454350 473833 523787 524807 530987 388682 427831 474984 555128 567159 465782
10715 465782 515295 645571 623461 566635 532139 461502 521292 507540 506469 513635 555482 584142
10703 584142 595536 610107 687775 756146 682515 628626 631727 591844 734971 768817 680785
10692 680785 686177 648547 674555 642736 547429 650512 786950 823700 849181 864547 894877
10681 894877 830360 834595 778256 693733 736296 814762 827445 821764 828891 799506 706550 708109
10669 708109 842727 788621 871632 1008490 1032914 972395 916134 945831 985000 986922 959723
10658 959723 980894 978416 971377 1117306 1188862 1216206 1181710 1097173 1114382 1067219 1121163 1096937
10646 1096937 1062728 1046305 1116919 1062963 1079301 1130798 1098393 1141250 990301 1051788 1056820
10635 1056820 1099305 1009635 1041017 1024449 1185216 1131307 1067890 1062009 1065789 1115949 1051036
10624 1051036 1065635 1028900 997248 979390 990976 1053278 1041627 1041306 1010564 980877 947831 968498
10612 968498 1024091 1048910 1000084 889252 910793 891123 899012 865739 858143 909387 844436 843919
10600 843919 887103 793697 658864 748427 828012 818203 774843 794905 795498 845254 933516 897013
10588 897013 869006 794217 865776 827789 766747 789663 734983 699479 643768 713529 721801 664899
10576 664899 720418 801087 884736 753610 729104 782778 842828 803084 765457 681998 766177
10565 766177 859376 850390 775928 709732 592517 582260 660371 609248 611108 638033 578133 584781
10553 584781 685039 712493 640626 585729 591406 495726 441906 520712 511512 503332 571266 513250
10541 513250 557501 604149 635898 633600 507429 507411 427651 470601 533618 520097 494419 570324
10529 570324 625461 664152 522409 507035 566825 525933 532187 481044 414989 421532 410391 490339
10517 490339 501983 550478 511433 503618 506183 597696 558059 570537 642492 607717 578314 576719
10505 576719 564320 540410 582987 503062 519191 495332 566476 597112 530115 504556 513931 393067
10493 393067 394252 543055 483816 465675 478754 448822 368806 518965 526467 490321 425370
10482 425370 475199 618862 578862 549885 531874 578592 507281 528045 576182 519755 457927
10471 457927 484634 398182 484852 480168 448547 390740 401476 368835 351251 371858 457722 468257
10459 468257 502944 498695 592764 546758 537113 549520 564939 502840 431545 432038 499437 523913
10447 523913 519360 518081 491321 463292 501904 534484 558952 514519 506961 496723 548313 520907
10435 520907 518679 425673 477288 515861 558570 468873 495486 530497 496556 587651 593101 583039
10423 583039 521868 470441 453592 576031 482853 549775 464444 358579 379395 551987 646310
10412 646310 536383 547065 601617 651295 606717 543944 598267 605270 690923 626125 601147
10401 601147 567312 598010 485642 466251 568110 618231 666588 599845 597199 674521 685365
10390 685365 728007 625461 474381 520219 610776 633323 745152 755269 666671 637741 661044
10379 661044 667946 766048 792411 793949 745819 701998 676456 735897 724309 684387 750268 808088
10367 808088 783657 703275 713464 774620 804750 812898 779312 832289 857594 890562 850734 848208
10355 848208 804500 806026 861382 908374 901489 901783 961481 1002203 1004072 1036116 1036982 980029 986749
10342 986749 972088 1053823 1202251 1259401 1199109 1253567 1282812 1276175 1350557 1343091 1339265 1428749
10330 1428749 1431889 1546707 1629236 1673625 1729418 1745800 1816090 1979193 2152510 2206421 2399938
10319 2399938 2441970 2626009 2951248 2995223 3185622 3198048 3309411 3435436 3594364 3580101
10309 3580101 3678931 3755283 3736124 3591714 3417073 3358498 3355290 3271906 3204393 3073290 2917658
10298 2917658 2678062 2457722 2381829 2277428 2041212 1977511 1929751 1958798 1940864 1853180
10288 1853180 1803199 1860588 1841280 1773635 1887684 1915216 1987079 2000374 2048098 2020574 2012759
10277 2012759 2075106 2248050 2333013 2491558 2562219 2646521 2808857 3026671 3068804 3123827
10267 3123827 3326828 3522547 3664200 3905579 3886778 3799989 3709207 3578992 3501638 3361630
10257 3361630 3409550 3481122 3489538 3566323 3706053 3709923 3669142 3536064 3333981 3039475 2776897
10246 2776897 2599582 2500318 2450206 2333925 2207232 2054186 1916817 1893761 1863572 1788110
10236 1788110 1740383 1846878 1765833 1667381 1664207 1602533 1637063 1702383 1701263 1618773 1590503
10225 1590503 1608679 1612646 1613820 1583508 1498542 1523058 1606093 1561291 1578075 1599139 1638308 1593011
10213 1593011 1521479 1618610 1551649 1552070 1555634 1534754 1578371 1673688 1619349 1616404 1587666 1592397
10201 1592397 1594218 1678737 1628402 1625145 1674276 1805860 1789141 1717470 1743435 1782949 1780855 1832521
10189 1832521 1740692 1711664 1799971 1742507 1749136 1706204 1722181 1841120 1841047 1787041 1816489 1781999
10177 1781999 1792003 1787085 1828049 1844622 1893054 1841575 1893969 1867194 1889507 1810551 1838610
10166 1838610 1839206 1912473 1865928 1795896 1832162 1829218 1852953 1812449 1826096 1886239 1879204 1862781
10154 1862781 1929028 2083143 2130041 2072493 1977491 1885539 2074137 2096824 2126914 2095439 2036670
10143 2036670 2054973 2114524 2236209 2148612 2096675 2112462 2154498 2143395 2285940 2343437 2267295
10132 2267295 2182998 2167204 2207284 2129217 2103906 2239955 2308647 2303287 2260281 2253418 2265187
10121 2265187 2304687 2270523 2321968 2399234 2454892 2462554 2424860 2383786 2428188 2580864 2666806
10110 2666806 2627956 2616595 2642389 2715959 2737238 2734351 2827810 2836171 2833506 2940127 2954389 2914925
10098 2914925 2942219 2918249 2892667 2890519 2895978 2871263 2966789 2990161 3218917 3254216 3245317 3335830
10086 3335830 3291246 3341572 3431043 3396347 3387628 3477225 3623283 3607226 3633785 3766836 3841130
10075 3841130 3853282 3837346 3820928 3913490 3905222 3903890 3953704 3984147 3975260 4024426 4085228 4078406
10063 4078406 4078676 4027369 4079261 4120525 4261650 4309870 4353689 4337064 4398440 4530648 4532497
10052 4532497 4597433 4650380 4754833 4744567 4868500 5013621 5061065 5162230 5054209 5121728
10042 5121728 5329412 5300197 5350631 5478738 5535301 5506139 5588996 5627048 5767874 5877610
10032 5877610 6056235 6120914 6290991 6375668 6389490 6534493 6615140 6750105 6950483 7010308
10022 7010308 7062079 7235671 7361956 7513803 7682100 7894734 8047737 8293801 8352807 8392720
10012 8392720 8525822 8700124 8791286 8937813 8970184 9100806 9298334 9561890 9642982 9658282
10002 9658282 9817936 10032147 10093686 10256658 10490805 10711935 11023511 11210500 11416371 11562256
9992 11562256 11716261 11910957 12070020 12246347 12557688 12661520 12952202 13192079 13325773
9983 13325773 13664131 13838492 14066579 14393050 14688048 14995855 15166790 15461553 15885626
9974 15885626 16308524 16667135 17039490 17364900 17736662 18037050 18484356 18828128 19198007
9965 19198007 19867238 20399649 21040416 21654045 22327684 23046914 23758864 24524627 25400386
9956 25400386 26221735 27077292 28034692 29069294 30242627 31346331 32584677 33955221 35347978
9947 35347978 37121546 38853228 40736255 42872724 45269416 47736983 50447001 53481106
9939 53481106 56740772 60123921 63895121 67980240 72229369 76882569 81792512 87182550
9931 87182550 92917023 98802145 104966194 111560475 118678676 126216570 134206071 142936557
9923 142936557 152306504 162624502 174136871 186911951 201525888 218389807 237428248
9916 237428248 259242642 283929940 310679662 338473635 365411076 389620930 410244709
9909 410244709 427999869 444691112 462413878 481541463 500056511 513942177 519215142
9902 519215142 513630852 498443842 477542898 455481648 435152049 416631174 397831853
9895 397831853 376513369 351550320 323573886 294596505 266734684 241819418 220229958
9888 220229958 201917953 186556444 173524244 162596188 153675108 146522130 140660789
9881 140660789 135996495 132489021 129821362 127980140 126846733 126577260 126861111 127586858
9873 127586858 128743431 130364505 132399697 134922723 137921690 141256345 144977210 149547444
9865 149547444 154851601 161066648 168300608 176899810 186751696 198142233 211425798 226855077
9857 226855077 244795631 265853059 290476729 319127253 351623124 386729947 421657299
9850 421657299 451459824 470766404 476371476 468858892 452532472 433898723 418643766
9843 418643766 410052839 408795136 414680058 426424233 441347687 454923411 461360984 455185956
9835 455185956 434488021 401804933 362542069 322604400 286007277 253936324 226326976
9828 226326976 202436367 182018021 164541878 149694023 136970185 126086794 116609283
9821 116609283 108262928 100954966 94303487 88538580 83359482 78800276 74825951 71261808
9813 71261808 68035214 65116443 62232536 59517871 56984730 54566560 52308554 50094800
9805 50094800 48041530 46204553 44269268 42646924 41110136 39659848 38106590 36707518
9797 36707518 35552278 34370074 33155702 32124238 31220881 30244840 29326409 28442596 27576473
9788 27576473 26776988 26022357 25179780 24464161 23768199 23112261 22408291 21790165 21069804
9779 21069804 20489224 20002659 19472794 18870500 18403542 17942231 17577596 17250615 16850337
9770 16850337 16481302 16106159 15708215 15292982 14906431 14526432 14223782 14002303 13743135
9761 13743135 13494932 13302256 13153346 13137597 13003452 12834479 12570777 12452537 12183016 11897190
9751 11897190 11686466 11438645 11251192 11034304 10807260 10650501 10543651 10348740 10139130
9742 10139130 9927649 9766438 9641337 9273679 9115532 9010801 8855233 8722008 8535301
9733 8535301 8429644 8386029 8304288 8226545 8252293 8078983 8003927 7970947 7873534 7855523 7745396
9722 7745396 7597920 7535076 7513197 7484783 7270570 7072418 6876126 6817520 6818925 6874962 6783896
9711 6783896 6674956 6606637 6571562 6439301 6274029 6129370 6231036 6066532 5922549 5805167
9701 5805167 5684514 5637942 5492016 5363206 5256980 5104195 4872387 4650598 4540117 4516708
9691 4516708 4493222 4337947 4291949 4235547 4063664 3962461 3885810 3796107 3686201 3612454 3455729
9680 3455729 3290565 3337423 3338851 3180079 3098030 3092728 3136670 3061062 3035886 2954450 2973631
9669 2973631 2802459 2810655 2717857 2736846 2848786 2751500 2609095 2631213 2625279 2578972 2595587
9658 2595587 2557920 2518094 2562284 2590813 2583472 2566105 2511981 2556337 2500971 2467156 2548685 2473897
9646 2473897 2418397 2322756 2277956 2368292 2362735 2275523 2288649 2248511 2256157 2266571 2350164 2377863
9634 2377863 2317346 2355857 2400350 2323035 2269186 2213022 2197917 2171071 2148175 2083070 2086911 2080424
9622 2080424 1999147 1977096 1856084 1929135 1920218 1866791 1828616 1881069 1877724 1769420 1765448 1675062
9610 1675062 1684498 1691556 1651375 1711936 1739042 1673966 1648992 1642690 1602660 1609860 1627680 1588695
9598 1588695 1675296 1774320 1730190 1788281 1660651 1703291 1737605 1610704 1527655 1631234 1627014
9587 1627014 1623386 1555245 1504342 1557747 1577729 1573173 1554849 1553801 1485376 1443965 1472077 1481102
9575 1481102 1470469 1412423 1316973 1277508 1256509 1367315 1345950 1312129 1434254 1379582 1263714
9564 1263714 1246362 1208568 1180631 1248710 1240482 1150094 1135076 1038930 1066832 1142546 1064147 966740
9552 966740 1050791 1216235 1214500 1211089 1134224 1100135 1088832 1112731 1162603 1115630 1001001 1065097
9540 1065097 1123361 1159849 1143812 1088142 1130044 1158399 1193100 1161542 1218754 1174322 1217368
9529 1217368 1177908 1141796 1181898 1161636 1237778 1252602 1272122 1409129 1424801 1437571 1487306
9518 1487306 1621015 1631350 1705920 1815053 1941524 1931954 1908218 1956877 1987735 2119421 2370284
9507 2370284 2514476 2569292 2726737 2791000 2918546 2943994 3066242 3203900 3300071 3419689
9497 3419689 3603132 3673428 3705290 3724844 3683681 3665915 3586993 3382149 3278246 3108581 2963288
9486 2963288 2789812 2666962 2671117 2454777 2214619 2147302 2072955 1946938 1932865 1826329
9476 1826329 1668310 1570474 1506187 1593854 1502832 1410970 1426561 1398840 1422168 1506091 1493472
9465 1493472 1472068 1475764 1512214 1569958 1428573 1416562 1364389 1386140 1437293 1503352 1533184
9454 1533184 1503046 1493044 1533011 1441787 1396779 1504793 1670853 1751089 1781677 1804546 1764838
9443 1764838 1835785 1907336 1932853 2054474 2073447 2203680 2395937 2501508 2634003 2867900
9433 2867900 3243839 3387112 3490201 3557312 3634083 3598417 3587803 3497380 3462902 3268045 3249715
9422 3249715 3329502 3498231 3581535 3690618 3726017 3568215 3564487 3438946 3312139 3035443
9412 3035443 2870917 2649883 2492727 2475296 2397910 2423564 2466407 2486819 2379414 2319698 2420472
9401 2420472 2478791 2650856 2677697 2654495 2630049 2568592 2548560 2639386 2682990 2715020 2667203
9390 2667203 2680634 2574285 2544365 2543973 2437093 2329805 2149372 2143828 2146133 2202963 2256731
9379 2256731 2233553 2063994 2069132 1979092 1865975 1718882 1696482 1708637 1781339 1766354 1773642
9368 1773642 1823010 1847369 1768384 1645601 1761461 1830574 1928238 2114208 2195894 2374942 2479103
9357 2479103 2443091 2411794 2460349 2504009 2416996 2508599 2572348 2737413 2618158 2556577 2635308
9346 2635308 2620769 2530887 2602922 2476761 2502252 2538200 2438507 2360440 2317387 2240808 2171372
9335 2171372 2166094 2104972 2005034 2045329 2017571 1941851 1870125 1813682 1762932 1765753 1795560 1751867
9323 1751867 1700248 1729039 1680353 1762195 1664523 1675773 1685326 1681278 1803364 1691876 1729897
9312 1729897 1648946 1582086 1705949 1734192 1744200 1737333 1774423 1810761 1745355 1857599 1814491
9301 1814491 1767036 1764979 1862483 1864283 1941760 1836674 1878662 1943771 1810170 1792176 1811808
9290 1811808 1884622 1951601 1860531 1923865 1888709 1811511 1895722 1870518 1799166 1829577 1878584
9279 1878584 1845209 2023593 1962673 1790703 1846715 1931356 2031997 2026205 2065714 1957021 1982694
9268 1982694 2002772 2069435 2039277 2041970 2086840 2084456 2006617 1957735 1889688 1868068 1923939 1964837
9256 1964837 2019214 2019444 2093995 2006071 1881602 1922818 2003362 2067719 2122850 2165723 2073756 2122931
9244 2122931 2102849 2090681 2105252 2071571 2116700 2158700 2122235 2059328 2121425 2136517 2203951
9233 2203951 2194756 2323445 2430153 2410966 2295760 2319994 2359780 2393536 2339493 2340802 2331136
9222 2331136 2292526 2293569 2284134 2305710 2382702 2394357 2439893 2483372 2415484 2418376 2437911 2469350
9210 2469350 2380966 2446656 2512802 2515684 2499152 2430508 2466155 2616805 2694421 2664653 2689832
9199 2689832 2782663 2752490 2762853 2810128 2808573 2770065 2853917 2980733 2940759 2979706 2909189
9188 2909189 2925648 3017031 2870967 2760959 2829909 2898368 2917966 2902123 2892252 2956116 2893939
9177 2893939 2865845 2879981 2817995 2782669 2839431 2912367 2970169 3068502 3007272 3111216 3160898
9166 3160898 3222058 3251667 3199324 3245994 3441837 3441209 3477627 3532746 3579860 3663417 3748134 3661885
9154 3661885 3695349 3678162 3727766 3832728 3811524 3939240 3976351 3993259 4084948 4225538 4153118
9143 4153118 4217642 4312839 4369545 4473729 4514441 4590246 4634295 4720225 4916664 4873192 4883913
9132 4883913 4913182 4920040 5089238 5240111 5193709 5196650 5402986 5458117 5544586 5676798 5778264
9121 5778264 5875600 5959448 5873731 5997316 6167687 6297568 6499865 6543081 6497823 6603203
9111 6603203 6798902 6938679 7063704 7136815 7274401 7505341 7665826 7695754 7834910 7881229
9101 7881229 8079545 8317963 8358865 8534643 8679121 8748712 8790307 8976127 9337830 9490189
9091 9490189 9641858 9884491 10022039 10262033 10491468 10610879 11008977 11283322 11540896 11874090
9081 11874090 12183954 12566281 12879617 13224711 13608964 13987896 14529219 14938102 15404233
9072 15404233 16003200 16638639 17267403 17981378 18788564 19440075 20277837 21102636 22082418
9063 22082418 23256500 24460492 25774753 27103235 28672185 30347336 32191626 34152283
9055 34152283 36264005 38515726 40990640 43488355 46136462 49013788 52140162 55616567
9047 55616567 59393101 63383945 67801302 72634166 77922898 83911405 90575949 98323381
9039 98323381 107079650 117171214 128950146 142288227 157160310 172091249 185445179
9032 185445179 195268211 201019503 203677892 205766532 209614318 216461923 225592952 234922008
9024 234922008 242314855 246723339 248078502 246577096 242723031 236062478 227526898 218497521
9016 218497521 210787732 205769486 203446914 201857902 198601873 191823783 181615173 169151672
9008 169151672 156776910 145852386 137220388 130685256 125949460 122648240 120540925 119719433
9000 119719433 120195349 121543142 124078725 127997628 133325071 140194189 148630872 159081008
8992 159081008 171412424 184577731 196989496 206720918 212536705 214783497 215276156 216775888
8984 216775888 221204151 228317686 236574365 243507269 247683805 249056010 247027485 242639731
8976 242639731 235474517 226187528 215387395 204990545 196918040 191653634 188038420 183620529
8968 183620529 176119405 164863756 150424091 134899908 120362795 107632516 97075130
8961 97075130 87882169 79987193 73141514 67272439 62228124 57928955 54172110 50786083
8953 50786083 47568257 44803107 42366385 40116093 38125548 36333152 34754234 33400117
8945 33400117 32139357 30973751 29881754 28840237 27993723 27199748 26529952 25827167 25283393
8936 25283393 24855399 24435204 23953388 23624331 23435738 23346817 23302845 23395109 23786222 24382478
8926 24382478 25137877 25692028 26067110 25907750 24912691 23461365 22050651 20879926 19980390
8917 19980390 19076997 18369553 17737263 17150702 16676193 16303818 15964563 15609793 15366637
8908 15366637 15155308 14942583 14828978 14827499 14894533 14943179 15038457 15156353 15298850 15410815
8898 15410815 15608326 15753386 15948766 16115623 16297564 16514088 16708908 16976991 17206669
8889 17206669 17475675 17675173 18063648 18664832 19303727 20066407 20943690 21892411 22646899
8880 22646899 23472166 24181447 24928987 25868997 26819588 27581677 28139234 28385838 28224516
8871 28224516 27782468 27500509 27564589 27670641 27934854 28299834 28708929 29081641 29476029 29881029
8861 29881029 30286330 30741934 31104699 31332104 31744935 32317501 33015113 33870260 34885601
8852 34885601 36068456 37673356 39518105 41679797 44087146 46561963 49103327 51725047
8844 51725047 54521132 57237267 59662009 61872950 63743946 65246812 66136148 66010970
8836 66010970 64490012 61945240 59041045 56358680 54015123 52263748 50874318 49706000
8828 49706000 48860184 48166832 47549917 47042509 46671070 46456710 46687922 47497141 48769356
8819 48769356 50891102 53571648 56890393 61172675 66519570 72562566 78854076 84698355
8811 84698355 88898636 90951569 90614924 88601829 85159357 80518460 75100964 70041262
8803 70041262 65893976 62652329 60180628 58290746 56940313 55857297 55182991 54930138
8795 54930138 55199556 55810733 56854259 58286837 60182963 62685649 65680581 69524042
8787 69524042 74085070 79337654 85483019 92433323 100008567 107954178 116165993 124040983
8779 124040983 131108539 136470753 139767457 140705280 138744367 134351580 128019425 120252530
8771 120252530 111619173 102967042 94658488 87296638 81046617 75775977 71769173 68811794
8763 68811794 66472046 64869705 63849288 63295716 63043852 62902303 62918810 63077820 63455207
8754 63455207 64030800 64563379 65322377 66139984 67156161 68199415 69170646 70075114 70712969
8745 70712969 70896325 70435429 69207999 67117844 64249376 60891622 57362105 53556273
8737 53556273 49816005 46314248 43091512 40003787 37187946 34506733 32160504 30166608
8729 30166608 28534803 27253558 26275867 25238434 24454343 23637226 22810466 22264955 21564348
8720 21564348 20897737 20244263 19821165 19465758 19131360 18843362 18479367 18081374 17576673
8711 17576673 17019866 16436522 15808088 15277800 14653626 14019439 13514574 12908672 12304320
8702 12304320 11624827 10995946 10391391 9719364 9257037 8905343 8605108 8201052 7814230
8693 7814230 7548077 7240404 6874612 6690225 6549156 6404539 6256615 6127267 6023490 5991608
8683 5991608 5831293 5767145 5770512 5715073 5599105 5670472 5679655 5585844 5578129 5482192 5359495
8672 5359495 5343621 5327616 5233098 5086975 5028399 4854211 4851476 4953383 4944317 5007909 5030122
8661 5030122 4906018 4890197 4800328 4694124 4529851 4520635 4511298 4367198 4442970 4450843 4489783
8650 4489783 4435898 4434204 4421004 4450997 4368758 4302331 4295389 4205418 4195453 4207581 4195602 4141206
8638 4141206 4004188 3966185 3897251 3791289 3674821 3600902 3552283 3621829 3786754 3877605 3862509
8627 3862509 3901943 4033270 4094303 4000420 4029515 4103580 4072756 4061908 4059807 4055294 4043610 4070243
8615 4070243 4059237 3921024 3886916 3817615 3844201 3817130 3852393 3784760 3740603 3788728 3796403
8604 3796403 3752070 3714137 3621019 3498985 3501714 3487010 3422221 3418784 3311370 3288882 3274948
8593 3274948 3160653 2991270 2908210 2878125 2827636 2839702 2729415 2634325 2591821 2662414 2674800
8582 2674800 2609835 2424391 2404460 2465554 2340591 2361236 2355284 2279744 2344850 2490018 2321821
8571 2321821 2124503 2179489 2278285 2232737 2212270 2153375 2079562 2193727 2329343 2323628 2209813
8560 2209813 2120037 2204849 2198189 2204048 2244274 2256068 2170595 2183763 2357854 2217531 2174830
8549 2174830 2210069 2211427 2233773 2296627 2300043 2291231 2163724 2204414 2369921 2441293 2349183 2462359
8537 2462359 2520409 2495394 2510083 2492731 2572422 2556170 2609523 2716111 2719353 2650737 2682640
8526 2682640 2817331 2623756 2641109 2814833 2824621 2864076 2908832 2971400 3010079 3073810 3105661
8515 3105661 3148653 3291092 3190416 3248561 3262703 3318259 3287937 3390498 3488611 3457308 3595376
8504 3595376 3685504 3700161 3794252 3899200 3842777 3880119 3957190 3970626 3984101 3952759 3977061
8493 3977061 4138930 4243596 4259801 4314830 4421162 4467076 4513301 4656368 4728145 4778735 4833111
8482 4833111 4836799 4883272 4980413 5096430 5245721 5269492 5307632 5416884 5398094 5500525 5662156
8471 5662156 5760334 5799256 6014942 6238400 6324750 6493873 6565710 6532043 6639774 6813419
8461 6813419 7056425 7173924 7305083 7515468 7725869 7927502 8109476 8307352 8529649 8810940
8451 8810940 9155309 9470294 9789281 10068102 10512939 10834034 11247602 11768029 12181108 12842820
8441 12842820 13420504 13832001 14495718 15132073 15787593 16516633 17450262 18390730 19431227
8432 19431227 20593139 21884854 23284465 24821088 26476050 28303457 30272684 32277532
8424 32277532 34392971 36473297 38352176 40253121 42168556 43710910 45285829 46964105
8416 46964105 48727713 50849484 53205960 55981480 59179582 63184411 68117582 74024681
8408 74024681 81180747 89465480 99042993 109738975 120420896 130148371 137899300 142930050
8400 142930050 145578789 146112283 144745735 141164422 135224603 126992004 116730550 105616403
8392 105616403 94713860 84900131 76504820 69461614 63706627 58898554 54998059 51720888
8384 51720888 49144234 47050177 45633381 44523210 43645306 43108139 42949626 43173964 43549542
8375 43549542 44145500 44995469 45979568 47118229 48502750 49995192 51683123 53658867 55728600
8366 55728600 58210118 61033902 64160060 67833761 72170239 77430210 83510615 90764510
8358 90764510 99452064 109563012 121171667 133506781 145559944 156214710 164289879
8351 164289879 169503350 172138263 172655807 171188577 167514132 161204027 152412602 141882048
8343 141882048 130775311 120385931 111675530 104765604 99361515 95181190 92247088 90436663
8335 90436663 89565326 89743801 90827189 92937118 96246817 100793580 106848744 114373189
8327 114373189 123821275 134845461 146971981 159477308 170546940 179248463 184657136
8320 184657136 187044568 186857923 184197719 179134744 171237042 160364866 147009104 132614835
8312 132614835 118694283 106089684 95304237 86279218 78815080 72591450 67357005 63105053
8304 63105053 59694327 56943950 54713210 53102613 51947398 51043728 50591555 50402599 50637815
8295 50637815 51101455 51743861 52666366 53750364 55019388 56580253 58275639 60346388 62524349
8286 62524349 65075932 68139449 71528146 75623317 80441210 86202444 93204502 101692899
8278 101692899 111623530 123350726 136533742 150560698 164075956 175611952 184027602
8271 184027602 188873312 190442823 189335865 185616009 178913206 168947144 155906326 140753728
8263 140753728 124811488 109781066 96582123 85385119 75883078 67779190 60831129
8256 60831129 54841640 49791849 45465207 41707816 38477572 35644724 33273879 31024368
8248 31024368 28938257 27192910 25645118 24227512 22951503 21953072 20937363 19946006
8240 19946006 19048404 18282672 17490349 16767191 16051372 15351264 14665885 14100781 13570016
8231 13570016 13041316 12521728 12035111 11513362 11081342 10738730 10407939 9990570 9603266
8222 9603266 9210440 8938431 8744023 8504708 8242909 8045213 7694746 7315560 7177730 7004370
8212 7004370 6768387 6668483 6470065 6192873 5983778 5928309 5728908 5641269 5648628 5524418
8202 5524418 5265820 5174681 5140798 4928205 4737519 4648785 4472451 4417671 4331903 4605186
8192 4605186 5501704 4562226 4040752 3944862 3771124 3584605 3434587 3486179 3487238 3303976
8182 3303976 3210688 3243974 3039473 2892985 2876372 2726566 2829537 2953561 2894167 2752734
8172 2752734 2767044 2725704 2633857 2676466 2588428 2590264 2501335 2472460 2321917 2372915 2369958 2289133
8160 2289133 2229113 2266262 2170022 2104221 2008632 2051788 2001327 1951618 1921616 1928876 1899566 1952009
8148 1952009 2006287 1982448 1903694 2010907 1921080 1888174 1920084 1841610 1828799 1752350 1648602
8137 1648602 1747195 1770196 1711340 1525978 1496021 1574242 1616273 1577894 1458763 1547699 1605227
8126 1605227 1481570 1484392 1424338 1398628 1491787 1410715 1406215 1325406 1282243 1227971 1256347 1250001
8114 1250001 1311739 1221671 1244460 1266511 1203036 1231360 1288149 1193787 1162745 1131167 1215455
8103 1215455 1146770 1132568 1085418 1077747 1008855 985899 1059132 1053001 977862 910728 916045 1042002
8091 1042002 1076941 1031196 1059762 1044169 1030764 1059311 1104579 1139202 1034058 991783 1059690
8080 1059690 1031215 1015429 940103 979982 972536 1010801 1054577 1027076 997670 966239 895298 1008111
8068 1008111 1063364 1046029 999103 983702 962521 958753 1077151 1062580 977748 979542 947920 956608
8056 956608 1026936 1150911 1193984 1222810 1302281 1349530 1319678 1318524 1454987 1500594 1481832
8045 1481832 1397568 1363462 1444318 1461072 1380872 1394602 1368416 1343089 1194418 1212501 1201415
8034 1201415 1055771 1054380 1017896 1107998 1031789 993780 984925 936249 882438 929756 978332 972479
8022 972479 1001784 1043387 1013425 960248 940103 1010732 1003465 990892 948822 917881 957215 996124
8010 996124 1030389 1071167 1093093 1129623 1142970 1167268 1106426 1134911 1123074 1072192 1172536
7999 1172536 1246608 1352563 1379170 1504358 1624873 1624239 1586041 1641089 1662805 1509709 1352172
7988 1352172 1347560 1202808 1190331 1229288 1240693 1199873 1163191 1166157 1236707 1310745 1334999 1375693
7976 1375693 1296246 1392449 1473024 1521707 1544964 1630385 1661618 1694311 1864714 1999467 2099155
7965 2099155 2204000 2217202 2164659 2214523 2317658 2286812 2325495 2415682 2523181 2528454 2554038
7954 2554038 2587459 2716166 2808711 2979688 3261133 3287121 3392625 3427803 3269095 3059564
7944 3059564 2847383 2688244 2542199 2242289 2057238 1903218 1881419 1765300 1656782 1565530
7934 1565530 1556856 1576203 1545590 1538223 1559314 1494598 1443075 1507603 1470524 1481881 1535131 1544614
7922 1544614 1545016 1576027 1754342 1855722 1856593 1941839 1904289 1940244 2033586 2046755 1895065 1823969
7910 1823969 1711497 1596896 1631918 1578082 1556794 1513584 1405366 1285401 1265485 1329384 1267244
7899 1267244 1171121 1177438 1211571 1353773 1274146 1265524 1287298 1328263 1286587 1264233 1371039
7888 1371039 1365934 1355763 1435557 1370471 1349756 1414009 1412937 1407480 1363487 1496906 1583790 1648952
7876 1648952 1668360 1702506 1762136 1927370 2128443 2356895 2582944 2626999 2688703 2703692 2583378
7865 2583378 2409318 2275756 2087217 1895766 1788246 1709685 1593275 1447294 1348307 1284088
7855 1284088 1204377 1163363 1206124 1259450 1151326 1047720 1082339 1112915 1137652 1085732 1129517
7844 1129517 1135990 1025242 1068999 1099412 996749 1083639 1122959 1132118 1125699 1293114 1335919
7833 1335919 1337690 1263904 1173499 1277666 1295977 1142088 1197378 1250946 1241876 1171576 1159750
7822 1159750 1299140 1177758 1180250 1177651 1191312 1204498 1200831 1243896 1313339 1214487 1215195 1238692
7810 1238692 1216850 1257284 1355369 1420299 1394032 1325059 1399781 1448017 1273682 1384929 1438058
7799 1438058 1527887 1525319 1529156 1479006 1445489 1393025 1562850 1678766 1618736 1498759 1595412
7788 1595412 1648316 1517122 1617837 1548591 1569518 1641051 1702666 1657349 1677094 1805040 1741596
7777 1741596 1745159 1844811 1870814 1854058 1774346 1881854 1921034 1954620 1971016 1916108 1943513
7766 1943513 1919062 1787756 1808162 1918094 1988743 1995013 1988151 2070356 2090632 2032726 2130470
7755 2130470 2075330 2084181 2136656 2052301 2074768 1874424 2010858 2070616 2133400 2224419 2234556
7744 2234556 2236536 2199272 2295679 2227828 2346987 2341729 2310871 2355312 2412938 2363732 2378528 2392910
7732 2392910 2475388 2461714 2519193 2559066 2612731 2685115 2715502 2696495 2757969 2807775 2912203
7721 2912203 2999665 3095254 3191597 3312694 3320093 3386329 3570773 3509167 3589573 3584829 3701872
7710 3701872 3765722 3859886 3819254 3816049 3885687 3885694 4010123 4117252 4268412 4357601 4290664 4409109
7698 4409109 4470053 4617114 4646756 4798646 4937075 5040839 5171494 5319005 5485403 5616669
7688 5616669 5762624 5904809 6025838 6034308 6109014 6119265 6097293 6106928 6268567 6409627 6521540
7677 6521540 6557072 6717640 6810758 6919551 7009339 7096927 7158882 7305496 7486378 7653592
7667 7653592 7797990 7973857 8187644 8446991 8769076 9063546 9325227 9498921 9719877 9945858
7657 9945858 10213130 10547788 10811450 11158014 11493981 11791139 12068463 12512433 13052311 13503778
7647 13503778 14098405 14727589 15412154 16109953 16746956 17394885 18180122 19146136 20167146
7638 20167146 21245504 22544592 23892551 25538487 27197333 28949091 30946345 33044917
7630 33044917 35571274 38214309 41049592 43933110 47260668 50874296 54697727 58785926
7622 58785926 62999665 67482108 71968666 76607038 81295590 86303856 91630814 97649314
7614 97649314 104418209 111940379 120566583 130568792 142271692 156197444 172989709 193342271
7606 193342271 217905416 247303250 282055022 321947381 364704844 405013667 434758822
7599 434758822 446329574 435868474 405507920 362835011 316952708 274465978 238215325
7592 238215325 207974307 182282312 160308232 141721812 126088511 113321735 102876632
7585 102876632 93868654 86183500 79493449 73566459 68344822 63724955 59762489 56333905
7577 56333905 53427877 50778751 48323450 46242766 44582750 43024294 41718113 40657618
7569 40657618 39504230 38622176 37828297 37028732 36325454 35752428 35252717 34745256 34353176
7560 34353176 34111122 34029424 34017891 34207561 34608818 35184890 35812749 36734530 38032053 39304749
7550 39304749 40853186 42621195 44654564 47013044 49315111 52035904 54801611 57726830
7542 57726830 60833218 63972351 67305445 70489185 73797472 77447853 81447513 85906180
7534 85906180 91102342 96900096 103620327 111424092 120808605 131963472 145456299 162125239
7526 162125239 182322276 206440259 234999981 267862579 302777156 335040840 357750099
7519 357750099 365056984 354107245 327588652 291929901 254193254 219743516 190451882
7512 190451882 165877136 145059685 127408693 112352587 99877685 89831762 81416327
7505 81416327 74027792 67636097 62206729 57281434 52877239 49076363 45598537 42703311
7497 42703311 40152539 37930193 35866430 33970468 32167210 30660691 29383769 28067064
7489 28067064 26946747 25814073 24629496 23578491 22562568 21641783 20710430 19911463 19272021
7480 19272021 18457996 17616428 16993995 16257107 15612928 14933536 14419811 13863154 13421648
7471 13421648 12954145 12674163 12323554 11982536 11575530 11153356 10836610 10496312 10200977
7462 10200977 9855245 9418101 9087600 8814189 8739993 8551615 8255930 8208153 7986706 7799552
7452 7799552 7542318 7371267 7143976 6971884 6748032 6563424 6352345 6377058 6184211 6122932
7442 6122932 6049969 5805230 5660217 5681467 5683310 5629716 5657896 5596834 5471415 5306160 5123316
7431 5123316 5048794 4919399 4774700 4714330 4662875 4670682 4642378 4478615 4365155 4325826 4225597
7420 4225597 4187605 4096463 4015515 4069236 4121958 4132523 4145320 4159108 4115410 4033261 3990370
7409 3990370 4025803 4007898 3928673 3904297 3947486 3914390 3862528 3833528 3842746 3826413 3863149 3851476
7397 3851476 3858184 3802926 3810040 3757490 3764481 3765290 3726319 3723513 3710798 3650815 3685892 3712226 3742716
7384 3742716 3737675 3601144 3539357 3524087 3525395 3464197 3503232 3500544 3503225 3539861 3512855 3564341
7372 3564341 3597335 3680036 3731090 3815701 3846660 3738609 3698065 3659159 3625504 3674954 3633343
7361 3633343 3692300 3750668 3739173 3719735 3750025 3895433 3929784 3922173 3983411 3999114 4075414
7350 4075414 4128153 4055961 4070519 4134694 4214340 4275497 4328347 4329809 4373591 4438142 4503687 4582616
7338 4582616 4735375 4807245 4837629 4839974 4861005 4982248 5073045 5019120 5109362 5070923 5123710
7327 5123710 5239320 5263612 5324462 5361843 5466058 5692334 5833768 5888740 6032617 6158461
7317 6158461 6267899 6361356 6491289 6600134 6651067 6691151 6797933 6894585 6855976 6894590 6955372
7306 6955372 7075192 7192450 7349580 7445703 7496436 7755932 7941308 8133734 8452473 8468085
7296 8468085 8588795 8807008 9077925 9334588 9546113 9653383 9896138 10174442 10455837 10777679
7286 10777679 11114527 11256452 11430044 11760108 12210152 12585404 12857276 13167232 13597341
7277 13597341 14127737 14639394 15200330 15827331 16508778 17175795 17934684 18687302 19590571
7268 19590571 20476338 21444612 22575587 23885943 25298482 26820475 28488854 30348952
7260 30348952 32453474 34654083 37016842 39693278 42634022 45683954 48878154 52178338
7252 52178338 55645705 59375786 63357748 67486079 71724133 76012012 80269766 84621982
7244 84621982 89353862 94606613 100460328 107325536 115390866 124852553 135887157 149153620
7236 149153620 165038784 184152811 207266926 234841385 267410466 304228278 342981517
7229 342981517 378970691 405724324 417411150 410817387 387497583 352304782 312164430
7222 312164430 272862304 237858816 208089059 183129222 162128833 144719620 130530389
7215 130530389 119080465 109941293 102556539 96602425 91934016 88225708 85373059 83513091
7207 83513091 82350932 81814747 81783089 82202472 83019242 84182125 85752679 87622899 89637200
7198 89637200 91769511 93980560 96294722 98961501 102046041 105862985 110463855 116008138
7190 116008138 122843905 130908593 140672048 152589243 167289387 185219439 206992461
7183 206992461 233158126 263690319 297685585 332148849 361949719 381257108 385378591
7176 385378591 372884652 346102037 310532838 272484012 236727463 205536242 179070825
7169 179070825 156869012 138055152 122359838 109180360 98205396 88924780 80959616
7162 80959616 74096513 68095579 62747042 58142851 54222059 50733904 47816220 45319010
7154 45319010 42967913 40829002 39146050 37556772 35980620 34384749 32973373 31492650
7146 31492650 29909090 28476570 27021551 25634153 24483879 23441681 22328016 21299081
7138 21299081 20375861 19535595 18662773 17780523 17166007 16527562 15854231 15324683 14802754
7129 14802754 14321085 13796378 13280119 12859508 12450178 12049173 11642207 11217656 10798937
7120 10798937 10460338 10133180 9841749 9609627 9347681 9032547 8824552 8578223 8300113
7111 8300113 8132386 8011795 7770732 7554585 7357809 7117651 6981605 6849713 6600309 6448081
7101 6448081 6370957 6229044 6077201 5809026 5565734 5467936 5310245 5141200 4954090 4727638
7091 4727638 4618589 4467203 4401548 4314616 4210933 4225249 4086099 4038338 4041688 4050277 3905308
7080 3905308 3876472 3875137 3812921 3733486 3658144 3564957 3525585 3440650 3379189 3242172 3102908
7069 3102908 3014361 2937105 3002444 2922693 2854891 2875140 2729488 2725433 2593693 2660417 2692631
7058 2692631 2603258 2646837 2628803 2566976 2570194 2611878 2441301 2517853 2521624 2501001 2459263 2404050
7046 2404050 2418883 2391405 2367782 2412388 2457951 2434532 2445678 2493681 2550447 2569982 2619690
7035 2619690 2693163 2501825 2417043 2506968 2360571 2357991 2255636 2126977 2192164 2051548 1913117
7024 1913117 1819585 1793290 1703397 1573217 1597534 1642355 1536404 1495207 1488202 1529743 1516115
7013 1516115 1428541 1307733 1364295 1383559 1400454 1261785 1325806 1269926 1217484 1312477 1443474
7002 1443474 1453946 1497750 1373434 1363860 1332429 1187338 1278768 1307340 1334715 1383887 1494474
6991 1494474 1558413 1654628 1586591 1576981 1643442 1603593 1634068 1744278 1590130 1569447 1540208
6980 1540208 1426446 1321220 1195833 1096574 1095254 1113986 1104836 1035393 989174 987507 951452
6969 951452 956537 1010870 937019 943466 1004833 1013675 899006 880170 780928 718407 808940 907135
6957 907135 818290 713411 772330 750064 805538 851394 765553 655198 769354 739358 602218
6946 602218 580783 531737 541012 536992 459748 402809 414615 466694 495748 626679 706532 613477
6934 613477 489292 616339 619222 548115 626633 685960 679697 662678 678420 520018 397997
6923 397997 414176 403042 467067 530228 449729 494434 415905 272006 288503 347863 263037
6912 263037 290701 299986 346005 359400 423157 340574 209016 315772 348305 359549 332118
6901 332118 393158 366659 347867 256355 233523 268497 305592 263561 249804 238442 132796
6890 132796 285050 391106 312803 358744 416074 519405 538567 413463 473372 531803 530302
6879 530302 557416 594601 580997 489995 470464 581405 699116 632305 607325 725373 858764
6868 858764 1050357 1055522 1044491 1153182 1281755 1500388 1688612 1918202 2098413 2369878
6858 2369878 2492375 2413273 2242841 2106382 1985151 1644768 1509335 1368349 1238863 1155583
6848 1155583 967001 836070 793171 771587 724518 656458 603842 549951 590499 544272 514271
6837 514271 641976 542946 490340 536504 470644 511388 563535 711915 745739 607668 578408
6826 578408 651003 650027 639599 707719 700453 760736 684560 763062 831080 932036 987094 1133892
6814 1133892 1250744 1314041 1494681 1713179 1984412 2214205 2289888 2051937 1937812 1796110
6804 1796110 1678311 1504063 1275368 1077933 953263 741134 633529 648736 647295 548793
6794 548793 464412 399906 351532 381700 433061 367680 298236 268902 284618 310427 340550 320434
6782 320434 266214 330049 261855 148040 208618 178936 117897 120515 119404 140490 85463 19436
6770 19436 -24062 -34470 9817 87665 44733 22485 86626 -47809 7128 11482 -10095 68992
6758 68992 -2765 -2107 -46367 80515 136605 93676 143065 -29959 -70808 -46523 -127695 -83099
6746 -83099 -98797 -21857 -26488 -65084 -62349 -55343 -64843 -61770 -102547 -36991 -92809 1428 -66689
6733 -66689 -114705 -102112 -69874 -132120 -209681 -258021 -276908 -128654 -156273 -169590 -132259 -177831
6721 -177831 -226167 -102761 -151767 -150582 -141787 -110226 -23415 -115588 -157414 -61700 -106414 -192547
6709 -192547 -110507 -101287 -69789 -69227 -126886 -157724 -270138 -221737 -170298 -199919 -219272 -228265
6697 -228265 -266405 -185746 -172961 -173382 -222734 -228329 -214560 -169643 -105033 -46864 -74607 -213377
6685 -213377 -192819 -154957 -5465 -39908 -142839 -117604 -192939 -182845 -88481 -74322 -130310
6674 -130310 -74859 -39237 -166776 -175550 -145561 -83864 -123977 -214920 -143689 -74589 -101419 -156434
6662 -156434 -163254 -97956 -52909 -106421 -121541 -171036 -249668 -200444 -153295 -74231 74944 9115
6650 9115 -130802 -107594 -109114 -137357 -98090 -211124 -160291 -109265 -88071 -150031 -226446 -181502
6638 -181502 -176055 -161072 -141586 -210282 -328553 -205486 -166538 -150418 -208447 -282846 -215766
6627 -215766 -149884 -228107 -229960 -267942 -248338 -166416 -181518 -265193 -181130 -137426 -187900 -177757
6615 -177757 -222221 -100136 -129116 -140099 -119803 -168621 -187996 -220881 -254105 -209284 -246266
6604 -246266 -215107 -199628 -146706 -62866 -56969 -105706 -167602 -238251 -168982 -147522 -163619 -112873
6592 -112873 -210162 -247314 -226982 -228959 -287109 -261985 -345521 -349635 -212998 -161413 -177676 -130274
6580 -130274 -223902 -178630 -150078 -294963 -219909 -257774 -286208 -301283 -280395 -238340 -190533
6569 -190533 -250302 -142701 -167371 -187558 -151916 -201389 -321126 -343302 -353991 -308806 -195914
6558 -195914 -122685 -92877 -85515 -163777 -227604 -278616 -267124 -170405 -245800 -202799 -233991 -316853
6546 -316853 -265317 -159125 -186662 -273020 -304869 -336294 -172586 -93645 -207035 -266384 -274044
6535 -274044 -215869 -196986 -222823 -247942 -204209 -259531 -232368 -241431 -210419 -369006 -364108 -302217
6523 -302217 -295515 -309549 -239020 -145174 -111051 -141753 -223606 -237149 -195506 -237949 -273139 -391557
6511 -391557 -362145 -309362 -205404 -210906 -161136 -126329 -233653 -281126 -223279 -291497 -214609
6500 -214609 -143619 -185772 -177117 -188597 -240016 -401064 -347078 -198902 -185619 -300855 -266744
6489 -266744 -344371 -289887 -243326 -123378 -140420 -184296 -176628 -146817 -248345 -287016 -234710
6478 -234710 -219299 -224452 -225335 -242241 -238207 -175468 -288102 -239750 -164956 -253232 -172813 -219610
6466 -219610 -274312 -207729 -240384 -254159 -261837 -334916 -308950 -327418 -312522 -318377 -245339 -207587
6454 -207587 -186618 -260778 -331662 -314933 -339000 -175742 -103369 -275359 -434131 -256180 -152865
6443 -152865 -274916 -266484 -253974 -317438 -357004 -280192 -280692 -250370 -227032 -287104 -262849 -232408
6431 -232408 -303146 -271401 -185682 -137469 -164937 -189914 -193690 -207425 -318343 -362163 -276505 -288517
6419 -288517 -242764 -243137 -264247 -300124 -285917 -326474 -360031 -430373 -437415 -378866 -223105 -124092
6407 -124092 -172133 -288078 -313098 -399262 -336133 -281625 -267882 -261638 -236416 -232277 -257980 -161380
6395 -161380 -37775 -150951 -325298 -262399 -193477 -119238 -155957 -102861 -85990 -167915 -110677
6384 -110677 19804 -60318 -141506 -200810 -191164 -196053 -269490 -199237 -244338 -220193 -116986 -152045
6372 -152045 -249584 -315497 -236635 -205150 -97577 -92827 -53527 -40154 -26551 -30475 -9884 25068
6360 25068 71248 65668 33661 88488 -1065 81560 183558 85633 17439 49942 15460 -22154
6348 -22154 -107929 -99431 -78871 -93839 -70382 -30948 -25744 -16424 -61837 -110805 -61913 -18925
6336 -18925 -23853 -90361 -154405 -17233 35831 109113 20539 -17829 82011 -34578 5547 -11510
6324 -11510 -30776 105739 172076 98634 102793 44779 -18281 45409 84210 -21951 -51477 1110
6312 1110 14102 -42334 -37081 42039 -137 -141997 -236223 -248511 -173656 -153109 -196706 -242570
6300 -242570 -171892 -109581 -194841 -150766 -91087 -93192 -170126 -261211 -416235 -397329 -286082
6289 -286082 -256188 -194799 -170489 -151022 -136061 -195627 -288594 -271151 -317140 -345321 -242017
6278 -242017 -200095 -262530 -205625 -298072 -277694 -204038 -215344 -197965 -258767 -253685 -214680 -167544
6266 -167544 -177101 -208571 -240180 -141938 -144609 -146856 -122213 -93892 -118100 -178776 -179276 -92400 -175285
6253 -175285 -200010 -173079 -190520 -177713 -104865 -210221 -304828 -360468 -288098 -157084 -206800
6242 -206800 -214950 -259130 -239093 -174235 -165840 -162945 -182561 -159829 -173929 -156230 -165032 -223172
6230 -223172 -273313 -325967 -266918 -264283 -94087 -106801 -150926 -189399 -230318 -155541 -175726 -202170
6218 -202170 -184701 -240583 -214410 -199268 -250248 -136970 -132746 -132078 -130240 -151893 -73230 -134138
6206 -134138 -166868 -233252 -172953 -238741 -253365 -249115 -150772 -158326 -242838 -278632 -282388 -277154
6194 -277154 -298259 -281465 -248960 -197971 -158152 -98679 -150517 -196709 -189531 -144759 -177675 -257525
6182 -257525 -212594 -115801 -71480 -69637 -143796 -119303 -128299 -121424 -88355 -76127 -179426 -121929
6170 -121929 -183029 -246472 -273992 -172713 -103987 -144047 -212011 -199070 -246770 -208869 -143284
6159 -143284 -198223 -117857 -32292 36291 25924 -133285 -158125 -21529 -79067 -95729 -174755
6148 -174755 -269595 -291426 -278909 -270669 -150057 -64859 -183452 -218255 -136859 -90156 -127722
6137 -127722 -235399 -256193 -235964 -125868 -94589 -131227 -165740 -201501 -149268 -135686 -84780
6126 -84780 -115487 -224616 -146023 -28469 -84322 -163609 -105194 -103058 -123530 -158886 -80105 -33716
6114 -33716 -67341 -92268 -50749 -21876 -88702 -157906 -152097 -21647 -22853 -20479 51809 -11881
6102 -11881 -98952 -14802 -32761 -107537 -87303 -72183 -7565 9618 -2206 44178 -14821 -55096
6090 -55096 -128827 -175508 -166705 -223864 -140043 -100762 -119042 -121308 -122850 -116333 -87538 -74507 -23450
6077 -23450 -72817 -206212 -80754 -105616 -213277 -156286 -166735 -115431 -119231 -115178 -164099 -169637
6065 -169637 -111253 -176151 -195834 -211583 -126668 -96717 -107106 -159327 -189546 -76920 -111323
6054 -111323 -227553 -182642 -63844 -247043 -307767 -219184 -194746 -181898 -216588 -155228 -147595
6043 -147595 -107133 -171643 -295225 -273047 -241932 -207208 -147849 -173045 -251671 -357997 -286762
6032 -286762 -280474 -244476 -245942 -170981 -113639 -197495 -218274 -209203 -75682 -93446 -117458 -166583
6020 -166583 -213181 -142377 -175773 -234573 -220367 -154278 -106541 -185991 -246227 -186877 -199197 -133944
6008 -133944 -220689 -318735 -344490 -340972 -255259 -221499 -197076 -269546 -197775 -114029 -76279 -116990
5996 -116990 -162769 -132826 -101939 -160207 -158337 -304453 -225232 -165765 -302783 -284765 -289516 -209574
5984 -209574 -233009 -198699 -266754 -210324 -186197 -151289 -213447 -161745 -187996 -214567 -128051 -282278
5972 -282278 -259201 -182628 -218196 -204294 -104932 -158011 -163662 -158005 -231572 -193256 -90598 -132750
5960 -132750 -208716 -206459 -70068 -166136 -250038 -139598 -208822 -238108 -215661 -169062 -164596 -219301
5948 -219301 -165568 -238942 -267011 -311291 -209425 -288025 -226822 -251117 -291353 -238275 -232740 -341259
5936 -341259 -248167 -122766 -173907 -66868 -68705 -119362 -166809 -237042 -333632 -314085 -268015
5925 -268015 -145316 -189466 -213244 -170963 -172680 -212030 -110582 -109514 -145688 -169384 -302580
5914 -302580 -221393 -188734 -233653 -158839 -84917 -26992 -82154 -209736 -233775 -145079 -185878
5903 -185878 -197496 -188553 -221228 -275061 -208556 -194204 -171687 -220995 -317946 -257328 -249842 -304616
5891 -304616 -269390 -271453 -144598 -126708 -173148 -211275 -254655 -208633 -205765 -184939 -224269 -336525
5879 -336525 -306948 -204562 -109605 -71370 -93331 -143832 -206910 -180974 -134136 -159220 -193886
5868 -193886 -216752 -240180 -165695 -75473 -168972 -192129 -164991 -157113 -97617 -163154 -137108 -294532
5856 -294532 -242512 -196513 -205859 -184234 -230317 -210114 -183523 -173417 -181978 -212705 -177517 -130017
5844 -130017 -193532 -167455 -152601 -295521 -195742 -172709 -173682 -102791 -107858 -135755 -112122 -77506
5832 -77506 -97448 -48428 -78031 -117858 -266255 -300081 -263951 -256066 -248749 -288071 -105481 -159915
5820 -159915 -196166 -128999 -161643 -202422 -133098 -108490 -196232 -269615 -263465 -161715 -124333 -166116
5808 -166116 -155877 -131041 -163970 -135056 -190938 -88333 -93499 -86664 -109389 -145495 -258874 -255166
5796 -255166 -222778 -164166 -155297 -83689 -12326 -32515 -80743 -122375 -25866 -55428 -48811 -101490
5784 -101490 -94921 -61511 -157977 -135632 -155077 -214820 -168467 -109665 -90996 -248167 -273965 -173266
5772 -173266 -265973 -170221 -43380 -36084 40326 22042 -7227 -65408 -39864 -133313 -127190 -149597
5760 -149597 -200476 -223528 -95824 -71834 -104626 -103469 -58101 -73004 -128329 -35657 -87520 -77794
5748 -77794 -55198 -138583 -198661 -140061 -162951 -87557 -85484 -85379 -92730 -67171 -61505 -219638 -197176
5735 -197176 -100935 -96938 -104631 -120044 -56191 -70104 -23795 19129 -128299 -70948 -14131 -81870
5723 -81870 -72513 -48471 -71870 4219 99598 65487 -25202 -134181 -73893 -82702 -32249 -26004
5711 -26004 -94064 -192702 -122530 -86858 -28999 45151 -83917 -240972 -222731 -170012 -187100
5700 -187100 -103273 -64838 -137078 -50804 -3630 -41504 20858 15999 -77772 -139521 -66426 -113696
5688 -113696 -150115 -127790 -41375 -86196 -186295 -186553 -69547 -77594 11667 -16484 -43718 -47208
5676 -47208 -27655 8923 5896 -58317 -3233 31651 -53679 50728 89650 18841 -59747 -52703
5664 -52703 -14096 62778 109976 122449 -39467 -155944 -67448 -58958 -26994 -128298 -62419
5653 -62419 72794 -20200 -72692 5072 31819 -60592 -99919 -94219 -5643 -16452 -35544 -97462
5641 -97462 -143840 -101288 -61715 -55043 -107718 9540 44272 65387 55570 -17015 -17649 -67011
5629 -67011 -14476 52824 -45598 -121828 -159787 -171908 -177230 -84282 -92757 -69067 45853 -83342
5617 -83342 -114369 -41107 808 30191 -1061 -10350 -12151 55725 93952 115236 -15340 -118577
5605 -118577 -28197 -100286 -69874 4690 -27212 -28469 54506 38353 56174 41764 78373 43825
5593 43825 119995 43115 55932 156423 119033 153848 98471 111217 173506 97502 46899 -15688
5581 -15688 -26495 -63567 -43817 -21779 20132 76107 177118 140483 26335 56619 65038 44936
5569 44936 40499 88043 96996 119518 170964 145314 98268 180894 75187 45214 84397 99949
5557 99949 116430 198962 168652 233964 211681 227198 179646 174108 136360 88439 196821 222633
5545 222633 246083 228136 283011 271795 239513 265184 252143 233835 172829 145824 122841 26983
5533 26983 66293 76762 194490 214135 179325 159242 208050 303259 273324 269852 275885 255726
5521 255726 262313 291260 298763 411298 443841 410811 449485 454250 524669 522154 510995 565273
5509 565273 482974 475136 474183 413396 477227 382932 328902 347000 293483 244426 308135 283581
5497 283581 218509 351407 387409 289008 327765 369466 287487 337502 346090 376901 374680 485157
5485 485157 596385 546206 440969 379009 392978 492394 476056 384864 386479 362840 334880
5474 334880 396020 360410 277968 292620 252984 271127 262571 224236 214280 168426 177678 152582
5462 152582 210734 204574 189498 278176 393684 438462 385919 445678 453640 438734 346651 280169
5450 280169 336468 317576 268058 201142 219030 211277 74096 146036 174735 135018 231394 225886
5438 225886 192049 217087 172441 97610 199070 188672 195528 259159 212885 221716 229747 302361
5426 302361 257228 147519 243373 357529 245971 258052 256314 155911 114501 101279 141896
5415 141896 270230 288115 131990 50290 210655 260798 202189 179802 181503 173872 112301
5404 112301 184539 172145 101298 125099 100396 166358 161872 139311 178361 245173 239139 152056
5392 152056 149866 106854 102834 175347 178371 147154 207143 196615 84543 8646 118140 169443
5380 169443 210569 253564 203382 239552 273019 270473 324691 298992 210051 206066 273686 178853
5368 178853 96408 110102 85066 92058 29633 87439 99850 209917 217988 230339 245506 162267
5356 162267 128893 94285 114040 95296 231943 264668 209082 228849 168561 252543 365947
5345 365947 297928 155193 123579 192743 207788 283246 340810 399259 388869 388410 390967 301417
5333 301417 297525 375334 334436 351908 281323 425398 436815 437924 490229 523330 515706 562008
5321 562008 622493 652379 727116 710010 825744 941514 995896 1101033 1324997 1494537 1580243
5310 1580243 1503633 1586570 1522398 1314985 1173102 1017424 939774 1010468 899136 854715 765670
5299 765670 605667 512333 514113 442133 423967 442238 282271 289576 337032 385040 421134 370261
5287 370261 398376 496220 401171 433574 373718 331368 326086 316275 342713 383437 317804 303647
5275 303647 362923 376113 361827 494062 461778 434574 405631 378866 394922 267897 369943
5264 369943 391787 417566 472353 499934 484080 423969 314755 318449 345326 386387 469544 572771
5252 572771 493145 495023 558327 521592 461297 437076 449192 514533 500902 413116 400883 442121
5240 442121 521568 602680 550280 379219 398612 419387 469807 487324 476980 606023 671424
5229 671424 578555 479226 573559 539066 540707 632200 658544 587141 588191 608362 651239 625911
5217 625911 608029 656942 732775 677152 634718 657114 645809 764149 752230 722338 777147
5206 777147 731113 739410 750652 773193 779377 771529 697200 657919 735855 692463 690777 698543 815990
5193 815990 860126 812299 682774 690173 777692 875256 829863 880731 916064 962058 981411 931236
5181 931236 945379 1029767 1131195 1100203 1026145 987673 1059021 1070156 1078417 1157380 1193080 1144992
5169 1144992 1169054 1174830 1148325 1207498 1206658 1230291 1232570 1228813 1254684 1289265 1298854 1251333 1378185
5156 1378185 1395565 1422803 1475160 1409924 1427251 1401887 1453284 1519047 1629980 1581688 1556744
5145 1556744 1596595 1588283 1606571 1553277 1483964 1536571 1604572 1712109 1739905 1723362 1753166
5134 1753166 1652935 1686208 1844715 1864432 1916974 1940079 1981075 1914552 1912648 2047181 2057119
5123 2057119 2064742 2034897 2193037 2203246 2186395 2381013 2399009 2384103 2428333 2541772 2605388
5112 2605388 2599779 2635115 2626560 2718262 2926200 3018846 2910655 2815258 2926846 3060341 3065376
5101 3065376 3102416 3294980 3419755 3342879 3380388 3464693 3602719 3664888 3705313 3701863 3781251
5090 3781251 3877458 3900140 3974789 4168892 4193732 4409105 4471249 4492163 4581140 4681450 4842415
5079 4842415 4970850 5057823 5226528 5396185 5456822 5535210 5604539 5733300 5841419 5975807
5069 5975807 6034504 6210805 6271024 6360447 6523904 6728155 6914008 6964156 7040048 7223353
5059 7223353 7488387 7610018 7671653 7769420 7883440 8071361 8070022 8239926 8328737 8419381 8549726
5048 8549726 8642819 8696887 8867132 9098733 9151155 9248629 9260519 9359659 9506107 9384835 9327289
5037 9327289 9326008 9541614 9627023 9623236 9724792 9638225 9593300 9570728 9478860 9412445 9367594
5026 9367594 9296831 9379092 9348039 9270157 9108905 9010463 8909867 8701687 8651634 8612484 8517963
5015 8517963 8354552 8157047 8024384 7963338 7917954 7734501 7602369 7477867 7382941 7165705
5005 7165705 7004979 6932266 6759304 6595606 6537171 6446604 6366527 6222960 6037509 5855400
4995 5855400 5766050 5676086 5637540 5579608 5432307 5332615 5187193 5072486 5112628 4838982 4687153
4984 4687153 4680020 4647285 4510526 4413670 4347288 4135133 4192947 4127379 3922070 3878915 3924856
4973 3924856 3847885 3707713 3627933 3657414 3460895 3313833 3226643 3254977 3167161 3141540 3172179
4962 3172179 3003122 2924952 2872769 2841154 2787027 2746422 2794364 2639635 2451982 2398895 2410186
4951 2410186 2392913 2395719 2420529 2360134 2308506 2275780 2341113 2208701 2067476 2193570 2074739
4940 2074739 2107278 2163583 2058091 1886599 1894182 1892921 1898173 1936332 1887921 1907536 1912205 1830952
4928 1830952 1789757 1819486 1832743 1854411 1884580 1897882 1865563 1731915 1739620 1774233 1732902
4917 1732902 1590753 1581631 1563032 1608387 1654262 1561360 1564706 1631434 1658248 1542981 1507270
4906 1507270 1474074 1489440 1415096 1512789 1561229 1531823 1432640 1480210 1607756 1580160 1522586
4895 1522586 1492049 1493617 1617515 1579669 1420081 1523982 1532675 1592775 1683579 1701383 1766551
4884 1766551 1759874 1704783 1628662 1628643 1567944 1531274 1515688 1537418 1479750 1397007 1437162 1501254
4872 1501254 1523929 1520749 1460925 1365179 1277826 1267919 1326545 1283649 1280769 1449361 1511191 1512237
4860 1512237 1556291 1591987 1742366 1682040 1726474 1767992 1738515 1767095 1802295 1860049 1749448
4849 1749448 1629624 1576114 1594962 1512797 1411924 1232869 1177609 1309011 1242199 1134504
4839 1134504 1133829 1167739 1121457 1054514 1071006 1187180 1235731 1151535 1131123 1108830 1111480 1193685
4827 1193685 1166228 1134350 1220463 1079143 1042448 1107118 1155534 1125581 1033423 899715 864229
4816 864229 885352 750333 770631 773622 765180 792117 823142 813571 747643 783331 828703 744433
4804 744433 618009 666760 663911 755092 671882 485889 513201 637922 663337 622602 592493
4793 592493 537450 568053 468649 391347 456645 487703 453405 420324 414106 499811 476757 434080
4781 434080 507951 470195 463422 504973 494250 522108 566911 444161 501427 528808 425817
4770 425817 426737 450212 436419 470058 576097 480491 441521 474593 497383 466384 469183 532392
4758 532392 586921 574852 433576 405610 467280 363680 438106 416104 519933 520051 491480
4747 491480 666855 679460 565383 578574 646689 622812 634043 668320 631544 637780 658450
4736 658450 719340 744857 702600 689476 709522 779219 772099 743868 723466 689682 685848 679868
4724 679868 684919 815392 822259 776660 759466 797793 814155 865007 902201 821531 793338 804430
4712 804430 943768 847475 925173 1083276 1051259 1026951 1136624 1221729 1219199 1293030 1315472
4701 1315472 1408826 1467286 1408807 1366836 1465724 1571089 1570483 1626753 1593132 1473625 1499817
4690 1499817 1530750 1391637 1331353 1380260 1380271 1407718 1413305 1473366 1580805 1654285 1659111 1634877
4678 1634877 1777397 1838979 1945742 2099287 2285326 2514792 2645585 2758483 2736669 2820702
$$ [...]
##END NTUPLES=NMR SPECTRUM
##END=
