##TITLE=1H_CA-9314
 CDCl3
 8 sc, 
 27.12.2024
##JCAMPDX= 6.0         $$ Bruker NMR JCAMP-DX V2.0
##DATA TYPE= NMR SPECTRUM
##DATA CLASS= NTUPLES
##ORIGIN= UXNMR, Bruker Analytische Messtechnik GmbH
##OWNER= root
$$ XWIN-NMR		Version 3.5
$$ Fri Dec 27 13:58:48 2024 Russian Standard Time (UT+4h)  she@DPX200
##.OBSERVE FREQUENCY= 200.1315
##.OBSERVE NUCLEUS= ^1H
##.ACQUISITION MODE= SIMULTANEOUS
##.ACQUISITION SCHEME= undefined
##.AVERAGES= 8
##.DIGITISER RES= 18
##SPECTROMETER/DATA SYSTEM= spect
##.PULSE SEQUENCE= zg30
##.SOLVENT NAME= CDCl3
##.SHIFT REFERENCE= (INTERNAL, CDCl3, 0, 19.4783)
##AUDIT TRAIL= $$ (NUMBER, WHEN, WHO, WHERE, WHAT)
$$ ##TITLE= Audit trail, XWIN-NMR		Version 3.5
$$ ##JCAMPDX= 5.01
$$ ##ORIGIN= Bruker BioSpin GmbH
$$ ##OWNER= she
$$ F:/spectra/data/she/nmr/H-F/1/pdata/1/auditp.txt
$$ ##AUDIT TRAIL=  $$ (NUMBER, WHEN, WHO, WHERE, WHAT)
(   1,<2024-12-27 13:57:36.57 +0400>,<she>,<DPX200>,
      <created by zg, POWCHK disabled, PULCHK disabled
       configuration hash MD5:
       00 E9 B6 7A A2 85 ED C7 34 08 36 98 17 FE 4E 26
       data hash MD5: 16K
       FB 9A 50 27 E2 BE E4 D9 21 1D 10 4C 81 A0 75 6C>)
(   2,<2024-12-27 13:57:42.54 +0400>,<she>,<DPX200>,
      <Start of raw data processing
       efp BC_mod = 2 LB = 0.24 FT_mod = 6 PKNL = 1 PHC0 = -26584.36 PHC1 = 22.38744 SI = 16K 
       data hash MD5: 16K
       91 17 89 E6 17 FD 40 DA F1 22 A4 27 8F D1 3B C8>)
(   3,<2024-12-27 13:58:00.67 +0400>,<she>,<DPX200>,
      <pk PHC0 = 5.993635 PHC1 = -4.6 
       data hash MD5: 16K
       56 F2 E9 0F 35 81 ED 9C 3A 30 26 22 00 C2 AE 29>)
(   4,<2024-12-27 13:58:04.53 +0400>,<she>,<DPX200>,
      <abs ABSG = 5 
       data hash MD5: 16K
       3C E6 BA 2E 68 A7 6F EB 17 11 03 F1 69 4C ED CC>)
$$ ##END=
$$ 
$$ hash MD5
$$ 1A A5 D9 44 5C 68 BB D4 AE 32 76 D5 C7 A4 E6 6D
##$RELAX= 
##$RELAX= 
##$RELAX= 
##$RELAX= 
##$RELAX= 
##$RELAX= 
$$ Bruker specific parameters
$$ --------------------------
##$DU= <F:/spectra>
##$EXPNO= 1
##$NAME= <H-F>
##$PROCNO= 1
##$TYPE= <nmr>
##$USER= <she>
##$AMP= (0..31)
100 100 100 100 100 100 100 100 100 100 100 100 100 100 100 100 100 100 
100 100 100 100 100 100 100 100 100 100 100 100 100 100 
##$AQSEQ= 0
##$AQ_mod= 1
##$AUNM= <au_zg>
##$AUTOPOS= <>
##$BF1= 200.13
##$BF2= 200.13
##$BF3= 200.13
##$BF4= 200.13
##$BF5= 200.13
##$BF6= 200.13
##$BF7= 200.13
##$BF8= 200.13
##$BYTORDA= 1
##$CFDGTYP= 0
##$CFRGTYP= 5
##$CHEMSTR= <none>
##$CNST= (0..31)
1 1 145 1 1 1 1 1 1 1 1 1 1 1 1 1 1 1 1 1 1 1 1 1 1 1 1 1 1 1 1 1 
##$CPDPRG= <>
##$CPDPRG1= <>
##$CPDPRG2= <>
##$CPDPRG3= <>
##$CPDPRG4= <mlev>
##$CPDPRG5= <mlev>
##$CPDPRG6= <mlev>
##$CPDPRG7= <mlev>
##$CPDPRG8= <mlev>
##$CPDPRGB= <>
##$CPDPRGT= <>
##$D= (0..31)
0 1.2 0 0 0 0 0 0 0 0.06 0 0.03 0 0 0 0 0.0002 0 0 0 0 0 0 0 0 0 0 0 0 
0 0 0 
##$DATE= 1735293456
##$DBL= (0..7)
120 120 120 120 120 120 120 120 
##$DBP= (0..7)
150 150 150 150 150 150 150 150 
##$DBP07= 0
##$DBPNAM0= <>
##$DBPNAM1= <>
##$DBPNAM2= <>
##$DBPNAM3= <>
##$DBPNAM4= <>
$$ [...]
##$SUBNAM3= <"">
##$SUBNAM4= <"">
##$SUBNAM5= <"">
##$SUBNAM6= <"">
##$SUBNAM7= <"">
##$SUBNAM8= <"">
##$SUBNAM9= <"">
##$SW= 24.0689530833862
##$SWIBOX= (0..15)
0 0 2 0 0 0 0 0 0 0 0 0 0 0 0 0 
##$SW_h= 4816.95568400771
##$TD= 16384
##$TD0= 1
##$TE= 0
##$TE2= 300
##$TE3= 300
##$TEG= 300
##$TL= (0..7)
0 120 120 120 120 120 120 120 
##$TP= (0..7)
150 150 150 150 150 150 150 150 
##$TP07= 0
##$TPNAME0= <>
##$TPNAME1= <>
##$TPNAME2= <>
##$TPNAME3= <>
##$TPNAME4= <>
##$TPNAME5= <>
##$TPNAME6= <>
##$TPNAME7= <>
##$TPOAL= (0..7)
0.5 0.5 0.5 0.5 0.5 0.5 0.5 0.5 
##$TPOFFS= (0..7)
0 0 0 0 0 0 0 0 
##$TUNHIN= 0
##$TUNHOUT= 0
##$TUNXOUT= 0
##$USERA1= <user>
##$USERA2= <user>
##$USERA3= <user>
##$USERA4= <user>
##$USERA5= <user>
##$V9= 5
##$VALIST= <valist>
##$VCLIST= <CCCCCCCCCCCCCCC>
##$VD= 0
##$VDLIST= <DDDDDDDDDDDDDDD>
##$VPLIST= <PPPPPPPPPPPPPPP>
##$VTLIST= <TTTTTTTTTTTTTTT>
##$WBST= 1024
##$WBSW= 4
##$XGAIN= (0..3)
0 0 0 0 
##$XL= 0
##$YL= 0
##$YMAX_a= 36515
##$YMIN_a= -150367
##$ZGOPTNS= <>
##$ZL1= 120
##$ZL2= 120
##$ZL3= 120
##$ZL4= 120
##$ABSF1= 19.17861
##$ABSF2= -4.890514
##$ABSG= 5
##$ABSL= 3
##$ALPHA= 0
##$AQORDER= 0
##$ASSFAC= 0
##$ASSFACI= 0
##$ASSFACX= 0
##$ASSWID= 0
##$AUNMP= <proc_1d>
##$AZFE= 0.1
##$AZFW= 0.1
##$BCFW= 0
##$BC_mod= 2
##$BYTORDP= 0
##$COROFFS= 0
##$CY= -3
##$DATMOD= 1
##$DC= 0
##$DFILT= <>
##$DTYPP= 0
##$F1P= 0
##$F2P= 0
##$FCOR= 1
##$FTSIZE= 16384
##$FT_mod= 6
##$GAMMA= 0
##$GB= 0
##$INTBC= 1
##$INTSCL= 2.524811e-10
##$ISEN= 128
##$LB= 0.24
##$LEV0= 0
##$LPBIN= 0
##$MAXI= 10000
##$MC2= 0
##$MEAN= 0
##$ME_mod= 0
##$MI= 1.114404
##$NCOEF= 0
##$NC_proc= -8
##$NLEV= 6
##$NOISF1= 3.799351
##$NOISF2= 2.8
##$NSP= 0
##$NTH_PI= 0
##$NZP= 0
##$OFFSET= 19.47831
##$PC= 1
##$PHC0= -26578.37
##$PHC1= 17.78744
##$PH_mod= 1
##$PKNL= yes
##$PPARMOD= 0
##$PSCAL= 0
##$PSIGN= 0
##$REVERSE= no
##$SF= 200.130010282879
##$SI= 16384
##$SIGF1= 3
##$SIGF2= 2
##$SINO= 5.538805
##$SIOLD= 16384
##$SREGLST= <1H.CDCl3>
##$SSB= 0
##$STSI= 16384
##$STSR= 0
##$SW_p= 4816.95568400771
##$SYMM= 0
##$S_DEV= 0
##$TDeff= 16384
##$TDoff= 0
##$TI= <>
##$TILT= no
##$TM1= 0
##$TM2= 0
##$TOPLEV= 0
##$USERP1= <user>
##$USERP2= <user>
##$USERP3= <user>
##$USERP4= <user>
##$USERP5= <user>
##$WDW= 1
##$XDIM= 16384
##$YMAX_p= 483698473
##$YMIN_p= -1516588
$$ End of Bruker specific parameters
$$ ---------------------------------
##NTUPLES= NMR SPECTRUM
##VAR_NAME=  FREQUENCY,     SPECTRUM/REAL,   SPECTRUM/IMAG
##SYMBOL=    X,             R,               I
##VAR_TYPE=  INDEPENDENT,   DEPENDENT,       DEPENDENT
##VAR_FORM=  AFFN,          ASDF,            ASDF
##VAR_DIM=   16384,         16384,           16384
##UNITS=     HZ,            ARBITRARY UNITS, ARBITRARY UNITS
##FACTOR=    0.29402158847633, 1,            1
##FIRST=     3898.19430681471, 0,            0
##LAST=      -918.761377193003, 0,           0
##MIN=       -918.761377193003, -1516588,    0
##MAX=       3898.19430681471, 483698473,    0
$$ Real data points
##PAGE= N=1
##DATA TABLE= (X++(R..R)), XYDATA
$$ [...]
13419 -283467 535981 514663 -331066 -230092 151357 285106 169203 177450 387094 287763
13409 287763 310305 -94277 -300583 -213136 -69555 319863 -157238 272193 880053 697561
13399 697561 394443 65052 100181 -215768 -96737 162006 546694 370020 595000 305770
13389 305770 -319826 -517059 -472740 -216449 104584 -289196 -130901 97448 115693 157960
13379 157960 273899 237491 -545241 -386146 -299093 -332561 263104 -45487 -42642 -230406
13369 -230406 -406086 -851230 -675661 -163768 -281436 -580310 -93255 152642 199444 335891
13359 335891 342869 508962 548693 462208 -152604 -172355 -63531 -198572 -405736 -240306
13349 -240306 -589586 -124437 -403544 -435072 160422 291399 350273 129730 283646 275881
13339 275881 318472 -371802 442734 -83519 -342636 -99841 -211647 -194633 -638 429332
13329 429332 456769 -138802 74593 -86073 -164587 389846 278328 419306 -48986 -217626
13319 -217626 -343784 280576 367530 545097 668239 -505155 -454469 -143664 -441066 -183832
13309 -183832 -63115 264264 -147137 400249 567303 458403 -19298 -319580 -474669 300577
13299 300577 -38830 226560 357522 186232 -146173 29583 -246806 -435770 -290287 87812
13289 87812 66838 63895 -6758 390215 605345 205883 631819 432907 346296 51482 -22008
13278 -22008 50008 219281 110748 648836 -674335 -540043 90201 246152 -401764 -355976
13268 -355976 283010 173209 67495 -142832 273490 -160387 348599 -202610 290647 -51687
13258 -51687 -402081 -9889 -718950 -384130 -60456 52894 -130863 -302579 63251 -689291
13248 -689291 -395277 528793 533871 503690 -272520 33177 146639 -97479 -286709 -110417
13238 -110417 218480 297102 -171271 -248901 -116887 846765 136597 28059 203308 -55541
13228 -55541 70263 166652 -28628 -36078 -112829 144128 -256170 -433836 -327710 -98022
13218 -98022 9963 349963 380180 363656 672320 -195237 -443591 110926 338353 52213
13208 52213 7413 311710 449577 -417534 -254661 -85073 376615 -311991 -218807 -330608
13198 -330608 -244565 -80907 -104697 -263339 -678802 -748756 -396578 -257392 -43198 107104
13188 107104 -65101 -326111 -396166 -727864 -642005 -591773 -894662 176832 471767 817537
13178 817537 422446 -291907 -196093 -117805 -539174 -361451 -290780 586920 323111 203712
13168 203712 446606 204435 -2921 -206053 239086 -105658 -202894 16839 118053 -72218
13158 -72218 -253598 -127825 -169757 -440496 -340939 -259569 -77000 376598 75339 -318905
13148 -318905 181538 484469 -210920 -174820 124153 -93729 -119299 640769 483059 583955
13138 583955 867187 367849 342540 535069 201453 -52425 710483 437300 280216 -46193
13128 -46193 -560249 -7492 1099316 579596 189992 197745 511069 277540 -121997 538920
13118 538920 362875 134451 213702 104877 -426797 -168429 -356335 -693765 191421 647669
13108 647669 494785 463256 130252 -4821 404546 221832 -209815 31436 109150 3056
13098 3056 -106448 151517 -116796 -20925 -74028 -402102 -57458 180994 -94460 302129
13088 302129 202368 -26836 299774 439854 287559 126874 -376740 -276682 373110 -618963
13078 -618963 -445237 253471 319070 -75644 -530956 105061 224484 -38406 -58444 -105306
13068 -105306 24577 429106 77191 -200918 -481107 132855 1274027 660004 469271
13059 469271 590068 659955 -300969 321651 409247 31070 136462 276655 375419 170301
13049 170301 213662 592034 413755 -495484 -85343 -457886 -1035496 -604617 -25107 -272612
13039 -272612 -56992 651214 928160 210983 271626 368325 211115 473785 677991 315819
13029 315819 -289535 -225752 -202688 -140811 138224 -105684 -432727 62442 524954 581113
13019 581113 90391 384950 352339 527201 695440 -150251 283415 25088 -315758 192510
13009 192510 503912 759956 -53863 123094 369799 52385 11770 183724 451886 299396
12999 299396 379872 846207 596092 572268 676454 378951 92748 -128019 207673 427250
12989 427250 -464860 -515854 -305469 -400684 -195553 145458 150773 333713 59154 36676
12979 36676 259994 381683 210820 -210854 -600833 -344769 5809 48949 265539 360438
12969 360438 -451219 217661 738106 95948 -68362 -342144 185983 -218537 -315228 -149284
12959 -149284 -28512 -102778 102086 36414 245620 446689 490279 204688 452112 624279
12949 624279 492230 171558 -662737 300552 471779 275553 429226 802394 450234 185590
12939 185590 -818568 -719160 -566723 -54006 429477 110179 -16586 76232 191055 226726
12929 226726 442201 -163521 273087 -466417 -585414 -54018 458165 778577 740038 520888
12919 520888 309170 240084 526530 330333 336208 -87475 -20082 62507 240701 108204
12909 108204 229957 641661 174434 49347 316778 120775 -89294 81558 345023 52083
12899 52083 238244 96670 237132 89584 -485854 -247465 211473 165152 619621 228199
12889 228199 -179888 -100990 63908 320527 196780 76436 52618 -524459 -477167 -83899
12879 -83899 106695 158178 77193 -248689 -218646 168336 58368 -286513 119686 286291
12869 286291 365429 266923 -177606 512401 733292 -127064 -193530 -267965 -152293 203659
12859 203659 46339 -202297 200459 46837 -359476 423714 148468 693981 188807 7185
12849 7185 201101 29977 -228540 -372084 -199347 74625 186123 -443426 -43590 -89625
12839 -89625 -230333 -347152 372551 372556 109293 -127404 -363988 -236863 187480 725347 987900
12828 987900 417350 530228 813717 113995 -137475 -420192 -432486 128910 -139047 -734696
12818 -734696 -241173 -190259 -94171 -433486 140200 155706 624872 -130112 88437 -758482
12808 -758482 -10001 126057 101521 -277584 -537795 -294723 348327 -152534 -13093 340765
12798 340765 -22429 -111802 230109 426064 705604 497354 49837 -132250 -36583 626905
12788 626905 295266 368630 300841 -338454 65673 303414 -124722 570364 292609 404826
12778 404826 856180 601031 269819 367257 377892 294830 281122 381994 414746 -3636
12768 -3636 -279438 697616 705114 155457 263214 433793 547561 44785 9110 527522
12758 527522 -210320 -389094 -269077 -810760 -440732 234013 376 330995 140239 204626
12748 204626 174243 30821 -106910 281455 -13620 -251951 -265735 -615544 -655868 -91846
12738 -91846 306417 553724 177850 419722 477296 663634 199382 -18341 -215604 -163072
12728 -163072 126758 220670 698296 172611 -335767 -279697 -604424 -550749 -898417 -375849
12718 -375849 -336241 -64168 574863 -535618 -411170 -549776 -405266 -177448 -85685 -248354
12708 -248354 -500170 -210119 -96930 451519 444377 440685 287505 411708 602149 96364
12698 96364 80354 166599 160337 -154840 -791291 -430131 37496 -313736 259589 24876
12688 24876 -527447 139162 -146194 -536956 -55015 -585025 -392238 177741 504648 -481574
12678 -481574 -604873 -848081 -377695 51679 -495609 222097 -386835 23432 200963 -160366
12668 -160366 438998 103911 -185122 -556269 -757871 65717 8533 -162427 -42114 -136488
12658 -136488 -216458 147644 -104077 261363 20650 38227 154160 -392340 323447 573761
12648 573761 148565 -599030 -74535 325494 -342351 77421 -317513 -368069 -204247 -205084
12638 -205084 93005 -18553 -127796 -412679 -420705 -421978 -602287 53867 525681 571240
12628 571240 383259 523086 168184 -299860 -206483 141486 263496 59034 -105705 -281829
12618 -281829 358052 93969 709627 564931 753107 936158 -152692 -648195 -256936
12609 -256936 230882 77669 285004 396735 624547 316960 44132 151428 89503 357297
12599 357297 444147 -95489 -305345 -159156 -621788 -778983 -360240 -127448 357916 -68011
12589 -68011 -641181 -370193 -437966 -518046 -329235 -88666 329225 -36532 512052 617738
12579 617738 126214 -139553 -469977 -54018 86801 -305585 189614 58929 -949698
12570 -949698 -761823 -469618 -31343 187232 462514 -75289 -125164 158435 -102552 -202048
12560 -202048 -140673 -398723 -386841 61618 -229579 -357377 190340 -141346 178488 -462071
12550 -462071 -108909 -280928 -519661 -617154 -330744 -584020 -294728 -47466 123609 -10325
12540 -10325 205903 -189091 -109312 39391 30940 664552 269017 496847 653419 322883
12530 322883 -39070 -122974 -277863 -172957 -129571 142794 -69264 -155951 -197499 -359145
12520 -359145 154054 -110241 285169 -1572 81820 397471 -86968 522297 734424 116320
12510 116320 -12215 386209 439422 32177 -164087 205615 97225 323283 -230714 39446
12500 39446 -212128 -406699 -162567 104078 799014 1082110 798618 572339 302250 28728
12490 28728 -41564 365683 -604196 -63465 345412 14515 96130 747893 66959 -205742
12480 -205742 -512086 -210567 -50537 748546 729529 302588 81664 453358 576288 8184
12470 8184 230020 -212005 -159254 138149 445723 97892 -104519 228445 447266 224710
12460 224710 32390 -155359 -187745 342258 549653 992610 956504 -52049 584213 843493
12450 843493 6777 347004 405101 -51377 -522768 -648357 -418758 -501411 -222057 -377233
12440 -377233 202966 -113992 -433848 -739221 -789966 -255826 44777 141640 -62030 -86024
12430 -86024 664867 316330 -168619 -75391 475301 229232 -245248 -250899 314616 481871
12420 481871 179057 28870 161274 174725 107747 55677 -523067 -25649 55720 137875
12410 137875 90697 215353 -169978 -326249 -81770 -20195 -147414 -343110 -253474 -295900
12400 -295900 -546869 -279123 13379 573449 -152629 -387675 183628 -66887 -374787 -689613
12390 -689613 184711 253949 -120700 182957 463117 347811 101778 -477041 -729836 -77605
12380 -77605 -303428 -71583 172182 9519 107917 181257 481127 -286091 -411077 -338808
12370 -338808 -321663 -6243 425852 289829 146751 139618 128705 -77028 62596 -167604
12360 -167604 433034 436731 154231 319563 -327433 -135235 -343892 -582316 34819 567888
12350 567888 475523 441596 737634 531627 -454234 -248033 143892 294746 88414 333644
12340 333644 458439 -370324 -361681 -176029 49714 -51599 -48962 -253448 -317753 81307
12330 81307 66039 -222161 52935 615401 159741 125282 345781 522992 393537 -266092
12320 -266092 -503885 -382802 -91807 -274362 60914 -76132 -357682 -440731 -294147 32074
12310 32074 -7057 303686 468066 -111704 270122 54427 -456875 -714565 -171041 -372827
12300 -372827 -116994 -167330 213182 457264 -8072 235205 42804 461088 -210566 -467347
12290 -467347 -332271 310059 342920 -530881 -295486 48281 89831 346613 167361 -2138
12280 -2138 333504 732745 189231 -126604 217884 689235 335503 -31661 -846178 -347766
12270 -347766 -244378 -452351 -135467 -314952 -214306 -153880 111061 247297 -235862 -412640
12260 -412640 -127141 23244 -347282 200597 11939 -410299 -421293 -588012 -418601 -59125
12250 -59125 350626 -197058 37625 501368 352053 661377 337236 85664 -143867 98091
12240 98091 -194108 271103 38227 -79654 336856 576092 595810 -125761 146014 -329055
12230 -329055 90527 83282 -110113 37611 284105 310354 47467 83158 772640 142688
12220 142688 88144 531263 88708 -596850 -70144 -35163 -389758 440702 2144 -383756
12210 -383756 166630 18471 -76515 -231238 -144875 -576234 -214897 404363 -86180 -502273
12200 -502273 280268 966149 414386 39451 515986 266272 421453 722786 407337 572198
12190 572198 343056 -307460 -320013 -442765 -339089 371869 -20144 -138616 -637278 -409045
12180 -409045 -224942 -392085 -127397 178249 580736 -128331 -2345 506818 129388 194098
12170 194098 445609 -81102 108126 808230 351190 528141 154341 28407 63331 -90510
12160 -90510 384325 34649 -114266 -135245 27011 252144 277493 -269333 -728208 -393053
12150 -393053 -418581 -63558 220829 269273 146176 680355 1571 -109593 -412894 -184948
12140 -184948 -88091 270680 831414 423207 629198 648460 886486 3466 729764 400718
12130 400718 189436 529916 319750 -348985 -410143 -73516 -414043 278042 886704 650301
12120 650301 -944550 -236293 -133817 -252520 267367 482183 423966 -8494 -450962 -576959
12110 -576959 324754 441932 -54144 215470 -167568 -370914 -391647 -72881 -138158 135145
12100 135145 81917 -169472 -310722 -112517 86044 -209177 -166524 -159258 146608 -365056
12090 -365056 30761 324227 15741 235352 -506565 239764 306152 -566025 -345697 -74096
12080 -74096 498918 251185 -162765 220406 275738 160556 641408 937223 335220 -125046
12070 -125046 145018 165544 9207 34121 -3770 -395402 95407 255503 28849 259671
12060 259671 352725 -299492 -196110 -30879 -43969 72985 -17539 -38320 -217403 -722829
12050 -722829 153585 -170500 -5829 870579 711003 -150727 -190956 -270080 113525 -165226
12040 -165226 348684 192920 245218 -42497 -346233 38276 -52309 662572 514252 76018
12030 76018 -369105 -251665 -268730 128676 604253 545471 349492 28955 -46746 50310
12020 50310 -81076 -265159 -476074 -298522 -239005 -101146 -281300 -194092 80935 19320
12010 19320 -394065 -910525 -675050 -227167 -588890 -15394 92892 63645 277503 168957
12000 168957 132489 497418 -131969 -592679 -303107 -143867 214020 -171973 -186731 -374945
11990 -374945 147319 154399 274349 -494699 308882 -231426 -435673 38741 -460600 -245293
11980 -245293 -230840 -464800 -376572 -119198 -320342 -834862 -329719 -61580 -460660 230047
11970 230047 141051 270396 27086 500733 -97989 -39784 -354729 -678463 90579 260728
11960 260728 -422228 -72952 -833565 -713800 -262720 -575259 -439882 -30055 189125 -69835
11950 -69835 231590 84026 -225268 -90226 -263664 -12613 13272 308399 560729 -17367
11940 -17367 103401 165440 59821 215489 34430 101159 -175212 -147790 360686 80036
11930 80036 746893 173729 -79104 31050 -477348 -354657 -161698 284899 -43535 -70198
11920 -70198 -320715 344155 694338 56643 285172 -399334 -82931 45297 -154440 -348962
11910 -348962 96261 -5489 29652 238552 620972 225314 -165277 3756 -207597 -170786
11900 -170786 -570811 -404728 -162174 81714 -3237 701959 301690 409216 -69983 -41808
11890 -41808 -597926 -738081 -166050 -84697 343861 6858 -713934 359748 880036 758491
11880 758491 511155 -57291 -101822 279452 -343242 -192759 -5317 799297 744445 101718
11870 101718 396817 -35257 18460 -125229 70287 -679624 -76533 -154129 -247835 -131263
11860 -131263 -651680 -256730 198055 -279477 -677315 -216904 253979 -517949 -407470 -362516
11850 -362516 -457292 -848378 -91114 124041 -720975 -131675 -495373 -258463 133291 147161
11840 147161 -336220 113950 41540 -564414 117625 -185417 -116943 -320325 63143 -401549
11830 -401549 -399290 -438992 -107654 297225 444746 -62256 -427833 71407 -240442 -385264
11820 -385264 249671 363886 -2510 -894724 -435424 -146389 323476 424385 -15793 607863
11810 607863 275519 -46560 456059 487905 -407129 474128 100094 -171084 -47151 -73893
11800 -73893 -444196 -111088 249320 235577 280048 169316 -36119 -460522 166880 664251
11790 664251 122989 -40508 361647 -465849 -284743 197304 198987 652912 491570 774385
11780 774385 674980 -444466 10148 -152849 -300696 273657 535627 1066027 8168
11771 8168 -578108 3713 -17137 89119 298380 594670 -27327 81705 -265219 259540
11761 259540 219190 52937 189905 -76632 153182 476178 482141 -157653 -430492 -123584
11751 -123584 630 -451044 23826 -379800 220218 314762 -143509 400920 -28514 -88560
11741 -88560 187553 95082 184597 182327 28185 6883 47664 -278493 435299 706333 566507
11730 566507 327447 -53354 255499 -298491 -737466 -312638 -255699 -152041 -458798 -71172
11720 -71172 -91491 445290 -206595 -478644 -426651 -695 -9083 -212202 -374164 -947920
11710 -947920 -670344 -896960 -448241 380273 235305 254627 194443 962371 214494 -255713
11700 -255713 177478 -348986 -908374 -838878 -86640 49782 -72125 -217156 22011 -318804
11690 -318804 -474646 -705521 -327135 457408 185649 -513113 -750728 -364438 63049 -514866
11680 -514866 -659458 -304236 27055 -285049 -447664 186385 -19177 -69461 77929 -453050
11670 -453050 -164730 141558 151429 -82112 42962 -73845 -329522 -270600 -95419 -209500
11660 -209500 -146131 -641179 -194569 -552519 -811558 -386287 349138 182485 260420 -334557
11650 -334557 -180336 -350638 -282867 -21655 -466752 -228133 -216131 -97624 -803190 -599170
11640 -599170 -629636 -376536 -695418 -106262 135256 391515 289448 51014 8894 271550
11630 271550 29929 -523083 162026 126189 -202074 -269093 -156238 -211224 430914 -253265
11620 -253265 287977 -132967 116919 162840 -290872 -71166 -128117 -453831 -226150 -186770
11610 -186770 -219869 -268791 -134708 45555 -517218 -443389 -241242 274064 496891 495125
11600 495125 134571 755643 465156 319311 532197 847479 316146 506555 117536 129835
11590 129835 93335 107413 434438 751450 -251718 -313029 -402441 -70250 -225364 -250317
11580 -250317 96653 234497 227707 420725 445394 -62540 -265339 -329583 243932 490230
11570 490230 562342 355726 184200 190152 -220903 -392532 -727997 134853 -204342 33971
11560 33971 314881 199203 -292035 348550 395664 24642 -16554 -624874 165054 -308915
11550 -308915 111923 601092 487138 342552 235581 -145236 249311 -628331 -179883 -282658
11540 -282658 -307777 713265 584189 262875 -489490 -596190 -497732 141200 -84329 -222814
11530 -222814 109733 -118372 -308435 -375368 299100 -74242 -406800 -79370 -136596 -243242
11520 -243242 155140 319750 98605 5502 712238 668909 309730 -740698 -644496 -316816
11510 -316816 5400 -309082 -20498 -149732 -249954 288335 297157 -406339 -359214 458139
11500 458139 210242 -499439 -203654 53379 429614 226594 250868 -390929 -535898 -260418
11490 -260418 -282692 331479 179663 -22438 -638521 -397634 -228324 -286469 -72182 -74007
11480 -74007 542582 862640 920591 54001 -467525 -139624 -354596 -250596 -317198 -253504
11470 -253504 257369 213391 258509 118712 488928 634891 196106 -166205 564638 -13383
11460 -13383 -315562 153391 38082 398887 97738 386061 225373 572922 127604 -316850
11450 -316850 221845 476349 77105 -259211 -83303 -554872 -219340 -1541 -120388 -364712
11440 -364712 -530207 335892 205860 -3286 -114957 -192032 -76690 152626 -108285 -791656
11430 -791656 -1373556 -1124992 -733976 -780685 -714511 -824309 -524460 258864 92638 520352
11420 520352 -121131 -23218 -62831 -161596 -2730 160238 -468237 -400412 -427474 -419419 -289126
11409 -289126 71389 259055 -103701 97433 225265 458602 -57081 -296903 38352 -53674
11399 -53674 -11440 -44363 160347 892439 438455 -78344 -588648 -889222 -122612 409545
11389 409545 192874 93091 262090 177170 23961 459689 285976 370241 33437 504118
11379 504118 840194 -453740 -800514 -47069 395527 622800 481635 593424 541769 152936
11369 152936 656709 -133033 -63248 -247790 -285822 -377345 -390255 92661 -587021 -585720 -539055
11358 -539055 -912288 -594031 -602808 -404536 77350 -104188 -169163 -185351 -665055 -671627 -499722
11347 -499722 -425397 -1010581 -807304 -255969 -115211 -188021 -482568 -117436 -116808 -317871
11337 -317871 -433178 -570009 -304841 399150 494477 558680 110301 101200 -333499 -390982
11327 -390982 282574 -683710 -655015 -246598 -339742 -505504 161793 -113139 269488 139681
11317 139681 78200 -67067 22830 -116335 -269870 75555 -354618 -194106 -677162 152110
11307 152110 537604 -18183 -755086 -8902 -78138 -387726 -678145 -382730 148521 118358
11297 118358 -247836 -340584 -709237 -629171 -589394 113356 142358 -105875 441617 385079
11287 385079 -310259 -11798 634790 104342 111671 410760 -8493 -329526 -27738 220237
11277 220237 -19485 108563 -9759 -91007 17017 372525 72563 457337 -5619 -385734
11267 -385734 -270906 -330320 -91984 -418971 -260287 18994 -362816 -564858 -710613 -589048
11257 -589048 -24763 -492307 -406748 84662 -49093 760 -62377 -345853 -700241 -464318
11247 -464318 -357199 14079 14783 -17581 221261 560000 -486860 -606690 126640 -822607
11237 -822607 -704023 -244296 174172 188852 -169117 -849509 -216006 -631033 42199 -500704
11227 -500704 -613205 -247102 -408080 -132445 339590 212419 425598 444832 227565 390972
11217 390972 194292 695747 238508 253751 64443 13749 -64014 -311702 -131704 201282
11207 201282 65397 3547 -290161 203509 356880 223285 -193877 -345640 -175858 -230939
11197 -230939 232681 255162 157747 -357433 -335906 142562 94219 -94627 64582 -111310
11187 -111310 -366045 332215 304096 -101543 -148585 138569 302094 74167 -331580 -261052
11177 -261052 -417583 -314698 191649 -202926 310524 -5016 -419691 -131318 -261050 165286
11167 165286 340204 248144 -326960 -424096 -214803 -455285 -106979 -35585 45290 -56646
11157 -56646 75674 129103 192435 232328 -33136 -507255 -527102 -679946 -22135 -94170 -32321
11146 -32321 449115 369025 -640245 -885971 -636507 -399020 -127912 -167242 -325749 -140942
11136 -140942 -109350 -145360 -329140 -277038 -427167 -582124 -643909 -209187 -386558 -299297
11126 -299297 105575 -546023 -317196 -227174 -427661 -642668 29791 52517 -83899 -910338
11116 -910338 -669944 -227930 -80661 -278177 72890 -350493 -612798 -381173 -340968 -138111
11106 -138111 -372842 -524947 -848238 233621 234646 -348335 -61447 423106 241765 -318965
11096 -318965 -202430 157215 150628 -359466 -173065 28316 287732 -92541 -172985 104563
11086 104563 -80742 296263 -128470 -25461 -413989 362412 225044 -880514 -667076
11077 -667076 -446607 53507 -292282 170965 938330 35642 -137870 -524593 -563870 -330138
11067 -330138 -484024 -317565 9724 225758 121119 -774118 -151370 -416382 -342190 430200
11057 430200 54821 223535 542549 251569 -107673 -152040 -278728 128389 15725 559458
11047 559458 32511 -186320 392222 438084 244842 536525 19672 7068 -7167 216702
11037 216702 -445475 -609264 -59516 385774 429457 298083 410143 263692 168893 -147775
11027 -147775 309964 672170 -589231 -769907 17276 272198 247285 -124936 -51777 443765
11017 443765 239367 -74487 -420685 -416340 26242 145019 194691 -9565 -142562 -14392
11007 -14392 -450708 199633 776632 202506 -14542 -103995 -185291 -337191 -4891 464125
10997 464125 359126 217768 446160 -46463 -134947 403533 173635 221612 -353982 -229376
10987 -229376 -402734 -696512 -174291 -629483 -1025754 -597183 -595104 -449460 -347318 23423
10977 23423 -169626 53650 -110624 -473261 -379642 -33110 627778 582309 758528 20489
10967 20489 -657147 -526968 -17102 284437 623407 626744 144851 -404519 -373196 -189735
10957 -189735 457796 311585 479515 549582 233256 -426443 339950 203496 88436 -133754
10947 -133754 274882 119578 -534023 -475357 -44870 3003 -321949 25477 -19902 -143015
10937 -143015 55312 319876 208395 163966 297664 236775 735754 1234379 318839 96479
10927 96479 -382392 -709802 -330760 -695579 -775157 -134226 -329417 -90417 -3555 -264483
10917 -264483 -310700 -392996 -15891 -660215 -69566 -2222 102137 889623 574632 430032
10907 430032 -548670 42989 92875 -555991 -469228 -134213 -267776 -302970 -762404 -247475
10897 -247475 -373535 -880124 -502298 -1038312 -637553 235631 -212510 -422234 -224067 66154
10887 66154 162251 -141369 -237137 -121170 266009 319009 -311207 -240120 405897 158439
10877 158439 39654 -332616 21692 -476067 -89607 89406 -437714 184643 -695012 -199808
10867 -199808 67249 247027 -489502 -514434 31938 -461931 -596078 -874684 -423866 29466
10857 29466 -408361 186203 188043 380261 424204 -92165 51589 -317347 -81993 20050
10847 20050 202018 -325280 -601615 -302410 -8606 344417 136615 -39362 -202467 -170379
10837 -170379 66683 -538824 -481288 -212485 -163216 -379711 -425449 -795602 150411 -20659
10827 -20659 -564869 -478155 -367181 119116 43330 -179728 -179139 -213993 -76352 -915305 -385620
10816 -385620 -240532 35346 -69479 78396 -304675 64716 239950 199966 -464227 -592633
10806 -592633 -509811 170778 -105638 220457 551815 162104 581886 470450 -29970 -602460
10796 -602460 -87048 105679 -164418 51958 -98122 -837331 -49890 80517 690138 42920
10786 42920 -501753 -174105 -119091 -367035 -92746 -368308 17944 -51184 90221 -337415
10776 -337415 241390 411705 167454 39691 237240 383298 -286428 -228201 -93500 -97837
10766 -97837 163056 191477 450013 326469 24768 -128714 -254588 -683105 -327386 182158
10756 182158 -73114 -225148 -11157 -221159 -12586 -238352 -64182 -240989 -404760 -339766
10746 -339766 -740356 -545523 -46164 -39120 -232730 112550 26036 102262 158436 -585955
10736 -585955 -479078 -773183 -332644 131583 -283317 12429 393286 -503060 -760130 -177918
10726 -177918 420268 -129182 -378315 -91831 357461 380218 -83394 -70004 -313286 -98774
10716 -98774 -302637 -172133 -8514 -22151 197274 -381005 27954 174443 458954 -3798
10706 -3798 -428061 -595548 -161045 -182295 -532330 -59378 -32396 -63574 13192 350838 -12326
10695 -12326 -129706 -49790 -392168 -886972 -300451 -532105 -267934 -125747 431133 627687
10685 627687 -256097 -295334 -71488 -159627 -120822 195570 23672 -364318 -809655 -963915
10675 -963915 -432366 -437653 -346662 -836564 -721272 -550440 -287197 231544 -212351 -255409
10665 -255409 -233774 -534811 249012 514873 588093 251512 295862 -227129 81898 80552
10655 80552 -222142 -260015 205548 223488 681385 211469 -7636 25136 14882 60340 -135825
10644 -135825 -509415 -404833 -676878 -434141 -143899 27674 117141 275561 244731 -79305
10634 -79305 -144830 -331647 -745876 -25102 90885 -103767 -255709 -728785 -213127 -19143
10624 -19143 -42486 293372 131499 80532 77205 -191604 160072 -149404 308981 -251088
10614 -251088 -216178 4934 426941 -133489 -188569 174579 -202410 -353008 107384 -81133
10604 -81133 -229295 -45386 47027 -330264 -792206 -411844 62417 43345 192301 631519
10594 631519 643271 -169414 -212495 91859 119079 291120 188452 160087 -11521 -467204
10584 -467204 -318493 -312733 151414 195477 281782 -210233 -308458 -242571 -796389 -464007 -121862
10573 -121862 -230051 -124356 70380 231351 292251 200774 -88514 -504523 -446987 295480
10563 295480 280394 190532 109463 -54811 -303617 -16033 42676 -16174 -110044 -262109 93519
10552 93519 274915 537192 -804 391334 516093 113092 246897 -22033 57500 61121
10542 61121 -556787 -293370 107249 -105776 -334478 -224311 -626681 323922 -326196 -660074
10532 -660074 308519 205532 -617356 -597675 -713180 -442151 -204462 -471736 -286541 -421070
10522 -421070 -238236 -212607 -92901 409827 162157 -582894 -646747 -313968 658448 378835
10512 378835 -352753 -576661 -471445 -3845 -12256 160585 291031 363089 226819 282554
10502 282554 -280994 -553440 -102558 -494740 -462661 -524248 -208306 -717619 -238527 336058
10492 336058 -491396 -925495 -202566 251281 376806 -90425 -369428 128028 81917 71840
10482 71840 -482553 -255549 -43005 -415252 -431940 -742169 -1105406 -1516588 -1104602 -888366
10472 -888366 -243900 181364 -261407 303193 -23215 128155 112087 -355151 2305 -273828
10462 -273828 -288078 -175965 -105504 234819 -273783 -859589 39983 -827011 -1284327 -368157
10452 -368157 96336 -94225 -524833 -491883 -216530 -424463 -471392 251350 114966 -198588
10442 -198588 -371027 -609834 -328186 -219275 -661506 -352680 639061 -13817 182622 243849
10432 243849 126659 60511 256782 -204689 -77538 588106 302875 157286 76768 88447
10422 88447 -289707 -43896 -481098 -493144 -183234 -96587 221528 474151 -199463 -165428
10412 -165428 -849203 -740522 -424454 -373520 313403 278866 393898 133909 123881 92582
10402 92582 -567096 -361360 -558027 -203804 -204263 -707753 -563185 -206073 -138891 -319377
10392 -319377 -34257 -118771 -305123 -103595 248911 179878 -191082 -402708 -937534 -473574
10382 -473574 135384 372606 81142 -172311 -541981 -743779 -588031 -641257 -1026260 -562245
10372 -562245 -134247 17504 281108 203889 -357793 -634096 -93033 -42171 -253338 -96698
10362 -96698 636238 228193 -380825 -244732 175259 -182234 -306141 218971 -277793 -575448
10352 -575448 -303288 -484430 -90479 -126381 -147176 156600 238131 -82770 -88907 -180704 -225525
10341 -225525 -82256 -192678 17430 -425112 123789 -423593 -141954 52990 296649 -135398
10331 -135398 -375511 -434320 -780873 -525362 -377496 -131485 -925261 -645683 -485141 -453417
10321 -453417 -366535 -503401 -512902 -509498 -927774 -663757 -640318 184939 407941 703725 92366
10310 92366 -456989 -164841 -152458 -420889 -614044 249628 479662 326075 -490790 -600242
10300 -600242 -626487 -360078 -164951 -523854 -56314 -374528 -231579 71192 -196782 -126757
10290 -126757 -463536 -488431 -379730 -137420 -358726 -316872 -213656 471047 467607 -278003
10280 -278003 -677409 83724 -21659 -247850 -124672 -284485 -48675 -412346 -363551 -193908
10270 -193908 -220717 -386761 656741 423559 -79467 152041 -168979 -213318 150162 -321171
10260 -321171 -854543 -430796 -37806 268094 -145571 -69958 87365 90809 247054 476980
10250 476980 660731 388862 -118056 -246645 -340709 192598 203827 44248 268731 -155801
10240 -155801 -226094 -441189 -285311 -46855 -359249 -562865 307625 285525 304621 61520
10230 61520 -646754 -874365 6167 -6299 -73078 8492 294177 -345646 -620289 -839027
10220 -839027 -546434 -522223 3157 173849 -131235 -140908 -431587 -235089 295106 492051
10210 492051 47033 -63285 103543 195932 -441316 -289569 -416792 -168035 -194821 -277449
10200 -277449 -277429 -294321 192348 -162129 -155780 -187801 -647698 -711005 -313418 217014 -542166
10189 -542166 -441033 117126 -266720 -749825 -660162 -470552 -294823 -664744 19957 -23443
10179 -23443 295923 -260281 -824350 -652528 -493946 -310515 -24528 -39463 -197934 -109943
10169 -109943 67499 -75522 -168354 -336289 -436979 37261 -520306 -506913 -861091 -399025
10159 -399025 -55389 196030 -348250 397142 95362 -187776 -1551 248924 -131155 151304
10149 151304 217159 -597786 -239349 -507358 -188220 -113126 -446731 -102131 -157850 -158373 183369
10138 183369 -232364 -337805 -461370 -546091 -516865 -87601 76496 273948 -335425 -387884
10128 -387884 -213100 -257877 -133189 276795 -211160 -303184 -700750 -588781 -187949 -322788
10118 -322788 28193 -220387 -374677 161346 189625 -75872 107054 -106828 -144200 480086
10108 480086 709063 412413 -639377 -267269 392892 -31443 -288085 290219 168819
10099 168819 -588811 -400917 111344 3563 -115942 -25515 -137443 -261631 -294894 -486389
10089 -486389 -413584 -264793 -28667 -227700 226421 510978 -352610 -204259 -103210 -430259
10079 -430259 -143568 171767 -221466 284160 362909 854833 841602 195112 8110 -386002
10069 -386002 -408327 -826960 -459670 -456791 -454597 591656 -88571 -606469 -144477 144102
10059 144102 -259239 -528506 -70723 171382 -233628 -722941 -13098 345100 -13220 106750
10049 106750 -269781 -585333 460353 -171532 -859515 -1019633 -262898 -248625 -776433 -381866
10039 -381866 -178039 231525 -149641 27891 438347 -332692 62252 -117036 -148929 129542
10029 129542 -160422 205909 46002 -42001 -750226 -1174916 -744654 -417600 -781145 -843328
10019 -843328 -340805 71966 -457551 -461140 -585719 -796228 -1086663 -464758 193742 97873
10009 97873 57556 146842 -193420 485653 480330 201809 -473649 -43457 412135 193227
9999 193227 3657 107613 -207406 -432104 -243797 -210671 -116031 -465172 89753 5732
9989 5732 565746 -50059 -456426 -278637 -346675 -246969 -155161 299640 -217294 -39505 92504
9978 92504 -566538 305854 283455 -467776 12212 -300631 -181006 -40432 -295806 -345487
9968 -345487 266102 170418 281789 606511 50102 349514 -158376 -141701 14140 372094
9958 372094 -42003 130509 -119617 -138279 43783 -118405 384092 263751 660031 348336
9948 348336 -47505 -174129 -409401 -446981 -184096 170828 -71197 713968 -45954 -550020
9938 -550020 -413509 -544206 -229714 -403000 70497 -160995 -52172 120876 796421 436455
9928 436455 208816 190851 -41838 -105128 -473262 -345710 73591 -325746 -130204 -648017
9918 -648017 -55712 -154336 -324365 -67898 -220869 27069 -258363 -320944 409595 596692
9908 596692 168994 -76953 -463634 -123888 -791552 -116811 288591 -144124 -458602 -706531
9898 -706531 -555150 -578324 -729481 -564027 187657 701600 174061 -614536 -222809 57093
9888 57093 -212031 112202 -39205 -271006 -418623 64149 -122747 -632546 -109440 183225
9878 183225 685689 295202 408834 1002312 424048 -335770 -118024 -128310 -77602 161062
9868 161062 -172592 44611 122897 -316022 -205004 620816 231877 483924 152053 -340137
9858 -340137 235072 -206955 -78560 57163 -153172 19920 355406 373020 40922 55218
9848 55218 -7108 -135886 -296880 -194839 208208 168218 -452520 82924 216677 143419
9838 143419 -133434 302085 369296 205583 317832 -42885 -200250 713257 423854 366726
9828 366726 318552 583156 502525 58075 248875 655614 551432 718121 176079 147172
9818 147172 237857 250055 552828 220286 196178 282265 10457 4005 52247 -113225 -389021
9807 -389021 -279826 -84689 -55196 136426 -177681 134605 356197 905127 -33691 261413
9797 261413 13329 -173459 -131156 -107222 -503575 -52336 549160 104434 -85099 208967
9787 208967 555783 440146 192472 286791 -544274 -297911 -314155 -497356 -227046 -463837
9777 -463837 -532236 -143669 -232782 -419525 -244674 381901 590073 -397316 -632040 -269682
9767 -269682 75778 178491 -140905 -652345 152775 574794 372247 -270519 235387 532593
9757 532593 304742 637327 377361 429522 195104 318773 -359074 -268743 254790 -411510
9747 -411510 -323428 -975134 -224138 -687 -297097 74963 708296 150525 -126917 478017
9737 478017 -73159 348461 121079 251520 -415868 -559999 -211229 -167525 276858 577340
9727 577340 1008375 590001 -239127 -224194 299618 -245737 98698 -89983 -43330 64637
9717 64637 -367383 -367575 -198304 -337100 -194243 186774 347698 6112 164546 41107
9707 41107 101307 161600 493291 804283 -18213 -395269 -427858 153851 -40414 -206932
9697 -206932 -168749 593930 457195 -401565 -134717 145422 12596 -234181 -181711 280576
9687 280576 -163075 -454130 -724047 -843703 -171486 -53045 -504383 -83011 -52642 302803
9677 302803 -177737 -173961 95962 -128100 -222839 -139189 205764 373027 -259190 -2113
9667 -2113 -16337 -69762 -19488 34328 429178 733545 776868 254559 -163771 335948 708801
9656 708801 -285654 -13991 219034 8626 187001 -133991 -321207 -60234 400271 516519
9646 516519 297281 507014 739981 288261 171787 143315 410093 441616 73454 -33692
9636 -33692 41091 206438 -96203 42872 -35694 572382 -260241 -47791 -562924 -258729
9626 -258729 490736 -212524 -331280 73420 420786 638385 626900 1114746 566848 276207
9616 276207 334733 95284 121739 696035 329756 237602 477626 804284 888444 60315
9606 60315 812315 650012 551059 488893 37068 246959 740071 531951 628729 252017
9596 252017 580187 1204181 562272 -58571 192464 61543 39203 218326 20676 -282569
9586 -282569 477946 530991 529700 449527 792705 508404 312625 231715 766817 1417751 952602
9575 952602 765711 908135 1062704 709467 1471044 1314023 1404789 1575954 1799449 1591117
9565 1591117 1328945 1287463 1287272 1179339 908020 889858 805929 988176 937984 202296 -250453
9554 -250453 557047 819790 249073 529713 145259 470348 -234684 -152836 410389 518837
9544 518837 388047 282108 -73006 179370 -154083 -390360 -186905 60858 367218 17327
9534 17327 -78366 38465 -510437 -358231 88723 -100218 76990 558370 452912 594118
9524 594118 208151 -233343 -573673 -432408 -337570 -634621 -370259 -381866 31764 385629
9514 385629 686828 -461637 -603521 347572 574319 -342529 -236375 -704665 -818503 -57580
9504 -57580 431358 465314 448318 739394 563065 496344 158321 -483285 -228865 -137079 219833
9493 219833 232504 -100649 -444908 -361309 -583999 -448673 370870 222417 735444 102933
9483 102933 -355129 40964 530331 257700 18119 -595285 -405138 -158831 -378421 273804
9473 273804 113462 361176 221410 383000 280398 -67434 -919722 -398319 -497749 -634293
9463 -634293 -803172 129322 -68221 3457 -246029 -232057 640098 254799 532095 907228
9453 907228 242101 268537 158944 418592 -172918 -139813 144786 -109433 371196 689093
9443 689093 485053 -94202 -128040 49667 190447 422237 482762 2786 342941 219694
9433 219694 14554 -261597 54690 11406 381119 106482 255528 515425 248024 310056
9423 310056 272581 526148 568549 487366 -417316 -267809 -88266 -142219 421218 125560
9413 125560 112135 -240270 25450 614422 695260 -518982 -211559 -47191 -71923 -324535
9403 -324535 -367541 24115 391045 106625 160009 354039 -72669 -8395 -127564 109496
9393 109496 284620 242047 -324330 -140271 323738 898238 542182 505725 152921 579114
9383 579114 352751 388720 451733 371768 212916 70312 631428 183461 -140830 -86247
9373 -86247 6520 -280555 274774 -138853 502396 590504 -98516 117165 -66910 -202266
9363 -202266 170791 287184 168273 -251342 75840 445458 410686 -65335 -34821 -4201
9353 -4201 -423196 -745538 -768253 -3581 -144258 -108894 -546529 -206952 535547 39838
9343 39838 -92491 -90620 248232 289708 254604 435518 32515 537072 427993 143191 -84396
9332 -84396 -154980 755955 203042 -261897 -31303 282873 -73336 304956 -278987 209233
9322 209233 393187 -750959 -540224 -686491 -247792 93163 -154261 -151862 -645498 -488031
9312 -488031 183617 415499 360667 207100 51170 260927 -141899 -424357 35908 27565
9302 27565 -462543 -416920 -266199 -499478 -29262 671547 396765 179930 639 168147
9292 168147 199079 83644 371584 252623 274352 82291 396084 34948 -64482 394074
9282 394074 325123 530152 115559 -38602 333601 99257 -362173 -341745 795436 411260
9272 411260 -60420 159316 -136419 130324 486016 49171 313976 732138 308350 -352891
9262 -352891 -394108 -126404 -95948 112286 -48145 -542539 24388 387063 512961 487060
9252 487060 5222 196582 351376 243251 426988 572180 208684 161747 -216208 297288
9242 297288 610134 679761 70208 494961 1070565 936554 271545 157793 637934 73890
9232 73890 449721 1067179 648326 -395774 121109 318645 54838 16189 45745 285671
9222 285671 337073 402509 440059 675827 508884 456617 803985 653366 516654 257567
9212 257567 346562 543947 183980 -241273 306894 399168 699377 231555 177396 107418
9202 107418 392910 609014 755549 886014 438115 469353 423671 183874 -22452 -47810
9192 -47810 142690 -365306 304613 277114 857907 574355 362085 415517 74578 458573
9182 458573 445222 818374 497992 382413 161344 21907 259334 118465 259172 31758
9172 31758 271616 -35358 21024 -149456 -129729 62762 -10934 220959 434712 528748 352663
9161 352663 384503 -247602 175910 -111694 -227815 -48072 -19068 420472 372981 498663
9151 498663 340437 269059 422661 446054 -171930 -144393 -152668 -136969 667056 1035598 719236
9140 719236 -29551 -292377 -7484 636075 634200 184292 250038 830517 867071 642771
9130 642771 179951 259650 124221 -98855 88766 364683 289062 556195 82915 261934
9120 261934 326576 1048736 472133 135687 455042 443694 -53526 262001 590647 606652
9110 606652 199240 18706 793888 -420382 -306998 34585 145962 175614 -411415 -214148
9100 -214148 -394120 174584 -225770 222614 338800 556310 930713 377688 326965 418719
9090 418719 375112 386090 139817 351781 -18609 679915 -183578 -756541 -149402 130400
9080 130400 494951 701088 63480 -522436 216170 582687 188121 -308921 27888 -134559
9070 -134559 -6084 10370 -196571 -38764 60081 -300205 -874709 -215024 285777 173416
9060 173416 250666 303769 228208 239601 431552 270182 933479 490013 214588 352421
9050 352421 396916 215184 464244 260077 109415 226463 76284 80673 -18741 677944
9040 677944 870743 932950 552165 283949 484059 403888 1079092 928563 971144 840907
9030 840907 599526 890323 857260 909729 211847 -23849 16377 607400 1301446 747245
9020 747245 369844 -154302 145320 754186 1069172 404923 635819 508236 514039 336825
9010 336825 165508 71443 976143 1318307 1295177 607480 682639 442368 571110 350001
9000 350001 485197 587576 559985 754870 951658 657100 1178048 1013004 612354 820982
8990 820982 432682 356619 312910 448607 1081606 949490 857699 675320 812498 1019787
8980 1019787 595643 897971 783420 696938 712689 884859 900739 781236 1009183 1255440
8970 1255440 788030 728200 767894 800561 864072 564066 495081 836739 250068 665873
8960 665873 219109 388180 381373 475639 967585 577517 129621 180346 506193 278501
8950 278501 -339960 376270 458616 455447 574809 1008827 957754 760621 894295 1103479
8940 1103479 402726 600424 1326962 584052 141540 1410133 1511265 1330517 905201
8931 905201 658122 1095692 866585 1034306 1415613 1304197 995978 967177 1018033 873258
8921 873258 898118 1420175 1389313 1384452 1176620 1216018 479019 917604 1345597 1118355 1909675
8910 1909675 1657861 1562615 1036057 1356473 1179913 769537 785225 755130 1213856 1501381
8900 1501381 1489976 1484222 1245930 1026890 1178310 1442212 1297663 1019839 1159176 1278313
8890 1278313 1388297 1137116 924224 1684098 1742782 1726344 2231311 1437147 1779531 1315252
8880 1315252 1337184 1404447 895659 1388074 1180183 789195 1592680 2287320 2127481 1760713
8870 1760713 2005037 1998017 1968635 2010900 2201068 2299934 2328275 2293917 3107374 2528588 2136611
8859 2136611 2260505 2419155 2753907 2683872 3141698 3111097 2928967 2885165 2890071 3049069
8849 3049069 3583733 3324774 2564680 2534815 2686001 2309264 2895415 2852309 2275531 2550994
8839 2550994 2485358 1676642 2107657 1902210 2052891 1572368 1861322 2699618 2131279 2112709
8829 2112709 2517007 2416780 2757826 2444237 1778849 1593180 2501237 2766327 3053477 3025909
8819 3025909 2890520 2802136 2534225 2709001 2569373 2980943 2130021 2909202 2447304 2222619
8809 2222619 2310600 2546649 2726409 2857447 2947179 2721946 2980683 2962561 2678147 2706393
8799 2706393 2651002 2937899 2959418 3092357 3300240 2865475 2725729 2803183 2317746 2765007
8789 2765007 3015134 3488745 3488413 3277647 3016355 2698748 3000800 2926321 2570222 3376477
8779 3376477 3468150 3457484 3559888 3590696 4136547 3994479 3851068 3727101 4003480 3943258
8769 3943258 3096191 3136993 3824662 3775339 3981748 3517036 3604875 4081681 4267919 3652954
8759 3652954 3816242 4329042 4673970 4685068 4729861 4418756 4533535 4520823 4452565 4277284
8749 4277284 4875028 5195320 4760511 4818556 4995505 5434101 5099569 5245403 5355328 5311673
8739 5311673 5579952 5176805 5534787 5428478 5822791 6422265 6293266 5878783 6178773 6131405
8729 6131405 6281904 5745022 5503819 6873266 7007461 6846907 7294155 7402774 7402838 8179474
8719 8179474 8195753 7939479 8452975 8375410 8501184 8943556 8668587 9334318 8689285 8944684
8709 8944684 9951462 9733651 9440612 10415855 10322180 10325950 10596071 10173319 10751865 11333329
8699 11333329 11328028 11053415 10912757 10949354 11663816 12080540 12287327 12433536 12923297 13157372
8689 13157372 14227843 14717984 14447376 14313042 14690428 15116822 15459556 16034485 16527078
8680 16527078 16899388 17456639 17627148 18238564 18212951 18725857 19459534 19494146 19989511 20161858
8670 20161858 20861070 21950404 22466920 23296098 23637259 24577760 24748900 25587522 26728112
8661 26728112 26853137 28141356 29229932 30566079 31745987 32365232 34543563 36821365
8653 36821365 38785946 41876595 44525742 46912156 49621073 51897812 53620236 55015851
8645 55015851 56019421 57305866 57257737 56918399 55552455 54020579 51903657 49526074 47638980
8636 47638980 45997271 43054633 41497806 40240350 39589022 38439726 37281939 36701606
8628 36701606 36274173 35839977 35943008 36137089 36197768 36136134 35742779 35959155 36463612 37097157
8618 37097157 37644266 38114255 39354593 39186438 40101317 41847985 42478990 43968288 45268273
8609 45268273 46680782 48041490 49725181 51001007 52235905 53780233 54244507 55265316
8601 55265316 56908719 57759051 58985316 59912224 60588953 61862116 63750398 65066330 66707182
8592 66707182 68536298 70700818 73855773 76998433 80349483 83637953 88562021 93715234
8584 93715234 98845451 105738545 113642432 122846337 133282278 145366681 159431482 175055815
8576 175055815 193114550 212039264 230587394 248571930 263335258 274468460 282129217
8569 282129217 286465977 286261797 281948463 274062404 262212790 247431039 230516607 212080201
8561 212080201 194651328 178671839 165165535 152809172 142484964 133107195 124516157
8554 124516157 116630484 109711591 102978899 97606025 93751248 90109542 86348979 83878131
8546 83878131 81525527 79258474 77043414 74605582 72420387 69953895 67543305 65670498
8538 65670498 62276087 58499503 55577751 52990200 50068613 47212285 45490595 43371048
8530 43371048 40776371 39053138 36742154 35047508 33953918 32971748 32124124 30765411
8522 30765411 29660020 29230397 28785362 27771535 26683046 26278607 26060875 26224251 25616112
8513 25616112 24753060 24828179 24396113 24017856 24116242 23969810 23990198 24004177 24532554 24907887
8503 24907887 24810822 24801119 24821492 25102194 25185341 25854712 25736066 25071458 24979194 25191129
8493 25191129 24805740 24730249 23449748 22316134 21749184 21811663 19953616 19386658 18555410
8484 18555410 18530249 17099081 17072782 17153526 16218893 16020721 15559614 14650274 14291121 14309709
8474 14309709 13982061 13261750 13622871 13756838 13436636 13923988 13301191 12962986 12951007 12504685
8464 12504685 12647816 12122186 11519761 12015210 11664955 12240101 11155273 11639286 11837515
8455 11837515 10846476 10834327 10710975 10651469 10844117 10465321 11009127 11360938 10747460 10897198
8445 10897198 11147681 10668726 10529132 10593822 10103025 10504230 10468008 10420665 10100900 9860818
8435 9860818 9669702 9869021 10367500 10424452 9979683 9566676 9616838 9413500 9956597 9539810
8425 9539810 10514773 10513244 9963447 9816932 9871160 10104587 10214246 9963678 9762963 10367396
8415 10367396 10168592 10175345 10417867 10361774 9877575 9985541 10328636 10239446 10345208 11104828
8405 11104828 10405489 9949537 10037387 10171533 10313456 10690662 10618836 10520298 10716725 10465282
8395 10465282 10456741 10074505 10842649 10409258 10826224 11077628 10586691 10951458 10880573 12058457
8385 12058457 12347200 11747922 12473408 12467906 12622337 12571936 12196405 12947785 12866206 12511399
8375 12511399 13332959 13223486 13391369 13464436 12981283 13319946 13688010 13856002 13418284 12870134
8365 12870134 13791373 14706304 14416675 13963632 14633332 14699322 14800503 15145509 15086343 15887886
8355 15887886 15771219 16228169 16409891 16724971 17600570 17704294 17646099 18006987 18289064 19129966
8345 19129966 20053586 20472078 20881936 21682134 22337200 23425474 24333598 26159815 28033030
8336 28033030 29248435 30379877 31390149 32852430 33363535 34085510 34716522 35423381 35115656
8327 35115656 34491717 33705324 32716573 32577240 31541140 31171430 29978251 29238473 29495909
8318 29495909 28848658 28575858 28903807 28970791 28927525 28970150 28778987 28751635 28694678 29112385
8308 29112385 29493470 30028793 30405637 30731613 31261877 31285840 31250175 31630026 31446781 31792959
8298 31792959 32064106 32694815 33803980 33815221 34623552 35166257 35594321 37126396 37235174
8289 37235174 37768133 38859123 39891770 41521422 42421786 43186434 44381849 45513726 46966273
8280 46966273 47969070 49604450 51319365 52219842 53377628 54993031 55424222 55782657 56793698
8271 56793698 57587699 58353270 59691361 60009076 60708783 61228962 62266924 63626475 64676390
8262 64676390 66827099 68526649 70344338 72046860 74733795 77201870 79787076 82631949
8254 82631949 86307312 90066591 94332155 98323765 102686750 107205002 111811331 115842669
8246 115842669 118675582 120738347 122583707 123936873 125731139 126589852 127829828 128293286
8238 128293286 129454024 130847182 132986417 135028657 138505968 142634228 147714304 152444329
8230 152444329 158742587 166323544 175024542 185919647 197632520 211742863 228833302
8223 228833302 249355826 271481137 295918814 321962180 348195224 372141877 393846279
8216 393846279 413319339 431756458 449405730 465684843 477867415 483698473 481879005
8209 481879005 470441994 450589495 424173156 391718624 357558292 322801829 291733616
8202 291733616 263997890 240537971 220119505 203080959 188736015 177485638 167515450
8195 167515450 159716888 152324744 148868553 137280704 130444507 128849085 124780828 122496692
8187 122496692 119507190 118087907 116483023 116645970 116115863 117471572 117966072 117472943 116543398
8178 116543398 114524717 111288427 107996904 103078819 98853552 93795799 89247363 85189163
8170 85189163 81922427 79433610 76687718 74701313 73603324 71742025 71212919 70591386
8162 70591386 70648134 69905049 70223388 71392689 71587151 72311151 73256783 74045642 74546448
8153 74546448 75734267 76646030 77931446 79784871 80341837 81025030 82560947 83076496 83827096
8144 83827096 84891614 85993312 87356992 89116897 90151274 90556572 90888099 90736030 90392319
8135 90392319 89821856 88703312 86594381 83733785 81308083 78809593 75830080 73121415
8127 73121415 71069979 69126005 67049169 64977811 63522547 62057762 59821055 57944666
8119 57944666 56419846 54550930 52267583 49617441 47342478 45586990 43949627 42279969
8111 42279969 41913857 41324296 39646755 38880118 38820818 39176486 38889654 38582708 38366534
8102 38366534 38635929 38455082 37409688 38188425 38624856 38225750 38218924 38317842 38370601 37878959
8092 37878959 37437742 37397266 37563242 37869137 38186182 38223777 39068035 39569959 39703948 41182346
8082 41182346 41879360 42406636 43117173 43654877 44693387 44322318 44852897 45075772 45912771
8073 45912771 47730489 49069449 51247127 52926515 55362830 58471392 61584758 65099685
8065 65099685 68958831 74208569 79742555 84248292 88938412 91323829 90492659 87123122
8057 87123122 83619132 80116974 76593349 73812046 71086431 69493752 67385214 65649839
8049 65649839 64309232 62434609 60382523 59237483 58987634 58425073 57326942 56861861 57065587
8040 57065587 57250008 58128178 58925529 59693290 60723618 62442261 64478676 66557622 68675111
8031 68675111 70655810 73117209 75643741 77391955 79491413 81938219 84748183 87701235
8023 87701235 90009034 93114411 96953184 100712907 103219660 106558709 109075109 110296176
8015 110296176 110599396 109558872 106392128 102298432 98015274 93697925 90026797 87403752
8007 87403752 84796585 83550786 83358751 83353398 84562082 86098932 88989027 92927156 97963628
7998 97963628 103845964 110876071 118694136 125199345 130702141 134036686 134564501 131611107
7990 131611107 126386077 120816090 114646705 109043921 103975219 100273962 96900791 94346400
7982 94346400 91222548 88258635 85691181 83543863 82449175 81723956 81508185 82157949 82395199
7973 82395199 83403142 83361282 81705274 78378402 74430583 69148708 63316952 59316675
7965 59316675 54965433 51266953 48064853 45586309 43287159 40322615 38671641 37607068
7957 37607068 36796067 35266184 34727110 33305572 31668960 31271146 30596242 29461907 29088265
7948 29088265 28273565 27603515 26195379 25970566 25331513 24032427 23717193 23295840 21691534
7939 21691534 21184882 21349006 21200137 21040827 20235485 20603510 19977532 19450469 18950265
7930 18950265 18155744 17825725 18067228 18098700 18110002 17854108 17073689 17119426 17355225 16600340
7920 16600340 17058442 16863420 16954217 17172874 16842422 15915666 15757560 16437593 15773403 15853787
7910 15853787 15761060 16203213 16579919 16935426 16822382 17140258 16990147 17367378 17620927 16032795
7900 16032795 17128183 17733828 18334807 18074502 18953213 19820077 20784397 21783823 22991938
7891 22991938 23835619 25320718 26592102 27472344 28574579 29555215 29119284 28648609 27822937
7882 27822937 26591583 25277040 23237292 22353650 21613165 20335253 19516231 18854475 18587787
7873 18587787 18296829 18636623 17874474 17750369 17745225 17461599 17654555 18201967 18939271 19014561
7863 19014561 19672753 20437813 21269307 22563058 23320191 24235376 25370847 25397942 25597151
7854 25597151 24712569 23416306 22186168 20833349 18992668 18219872 17092766 15841371
7846 15841371 14719640 13802162 13145717 12834616 12315701 11680209 11889193 12445404 11624834
7837 11624834 10349389 10363366 9632321 9401600 9543980 9521767 10304178 9992813 9632706 8970148
7827 8970148 9158763 9581935 9004393 8179120 8638561 8729778 8356165 7719969 7404311 7587179
7817 7587179 7605178 7446570 7126996 7409000 7081079 6884134 7255949 7169408 6969309 6776043
7807 6776043 6858157 6742669 6605769 6353053 6195510 6436773 6624538 6418152 6515097 6596044
7797 6596044 6337402 5971274 6150849 6556659 6672745 6386789 5796755 6428574 6085921 5526258
7787 5526258 6146266 6556417 6538908 6436414 6845027 6581159 6737480 7010654 6353998 6224630
7777 6224630 6555063 6748483 6879269 7361518 7843511 7364324 7195940 7081830 6609555 6702863
7767 6702863 6184503 6346583 6754497 6272549 6075972 6201969 6212557 5974543 6307814 6189041
7757 6189041 5971093 5540852 5426845 5677522 5535108 5947186 5951598 5998375 5432664 5285627
7747 5285627 5853736 6434032 5564469 5551873 5701429 5623589 6483919 6652399 5749774 5563441
7737 5563441 5788469 5471089 5456075 5183457 5350493 5775387 5612974 5529351 5568559 5417349
7727 5417349 5922849 6070009 5028007 5041678 5339476 4657479 4600889 5051620 4552420 4344459
7717 4344459 4802766 4411453 5130833 4574445 4556313 4823357 4708617 5227671 5238954 5332156
7707 5332156 4374099 4280133 5181858 5591135 5236707 5579158 5393798 5234635 4831525 4822916
7697 4822916 5178669 4824031 5665771 5326182 4969962 4605785 4387579 4664450 4583580 4531681
7687 4531681 5058670 4765193 5524617 5700118 5724871 5633710 5143165 5090379 5254142 5104090
7677 5104090 4935914 4818526 4642366 4711244 4752529 5460324 5343900 5513302 5006871 5512297
7667 5512297 5187566 4924268 4992453 4632702 5180152 5388134 5593536 5452201 5230612 5260026
7657 5260026 5959837 5901448 5754509 5381678 5788344 6147289 6206899 6203477 6054108 6380442
7647 6380442 6260665 6706632 7055167 7051613 7374428 7747767 7445467 7846517 7605285 8082948
7637 8082948 7916740 7299457 8019609 8186063 8228241 8652405 8325708 8364280 8048932 8086862
7627 8086862 8237502 8365447 8100074 8005238 8235355 8660018 8399267 8355817 8022635 8898513
7617 8898513 9029415 8658152 8994497 8938795 9356968 9715205 10357497 10883904 10698656 10015593
7607 10015593 10864437 11563660 11809221 12068304 12224477 12430202 13642749 14125564 14187502
7598 14187502 14536356 15253092 15484676 15705460 16507134 16862837 18022746 19212572 19932317
7589 19932317 21101563 22008829 23281524 25250793 27196905 29631958 32029018 35284992
7581 35284992 38396005 40915789 43230634 45201612 44942092 43697655 43004832 40727957
7573 40727957 38889419 36840791 35592303 34504021 34012630 34420985 34168104 33784922 35191545
7564 35191545 36536267 37928579 39230075 41036659 41920147 42449622 43504954 43397560 43423089
7555 43423089 43357279 43076145 43689822 44443458 45127471 46369918 46919765 46085248 45287437
7546 45287437 43088836 40984802 38467155 36079480 34412598 33117146 31836814 31319362
7538 31319362 31005801 30559724 31127188 31421564 32073963 33181703 34575593 34986061 35169186
7529 35169186 35424889 35325269 34432815 33097538 32517386 32435436 31710317 31941294 33347091
7520 33347091 33297932 33874302 34744545 35764182 36534031 36532744 36762823 35557609 34643387 32449105
7510 32449105 29793375 27056061 24752437 23086413 21559444 20181432 18572912 17264040
7502 17264040 16391209 14809447 14210707 13779010 13178568 12706186 12275998 11876648 11182117
7493 11182117 9914427 9646963 9430613 9486039 9403550 9138259 8957045 8134946 7771950 7136172
7483 7136172 6913189 7275454 6935939 6901869 7085874 6811935 6352052 6270703 5635546 5411839
7473 5411839 5261521 5471422 5028177 4694586 4845187 4465064 4062366 3807832 4445850 4434505
7463 4434505 3989037 3997320 4112964 3765543 3856882 4095700 3658724 3987333 3704767 3801972
7453 3801972 3638160 3283853 3409054 3212253 2365349 3135819 3861871 3427501 3764774 2723974
7443 2723974 3402017 3433543 3352362 3323599 3405444 2445387 2899724 3466146 3280256 2526242
7433 2526242 2834106 2929029 3311363 2999565 2495712 2575161 2766370 3340799 3099978 3402804
7423 3402804 3449828 3123174 2977529 2838004 2954943 2981282 2774283 2677898 2460025 2402082
7413 2402082 1899548 2512773 2552298 3027440 3029264 2477994 2603934 2949339 2346185 2221223
7403 2221223 2415325 2530904 2582875 2280712 1944322 1937236 2320746 2275445 2201593 1575938
7393 1575938 1892503 1697298 2213865 2729871 2895329 2484439 2554939 2793044 2645436 2274113
7383 2274113 2446160 2695046 2438806 2257628 2275434 2471573 2726805 3046648 2262600 2081958
7373 2081958 1918322 1955528 1993986 2383207 2629534 2270607 2651043 2862508 2058744 2038025
7363 2038025 2861954 2573327 2000477 1523231 1420112 1593546 1840405 2643978 2930458 2608553
7353 2608553 2341865 2176739 2464141 3094168 2257663 2421191 2709948 2776715 2768729 2601968
7343 2601968 2971449 2829671 2887772 2848122 2722255 2977697 2865652 2581554 3160821 2924861
7333 2924861 2905936 2898116 2694527 2517787 2669845 3008225 2664419 2623895 2274589 2442105
7323 2442105 2435686 2403854 2613016 2651011 3111091 2669897 2487324 2872845 3009255 2850563
7313 2850563 2851964 3427047 2949777 3881846 3072480 2872156 3262112 2716513 3168955 3418889
7303 3418889 3985516 4027215 3280357 3369860 3000484 3241738 3615218 3856217 3932629 3748042
7293 3748042 3446735 3925346 4419394 4247390 4123686 3988310 3944604 3917681 4036492 3970943
7283 3970943 3859227 4344414 3871163 3785736 4594822 4646617 4482343 4722940 4612563 4584588
7273 4584588 5345441 4989942 5193346 5279573 4978693 5214170 5186412 5055300 5004441 5340261
7263 5340261 5475974 5031778 4822871 5635723 6088391 6044790 5624831 5520509 5961900 6102609
7253 6102609 6280836 6345230 7057035 7374465 8391766 7993854 7984649 9297024 10003992 10207330
7243 10207330 11111373 11271169 11334711 11880902 12250529 12071526 11589411 11918837 11963515 10775897
7233 10775897 10410107 10448553 10356983 9985848 9743322 9855730 9155880 8847473 8697898 8271622
7223 8271622 8465286 8828050 9085550 8834380 8830633 8805012 8894623 9590758 9652500 9512957
7213 9512957 9758830 9844122 9831699 9547403 9739294 10957159 11032303 11040534 11521572 11725246
7203 11725246 12394228 12481412 13372087 13784457 14279149 15048031 15352997 15812864 17051053
7194 17051053 17512321 17866676 18440045 18555953 18769708 19732950 20031170 20070458 20464873 20820993
7184 20820993 21489470 21338030 21459307 21121449 20758660 21051648 20790886 19660939 18996154
7175 18996154 18316552 16918846 15737969 14732857 13910890 12658272 12232182 11504730 10553947
7166 10553947 10223077 9835383 9484295 8521905 8099374 7907804 7958732 7127305 7506618 7485474
7156 7485474 6481984 6465228 6295308 6277705 6554672 6785470 6197006 6492555 6656908 6086687
7146 6086687 6068667 5552142 6112168 6410183 5758775 5584185 5243373 4451324 4795239 5150740
7136 5150740 5283566 5155438 4593573 4844746 5002934 5437829 5250128 4756337 4566838 5146981
7126 5146981 5711038 5528772 5578309 5191870 5314656 5280885 5309755 5136504 5246741 5202724
7116 5202724 5198790 5010902 4860114 5688998 5329384 5578045 6331209 5827875 6112562 5664918
7106 5664918 5669629 5837809 5966800 6611954 6989174 6550038 6404519 6443576 6762550 7215243
7096 7215243 7140922 6584500 6516172 6780664 7444389 6964145 7067653 7821774 6987188 6979196
7086 6979196 7875908 7751969 8360268 8404614 7818704 8072089 7773884 8353674 8546305 8691078
7076 8691078 8271315 8740835 9290925 9355042 9273612 9852288 10275800 10069835 9883052 10174599
7066 10174599 10818533 11274692 11672137 11500845 11882248 12265681 11973799 11941957 12364381 12490317
7056 12490317 12346810 13001582 14107226 14556945 15254871 15657601 15251321 15939133 17174544
7047 17174544 17133967 17657136 17908772 18535124 19359754 20281395 20793229 21201725 21919357 22626384
7037 22626384 23622115 24275318 24554898 26108106 27145493 28045019 29319108 30205682 30879015
7028 30879015 32616305 34184068 35827173 36689828 38017345 40225012 41834186 44142708
7020 44142708 46540702 49296128 51922109 54766521 58178352 62533511 67049363 71996400
7012 71996400 77589954 84408734 92513882 101853374 113106480 125745701 139045418 153981440
7004 153981440 168353337 180410434 187108645 186989720 180916928 170300213 158009361 145407150
6996 145407150 134100321 125815084 118456772 113932792 110490387 109354456 109694874 111592975
6988 111592975 114519625 120242420 127241138 136644511 146990748 158930544 170347007 178449129
6980 178449129 182468935 179870025 171258725 158437534 143611993 128910423 115595496
6973 115595496 104524414 94703726 86705798 80277726 74569757 69834289 65203858 60911921
6965 60911921 57280395 54842599 52788335 50234543 47404031 44876735 42165075 39504271
6957 39504271 37051163 35534234 34223379 32762182 30984074 28538812 26869653 25598394
6949 25598394 23990331 23292106 22738151 21914468 19808086 19326908 18249666 17455893 16773796
6940 16773796 15852670 14658512 14260535 13686638 13066192 13057046 12127121 11873135 12013553 11875242
6930 11875242 10764960 11130589 11027591 10483135 10922784 10037384 9240310 9632137 9373811
6921 9373811 9146247 8667988 7800539 7971147 8280817 7297242 7195313 7549911 7513910 8098147
6911 8098147 7410206 7038235 6650110 6803898 6938079 6861283 6551468 6569249 5631026 6078127
6901 6078127 6321964 7369418 6981484 6535474 6742422 5891367 6129571 5793145 5246752
6892 5246752 5400565 5192572 5365973 5484458 5478445 5666908 6183197 5953830 5788442 5906468
6882 5906468 5622846 5999945 6016598 5780598 5194972 5710028 6361443 6287096 6076652 5947184
6872 5947184 5720886 5047026 5161762 5939709 5795816 5768422 5657326 6092103 6125247 6121945
6862 6121945 6695578 7222754 7279469 7039829 7860811 8013632 8171727 8807114 9337496 9689687
6852 9689687 10479794 10969087 11061349 11206743 10464540 10979557 11200796 10982059 10723041 10581470
6842 10581470 10162319 9316977 8964432 8475884 8401578 7335304 6746451 7015270 6211796
6833 6211796 5672758 5498887 4688888 4749385 4715924 5012710 5164420 4799222 4770148 4316487
6823 4316487 4108380 3995409 3720623 3210026 3875135 3698560 3287210 3441026 3919549 3253948
6813 3253948 3340003 3752974 3381365 2755927 2795031 3121822 2832850 2616337 2784482 2550364
6803 2550364 2624270 2583298 2319725 2690337 2193627 2624018 2833263 2549986 2811251 2646043
6793 2646043 2274226 2611851 2687280 2299909 2738628 2849931 2792248 2719296 3309678 2589730
6783 2589730 2449615 2833323 2314050 2698896 2462162 2244372 2393366 2497468 2602078 2559602
6773 2559602 3067647 3015310 3339871 3393686 3327289 3448485 3166898 3735730 3620993 3026048
6763 3026048 3060142 3430898 4156512 4310023 3649218 4074708 4525505 4535887 4964232 5880777
6753 5880777 5861330 5627462 5124397 5644228 6253299 6152047 6840425 7098126 7511101 7180722
6743 7180722 8069825 8572968 9363079 9978063 10745648 11427928 11927766 12570390 13077506 13986511
6733 13986511 14331662 15555606 16024836 16285012 15292177 15513372 15429326 14829800 14702445
6724 14702445 13780428 13221859 12481113 11836229 11720093 10498774 10029302 10153070 8834665
6715 8834665 8287442 7763929 7449253 6979983 6551400 7041783 6890611 5928895 5413299 5832735
6705 5832735 5832207 5038731 4935713 4805780 4237119 4514338 4137754 4899181 4634535 4272658
6695 4272658 4501244 4240618 3773651 3888272 4385216 4538146 4101963 3175486 3243320 3098670
6685 3098670 3122359 2731098 2951763 2858390 2864312 2942263 2495880 2124117 2531381 3104080
6675 3104080 2584110 2183907 2099122 2094995 2564633 2006362 1686133 2275359 2491250 2366539
6665 2366539 2599707 2622057 1967502 1565586 1606036 1593314 2045155 2208147 1949742 2257039
6655 2257039 2400700 2306101 2030849 1761980 2052729 2168638 2077113 2017962 1619450 1967071
6645 1967071 1661014 1511700 1999959 2324869 1976189 1977985 2182701 2035245 2680714 2293561
6635 2293561 1827898 1911750 2442537 1657019 2048720 2344480 2490039 2675450 1812450 2019426
6625 2019426 2316161 2705043 2012716 2460234 2124675 1757837 2396756 2454381 2849546 2546326
6615 2546326 2367179 2910849 2914634 2674511 2641681 2520814 2785796 3044370 3103819 3299441
6605 3299441 2537107 2435885 2564435 3116478 2974633 3271974 3146297 4086936 4557243 4361878
6595 4361878 4329646 4372421 4400714 4307025 5205194 5328646 5504524 5379627 4770180 4462611
6585 4462611 4727041 4552804 4385866 4270543 4547593 4157221 3499692 3098141 3044986 3380238
6575 3380238 3033961 2515112 2212072 2515552 2705349 2387234 2028774 2646262 2741678 2528873
6565 2528873 2076610 1328500 1528769 1452038 965347 638783 1314919 1525990 1409291 1615004
6555 1615004 1656678 1580733 1437542 1910078 1512614 1107519 918968 1225426 1343302 1328076
6545 1328076 1454215 1502718 1409420 1459468 1515076 1509802 2026467 1886115 1983621 1313499 1601199
6534 1601199 1494409 2047691 2226482 2280434 1816106 1702437 1199115 1713640 2281729 2646756
6524 2646756 2169033 2155860 2758952 1952834 2314013 2551339 1915951 1999278 2386460 1599748
6514 1599748 1742962 2317516 2685769 2858871 2732453 3006294 3232815 3950264 2971215 3159168
6504 3159168 3260387 3376060 3995287 3618146 3472352 3872304 4201525 3642683 3844048 3606857
6494 3606857 3904722 3810618 3921968 4143542 3874384 3518660 3892165 3777979 3922809 3531352
6484 3531352 3451366 3610307 3539001 3261195 2890594 3227888 3419843 2644452 2857863 3614601
6474 3614601 4197710 4402658 4263316 4064731 3940422 4771756 5463561 5805242 5669036 5817164
6464 5817164 6282551 6505569 6226383 6149555 5789242 6162585 6106931 5658144 5537707 5394363
6454 5394363 5169331 4685562 3824588 4050185 4030867 3230275 3358984 3513932 3153345 2944009
6444 2944009 2544382 2618417 2730974 2235504 2150859 2066364 1909869 1527622 1424856 1084840
6434 1084840 1843853 1862141 1620271 1421037 1655467 1217512 1137480 1172310 1538020 1130481
6424 1130481 1421674 1808617 1295731 1408402 1026836 1254416 1125497 831199 1525060 1355340
6414 1355340 1096983 1440319 1543094 1526577 1288517 1232774 698777 1074505 1038553 1026484
6404 1026484 1576857 1642718 1153521 1135312 950681 1832100 2477020 2404105 2658727 2087324
6394 2087324 1896394 1975970 1825146 2075234 1873832 1179748 1593193 1775009 1956799 1468704
6384 1468704 1537400 1880221 1579390 2636219 2115830 1421067 1644176 1412232 1615900 2172495
6374 2172495 1724389 1874390 1546333 1749397 2103326 1938599 2044052 1893605 1484945 1478092
6364 1478092 1983427 1978289 2592464 3247694 3644577 2782039 3013529 3178714 3460215 2725503
6354 2725503 3471189 4033842 3427860 3858566 4378428 5023701 5270262 5001393 4745983 5051588
6344 5051588 4463535 4571834 3983890 3431076 3066813 3251482 2990486 2965666 3122316 2505001
6334 2505001 2471051 1980766 2381208 2599937 2010730 1951130 1853375 1848550 1643109 1509933
6324 1509933 1561499 1534103 1198834 1067630 1678681 1311463 889236 1570089 1962676 1149861
6314 1149861 1504642 1498885 1598301 1997241 1706119 1071461 1205795 934492 779191 1659471
6304 1659471 1766844 2014670 1834272 1872307 1147881 1910383 1991618 1744604 1724679 1840883
6294 1840883 1741031 1526926 2066373 1844634 2037159 1165890 980543 1663332 1350027 1486397
6284 1486397 1532570 1470570 1528859 1746622 1783342 1655697 1723516 1490538 1664283 1647195 1400071
6273 1400071 1510015 1772482 1375829 821686 862166 1887920 2068660 1331140 1010694 1714217
6263 1714217 1145444 1076612 993275 997473 1380530 1338207 1573512 1741341 1814689 1215397 1300803
6252 1300803 1702006 1693067 1092183 1526759 1392125 1112635 1448533 1590913 1089987 1619190
6242 1619190 1713182 1689041 2327798 3125860 2624233 2462832 2251650 2661440 2416918 2351856
6232 2351856 2707734 2907308 2745167 2625546 3335986 3771305 3331110 3935328 4102063 4373951
6222 4373951 4405231 3964625 3830309 4388939 4074203 4013316 4095684 3587013 3949034 3821901
6212 3821901 3169765 3273775 3799064 3255677 3103115 2807408 3227421 2575567 2650417 2875212
6202 2875212 2831673 3272984 2945271 2554497 3206668 3043973 3117717 3573367 3057714 3225839
6192 3225839 3861208 3584214 4020224 3264985 3339080 4343754 4381950 4604910 4952817 4790474
6182 4790474 5237406 5801832 5448856 6214618 6304282 6987957 7333050 7053174 7340161 8102374
6172 8102374 9358989 9370976 10607702 11439734 12249992 12193991 12874953 13105676 13466815 13356646
6162 13356646 13374033 13167573 12405727 12535751 12178091 11843793 11307434 10670597 10655641 9902433
6152 9902433 9870183 9333160 8780683 8431611 8634423 7838465 7540243 7597923 7543675 7952256
6142 7952256 7968043 9045808 8498034 8951866 9504413 9340749 9816429 10858526 11572341
6133 11572341 11946326 12569083 12927588 13920265 13781046 13957936 13474518 13207934 13030444
6124 13030444 11567450 10574190 10918939 9907013 8654380 8690558 7524401 7679961 6438158
6115 6438158 5538545 5881807 5756605 5335673 4775370 4398838 4718543 4122664 4063598 4142762
6105 4142762 3919621 3869213 3763124 3270750 3394670 3156594 3219526 3373808 2895015 3033206
6095 3033206 3246387 3137861 3036571 3004698 3361765 3311775 2923583 3186508 3172858 3645879
6085 3645879 3561189 4032517 4183855 4040846 4559628 4413846 3969674 4200770 4399899 4275254
6075 4275254 4787737 4303456 5230245 5828965 6206961 5663016 5440398 4873036 4608698 4293465
6065 4293465 4124978 3518810 2802160 2953668 3474918 3202278 3023845 2982475 2179974 2251156
6055 2251156 1412137 1623824 2030984 1944594 1401877 1666069 2003626 1621393 1724843 1749189
6045 1749189 1435205 1185901 1217905 1386785 1200220 1111024 1050628 1153111 699782 731237
6035 731237 878229 956050 331374 605357 840401 233429 1030154 1015259 1252792 929845
6025 929845 1306233 902805 225237 832850 770116 154158 451054 836118 961112 665136
6015 665136 795999 699890 503305 -267611 -153135 622930 120682 413576 -36337 -28631
6005 -28631 331596 525582 -13271 -103365 -28499 213115 894945 728265 1033246 445407
5995 445407 1304282 948748 1072770 1046714 144813 611384 305940 378618 252780 374215
5985 374215 937486 369720 28018 283344 -523809 -577616 -152471 969534 503647 218695
5975 218695 664723 387071 325055 240591 -27071 634722 546041 906486 -41186 -405543
5965 -405543 149969 573957 373672 49582 538436 893708 622444 713045 789803 141193
5955 141193 -405771 102615 388087 138024 -218489 141995 561035 24879 -42238 362570
5945 362570 781248 853397 834970 85067 48606 183689 -3735 185207 32379 236786
5935 236786 -176840 -428623 261369 89151 -30788 250450 516935 708815 483048 361502
5925 361502 770813 659260 447010 406600 436668 800677 264339 400775 123943 187357
5915 187357 505077 271368 630236 640029 791493 229716 805010 1144106 471371 371868
5905 371868 7976 -131464 372527 689919 713596 146322 -359137 -425011 230280 553407
5895 553407 166919 675083 735433 535704 427019 278405 404061 496184 353302 1110670
5885 1110670 1056855 768661 672659 523480 268331 -17949 -59938 -57887 681406 836850
5875 836850 992773 846434 935157 1001756 1182032 1239431 1306609 815237 497030 402672 1315270
5864 1315270 1325411 903867 599854 877276 1087205 767224 917219 738029 862561 347533
5854 347533 -49750 112269 115554 437747 533700 558123 438285 1287226 1352635 1019843 1170464
5843 1170464 609217 596364 1114104 1059145 796840 1201027 1264004 1154767 768923 286682
5833 286682 332829 294775 653924 569101 865289 387378 164000 67413 292589 569430
5823 569430 553062 507623 567969 776259 336339 579685 172004 326234 586037 1201061
5813 1201061 906122 782434 803812 745094 755852 1111000 1559711 1271314 727632 452466
5803 452466 912687 994396 895634 966258 84440 -16587 635243 805984 898285 793280
5793 793280 1437731 1508224 1557480 1126880 807330 827532 672979 795504 298191 541976
5783 541976 622530 1128818 469517 300719 1233243 623837 1027908 828130 395432 422315
5773 422315 510623 770138 568489 311189 1178115 1394109 1051881 1194147 378121 662200
5763 662200 1140283 1153446 1112989 716865 812886 467662 261438 239940 651130 847085
5753 847085 -17271 27570 363324 403438 283933 398723 480430 1097708 988395 664482
5743 664482 635770 891469 529526 852279 669581 961527 1514929 1079114 1229119 1555604
5733 1555604 1012149 1135218 1081889 692484 1275760 1224244 1270681 850357 751996 573382
5723 573382 1033323 742644 774816 785043 668452 1469123 1485855 1219512 1211201 634672 936622
5712 936622 997391 961979 1008806 981049 1155240 944380 1277313 1077824 1261711 813488
5702 813488 699856 1258937 737043 243378 488744 213369 338291 1080530 1082345 1122951
5692 1122951 1078503 928441 741976 1157030 852554 859266 1196984 792359 806733 975741
5682 975741 766433 1495846 1720604 1286031 1348847 1461309 979358 526891 1214259 1174270
5672 1174270 862437 850670 821257 1152476 1300352 1289979 1678546 1417510 563237 904090
5662 904090 989397 543117 708308 788218 1315280 1149427 794077 785225 976328 1249011
5652 1249011 1031594 921524 1321481 1007900 515617 537278 1079153 1038697 1302671 1267795
5642 1267795 976613 1357107 1310297 887278 1475776 1550723 1272226 1337281 652612 1302957
5632 1302957 1250476 1490847 1321673 1039862 1102293 1106456 877898 1001954 856378 1110380
5622 1110380 1132262 1039677 1150544 1101631 1520541 1388895 1819090 2223460 1930661 1576974
5612 1576974 1817632 2251061 2479921 1934572 1542561 1753754 1528843 1869618 2265853 2243369
5602 2243369 2661253 2599631 2389377 2522123 2903678 2891303 2900343 2080063 2253624 2461836
5592 2461836 2141054 2145813 2077754 2441771 2353463 2262253 2652114 2619967 2454360 2401700 2468892
5581 2468892 2621944 2648655 3147185 2828090 2693895 2656341 2617926 2991149 2574856 2722665
5571 2722665 2822421 2810226 3109805 2381602 2727357 2608707 2548144 2790827 2556875 2757487
5561 2757487 2931936 2870610 2544268 2691572 2427338 1825196 1806762 2242556 2040638 1954485
5551 1954485 1727644 1761356 1953662 2225583 2518272 2321460 2767961 3408290 2694263 2588380
5541 2588380 2313123 2141130 1640959 2214274 2013858 2346767 2208741 2273128 2406859 2035869
5531 2035869 2399592 1906034 1996533 2039483 1671791 1868407 2145447 1593357 1734543 2261419
5521 2261419 2293070 2010333 1480282 1450036 1523810 1381808 1131221 994132 1542903 1416007
5511 1416007 1228913 1104252 1507640 945025 732665 851430 1115637 1170281 1687233 1530095
5501 1530095 1187998 1629356 1854607 1265042 896749 1444846 1520314 1542421 905609 1054888
5491 1054888 1560611 986545 1497955 1055875 1650383 1450472 1532304 1839932 1397423 1313067
5481 1313067 781788 678464 1089659 1521826 1271595 968206 1460612 1154336 822448 1548742
5471 1548742 773773 825608 997477 1593837 1537495 1402953 1123521 837197 1393248 1238967
5461 1238967 1652897 1289444 1681454 1903657 1432884 1090024 1309875 1279342 569381 919087
5451 919087 1096359 814369 1473683 1270669 1600858 1453777 1024409 1536138 1245621 1696544
5441 1696544 1758430 1642155 1834539 2152743 1538836 938951 1210861 1686887 1659888 910270
5431 910270 1243641 921658 1302592 1216530 1436887 925084 1236887 1707476 1011602 1200751
5421 1200751 1343909 1078667 1057278 321905 289429 606717 288632 650099 861018 1332934
5411 1332934 1205461 982320 741589 1152369 1140479 963552 1308386 948435 1039283 678381
5401 678381 651284 850434 1111659 1753081 1829611 1270899 331449 1004962 923982 1189166
5391 1189166 1122816 1017314 793909 1224672 1052312 1429106 1172789 1628509 2232088 1978391
5381 1978391 1943033 1335775 1338214 2155576 1707887 1969631 1990428 1323879 819568 1390682
5371 1390682 1483508 1058692 852006 970735 1309740 1449313 848024 1335905 756670 1306451
5361 1306451 1823915 945915 859573 772480 1003255 818905 1126352 1418620 1443217 1810941
5351 1810941 1363068 1078078 1269646 1625706 1894001 1777713 2117762 1918172 1676345 2010060
5341 2010060 1652113 1298297 1215285 1801213 1823661 987228 1680807 1738180 1617131 1049257
5331 1049257 1905135 2251862 2139397 2445101 2912598 2519200 2917162 2966872 2851670 2405390
5321 2405390 2178545 2527448 2877955 2649221 2697015 2502530 2539264 3039114 3468064 3608122
5311 3608122 3311857 3724127 4025930 3999448 3497926 3914456 4254043 4714105 4188861 4221174
5301 4221174 4031351 4670873 4506093 4377934 5355239 5439155 5111068 4988940 5202737 5965855
5291 5965855 5705966 6262720 7013946 6254586 6307901 6147843 6397633 7146842 7728743 7761267
5281 7761267 7883105 8351685 8928035 8496463 9359005 9678816 10310213 9833179 10569043 11290439
5271 11290439 11748317 12795369 13421140 13938588 14688225 15467670 16094428 16530267 18071281
5262 18071281 18794687 20061354 21271444 23296647 25602385 27895563 30778550 32833031
5254 32833031 35352445 38351638 41839648 45284927 48655690 50451557 52440838 52915432
5246 52915432 52352305 50200731 47510207 44903422 40867100 37042592 33835283 31238236
5238 31238236 28227652 25407397 22577425 20985844 19619617 18292358 16843586 15938855
5230 15938855 14506037 13575693 13359036 12158573 11707862 10857356 10173529 10037140 9272122
5221 9272122 8641000 8994872 8456180 7734901 8106280 7999924 7658878 7061926 6684995 6357454
5211 6357454 5867511 6278392 6494921 5859255 5334017 5119862 5200663 5098284 5211286 5525957
5201 5525957 5397104 5188644 4800595 4374064 4618890 4103458 3466799 3787844 4113735 3576432
5191 3576432 4023177 4367514 3671951 3493321 3253026 3455993 3645110 3553006 2975913 3604159
5181 3604159 3622296 2725389 2821362 3438047 2933581 2946090 2744464 2503996 2282114 2413866
5171 2413866 2615438 2917581 2909074 2781033 2868462 2691637 2370126 2402284 2698028 2606890
5161 2606890 2407716 2303259 1980799 1891172 1646537 2404568 2455290 2702106 2563466 2134019
5151 2134019 1647674 1923651 1799103 1853340 1455140 1585666 1518206 1679916 1468628 1534010
5141 1534010 1662879 2235386 1845823 1742962 1736256 2323917 2041801 1220654 1401290 1078394
5131 1078394 1746790 1912526 1267289 1155766 1325493 1507038 1910343 2116887 1994802 1300091
5121 1300091 1297383 1093434 1395006 1447140 1534148 1540214 1770902 925153 1021290 1341764 1190838
5110 1190838 1255320 1622789 1516902 1502225 1542687 1820994 1658704 1745402 1414792 915608
5100 915608 1471344 1922609 1308710 1128295 1118215 1599120 1263200 714503 1244331 1620542
5090 1620542 1676833 1248990 953617 1205104 1447791 1477610 1049023 1076905 1290665 1341232
5080 1341232 1173583 797426 1097162 1787490 1643841 1674084 1643288 1433897 954089 893317
5070 893317 1291359 1016644 1361231 1633163 1126948 1573291 1441207 840131 1458435 1451426
5060 1451426 1511092 1490455 2005128 1696876 1108504 1316691 1162390 1052787 1376194 1656670
5050 1656670 1999655 1076769 1087800 1533984 1382794 1354203 2151987 1932028 1458954 1047514
5040 1047514 1199186 1473548 933921 914202 1196558 1962445 1801000 1794503 1082982 769240
5030 769240 979072 1000560 1247335 1508706 1605338 1499645 1848278 1467629 905178 1274542
5020 1274542 1435888 1403946 1117513 1506722 1137101 1110172 1684270 1774113 1554237 1748216
5010 1748216 1474898 1634551 1052405 1214445 1098177 1380994 1411882 1552609 1463491 1222008
5000 1222008 1370495 1729106 1220293 1328125 1293894 1443266 738327 1050275 1466878 1118853
4990 1118853 1232078 1325726 1528738 1532793 1536284 1519407 1241687 1373266 2090936 2350558 2279516
4979 2279516 2051557 1671664 1124953 1713151 2079417 2116074 1453035 1758567 1542036 1814374
4969 1814374 2137013 2240004 2018432 1874788 2131037 2170242 2203571 2309600 2104639 2274367
4959 2274367 2322555 2320581 1839666 1974358 1771270 2265890 2130910 1697452 1736826 1808571
4949 1808571 1939943 1963499 1927592 1738969 1864182 2415211 2218097 2143978 2253955 2725258
4939 2725258 2909612 2732112 3618135 3687158 3540876 3002044 3148945 3523896 3794312 4700166
4929 4700166 4131468 3916025 4489709 4706046 4480030 4685530 5251941 5648620 5141622 5493466
4919 5493466 5512601 6095366 6973249 7589809 8579278 9258522 10426839 11783230 12526870
4910 12526870 12553581 14154292 14788981 15237860 14497541 14027580 13900983 13457012 14425451
4901 14425451 14235887 13580342 12239265 11244559 10306606 9378463 8558372 7180053 6691906
4892 6691906 6489645 5873820 5598421 4611457 4742326 4473820 3852033 3292887 3604429 3107198
4882 3107198 3182562 3299392 2996734 3310518 3206216 2755393 2649693 2381037 2532343 2194322
4872 2194322 1711211 2111368 2384077 2019853 1966934 2293850 1346742 1305255 1706661 2187139
4862 2187139 1844942 2090579 1514529 1640102 1250496 998647 1614183 1339672 1364107 1627964
4852 1627964 1043792 1358551 1764776 1439899 2003465 1733064 1699216 1595621 1007505 1082280
4842 1082280 1753516 2010756 2165137 1786611 1367988 1681936 1573456 1793690 1905749 1878562
4832 1878562 1068538 1546398 1546769 622479 1017154 1096881 1236093 1091105 1814377 1764125
4822 1764125 1621532 1516303 1635097 1890382 1405433 1997393 1883788 1593522 1354686 1476537
4812 1476537 1274900 1426757 1124872 1106056 792720 627072 828084 1418888 1906101 898390
4802 898390 1147236 753760 269955 765416 975545 1175222 543362 582281 1471109 1729445
4792 1729445 960789 885506 1217975 1373983 1165233 1161487 243702 352569 974862 1084885
4782 1084885 1082428 746543 897196 788745 584422 329464 1001638 736551 832517 359158
4772 359158 547502 726121 856381 1255291 1795213 1700648 776437 459105 606952 1327442
4762 1327442 637096 694363 1337503 1088850 838789 1094075 1170920 1018264 824106 719783
4752 719783 1535177 1569909 1256412 923305 849096 1097078 1300514 1215538 782174 850050
4742 850050 659344 1187437 647313 916621 802015 511107 809316 1092696 1820803 1758240
4732 1758240 2080767 1618939 927038 1318972 1272409 1414129 604082 760805 1320698 1327876
4722 1327876 1310623 2237247 1687920 947639 750951 1290409 1504587 1827261 1943520 1550576
4712 1550576 1520536 1310977 1292887 1477699 1457726 1127367 1621094 1641827 1526943 2190189
4702 2190189 2087254 1688956 1649158 2227342 2627647 2598118 2426463 2149994 1824321 1463258
4692 1463258 2259615 2543150 2314987 2211375 2746155 2361083 2054579 2469777 2799085 3511106
4682 3511106 4150463 3423121 3188502 3124986 3531172 4016457 5018562 4965228 4866501 4399687
4672 4399687 4557013 4777141 5050823 5250581 5486406 5645287 5489048 5838252 5661691 5276891
4662 5276891 5354486 5381746 5452600 5249204 5568529 6035619 5950193 6048364 6093300 6387458 6662179
4651 6662179 6007055 5799561 6423362 6535503 6999485 7363274 7849276 7354145 7511644 8205297
4641 8205297 8781158 9363662 9649475 10226422 10276305 10836568 11823689 12933960 13328175 14956744
4631 14956744 15947462 17771672 20159415 22088078 24355439 26982820 30292653 33646131
4623 33646131 36218552 38145693 38472258 37555737 35256223 32218724 29321162 26259678
4615 26259678 23565242 21579516 19254130 17270278 16177315 15165245 14006634 13342594
4607 13342594 13661153 13085562 12039098 12217611 12224620 12435551 11890591 12351597 12684782 12529997
4597 12529997 12191852 13451246 13379197 13029376 13712184 13686100 14029432 13593015 13414988 13634286
4587 13634286 13156948 11837340 11458133 10909811 10658971 9830919 9432372 8823435 8157169
4578 8157169 7496036 7194425 6316477 6225812 5681798 5565780 5541228 5435185 5235877 5573141
4568 5573141 5022763 4460034 4792967 4115874 4094106 4090193 3632701 3722045 3617160 3392904
4558 3392904 3007935 2486781 2429609 2681606 2799997 2798805 2137072 2155268 2427002 2041547
4548 2041547 2764932 2511407 2437409 2307992 2013341 2778460 2813582 2813995 2563784 2674924
4538 2674924 2545480 2349030 1962240 2463663 2700980 2424642 2421211 2641001 2587396 2558594
4528 2558594 1907002 1813109 2081653 2349924 2340998 1958716 2134018 2813945 2846735 2166587
4518 2166587 2206183 2400602 2490322 2090275 1718439 2101952 2238478 1616313 1742813 2045169
4508 2045169 2240159 2023380 2074296 1782092 2249531 2115053 1851243 2426293 2322049 2267457
4498 2267457 1584915 1453812 1582905 2316794 1827851 1302044 1179159 1751350 1986750 1940637
4488 1940637 1364855 1388182 1925544 2140840 2041091 2197371 1935430 1900715 1608297 1693917
4478 1693917 1825478 1458028 1604263 1675342 2048196 1951936 1927565 2079444 2295773 2528802
4468 2528802 2214075 2928739 2487348 2342961 2475717 2542564 2504257 2667467 2178019 1533620
4458 1533620 2541758 2422735 2342771 2345271 2333573 1956412 1913494 1792714 1580921 2072630
4448 2072630 2437693 1762712 1232261 1001564 1290688 1073100 1563953 1303301 1394941 1663070
4438 1663070 1558808 1497642 2100383 1988064 1692327 1659259 1415424 1309768 1549230 2020250
4428 2020250 1785392 1618430 1893792 1683925 1527032 1397215 1533998 2146270 1751333 1093288
4418 1093288 1845142 1952045 2088682 2105278 2184833 1805593 1608429 2048504 1316772 1249867
4408 1249867 1865057 1680663 2326370 2425262 2286748 1849834 1981846 1732898 1671994 1589626
4398 1589626 1937227 2228501 2625816 2696605 2135592 2045627 2356741 1920632 2057417 2394547
4388 2394547 2030159 2241666 1995928 2571254 1745021 1776794 1815228 1086225 1343582 1563866
4378 1563866 2248204 2469557 2256202 1742780 1496814 1627418 1861071 2210991 2124679 1960067
4368 1960067 2101647 1536992 2083601 1852815 1977021 2327236 2002255 1961987 1997073 2147741
4358 2147741 1550259 1675398 1302231 823647 1343271 1955453 2063088 1358311 1840404 1914104
4348 1914104 2105222 2601709 2233059 2324357 2935375 2174608 2161899 2505163 2874162 2641194
4338 2641194 2419272 2893874 2203746 2365425 2789546 2265474 2088536 1943340 2429138 2715954
4328 2715954 2246397 2217074 2410647 3413516 3585922 3207364 2587385 2345323 2112008 2440738
4318 2440738 3181345 3550802 3736079 2967788 3274900 3238006 3407428 3051114 2914651 3402437
4308 3402437 2475939 3047640 3430840 3539089 3548022 3671122 3498949 3844025 3580723 3879018
4298 3879018 3524617 4168753 3946658 4290810 4417619 3707908 4427380 4592941 4572373 4758665
4288 4758665 4535665 5046844 5173016 5152951 4158230 4197525 4897459 5064640 4392146 5078948
4278 5078948 4590661 4528926 4995328 5017194 5160175 5208832 5194769 4964038 5098721 5437571
4268 5437571 5760994 5777110 5556348 4985489 5317106 5769739 5914401 5990161 6182576 6451846
4258 6451846 6326712 6423358 6663926 7129480 6988035 7319372 7154431 7221023 7251552 7325932
4248 7325932 7453670 8128921 8071334 7588884 7583853 7973792 7746202 7741215 8183396 8232352 8032772
4237 8032772 8217653 8264989 9059666 9427981 8462518 8954373 8771277 8357153 8820583 8959475
4227 8959475 8706292 8857198 8963499 9359286 9557461 9040671 9087860 9587760 9292011 10235644
4217 10235644 10394164 10064562 9717245 9810194 9596352 10276905 10065712 9492655 9868491 9673744
4207 9673744 9659912 9707899 9175202 9654914 8922520 9308594 9582892 9065806 9284165 10017650
4197 10017650 9637119 8767673 8816819 8862073 8457494 8594991 7795127 8511457 8469010 8676175
4187 8676175 8313229 8359389 8562431 8488792 8062541 7996915 7953597 7986856 8088805 7681312
4177 7681312 7915951 7934630 7802662 7338134 6760710 6297990 6954659 7232610 6796866 6677618
4167 6677618 6158591 6211915 5782903 5507244 5663561 5518656 5611511 5347917 4820490 5160451
4157 5160451 5706046 5520466 5387892 5031127 5695513 5292871 4928480 4723691 4079521 4077356
4147 4077356 4625792 4929537 5007207 4739648 4726005 4772940 4603550 4220232 4036681 3564454
4137 3564454 3786519 4482375 4173317 4219281 4396831 4851448 4469076 3486161 3457777 3522220
4127 3522220 3749050 3414688 2966186 3791402 3630550 3769708 3515002 3322722 3162047 2799662
4117 2799662 3087962 3914560 3257164 2641051 2386866 2787430 3377729 2835329 2208251 2569498
4107 2569498 2816645 2409364 2512071 2885618 3111134 2313881 2613280 2657381 3182633 2890069
4097 2890069 2433025 2099037 2728715 3261069 2669173 2183253 2178654 2224640 2443370 2304429
4087 2304429 2452154 1856352 2091028 2380485 2045995 1991641 1797188 1744891 1733915 2083888
4077 2083888 2214272 1508090 2102315 2288033 2055248 1927136 1860008 1839841 2153833 2206617
4067 2206617 2073342 2298682 2239549 2061588 1998187 2360373 1953973 2937379 3023940 2687404
4057 2687404 2298051 2117469 2524212 2378634 2856677 2313539 2128124 2658640 1727086 2302046
4047 2302046 2010685 1420566 1705406 1455279 1842070 1904787 1584222 1867767 1890577 1737121
4037 1737121 1841749 1773288 2045761 1777193 2765177 1787446 2108205 2141684 1484758 1616704
4027 1616704 1594199 1804947 2140484 1779787 2348056 2033165 1910794 2223027 2198761 2277436
4017 2277436 2722433 2740504 3117815 2514318 2282043 2567910 2321445 3016584 2938002 3649208
4007 3649208 2524834 2442904 2983596 2505324 2899219 3085479 2681062 2720825 2646234 3149333
3997 3149333 3684675 3556290 2934678 3729404 2999730 2900033 3486346 3465212 3792125 4054621
3987 4054621 3843917 4244433 3905646 3960127 4145524 3606891 3782298 3957696 4150567 3694407
3977 3694407 3978482 4691283 5354762 4984677 5225327 4711044 4977569 5445211 5437080 5157612
3967 5157612 4568923 4492285 4156669 4162794 4860756 4903207 5170657 5212998 5321743 5201025
3957 5201025 5449921 5403809 4680003 4406280 4695399 4914231 4416087 4141472 4090998 3998097
3947 3998097 3390121 3807225 3306653 3206522 3318987 3234863 3782577 3557346 3661291 4026610
3937 4026610 4130899 4711321 4250627 4365716 4303524 4061286 3433991 2947680 2186030 2433268
3927 2433268 2237430 2371940 1545490 1656821 2216918 1978795 1266029 1301317 885140 1157603
3917 1157603 1078291 991657 1626238 1236391 642000 439394 483908 1179578 1132041 1233158
3907 1233158 647607 -34515 671208 698672 768424 710491 1232690 1087910 1043612 1096356
3897 1096356 1418597 998328 685332 587246 226276 689534 672001 559806 808614 298184
3887 298184 1098904 726950 1029053 1076536 952050 1245058 944132 896013 679848 672628
3877 672628 643247 390864 1033546 788922 681500 1087405 760506 1552323 1606287 1785429
3867 1785429 1577582 1128285 1144957 701981 703174 183745 1141202 1218855 638736 940556
3857 940556 1096578 950744 795773 1383450 1611761 1394787 1249710 654563 685841 878887
3847 878887 848247 1148520 1269623 1280504 1308688 1034235 1357882 488761 874869 1209722
3837 1209722 686455 1059154 1319374 1123587 1188682 1043867 598197 889439 777732 873241
3827 873241 339268 886080 408720 1306681 828047 368553 944225 1143081 1411300 815512
3817 815512 402265 60322 156132 189735 472952 331609 919715 996352 850034 679698
3807 679698 465930 851349 884238 852952 712900 235812 178324 114037 -317991 -27753
3797 -27753 524394 363079 596945 890130 621450 416193 130174 383590 377139 -298724
3787 -298724 -18047 68747 169948 543205 541615 1046426 631339 302572 157765 -694877
3777 -694877 -177607 165295 259975 955166 796687 333157 305372 50881 278298 325225
3767 325225 223935 291069 372833 97257 -255604 -65968 124107 524439 172478 126927
3757 126927 490746 -68353 727261 1097390 708868 367853 154787 883918 570508 -81887
3747 -81887 335572 281946 85218 169989 602925 661245 1195289 1242847 760857 683109 1300663
3736 1300663 805355 491937 312934 457059 845919 762268 833564 768097 805211 616122
3726 616122 341196 206658 444048 492669 727357 769306 1142712 713646 370105 906388
3716 906388 599337 323331 367068 362661 581025 804520 1129670 498444 745911 851012
3706 851012 171807 238261 -59897 -5419 594584 820061 648772 721421 388631 -38368
3696 -38368 1359297 989857 262041 120048 316240 232871 175365 116919 -332609 -390269
3686 -390269 -28918 418639 -162295 -612631 -802579 -763808 -205661 -385000 162515 207516
3676 207516 35980 -169849 -496582 195708 247468 59342 -280133 -484917 -85671 178039
3666 178039 -709733 -640611 -386352 -455476 7265 -385891 -413626 194272 -245258 -715367
3656 -715367 -425765 -605388 -541988 -184637 318499 -102617 -610342 225411 304535 120580
3646 120580 -81124 -295953 -668069 146591 26170 -97726 -314883 -533308 -155999 -264401
3636 -264401 -93172 -367950 -491819 398119 24367 385226 203334 -953148 -593798 75349
3626 75349 -201558 -346611 277638 81445 174582 615296 632182 -80573 399557 -381529
3616 -381529 118707 -264105 -553573 -76777 -390673 -100662 -121396 -315068 -502807 140430
3606 140430 -71383 -147002 -133283 -268039 -208191 -70815 22161 635123 319850 424125
3596 424125 574564 -82915 60700 -540389 -52896 -287648 -812573 -386365 -386518 -441442
3586 -441442 -345076 -304688 71483 -367855 -123645 -319471 -272606 -345847 255084 -187321
3576 -187321 -282869 130061 242268 -21235 -298801 -430654 -309614 -463030 -254747 187754
3566 187754 345412 125910 -168839 -369165 -334365 367993 -473478 -36145 247660 357543
3556 357543 145813 -48413 -90774 -432975 -506227 297793 24206 -353971 -17931 -461648
3546 -461648 -444795 -303377 -568686 -730511 -423088 156431 219927 -225753 -469 339347
3536 339347 140466 612987 -104461 -284122 28892 669812 7373 -389723 -546398 -783371
3526 -783371 -30436 -407007 -410447 -91188 -387322 -464493 -192296 -536536 -15909 324480
3516 324480 323456 685343 264410 136465 179776 273541 58790 -49066 27886 489199 3061
3505 3061 -176437 -341260 -228917 -146576 -353683 -549114 -214359 205513 212226 -268389 -135688
3494 -135688 -233941 -261554 -497551 -114274 -179450 -635940 -151077 397369 124386 5070
3484 5070 -199265 -296018 -29908 -330344 -1017919 -821743 -926981 -751481 -1012261 105521
3474 105521 -313631 -503096 -512596 -947454 -555597 -601841 -144938 -126503 26450 -216434
3464 -216434 310365 133258 268210 -188431 -217036 -448348 -147728 322964 196607 -413297
3454 -413297 -73928 87155 -213217 -465939 -275609 -204956 -905976 -389994 -137677 -56977
3444 -56977 -644477 -517583 490909 383109 400745 -87010 64675 -64222 -44194 -700456
3434 -700456 -454572 260957 -126726 -662033 -383438 -75781 -66891 -530968 -427052 -287764
3424 -287764 -737985 -571867 -226475 -169115 75510 -220354 -145627 -372156 -297550 30180
3414 30180 -64288 -250621 -334148 -566270 -339291 40397 604516 643236 278241 232679 -358580
3403 -358580 355273 -60700 -429073 -295866 -432077 -141059 -207122 -231929 -502830 -801117
3393 -801117 -655076 72465 487955 269815 -395284 47007 -236282 -390498 -127420 22331
3383 22331 -599431 -433660 572624 472859 -77799 112811 -2357 91217 98434 -187478
3373 -187478 65337 -426715 -81146 -121640 -397041 -347698 -233014 -308782 -732078 -885982
3363 -885982 -272740 51275 -48431 319904 175574 -57079 -112381 70936 -560024 -526468
3353 -526468 -418629 -602071 -753462 -120881 55834 -511945 -349663 -689308 -102084 -161272
3343 -161272 45390 170495 10359 696179 721267 222544 -45997 -397517 43658 -212223
3333 -212223 10058 107094 -24122 149118 -153172 -240412 653073 1085897 848056 784867
3323 784867 458550 106692 856041 623903 491442 -343565 -107346 402483 82851 125159
3313 125159 -361501 61400 -408169 418386 656399 124119 192479 460532 -74952 -204879
3303 -204879 94656 -231785 130313 -98756 -352755 -235859 -73712 33587 213351 750752
3293 750752 -110400 138093 691120 669604 1242825 884026 408262 221529 133537 191275
3283 191275 293188 -164407 67847 -84474 179500 -90030 67203 -284008 -328143 132436
3273 132436 107775 -412054 -459838 62320 -285914 276708 117010 733564 947746 -117291
3263 -117291 -46476 403494 15274 209985 973444 -111770 251576 740202 973448 540080
3253 540080 17020 405031 999306 973138 848806 440124 667050 686279 933389 660867
3243 660867 772670 472231 275354 901198 182974 565697 97730 318772 -146786 163893
3233 163893 228587 518954 818739 853642 338771 1050128 596473 274828 1133034 1063903
3223 1063903 1314455 1113387 1048232 680932 1120503 655076 666506 908843 1017539 853590
3213 853590 1273065 1554018 1334636 1032462 1361754 1474340 1381969 1070010 1446691 1971807
3203 1971807 1653869 2015196 1230244 1291969 1539478 1687495 1843686 1229467 1393211 2599211
3193 2599211 2533435 1885425 2008249 1516839 1889934 2339168 2366076 3033535 2833179 3224663
3183 3224663 3033303 2899984 2890970 3278242 3548972 3192670 3688358 4531364 4795425 4337491
3173 4337491 3902743 3921577 4421114 4966706 5416108 5625401 5940969 6160249 6310922 6344538
3163 6344538 6116217 6844638 7272121 7101091 7346562 8143041 8365383 8561954 8675779 9058008
3153 9058008 9888729 10602817 11299457 11990613 12648865 12765405 13845221 15242941 16500160
3144 16500160 16502524 17245528 18016788 19038751 21525234 22616724 24411633 27192664 29520545
3135 29520545 32675485 36198601 40310159 45651809 52149391 59385400 67832264 77216385
3127 77216385 85802561 92093905 93453162 89681374 81931118 72902009 63631161 54173119
3119 54173119 46790616 41345874 36919407 33168019 29549812 27146208 25203110 22517200
3111 22517200 20571980 19465854 17713062 16416352 14879684 13483679 12673275 12192494
3103 12192494 11871329 10819316 9728551 9074738 8602551 8496803 8217770 7894605 6916571
3094 6916571 6748119 6636512 6761688 5853919 5384188 4881410 4909822 5052520 4326199 4382292
3084 4382292 4629580 4754469 3747516 3315818 3415590 3207686 2636989 3191929 3056959 3020307
$$ [...]
##END NTUPLES=NMR SPECTRUM
##END=
