##TITLE=1H_CA-9312-1
 CDCl3
 8 sc, 
 26.12.2024
##JCAMPDX= 6.0         $$ Bruker NMR JCAMP-DX V2.0
##DATA TYPE= NMR SPECTRUM
##DATA CLASS= NTUPLES
##ORIGIN= UXNMR, Bruker Analytische Messtechnik GmbH
##OWNER= root
$$ XWIN-NMR		Version 3.5
$$ Thu Dec 26 14:34:39 2024 Russian Standard Time (UT+4h)  she@DPX200
##.OBSERVE FREQUENCY= 200.1315
##.OBSERVE NUCLEUS= ^1H
##.ACQUISITION MODE= SIMULTANEOUS
##.ACQUISITION SCHEME= undefined
##.AVERAGES= 8
##.DIGITISER RES= 18
##SPECTROMETER/DATA SYSTEM= spect
##.PULSE SEQUENCE= zg30
##.SOLVENT NAME= D2O
##.SHIFT REFERENCE= (INTERNAL, D2O, 0, 19.4783)
##AUDIT TRAIL= $$ (NUMBER, WHEN, WHO, WHERE, WHAT)
$$ ##TITLE= Audit trail, XWIN-NMR		Version 3.5
$$ ##JCAMPDX= 5.01
$$ ##ORIGIN= Bruker BioSpin GmbH
$$ ##OWNER= she
$$ F:/spectra/data/she/nmr/H-F/1/pdata/1/auditp.txt
$$ ##AUDIT TRAIL=  $$ (NUMBER, WHEN, WHO, WHERE, WHAT)
(   1,<2024-12-26 14:33:09.90 +0400>,<she>,<DPX200>,
      <created by zg, POWCHK disabled, PULCHK disabled
       configuration hash MD5:
       00 E9 B6 7A A2 85 ED C7 34 08 36 98 17 FE 4E 26
       data hash MD5: 16K
       C0 A3 B3 E2 FE 82 5E E7 D7 05 84 22 BF 26 B6 70>)
(   2,<2024-12-26 14:33:20.25 +0400>,<she>,<DPX200>,
      <Start of raw data processing
       efp BC_mod = 2 LB = 0.24 FT_mod = 6 PKNL = 1 PHC0 = -26491.32 PHC1 = 20.78744 SI = 16K 
       data hash MD5: 16K
       2B BB 89 86 58 A2 36 55 DF 75 C9 49 36 E1 90 FD>)
(   3,<2024-12-26 14:33:47.00 +0400>,<she>,<DPX200>,
      <pk PHC0 = -79.27245 PHC1 = -12 
       data hash MD5: 16K
       10 08 08 5D 4C 85 A1 E8 BE 11 D5 2F A2 B3 A4 1B>)
(   4,<2024-12-26 14:33:50.34 +0400>,<she>,<DPX200>,
      <abs ABSG = 5 
       data hash MD5: 16K
       77 B8 E9 83 B3 C4 FB 8A 4B 6C ED DA 5B FE 05 EC>)
$$ ##END=
$$ 
$$ hash MD5
$$ AF C0 78 04 B0 36 81 57 58 5B 53 2C 84 97 59 22
##$RELAX= 
##$RELAX= 
##$RELAX= 
##$RELAX= 
##$RELAX= 
##$RELAX= 
$$ Bruker specific parameters
$$ --------------------------
##$DU= <F:/spectra>
##$EXPNO= 1
##$NAME= <H-F>
##$PROCNO= 1
##$TYPE= <nmr>
##$USER= <she>
##$AMP= (0..31)
100 100 100 100 100 100 100 100 100 100 100 100 100 100 100 100 100 100 
100 100 100 100 100 100 100 100 100 100 100 100 100 100 
##$AQSEQ= 0
##$AQ_mod= 1
##$AUNM= <au_zg>
##$AUTOPOS= <>
##$BF1= 200.13
##$BF2= 200.13
##$BF3= 200.13
##$BF4= 200.13
##$BF5= 200.13
##$BF6= 200.13
##$BF7= 200.13
##$BF8= 200.13
##$BYTORDA= 1
##$CFDGTYP= 0
##$CFRGTYP= 5
##$CHEMSTR= <none>
##$CNST= (0..31)
1 1 145 1 1 1 1 1 1 1 1 1 1 1 1 1 1 1 1 1 1 1 1 1 1 1 1 1 1 1 1 1 
##$CPDPRG= <>
##$CPDPRG1= <>
##$CPDPRG2= <>
##$CPDPRG3= <>
##$CPDPRG4= <mlev>
##$CPDPRG5= <mlev>
##$CPDPRG6= <mlev>
##$CPDPRG7= <mlev>
##$CPDPRG8= <mlev>
##$CPDPRGB= <>
##$CPDPRGT= <>
##$D= (0..31)
0 1.2 0 0 0 0 0 0 0 0.06 0 0.03 0 0 0 0 0.0002 0 0 0 0 0 0 0 0 0 0 0 0 
0 0 0 
##$DATE= 1735209189
##$DBL= (0..7)
120 120 120 120 120 120 120 120 
##$DBP= (0..7)
150 150 150 150 150 150 150 150 
##$DBP07= 0
##$DBPNAM0= <>
##$DBPNAM1= <>
##$DBPNAM2= <>
##$DBPNAM3= <>
##$DBPNAM4= <>
##$DBPNAM5= <>
$$ [...]
##$SUBNAM3= <"">
##$SUBNAM4= <"">
##$SUBNAM5= <"">
##$SUBNAM6= <"">
##$SUBNAM7= <"">
##$SUBNAM8= <"">
##$SUBNAM9= <"">
##$SW= 24.0689530833862
##$SWIBOX= (0..15)
0 0 2 0 0 0 0 0 0 0 0 0 0 0 0 0 
##$SW_h= 4816.95568400771
##$TD= 16384
##$TD0= 1
##$TE= 0
##$TE2= 300
##$TE3= 300
##$TEG= 300
##$TL= (0..7)
0 120 120 120 120 120 120 120 
##$TP= (0..7)
150 150 150 150 150 150 150 150 
##$TP07= 0
##$TPNAME0= <>
##$TPNAME1= <>
##$TPNAME2= <>
##$TPNAME3= <>
##$TPNAME4= <>
##$TPNAME5= <>
##$TPNAME6= <>
##$TPNAME7= <>
##$TPOAL= (0..7)
0.5 0.5 0.5 0.5 0.5 0.5 0.5 0.5 
##$TPOFFS= (0..7)
0 0 0 0 0 0 0 0 
##$TUNHIN= 0
##$TUNHOUT= 0
##$TUNXOUT= 0
##$USERA1= <user>
##$USERA2= <user>
##$USERA3= <user>
##$USERA4= <user>
##$USERA5= <user>
##$V9= 5
##$VALIST= <valist>
##$VCLIST= <CCCCCCCCCCCCCCC>
##$VD= 0
##$VDLIST= <DDDDDDDDDDDDDDD>
##$VPLIST= <PPPPPPPPPPPPPPP>
##$VTLIST= <TTTTTTTTTTTTTTT>
##$WBST= 1024
##$WBSW= 4
##$XGAIN= (0..3)
0 0 0 0 
##$XL= 0
##$YL= 0
##$YMAX_a= 205149
##$YMIN_a= -507499
##$ZGOPTNS= <>
##$ZL1= 120
##$ZL2= 120
##$ZL3= 120
##$ZL4= 120
##$ABSF1= 19.32406
##$ABSF2= -4.745068
##$ABSG= 5
##$ABSL= 3
##$ALPHA= 0
##$AQORDER= 0
##$ASSFAC= 0
##$ASSFACI= 0
##$ASSFACX= 0
##$ASSWID= 0
##$AUNMP= <proc_1d>
##$AZFE= 0.1
##$AZFW= 0.1
##$BCFW= 0
##$BC_mod= 2
##$BYTORDP= 0
##$COROFFS= 0
##$CY= -3
##$DATMOD= 1
##$DC= 0
##$DFILT= <>
##$DTYPP= 0
##$F1P= 0
##$F2P= 0
##$FCOR= 1
##$FTSIZE= 16384
##$FT_mod= 6
##$GAMMA= 0
##$GB= 0
##$INTBC= 1
##$INTSCL= 2.524811e-10
##$ISEN= 128
##$LB= 0.24
##$LEV0= 0
##$LPBIN= 0
##$MAXI= 10000
##$MC2= 0
##$MEAN= 0
##$ME_mod= 0
##$MI= 1.114404
##$NCOEF= 0
##$NC_proc= -7
##$NLEV= 6
##$NOISF1= 3.799351
##$NOISF2= 2.8
##$NSP= 0
##$NTH_PI= 0
##$NZP= 0
##$OFFSET= 19.47831
##$PC= 1
##$PHC0= -26570.59
##$PHC1= 8.787439
##$PH_mod= 1
##$PKNL= yes
##$PPARMOD= 0
##$PSCAL= 0
##$PSIGN= 0
##$REVERSE= no
##$SF= 200.130010283994
##$SI= 16384
##$SIGF1= 3
##$SIGF2= 2
##$SINO= 5.538805
##$SIOLD= 16384
##$SREGLST= <1H.CDCl3>
##$SSB= 0
##$STSI= 16384
##$STSR= 0
##$SW_p= 4816.95568400771
##$SYMM= 0
##$S_DEV= 0
##$TDeff= 16384
##$TDoff= 0
##$TI= <>
##$TILT= no
##$TM1= 0
##$TM2= 0
##$TOPLEV= 0
##$USERP1= <user>
##$USERP2= <user>
##$USERP3= <user>
##$USERP4= <user>
##$USERP5= <user>
##$WDW= 1
##$XDIM= 16384
##$YMAX_p= 402581513
##$YMIN_p= -826606
$$ End of Bruker specific parameters
$$ ---------------------------------
##NTUPLES= NMR SPECTRUM
##VAR_NAME=  FREQUENCY,     SPECTRUM/REAL,   SPECTRUM/IMAG
##SYMBOL=    X,             R,               I
##VAR_TYPE=  INDEPENDENT,   DEPENDENT,       DEPENDENT
##VAR_FORM=  AFFN,          ASDF,            ASDF
##VAR_DIM=   16384,         16384,           16384
##UNITS=     HZ,            ARBITRARY UNITS, ARBITRARY UNITS
##FACTOR=    0.29402158847633, 1,            1
##FIRST=     3898.19430683643, 0,            0
##LAST=      -918.761377171284, 0,           0
##MIN=       -918.761377171284, -826606,     0
##MAX=       3898.19430683643, 402581513,    0
$$ Real data points
##PAGE= N=1
##DATA TABLE= (X++(R..R)), XYDATA
$$ [...]
11051a92268K64481P9959P8455j32912K58142k99727j96036K93524J58566l29994
11041a7810k07346L54433R4633l61353M8357N7605M7989L09388l45259l55858
11031c75221L68669k0272Q2053k27178j87399l213k28633N94104k28519k04799
11021d30408j20792R9253K82108l23448J28108j36066K07082K18475j42189k6388
11011b44265K01269k4019n94734L57261L58880k26839J68219l38037j19378N78612
11001A16969j6516o7604n07234R7629J81725O5572N882k7563R8254n7425r554
10990a19865k48275L02061N9339l27012J67723q0875L54455n0392p508l04022
10980b54371J97507J12865m3191j35903j0131L2231r0337j15367J23897p8309
$$ y = [-192268, 72213, 152172, 230627, 97715, 355857, 56130, -139906, 153618, 312184, -17810, -225156, 129277, 223910, -137443, -89086, -31481, 16508, 325896, -19363, -375221, -6552, -26824, 55229, -171949, -359348, -362561, -591194, 2910, -225609, -430408, -551200, -451947, -169839, -493287, -365179, -501245, -294163, -75688, -217877, -244265, -42996, -67015, -661749, -304488, 54392, -172447, -4228, -342265, -461643, 116969, 100453, 32849, -474385, -376756, -195031, -129459, -123577, -151140, -52886, -110311, -119865, -368140, -66079, -6740, -333752, -166029, -246904, 107551, 57159, 49651, -254371, -56864, 56001, 12810, -123093, -133224, -100993, -191330, -306697, -182800, -261109]
10970b61109l036K19369J31887M2372p6700N8962j68633Q7566K32616k65875j53228
10959a55809N1912m5572j17318J53999J88306j41720j95963J20748R3780k5418
10949g3055K5515r4735J12071m73556l754k12254L07673k1166J10836N3647J77378
10938i1400P5324j81653n7653K983J47206K2550N2698j09261m3493k8830J32047
10927g9482l4504j57024J3822J01050l0024K1688K19835k31870m0670J5270j7294
10916b19203M34278l57542J45593N2755k64423L32000k08815j06499J35984N1526
10906d346K09147o0825j19284j5911k36639J67641M5649L32684N7834l20247k52562
10895a96859J27597P7869M4044p8416J14169j73485J60466J72757k84041Q3769
$$ y = [-261109, -264145, -44776, 87111, 129483, 52783, 111745, -56888, 30678, 263294, -2581, -155809, -103897, -149469, -266787, -112788, 75518, -66202, -262165, -141417, -47637, -73055, -47540, -142275, -30204, -503760, -507514, -719768, -412095, -433261, -322425, -268778, -91400, -16076, -197729, -255382, -252399, -105193, -82643, -29945, -139206, -182699, -211529, -79482, -113986, -271010, -257188, -156138, -186162, -164474, 55361, -176509, -217179, -201909, -219203, 215075, -142467, 3126, 55881, -208542, 123458, -85357, -191856, -55872, -4346, 204801, 143976, 24692, 8781, -227858, -60217, -14568, 318116, 375950, 55703, -196859, -69262, 8607, 52651, -25765, 88404, -85081, 75385, 248142, -35899, 47870]
10885D7870k36136j83237Q487L10867j82881j10357J54354K20257K74495k78033
10875B5686j84189K13816J48339l55558j28787Q213o5845L3419L04965R3719j70803
10864g7025n5010j97884N721N8007M73329J56734m05826j88528k35252Q8711K08383
10853a68640l3890J4130o0834P3589j98338L09844j50971k4417O2407K9578o7107
10842b14649N150P2673j79826P2029J37005L8006j72587J56292m2l2752j2405
10831a31106L9389K87376j06023j37111j83134k15656J38490M5064l9526O5243
10821b36994p9608P2552J67115J94291k07665r8002k0634O8461j54727L8763q8988
10810c45436L9056K69401j4407M2985K07993o3470k51365j19203j27954K73030
$$ y = [47870, -188266, -371503, -363016, -52149, -235030, -345387, -191033, 29224, 303719, 25686, -158503, 55313, 203652, -151906, -280693, -272480, -338325, -304906, 59, 93778, -77025, -132035, -329919, -324198, -266191, 207138, 363872, -41954, -230482, -465734, -377023, -168640, -202530, -188400, -249234, -175645, -373983, -64139, -215110, -239527, -177120, -147542, -214649, -209499, -136826, -316652, -244623, -107618, -69612, -242199, -85907, -85949, -118701, -131106, -91717, 195659, 89636, -47475, -230609, -446265, -307775, -262711, -302237, -236994, -316602, -244050, -76935, 117356, -90309, -188311, -208945, -140484, -295211, -256448, -345436, -306380, -36979, -51386, -8401, 199592, 136122, -115243, -234446, -362400, -89370]
10800h9370n7433l05211N8086K05916j49512j56581P7477J64203j54698J68071
10790b39052K92711k12549J2077o8814r8049K6829N4426Q6575p7P588N8124J23161
10778D2950l7387J84990l57015P3597j21453K652M9398k4579o5761l9422K41842
10767e0188L9181o7235j84617J47860K414k43596L44308R4697J77663j0065j60711
10756H9711j91527k75284L39164n3567k90599L49750J10077l65135O994L36200
10746E5784k25046O9M2344Q3422j08815J0584J17335k40366K54419j04169j24667
10735b39106M49908j76376k2486l4345r9382M1838k78989J40858j52118M05795
10725C5597k20397J12464J06000o2084n5591m4819j06560n1308K61400K415M0187
$$ y = [-89370, -146803, -452014, -393928, -188012, -337524, -494105, -416628, -252425, -407123, -239052, 53659, -158890, -146813, -215627, -313676, -286847, -232421, -145846, -145923, -138335, -80211, 42950, 5563, 190553, -166462, -92865, -214318, -211666, -162268, -186847, -252608, -292030, -50188, -11007, -78242, -262859, -114999, -112585, -356181, -11873, 82824, 260487, 250422, 89711, -101816, -377100, -37936, -91503, -382102, -32352, 77725, -287410, -280416, 55784, -169262, -169193, -126849, -43427, -152242, -141658, -24323, -264689, -10270, -114439, -239106, 210802, 34426, 11940, -22405, -121787, -79949, -358938, -218080, -370198, 35597, -184800, -72336, 33664, -28420, -84011, -128830, -235390, -286698, -25298, -22883, 17304]
10714A7304j01440j30216J81063K98778q8063r3887q8288k62033J30340m3700
10704a80142J14107J98709j2660m38910K36476J06650k68951k45821Q3672K46908
10694a59962j61911P6695j78214k507j32163N69703J08940l73850L10148K19562
10684B76441l96267J41880L23593l11945j72655M0702K74932j28141j92643K0587
10674a23516P6437k1899M3926K3983K7071j58361O842N5856l11515L48035K20486
10663A87345k24529k6097k100O3198j64509R0970k0978j09908K94930J1158J2592
10652A12072p2600k4860O082j97375O8452J99537k29918J24381l49312P391J20026
10641b36124n0658M6675K38298n3435k20299J58346J30923p0132o1047R4036Q2869
$$ y = [17304, -84136, -214352, -33289, 265489, 177426, 83539, -4749, -266782, -136442, -180142, -66035, 132674, 120014, -318896, -82420, 24230, -244721, -490542, -406870, -159962, -321873, -245178, -423392, -425899, -558062, 11641, 120581, -253269, 56879, 276441, -119826, 22054, 345647, 33702, -138953, -98251, 176681, 48540, -144103, -123516, -47079, -68978, -25052, -1069, 26002, -132359, -125517, -69661, -381176, -33141, 187345, -37184, -63281, -65381, -2183, -166692, -75722, -96700, -206608, 88322, 99480, 112072, 39472, 14612, 20694, -176681, -108229, 91308, -138610, -14229, -363541, -356150, -236124, -286782, -240107, -1809, -55244, -275543, -117197, 13726, -56406, -117453, -23417, 59452]
10630E9452j89388l10013K67413J50679J42268N2075k03769p5870J05315j16606
10620a18444j05305M11905p4570j77749K47n9350L06868k70972j08632J65659
10610c0343j1573m0181J84124J47991l64472n8926O5394R3406Q0320k71151J78582
10599b6829K57936P332n09538p9848L75692o686j46266O7607j56684Q9754R8356
10588b9174J71199k97913N8655l8347j50535J64244j42473J15664k24720K94567
10578g8833O5481M4736n7020j25404J37580j42198O9044J60080k10842Q4384J83393
10567A30401P3427k41024l21922Q8678M12631k3488k20829n6824K8361R292j27537
10556b48834j2458Q4140J06122k17352q541Q3447K35000J39116k29868p8229j73525
$$ y = [59452, -129936, -439949, -172536, -21857, 120411, 172486, -31283, -107153, -1838, -118444, -223749, 188156, 113586, -64163, -63916, -123266, 183602, -87370, -196002, -30343, -41916, -82097, 102027, 250018, -114454, -173380, -107986, -14580, 65740, -205411, -26829, 231107, 238439, -271099, -350947, 24745, 18059, -128207, -60600, -217284, -127530, -29174, 142025, -155888, -97233, -135580, -286115, -121871, -264344, -148680, -373400, -78833, -13352, 31384, -25636, -151040, -13460, -155658, -86614, 73466, -137376, -52992, 130401, 203828, -37196, -359118, -270440, 142191, 118703, -102126, -158950, -130589, -121297, -248834, -261292, -177152, -71030, -288382, -296923, -213476, 21524, 160640, -69228, -147457, -320982]
10545c20982L47563j1215J08655J68715n03174m1178J65300l79924m2237K77443
10535b31034K51866J65256k42945j27781J69936j13247J05831j4229J7187J67612
10525A48452J829k8740j53680m2283J3019l38491l7729L50304l0641K37481j09919
10514I602j71006N3251m8813m0954k44964K07194J1897j68448K03752J0223k62289
10503d40555l7705o7724m3729K62291L44181j86677k93916q5131R2837L92691
10493f3437j10145o44j46129J40417M26956J79537m99389K51299N7516k49975
10483a3994k48712O9926K40494j86753J83087J80137k67483k59231J30889J16438
10473e5202j37473j49786K47797k8850q9838m9517o3838j36124K82257K24035
$$ y = [-320982, 26581, 15366, 124021, 292736, -210438, -251616, -86316, -466240, -508477, -231034, 20832, 186088, -56857, -184638, -14702, -127949, -22118, -36347, -19160, 148452, 150281, 121541, -32139, -74422, -61403, -399894, -437623, -87319, -117960, 119521, 9602, -161404, -108153, -156966, -197920, -442884, -235690, -223793, -392241, -188489, -178266, -440555, -478260, -545984, -589713, -327422, 16759, -169918, -463834, -548965, -456128, -63437, -173582, -174226, -320355, -179938, 247018, 426555, -72834, 178465, 235981, -13994, -262706, -192780, 47714, -139039, 44048, 224185, -43298, -302529, -171640, -55202, -192675, -342461, -94664, -123514, -213352, -262869, -326707, -462831, -180574, 43461]
10463D3461l1671J09998j16628L274j03794j41064j12292L10803L58751l01623
10453A9215L1698o5053l11404J8544J26788K45886P1343J1160j35145j65123k77731
10442d29822L89381j23863j5749K4714R4575J06090n9829k05448q1578J43648
10432a57881o4565J2294o8741L56795k17603J03440J89146r2889q5669j52662
10422a78335r2943O2216K5280j59995L10807m4819j35999m5523k05337L9894J92975
10411b31779J1475k1155Q5211k57256K65942K58955j64081j49130Q3953n5095
10401a72960k35223R8023J52513m7934L56600j78666k6490j54598J70314J53372
10391A14951k977l0237k92301K90103K121q6083J35928q8245J26908j59341j39199
$$ y = [43461, 11790, 121788, 5160, 8434, -95360, -236424, -348716, -37913, 320838, 19215, 50913, -14140, -325544, -307000, -180212, 65674, 137017, 148177, 13032, -152091, -429822, -40441, -164304, -180053, -155339, -60764, 45326, -14503, -219951, -301529, -157881, -222446, -210152, -278893, 77902, -139701, -36261, 152885, 59996, -25673, -178335, -271278, -209062, -183782, -343777, -32970, -77789, -213788, -259311, -464648, -424754, -231779, -220304, -241459, -156248, -413504, -147562, 111393, -52688, -201818, -117865, -172960, -408183, -310160, -157647, -205581, 151019, -27647, -54137, -208735, -38421, 114951, 111974, 81737, -210564, 79539, 81660, -4423, 131505, 43260, 170168, 10827, -128372]
10380a28372j7112q5561K13813K10116j22213r8101K3449j07055J61436m1165
10370I235k3503j05470K437J3360j29890J88396j69416r4145J95595J81619l01571
10359b33353n3807q354K52415k5683N022j53910J42971K88409m24058J12488q0790
10348a78650o8166J4147k34755r3372K53605K70542j19108N1555J22528p5154
10338e6828k74625K28094K04656j38329k31902J10364R3256j06875J30495N142
10328c6552K98409k2113l16928k1669J41363J6409q3030j82329L39824O2980j14088
10317H2276o1276k72235L5575K97368k41043J43108p7167m0737J46765j06772
10307i4138P383J51523j40385K1001L0757J53964j07871P7203j7570M0781j3476
$$ y = [-128372, -145484, -231045, -17232, 192884, 70671, -27430, -3981, -111036, 50400, 9235, -14268, -119738, -117301, -103941, -233831, -45435, -214851, -308996, -113401, 68218, -233353, -287160, -295514, -43099, -68782, -63760, -217670, -74699, 213710, -210348, -97860, -178650, -246816, -232669, -467424, -560796, -307191, -36649, -155757, -104202, 18326, -56828, -331453, -103359, 101297, -37032, -268934, -158570, -65314, -172189, -41694, -36552, 261857, 239744, -77184, -98853, 42510, 58919, -24111, -206440, 133384, 196364, 82276, 21000, -251235, -215660, 81708, -159335, -16227, -93394, -134131, 12634, -94138, -86755, 64768, -75617, -54616, -23859, 130105, 22234, 99437, 81867, 122648, 109172]
10296A09172K1767n6247Q9551K33719l42679k75502J82731O3270M187J7308R0327
10285A37604N4164j25637j04546R7607m7384J35384j80403Q1883K06573l48626
10275i3381L3122L09447J68320k7513k13774k61946J26171k6789j46576L4828
10265i8091J35876P9836R9511k12795k78643J95171L3499J14817j78633K8691
10255h0761J22907L9622j73013m2314K15019j93766L95478k91760j30408L03556
10245A64560Q9579j63795L9781j70114J3037k20679L25682K9831j41080L4829
10235A631O3442j2640J6538k0164j19510K70571j7207j66136j36423K55583J46446
10224B82131k03276K4225r1952N4712l05469Q1225J72139k00778L44845j03611
$$ y = [109172, 130939, 74692, 164243, 397962, 55283, -220219, -37488, 25782, 29969, 47277, 137604, 191768, 66131, -38415, 59192, 11808, 147192, -33211, 48672, 255245, -93381, -60259, 249188, 417508, 389995, 176221, -85725, 40446, 13657, -132919, -98091, 37785, 117621, 217132, 4337, -274306, -79135, -45636, 69181, -109452, -80761, 42146, 81768, -91245, -133559, 81460, -112306, 283172, -8588, -138996, 164560, 254139, 90344, 130125, -39989, -26952, -247631, 78051, 107882, -33198, 1631, 65073, 52433, 68971, 48807, -70703, 199868, 182661, 16525, -119898, 135685, 282131, 78855, 103080, 11128, 65840, -239629, -158404, 13735, -187043, 157802, 54191]
10214E4191Q4554k50914R957K49178j02577k34026K8292N1946j87491J89268m1511
10203a49133n9148j17599Q0857j03954K43414p2710O4256n4690j64611J29518
10193b03800J13803j65763J26232M12929j79678p1215J75115k50037l10259J13185
10183b39488J53317j35457L467k4943J97556p3654l5093q2690O1326k20516J36061
10172b60114j426N9775J50101N7228R8301M8009J11537k41889K8632J86281J49692
10161C86127l40416r6229J5228J64917n21956J56568N07828j40265q9908K4143
10151F6037l98874K82819J94441l59105J07393K29503K3930n21532J13952K5008
10141b36428K83985J55288j61862L23685l30101K8648q6018J96031j87230r6905
$$ y = [54191, 138745, -112169, -102212, 146966, 44389, -189637, -161345, -109399, -296890, -107622, -149133, -208281, -325880, -245023, -348977, -105563, -178273, -114017, -168707, -333318, -203800, -89997, -255760, -129528, 283401, 103723, 32508, 207623, -42414, -352673, -239488, -86171, -221628, -218161, -243104, -45548, -119202, -154295, -236985, -175659, -396175, -260114, -261540, -201765, -51664, 5564, 103865, 151874, 263411, 21522, 50154, 236435, 386127, 45711, -50518, -35290, 129627, -392329, -235761, 272067, 131802, 41894, 66037, -332837, -50018, 144423, -214682, -107289, 122214, 146144, -375388, -261436, -236428, 47557, 202845, 40983, 364668, 34567, 63215, -22803, 173228, -14002, -110907]
10131a10907L25341j25729m27329N13140j22348j35146Q5814j46399K72553K87628
10121D16618L1191l53888k07836Q0743K4883l6220p551j95949P3376R9024j04975
10110a80584N4724m6134K25089q648j78285k5637L2059O0295M2523k21171L0370
10099b15399j34308P6702k95383M75929l4284Q1723K96372K8491j84006j05881
10089a0044p9081j26859J24955K60800j21033l80089O7985j92267q813L04183
10079a60263J66616O4731m51690J63718K94887j74346L7490k4764q6951J68149
10069b423J54487k29968m8970K4629L14193m77857o2817J81323j57129R908O3296
10058b31328N4272o3579j85742N8934J03510j75941p2978L04621j41358K76106
$$ y = [-110907, 214434, 88705, -338624, 174516, 52168, -82978, 2836, -143563, 128990, 416618, 447809, 93921, -113915, -33172, -8289, -44509, -52060, -248009, -174633, -75609, -180584, -125860, -171994, 53095, 44447, -133838, -159475, -127416, -67121, -24598, -245769, -215399, -349707, -273005, -568388, -92459, -126743, -45020, 251352, 279843, 95837, -10044, -89125, -215984, -91029, 169771, 48738, -331351, -263366, -455633, -464446, -160263, 6353, 71084, -380606, -216888, 77999, -96347, -58857, -83621, -170572, -2423, 152064, -77904, -126874, -102245, 211948, -265909, -328726, -147403, -304532, -294624, -231328, -177056, -240635, -426377, -367443, -263933, -439874, -512852, -208231, -349589, -73483]
10048g3483M0990J24987k34826J07044j46385K0694J09105j33499k7062J45800
10038f6635k97937K39319k50597q221L02954J85174j0688l2925k46208m4484O3694
10027a66554J78232m15072J33722Q2883n366l6542M6035k03460r1716K08533o4886
10016c34191J744K8140J04108L4946n7921L38609k01127R2316K61897l36312k04862
10005b72653l5122J280P6732K39877j21969l4057K12662l43K52479k26801k80295
9994a88210K16082J25754O903j31653j03465r4682m0361k06817J1165M05250J09566
9983A09532k09453K94125k67748L630q7955L1833K08105J21921n23072J85186
9973a33896j04213J51933j1965L64606j00707j4144J1795j93602O307M2596p9192
$$ y = [-73483, -32493, 92494, -142332, -35288, -181673, -160979, -51874, -185373, -212435, -66635, -364572, -125253, -375850, -384071, -81117, 104057, 93369, 60444, -185764, -230248, -166554, 11678, -403394, -269672, -186789, -192155, -228697, -182662, -386122, -477838, -269305, -334191, -332447, -304307, -200199, -165253, -223174, 115435, -85692, 6624, 268521, -67791, -272653, -307775, -306495, -229763, 10114, -111855, -145912, 66750, 66407, 318886, 92085, -188210, 27872, 153626, 160529, 28876, -74589, -169271, -209632, -416449, -405284, -34, 109532, -99921, 194204, -73544, -69914, -157869, -126036, 82069, 203990, -319082, -133896, -238109, -86176, -98141, 266465, 165758, 151614, 163409, -30193, -23886, 18710, -60482]
9962f0482r0558K7367q6416j74006j4008J49487J08964r8043Q989q2502Q4335
9951b26873k8025R685N693J35121j37919J92527j26421K542J04676K41199r9316
9940G2889j53833J90233j87084j75339L082L04337j57066p5825K36064J9103j58564
9929h2003j00062J42666J54336J29565o0358k52821l7773K77114j74971K86714
9919B82407k71428k22046N0997J60220K9316N3126N1685k00866L96383k44388
9909H5406r6911j18549M6947J03575r9727j49992J94929K41971j72695j70070
9899a35116J2026j12380R8355j29116J34193K5762j45568K90453k344m6062q2323
9888i2120m7332J37091p1727m3439j9629M67649j09125J07137M5106k59262j67596
$$ y = [-60482, -151040, -123673, -210089, -384095, -398103, -248616, -139652, -237695, -228706, -311208, -226873, -254898, -245213, -239520, -104399, -242318, -49791, -176212, -173670, -68994, 172205, 72889, -80944, 109289, -77795, -253134, -250052, 54285, -102781, -178606, 57458, 76561, -82003, -182065, -39399, 114937, 244502, 184144, -68677, -106450, 170664, -4307, 282407, 10979, -211067, -160070, 150, 29466, 82592, 134277, -66589, 329794, 85406, -11505, -130054, -83107, 20468, -79259, -229251, -34322, 207649, 34954, -135116, -123090, -235470, -137115, -266231, -132038, -106276, -251844, 38609, 36265, -9797, -92120, -139452, -2361, -74088, -117527, -137156, 330493, 221368, 328505, 373611, 114349, -53247]
9877e3247J03645R644k07168j25477L5861p3213J98306P8842l7194J39351M2110
9866A11460k16796J0393M9619p5922J27946L6738n5662K02043l79339J47431j44818
9855a86907J31618R1325k78556L50371p4481N3184O5958j12728j29676j03961
9845a93853J08923Q2360l3199K7393P460j21190J89535m2216l03308K27430O0687
9834A0022K34023n9667p4658j98850J03825k8609K9500J23091k10290P6159q6083
9823h1537j82043P4643J09530k39085K6862Q0469N0728m5087O741P0434j7273
9812a45618J64508J0124n7528J80397k59293J11668K83376j36823j66739o9506
9802h5434k5997J23035q2568J5661O0814P9339l50184J50685J4698n9941j489
$$ y = [-53247, 50398, 60042, -147126, -272603, -236742, -309955, -111649, -32807, -70001, 69350, 111460, -105336, -94943, -45324, -121246, 6700, 43438, -12224, 189819, -189520, -42089, -186907, -55289, 36036, -242520, 107851, 33370, 86554, 152512, 39784, -89892, -193853, -84930, -2570, -35769, -8376, -916, -122106, 67429, 25213, -278095, -50665, 10022, 244045, 184378, 109720, -89130, 14695, -13914, 15586, 138677, -71613, 4546, -81537, -263580, -188937, -79407, -318492, -291630, -211161, -160433, -205520, -198779, -128345, -145618, 18890, 29014, -28514, 151883, -107410, 4258, 287634, 150811, -15928, -85434, -111431, 11604, -70964, -55303, 5511, 84850, -265334, -114649, -99951, -159892, -161381]
9791a61381p2702j7188N9130p8707l04876L05444J24848J58369N7j21353k578
9780a10937r3567o0705o3807m003J49191J52816P8234j33035R7230m7444k63487
9769b99514J92020j32954L26749o6442R1117K65114j56678k8625j47880J45007
9759A87914k84215j85785r5776L60071N899Q3051J5813j32395J61556M7817p9971
9748H3979K78610k17730p7884j6244K47802J58262j47000j15747q2012J64329
9738B76365j80798j85954o7501n7147J76823k47860J50911j54015K02427L6469
9728e0280m0272J47273j61186K1372J44435M7169l64295K10449K50558j57187
9718D8036R1532j19147j6842j91890P9823J65514j20383j83544J66445K13625
$$ y = [-161381, -234083, -251271, -192141, -270848, -575724, -270280, -145432, 12937, 12994, -108359, -110937, -204504, -265209, -329016, -333019, -183828, -31012, 47222, -85813, 11417, -36027, -299514, -107494, -240448, 86301, 19859, 110976, 376090, 219412, 190787, 42907, 187914, -96301, -282086, -377862, -17791, -11892, 71159, 86972, -45423, 116133, 163950, 83979, 362589, 144859, 66975, 50731, 298533, 456795, 309795, 194048, 112036, 276365, 95567, -90387, -157888, -215035, -38212, -286072, -135161, -289176, -86749, -50280, -90552, 56721, -104465, -83093, 61342, 108511, -255784, -45335, 205223, 48036, 139568, 20421, 3579, -188311, -108488, 57026, -63357, -246901, -80456, 133169]
9708A33169j66769k08264J29439l1148J98127K5227k66376K1788J50321l34643
9698c49129N0309l8400K99070K78448m02510K0395j63870K59035n3247k6785K23905
9687I7221k07034L51711J12784j29734p0209R98K1587j06562P673l11681L24812
9676I1566l17993j30987L81396L57804k58046j59778J27830J05200r6293l8525
9666F2174J90789j01317J40356k32758l59025P7110M5414K59283J6281J04275
9656B02582k27509j37708J39663K47292O9972q3006n4374M8963L34500j87068
9646C53307k09073J56469k28397l2634R7617L03615N7408q7029j62421q3468k1502
9635A43892j92778n0786J83354L4064l8063l37723K07312J00828k77934L1697
$$ y = [133169, -33600, -241864, -112425, -143573, 54554, 79781, -186595, -164807, -14486, -349129, -298820, -337220, -38150, 240298, -162212, -141817, -305687, -46652, -99899, -126684, 97221, -109813, 241898, 354682, 224948, 154739, 155737, 177324, 70762, 78435, -233246, 91566, -226427, -357414, 23982, 381786, 123740, -36038, 91792, 196992, 100699, 62174, 252963, 151646, 292002, 59244, -299781, -222671, -177257, 82026, 98307, 202582, -24927, -162635, -22972, 224320, 294292, 211286, 156912, 205875, 540375, 353307, 144234, 300703, 72306, 39672, 137289, 440904, 498312, 411283, 248862, 165394, 143892, -48886, -99672, 83682, 117746, 79683, -258040, -50728, 50100, -227834, -196137]
9625a96137J04082O7179L6953k03455J48532m5389J73796n9215M9048O3920K20213
9614C59527j17754l15587K70858p1055L09478M4474j19477k11193l44653M16196
9604B20814k5736l26898J02984J97244R4539k17700O9969k8564L42206J65189
9594E94047J8924m07506K1076n4494O4681N7491j34328k83953j91288J89372K86034
9583A60056J7623K4838p7991j81098l20326J46025K49476J02022P732j76202L2060
9572a5785L84618m74507k66361L28932m9524L36126M5831j67821J56613L5341
9562C13463j24344j31782j624J86863j35771J4979k54327R0529P4031j24237K36727
9551A44507L4871j97974K8368L7159J00938j7737q5040n3913M33343P7883k41389
$$ y = [-196137, -92055, -24876, 12077, -191378, -42846, -88235, 85561, 26346, 75394, 139314, 359527, 241773, -73814, 197044, 125989, 435467, 479941, 360464, 149271, -195382, 220814, 195078, -131820, -28836, 168408, 262947, 45247, 115216, 86652, 428858, 594047, 612971, 205465, 226541, 172047, 236728, 294219, 159891, -124062, -315350, -125978, 160056, 177679, 202517, 124526, -56572, -376898, -230873, 18603, 120625, 128357, -47845, -15785, 368833, -105674, -372035, -43103, -92627, 243499, 289330, 121509, 278122, 313463, 189119, 57337, 55713, 242576, 106805, 121784, -132543, -42014, 32017, -92220, 144507, 179378, -18596, 9772, 46931, 147869, 130132, 45092, -8821, 424522, 502405, 261016]
9540B61016J01156l13202M0842p472j74287L38636J33792O9194m10740J8877L09228
9529C67040m2124k69877l9349R2636K08720l59343J15537K70721n13316O6681
9519a02674J78264K79863J6291j79641j00446q6811k17751L3189K7423J07926
9509d4367J25333j63562J15262L14307k8743r2198J3864k04864J03408j95496
9499e7056k18182K80807O846M55338p02523m1685J86622L42236p8324Q9889j23808
9488A40160j72939J31196J94240J43389l94013K71465j1127k87783L51643j5735
9478C50496j93972J30790p0105j51393L44875l15623K43321J77902l99726P6020
9468A92585o5327o5757j44864J62139L27582l1585j63987J13284l9042L47108
$$ y = [261016, 362172, 48970, 89812, 82340, -91947, 246689, 380481, 449675, 38935, 57812, 367040, 324916, 55039, 15690, 108326, 317046, -42297, 73240, 343961, -169355, -102674, 75590, 355453, 371744, 192103, 91657, 4846, -212905, -179716, -152293, -44367, 80966, -82596, 32666, 346973, 318230, 226032, 239896, 35032, 138440, -57056, -275238, 5569, 12415, 467753, -234770, -276455, -89833, 252403, 174079, 263968, 140160, -32779, 98417, 292657, 436046, 42033, 313498, 302371, 14588, 366231, 350496, 156524, 287314, 217209, 65816, 410691, 95068, 338389, 516291, 116565, 192585, 127258, 61501, -83363, 78776, 406358, 374773, 210786, 324070, 285028, 632136]
9458F32136k78067l7122l12344J8288P8935J2421M793p2290j36470L1152j57131
9447b15699l4575m1740K52816m4652J84094l1701n5313J69328j01746l0173k36234
9436a85595K18744K09934k33851j02446J73266N6152Q9394j60098L8622P9956
9426A84078j21681P3279J07181k26166K48942j16267J54842j94193q5429O2221
9416H6807j17988j5955J65127K79971J09219k15291k36264J11533L35526l43505
9406A59180j37774L22546r9998J20890j03169K5416o1041j77148j0100K31334
9396B70136J53568J36955n4126j5112k38604j85524O3059N6561k02837K36697
9386B20773J96285q3695J0726k74406J8914O3073O1063J98538m14719L65748L17151
$$ y = [632136, 354069, 316947, 4603, 22891, 101826, 114247, 119040, 46750, -89720, -58568, -215699, -250274, -292014, -39198, -83850, 100244, 68543, 13230, 182558, 80812, 50639, -185595, 33149, 243083, 9232, -93214, 80052, 136204, 225598, 65500, 104122, 184078, 62397, 135676, 242857, 16691, 265633, 149366, 304208, 110015, 24586, 86807, -31181, -47136, 117991, 397962, 507181, 291890, 55626, 167159, 502685, 159180, 21406, 343952, 243954, 364844, 261675, 287091, 226050, 48902, 38802, 270136, 423704, 560659, 506533, 491421, 252817, 67293, 130352, 186913, -15924, 220773, 417058, 333363, 344089, 69683, 88597, 151670, 212733, 411271, -3448, 362300, 679451]
9375F79451J4436n79508j31933P0528J99365J20291Q1166j69466l06400R7897
9365G5827k2343n8498J45364J17089Q8688q4028l65428K14810K06412j9758k81904
9354A6231R2798l30055k0952J76868r4350J91142L88971J55260J4236J3290j71100
9343D32339j13534M5692Q4968q5512R782j51130K6612k9839j75727r6027k97814
9332c50190J75469L89238L1431R8374o9254k54783J20298j39944J64236J11097
9322B75972q5111o453j42071J51681O7431K70155j81960J12861j74092j32602
9312A55811R603j0503K55960k65077L89262m11997J09062j20392P250l4898N316
9301H9397J91128J55574n1021r1546K8964J14857J33219j58264l39337k12956
$$ y = [679451, 693887, 114379, -17554, 52974, 252339, 372630, 453796, 284330, -22070, 75827, 53484, -5014, 140350, 257439, 346127, 262099, -103329, 111481, 317893, 298135, 16231, 109029, -221026, -241978, -65110, -159460, 31682, 420653, 575913, 590149, 603439, 432339, 318805, 364497, 449465, 363953, 373735, 222605, 249217, 219378, 43651, -52376, -350190, -174721, 214517, 245948, 344322, 275068, 20285, 140583, 639, 164875, 275972, 190861, 184408, 42337, 194018, 261449, 531604, 349644, 462505, 288413, 155811, 165414, 154911, 410871, 145794, 535056, 123059, 232121, 111729, 118979, 84081, 89397, 280525, 436099, 385078, 293532, 322496, 437353, 570572, 412308, 72971, -139985]
9291a39985K81287J43489N9106J65821m9141j86805j41604K50832n3205j24953
9281B04842J54446Q3979n4084l58238l30078N65127J03210k5390J91022j00489
9271D34347k19321J12013j69509R8299J29423j74979J29738P8424P8180k22902
9261B73713j29907k3678J41714j26547j3787N1804Q8954J46094J35262l13720
9251B29902k93l5761J01235Q3574J20203n1235p4715J08047p5343j12165J78180
9240D71629j67020J0462J68148k00502k18379O7549l0804J10050o9288K5049K28572
9229C95466J3506k20153M5217p4955k8972K20860M6698j90994J66709j38129k07245
9218B8008L76131o9823J23565L07761j81229k02744J15702J46207k11020J63265
$$ y = [-139985, 141302, 284791, 343897, 509718, 460577, 273772, 132168, 383000, 329795, 204842, 359288, 443267, 389183, 30945, -299133, 265994, 369204, 343814, 534836, 434347, 215026, 327039, 157530, 255829, 385252, 210273, 340011, 418435, 496615, 273713, 143806, 120128, 261842, 135295, 121508, 173312, 262266, 408360, 543622, 229902, 229609, 193848, 295083, 378657, 498860, 447625, 372910, 480957, 405614, 293449, 471629, 304609, 315071, 483219, 282717, 64338, 131887, 101083, 211133, 141845, 166894, 395466, 408972, 188819, 234036, 159081, 130109, 350969, 397667, 206673, 373382, 235253, 28008, 404139, 334316, 457881, 765642, 584413, 381669, 497371, 643578, 432558, 595823]
9208E95823j21189j0952J30990k75714j18941n2998j56193K02864M44098n44258
9198I3530j45968N6238K2681K83991O4710O0600r6343J99748r378m45239K11254
9187B95824K01158J84822o20155k00990L66290j14336J94232L13631j16186J8442
9177E22732J46996j24892k14508j10441K70399J04725l45407j98008M00257m5883
9167D05970j70834j08793L22026K31695m18805J12487r2326o7514J98464M9762
9157D62132l63905N1581K95582L72L95597j74669n5471R5096K7811k05130l65176
9146A63820R0036K75699j51355j29675O2363M6200k6669M6220K78065q9189j60470
9135D05045k45924J45009J86799l59454J21003L56732j94563j48782K2953L41328
$$ y = [595823, 474634, 463682, 594672, 318958, 200017, 147019, -9174, 193690, 637788, 93530, -52438, 3800, 26481, 310472, 375182, 435782, 339439, 539187, 529809, 84570, 295824, 496982, 681804, 61649, -139341, 226949, 112613, 306845, 620476, 504290, 522732, 669728, 544836, 330328, 219887, 490286, 595011, 249604, 51596, 451853, 405970, 235136, 126343, 448369, 680064, 261259, 373746, 281420, 213906, 412370, 462132, 98227, 149808, 445390, 445762, 841359, 666690, 611219, 706315, 734126, 528996, 163820, 253856, 529555, 378200, 248525, 310888, 357088, 330419, 376639, 654704, 565515, 405045, 159121, 304130, 490929, 131475, 252478, 609210, 414647, 265865, 288818, 630146]
9125F30146j11459o6291Q2838j9443k0761J53025k45018K62256j23730r3567N4356
9114E02352O7022K5613q1602J77801j89127L7455M7186k44980m18306J41169N61004
9103F25587R5778j03972l62292q2949L79522j3174j08655k6033R6071J42273j36798
9092E05358K2632J20354j74178r6969R4558j48593K06304Q6754J68558j53253
9082F31525j7025r0585n0942K40175k58049Q1753K18772J48172k65420M7690j07338
9071E78728J78626k43199J37593j38159K20487L3625m3227r552J4282O355J84022
9060I19581k17301R300q5273J29816N4403k63022l9186L83603j76153j96656L84397
9049I03509m04677q9382L09225R236k4384j93533q6039K45440j63526q9153K75802
$$ y = [630146, 518687, 452396, 535234, 515791, 495030, 648055, 403037, 665293, 541563, 447996, 502352, 569374, 594987, 513385, 691186, 502059, 539514, 586700, 341720, -76586, 64583, 625587, 721365, 617393, 255101, 172152, 551674, 538500, 429845, 403812, 499883, 642156, 505358, 527990, 648344, 474166, 377197, 471755, 323162, 529466, 616220, 784778, 631525, 614500, 523915, 472973, 713148, 455099, 536852, 755624, 903796, 638376, 686066, 578728, 757354, 514155, 651748, 513589, 734076, 767701, 724474, 714922, 729204, 735559, 919581, 702280, 711580, 626307, 756123, 810526, 547504, 508318, 891921, 715768, 519112, 903509, 498832, 409450, 718675, 727911, 703527, 509994, 423955, 669395, 505869, 416716, 692518]
9038F92518J37937O9155K5212m9150J80353j17182l33252k357K52034l51667L9186
9027E42787J51075n0732l1143J84971r4437j42152J00912k0854j98992J37650
9017E79085j85328J49381K19906j73105O0440j91168R450O5602j85327M58660
9007H07596K7029J22755l8827o568l25933l2201M55253k12254l23389N6915L80457
8996I10833M076k75678M1470o2311p1369j46595K61515K00874M292J30363n8658
8985I38812l17396J88860j56564j13691J43474j7289K73692k7531P9358l33052
8975F58673n840L63150j94045k28552L5470N11352j09051o4146j063k99308K7785
8964F94425M13803k73888j02185K17678m02002L33590l8070j27377J22142k22541
$$ y = [692518, 830455, 899610, 924822, 875672, 1056025, 938843, 605591, 603234, 855268, 503601, 542787, 693862, 643130, 611987, 796958, 702521, 560369, 661281, 640427, 441435, 579085, 393757, 543138, 763044, 589939, 650379, 459211, 468661, 534263, 348936, 807596, 834625, 957380, 918553, 911985, 586052, 553851, 1009104, 796850, 473461, 530376, 910833, 914909, 639231, 680701, 618390, 547021, 400426, 661941, 862815, 867107, 997470, 938812, 621416, 810276, 653712, 540021, 683495, 666206, 939898, 912367, 991725, 658673, 652833, 1015983, 821938, 593386, 628856, 1140208, 1031157, 967011, 965948, 666640, 694425, 1108228, 834340, 732155, 949833, 547831, 881421, 843351, 715974, 838116, 615575]
8954F15575J7030l9028J5430O0651J2836r5910P5197K43182M9706k43550J47681
8943H58800N9118l0348p3617j82946L57146k91270P5420K09077j5791o6237K83290
8932A182642K9488o4159j49164l977j18514p0882M5647k25962K71311K9928k91294
8921F35064J87417Q3427K37514r206J09900l21706l3180M22846j36980m8518q3657
8910A042921j66024L36890j57246j38352l79125L02427K11447o9724K07387p1754
8900A118847K0906l69440n4370J73466P8717q0448J82052J33250N6790k4616m59590
8889G75564K72357j44889j6576k25304J31387M8771p5150M0952L24449J97321
8879A328882k38054q800r0845P9586n5096j54841J62212K11757m0985p8006j03878
$$ y = [615575, 632605, 593577, 609007, 669658, 682494, 586584, 661781, 904963, 954669, 711119, 858800, 917918, 887570, 813953, 631007, 988153, 696883, 772303, 981380, 965589, 899352, 1182642, 1212130, 1147971, 998807, 994830, 876316, 805434, 851081, 625119, 896430, 926358, 635064, 822481, 905908, 1143422, 1134216, 1244116, 922410, 889230, 1312076, 1175096, 1126578, 1042921, 876897, 1213787, 1056541, 918189, 539064, 841491, 1052938, 983214, 1190601, 1118847, 1139753, 770313, 715943, 889409, 968126, 887678, 1069730, 1202980, 1259770, 1235154, 775564, 1047921, 903032, 886456, 661152, 792539, 841310, 766160, 807112, 1131561, 1328882, 1090828, 1082028, 991183, 1070769, 1015673, 860832, 1023044, 1234801, 1193816, 1115810, 1011932]
8868A011932M00335L7174n69295K80092K13856k29679J02049K5438m2763k41012
8858I88127J37441J31002R2862l87588L42923J32931L1719M9800J00774j14875
8848A505116j70537p7415L9219q8392J03124j19838K48318m1144k48613k6769
8838A123069L38722L0251l21006n9077j43946K8667J83895J2197R1910Q5444j50065
8827A220061K09602J2330J63745l74286j22368J50194j6891O4769J95436P3200
8817A575792m82035j2641L11415J20502m32823L30605r9091P8381O4999J99882
8807A654986q2567M5173j69164J82391K19600j01177m2231k11670J25259j61477
8797A459123J44736J1066J03604k66676K15148l60495J8527J64878q6227L71676
$$ y = [1011932, 1412267, 1449441, 880146, 1160238, 1374094, 1144415, 1246464, 1271902, 1229139, 988127, 1125568, 1256570, 1349432, 961844, 1304767, 1437698, 1469417, 1519217, 1619991, 1505116, 1334579, 1257164, 1296383, 1207991, 1311115, 1191277, 1439595, 1398451, 1149838, 1123069, 1461791, 1492042, 1171036, 1111959, 968013, 996680, 1180575, 1192772, 1284682, 1370126, 1220061, 1429663, 1441993, 1605738, 1231452, 1109084, 1259278, 1242387, 1307156, 1502592, 1575792, 1093757, 1081116, 1392531, 1513033, 1080210, 1410815, 1311724, 1390105, 1455104, 1654986, 1572419, 1617592, 1448428, 1630819, 1850419, 1749242, 1707011, 1495341, 1620600, 1459123, 1603859, 1614925, 1718529, 1451853, 1667001, 1306506, 1325033, 1489911, 1403684, 1775360]
8787A775360J07283J1312m15652k10498K00447k75593M33165r3945k27314P2842
8777A377407P6982K04926j4233L22140J40379k27613J27568j96137l61919J08956
8767A558456J73922k69046K6462K47324J5427J39165m33800J24563j64781J17480
8757A535172J41525J28527J23872j2827q3943j47632l2271Q2347k37627J16900
8747A614043m1947j21897K79667J40663k4682k13930J68686j16959j42819o6847
8737A473978M33574j57350J065K29915o7361k45230J55213k6822R3332R3612J31594
8726B115520k71556j1889j9372K29198L5709r6519J70129r7588j43619R2038j48057
8715A853994K85401l03227l1970J45239O617K83601j70435j27535k1906J64746
$$ y = [1775360, 1882643, 1893955, 1478303, 1267805, 1468252, 1192659, 1625824, 1531879, 1304565, 1377407, 1454389, 1659315, 1645082, 1967222, 2107601, 1879988, 2007556, 1811419, 1449500, 1558456, 1732378, 1463332, 1489794, 1737118, 1752545, 1891710, 1457910, 1582473, 1417692, 1535172, 1676697, 1805224, 1929096, 1916269, 1832326, 1684694, 1652423, 1734770, 1497143, 1614043, 1572096, 1450199, 1729866, 1870529, 1845847, 1631917, 1800603, 1683644, 1540825, 1473978, 1907552, 1750202, 1751267, 1981182, 1913821, 1668591, 1823804, 1796982, 1890314, 1983926, 2115520, 1843964, 1832075, 1812703, 2041901, 2077610, 1981091, 2151220, 2053632, 1910013, 2002051, 1853994, 2139395, 1836168, 1804198, 1949437, 1956054, 2239655, 2069220, 1941685, 1919779, 2084525]
8705B084525N1188r3663j72259j9916j48232l7954J24126J22466j00372L84508
8695B194417k5174k55268L5762J22632L09237K26874l16911L3205r8888P4806
8685B300692p5449M0463J63312k64004k64140k02297J62034J41817K45475R2940
8675B340843J1038k41442p1837N70674j8961j05890O692o148l87k86337K34007
8664B432252Q7041k69604J45164j66573l61478J99481K20978M4131O8293L09045
8654B708730j48725r4149k1150p0460j60585j27697M89725k09025L0616J42105
8644B539385J8442n8702q9142k30293R9442K13339Q3092l2299J16223K26222m31412
8633B454297L1100K01998J10014l1250N892N0699j63093k6653L4054n155L51226
$$ y = [2084525, 2135713, 2042050, 1869791, 1849875, 1701643, 1663689, 1787815, 1910281, 1809909, 2194417, 2169243, 1913975, 1949737, 2072369, 2381606, 2608480, 2291569, 2324774, 2225886, 2300692, 2225243, 2265706, 2429018, 2165014, 1900874, 1698577, 1860611, 2002428, 2247903, 2340843, 2351881, 2110439, 2038602, 2609276, 2590315, 2484425, 2491117, 2484969, 2484582, 2198245, 2432252, 2519293, 2249689, 2394853, 2228280, 1866802, 2066283, 2287261, 2331392, 2399685, 2708730, 2560005, 2465856, 2444706, 2374246, 2213661, 2085964, 2575689, 2366664, 2397280, 2539385, 2557827, 2499125, 2409983, 2179690, 2279132, 2492471, 2575563, 2543264, 2659487, 2885709, 2454297, 2485397, 2687395, 2797409, 2766159, 2772051, 2822750, 2659657, 2633004, 2667058, 2661903, 3013129]
8622C013129k95630j89049J10367M1053l16831N9271R1339R7177N6831M3099O4818
8611B775574J22030N6905k61425J77465p4583P3231O8481j01368j95830J75445
8601B815925r0332L32610K0942J35225m28492j49005J06680M03966j11516k5166
8591C010837l21837K23616j9625j60592K36476L9599M2175k8j7935l4167k7116
8580B971403N2161k31421J30851O8684l9544K72679j66806L887m1915P4846k67
8569C094558J67708k02399J28999K2637p4684K3646J03891J1877m2761q649J99915
8558C424738k89596J23248N17161n20966k21619L27518l29694J20149K46347n9287
8548C337999J19129j4410J71752J7711n4687k63938q2524M81105o4434Q4348j26268
$$ y = [3013129, 2717499, 2528450, 2638817, 2679870, 2363039, 2422310, 2513649, 2610826, 2667657, 2710756, 2775574, 2897604, 2954509, 2693084, 2870549, 2795966, 2869197, 2937678, 2836310, 2640480, 2815925, 2725593, 3058203, 3079145, 3214370, 2785878, 2636873, 2743553, 3147519, 3036003, 3010837, 2689000, 2912616, 2892991, 2732399, 2968875, 3008474, 3050649, 3050621, 3032686, 2998519, 2971403, 3023564, 2792143, 2922994, 2991678, 2952134, 3224813, 3058007, 3061894, 3019979, 3094825, 3094558, 3262266, 3059867, 3188866, 3211503, 3136819, 3160465, 3264356, 3276233, 3233472, 3224823, 3424738, 3135142, 3258390, 3775551, 3254585, 3032966, 3360484, 3030790, 3150939, 3397286, 3337999, 3457128, 3442718, 3614470, 3632181, 3577494, 3313556, 3231032, 3712137, 3647703, 3732051, 3605783]
8537C605783k54569j70270M89679K22517l53895k2771P1840O8912K22394j67379
8527C712241R4467j78798L17585J49225j54353j01927M6658N8449J52076j52407
8517C943216L37871K8514n4043R867j47773Q403p0575k11363j25333J70102J48214
8506D037100K56213M18332j36972j24391j36632R6144j84663M832J34424j55224
8496D209163J65950L6558P5882n8404k4016J74720o0270n5053j27889J09907K76199
8485D722747q362l1269L3469K68670J1152k78951K81578n8634q8059L31388q9339
8474E094390L6687Q2540J07674k83751N96290l75824j94410R5034J66815J75948
8464E501393j54325p9694O477o9512K16484r470J56739K12163N4470p4888r6473
$$ y = [3605783, 3351214, 3180944, 3670623, 3893140, 3539245, 3516474, 3588314, 3657226, 3879620, 3712241, 3806708, 3627910, 3945495, 4094720, 3940367, 3838440, 3885098, 3943547, 4095623, 3943216, 4281087, 4309601, 4255558, 4265425, 4117652, 4126055, 4055480, 3844117, 3718784, 3888886, 4037100, 4293313, 4711645, 4574673, 4450282, 4313650, 4409794, 4225131, 4229963, 4364387, 4209163, 4375113, 4411671, 4487553, 4429149, 4405133, 4579853, 4519583, 4464530, 4336641, 4446548, 4722747, 4714385, 4683116, 4716585, 4985255, 4996407, 4717456, 4999034, 4940400, 4852341, 5183729, 5094390, 5131077, 5213617, 5321291, 5037540, 5633830, 5258006, 5063596, 5158630, 5325445, 5501393, 5347068, 5267374, 5273851, 5204339, 5420823, 5411353, 5568092, 5780255, 5834725, 5759837, 5663364]
8453E663364l2872j37391N8194J99871o6284k02234L6383L05123j84672j5718
8443E623764j9976P2068M1793L09923j33763K03098R1331J89244l07577k1003
8433F048902K51792J57709q4306J23713L08356j72445K7775N8848Q816j0150J69176
8422F888186J21303k18523j60445J51754J65112J04953J79599L69834m35355J8977
8412G185395o4089K56797J75421m5875J73566J0551q5557J60099j11207L22965
8402G978066N864j83657K81967J43834J26353m279q9634L9092J57619M2338q6768
8391H410795Q542L9993J44204l1918K56508L32344j16007M1546j07521K29378
8381I207864r050J41051M8928K7688J76472P8709p4694J14370n2218J30781N17299
$$ y = [5663364, 5630492, 5493101, 5551295, 5751166, 5684882, 5482648, 5519031, 5824154, 5639482, 5623764, 5603788, 5675856, 5717649, 6027572, 5893809, 6096907, 6188238, 6377482, 6069905, 6048902, 6300694, 6458403, 6374097, 6497810, 6806166, 6633721, 6661496, 6720344, 6729160, 6719010, 6888186, 7009489, 6790966, 6630521, 6782275, 6947387, 7052340, 7231939, 7601773, 7166418, 7185395, 7121306, 7378103, 7553524, 7507649, 7681215, 7691766, 7606209, 7766308, 7655101, 7978066, 7983930, 7800273, 8082240, 8226074, 8352427, 8348148, 8258514, 8297606, 8455225, 8497563, 8410795, 8419337, 8459330, 8603534, 8571616, 8828124, 9160468, 9044461, 9086007, 8978486, 9207864, 9198814, 9339865, 9388793, 9416481, 9592953, 9671662, 9596968, 9711338, 9659120, 9789901, 10307200]
8370A0307200j43604K33781l69453k45731N9181P50294L26125j61363j75058j36732
8360A0444640K89821K97770O7751K32122k71561k08306L03272j88599J24697K96252
8350A1387859O7236J5469J80865L20650l61665K69358J61245K99980O9695k90219
8340A2120473Q1727m5547K23168L40985m497k06877n2685j0923o2845N12624p2871
8329A2822732j90983K12046J54034J42978J45824K91148K51795j14977m4549k9413
8319A3640635K16489J70481j27615J03987K750n1364K09870J71271O6863J66519
8309A4569886j6299n3835M20209J26069L22016Q2129Q4007O4092n56817K25652
8299A5267109k6588O35555n4130l6577N2433K84780R8307O0580J90359L36472
$$ y = [10307200, 10163596, 10397377, 10027924, 9782193, 9841374, 10591668, 10917793, 10756430, 10581372, 10444640, 10734461, 11032231, 11099982, 11332104, 11060543, 10852237, 11155509, 10966910, 11091607, 11387859, 11455095, 11470564, 11651429, 11972079, 11610414, 11879772, 12041017, 12340997, 12410692, 12120473, 12202200, 12156653, 12379821, 12720806, 12716309, 12509432, 12456747, 12445824, 12382979, 12895603, 12822732, 12631749, 12843795, 12997829, 13140807, 13286631, 13577779, 13829574, 13714597, 13670048, 13640635, 13857124, 14027605, 13899990, 14003977, 14006727, 13955363, 14165233, 14336504, 14403367, 14569886, 14553587, 14499752, 14919961, 15046030, 15368046, 15450175, 15534182, 15598274, 15041457, 15267109, 15240521, 15876076, 15821946, 15785369, 15837802, 16122582, 16220889, 16281469, 16471828, 16808300]
8289A6808300j28945K87280J33355M6497M66797N7052K71900M8985J14706p6854
8279A8029073J08040M24223k021K33783q3965K24321N2362J90319J84157q9776
8269A9270516N29906P3702j49978J08178J24523K95662K42137L73956J77007Q6491
8259B1132100K52938k52833J61851R7353K00891K47050N26470L85800j58861L65043
8249B2957802L23195J01736J08993j65807L46339M94394N66294J48700R6302L36076
8239B5314024j09464L02206O3720K62784L54439J94245L98183K45613M49671N64847
8229B8040268J26694J25193L41725L36382N70157L64326L53265L59073Q44282
8220C1461365o325l6186P19217L34126R41735O45125J23083K85026Q50542O56302
$$ y = [16808300, 16679355, 16966635, 17099990, 17146487, 17613284, 17670336, 17942236, 17991221, 18105927, 18029073, 18137113, 18561336, 18559315, 18793098, 18709133, 18933454, 18985816, 19176135, 19360292, 19270516, 19800422, 19874124, 19724146, 19832324, 19956847, 20252509, 20494646, 20868602, 21045609, 21132100, 21385038, 21132205, 21294056, 21391409, 21592300, 21839350, 22365820, 22751620, 22592759, 22957802, 23280997, 23382733, 23491726, 23325919, 23672258, 24166652, 24732946, 24881646, 24977948, 25314024, 25204560, 25506766, 25570486, 25833270, 26187709, 26381954, 26780137, 27025750, 27475421, 28040268, 28166962, 28292155, 28633880, 28970262, 29540419, 29904745, 30258010, 30617083, 31461365, 31455040, 31418854, 32138071, 32472197, 33413932, 34059057, 34182140, 34467166, 35317708, 35974010]
8210C5974010K05356M41667r148O88881P30859R32187M99259J83889N20653O19480
8200D0787093M57714Q55188O66031O82881O88176R46054O76439J531227J432761
8191D8723564o79821O14065O68723Q69887J179383J135491L97032R75082Q77809
8182E4761215P84865J119230J067930R71868R95399J388397J278369J148756J278160
8173F4794189J156509J163674J287127J527409J158515J689954J492533J336223
8165G5606133J314945J988209J738755J461820J572017J544904K432074K047351
8157H9706208J945820J912415K035713K234610K585274K418035K580331K093426
8149A07511832K417237K791223K635063K978387L120390K587539K808777L091501
$$ y = [35974010, 36179366, 36621033, 36611885, 37300766, 38031625, 38963812, 39463071, 39646960, 40167613, 40787093, 41244807, 42099995, 42766026, 43448907, 44137083, 45083137, 45759576, 47290803, 48723564, 48043743, 48657808, 49326531, 50196418, 51375801, 52511292, 52908324, 53883406, 54761215, 55546080, 56665310, 57733240, 58705108, 59700507, 61088904, 62367273, 63516029, 64794189, 65950698, 67114372, 68401499, 69928908, 71087423, 72777377, 74269910, 75606133, 76921078, 78909287, 80648042, 82109862, 83681879, 85226783, 87658857, 89706208, 91652028, 93564443, 95600156, 97834766, 100420040, 102838075, 105418406, 107511832, 109929069, 112720292, 115355355, 118333742, 121454132, 124041671, 126850448, 129941949]
8141A29941949L212520L414539L388360K897118L744734L744668L942488L990527
8133A58276903L916178L674387M149328M376373M225672M308982M013789M555522
8125A91497134M422552M464028M742032M657116M348153M831734M896912M241627
8117B28101288M800480M830100M800204M578521M803788M759202N020116N038214
8109B66731913M995643N088276M778851N017162N138353N120026N344513N043351
8101C07258088M695744M916872M964654M810795M359653M579825L972359L704964
8093C43262954L173023L083624L120240K861478K944293K560939K727447K870379
8085C66604377K239612L038143K771505K873911L305552K728092K715145K990049
$$ y = [129941949, 133154469, 136569008, 139957368, 142854486, 146599220, 150343888, 154286376, 158276903, 162193081, 165867468, 170016796, 174393169, 178618841, 182927823, 186941612, 191497134, 195919686, 200383714, 205125746, 209782862, 214131015, 218962749, 223859661, 228101288, 232901768, 237731868, 242532072, 247110593, 251914381, 256673583, 261693699, 266731913, 271727556, 276815832, 281594683, 286611845, 291750198, 296870224, 302214737, 307258088, 311953832, 316870704, 321835358, 326646153, 331005806, 335585631, 339557990, 343262954, 346435977, 349519601, 352639841, 355501319, 358445612, 361006551, 363733998, 366604377, 368843989, 371882132, 374653637, 377527548, 380833100, 383561192, 386276337, 389266386]
8077C89266386K734715K590135K386360J784137J213471J382219R08316L15774
8069D02581513l55169j113874q59095j152919j096488j674695j211535j272010
8061C93845728j390113j340570r22373j127605j289096j600266j427778j057169
8053C83690758q00714r57679o83933r54435o89222K13545N6814M45309O69459
8044C80989902M98534O59572J205063R59126J557333R72970J098469R77616O11356
8035C89529941O01322P23831M10774J48175K07142J73355j78614J63920l73684
8026C91406162p29638q80834j411853j582842j838585l305675l555868m005724
8018C74095143m272338m951618m821034n377854n818394n617286n890229n817257
$$ y = [389266386, 392001101, 394591236, 396977596, 398761733, 399975204, 401357423, 402265739, 402581513, 402226344, 401112470, 400253375, 399100456, 398003968, 396329273, 395117738, 393845728, 392455615, 391115045, 390192672, 389065067, 387775971, 386175705, 384747927, 383690758, 382890044, 381932365, 381248432, 380293997, 379604775, 379818320, 379875134, 380320443, 380989902, 381488436, 382148008, 383353071, 384312197, 385869530, 386842500, 387940969, 388918585, 389529941, 390131263, 390855094, 391265868, 391414043, 391621185, 391794540, 391615926, 391779846, 391406162, 390676524, 389795690, 388383837, 386800995, 384962410, 381656735, 378100867, 374095143, 369822805, 364871187, 360050153, 354672299, 348853905, 343236619, 337346390, 331529133]
8010C31529133n594308n295667n633248n257968n225566n622014m924019n194800
8002B88781543n213171n073613n350373n210124n476279n639404n741609n363616
7994B45713354o115071o117355o391079o171406o445686o145383o194146o152284
7986A95980944n621251n853991n565302n262006n180525m797971m573946m382754
7978A54743198m255098l860391m205941l962656l524952l128565l375314l266816
7970A25163465l170271l081809k549693k747007k794315k295269k422739k549161
7962A03553201k306545k256624k033473k328152j663659j966595j765091j868397
7954H7364665j990025j471398j812721j836226j751768j241860j232119j316889
$$ y = [331529133, 325934825, 320639158, 315005910, 309747942, 304522376, 298900362, 293976343, 288781543, 283568372, 278494759, 273144386, 267934262, 262457983, 256818579, 251076970, 245713354, 239598283, 233480928, 227089849, 220918443, 214472757, 208327374, 202133228, 195980944, 190359693, 184505702, 178940400, 173678394, 168497869, 163699898, 159125952, 154743198, 150488100, 146627709, 142421768, 138459112, 134934160, 131805595, 128430281, 125163465, 121993194, 118911385, 116361692, 113614685, 110820370, 108525101, 106102362, 103553201, 101246656, 98990032, 96956559, 94628407, 92964748, 90998153, 89233062, 87364665, 85374640, 83903242, 82090521, 80254295, 78502527, 77260667, 76028548, 74711659]
7946G4711659j241822j479258j342894j136229j230643j352183q18940q14785
7938F5294905j310644q05092j124657o76127j252436r25837q65644q18660p39145
7929E6776663p03450n28298n01448o57993p95370o48634q66732p81395p28401
7920E0564942n85067m64663p96229n76213m16543o85752m26508p05438j67158
7911D5741371n22851p14847j75188j85263o56002m75909J95544p27744p54202
7902D1724909r3844n03884n8077m51085l15473j20632l42628l63727l76238k42135
7892C8857186k81558L500q9953m55573j29551l14910l34632l11802j76235k56243
7882C6510229n8839l56158P746k5021j51926k77132j73080J75332l68600P6560
$$ y = [74711659, 73469837, 71990579, 70647685, 69511456, 68280813, 66928630, 66109690, 65294905, 63984261, 63179169, 62054512, 61378385, 60125949, 59200112, 58334468, 57515808, 56776663, 56073213, 55544915, 55043467, 54385474, 53590104, 52941470, 52074738, 51293343, 50564942, 49979875, 49515212, 48718983, 48142770, 47726227, 47040475, 46613967, 45908529, 45741371, 45218520, 44503673, 44328485, 44143222, 43487220, 43011311, 43206855, 42479111, 41724909, 41631065, 41127181, 41069104, 40618019, 40302546, 40181914, 39839286, 39475559, 39099321, 38857186, 38575628, 38579128, 38489175, 38033602, 37904051, 37589141, 37254509, 36942707, 36766472, 36510229, 36451390, 36095232, 36102978, 36077957, 35926031, 35648899, 35475819, 35651151, 35282551, 35359111]
7872C5359111m06353j68527P7337O3911k28744J1211J01152m77235J78929m22982
7862C4087810k9648k5474P5675K2339j10706K93250k04274M67652k13685j01950
7852C4260989K01200O113K7923j17680m17128J18899P68488l5064j2490K83075
7842C5084325N6197K16890n8752P3140M71696J8304J39657J71739O4053M15449
7832C6652698L5247J11973J40805M68819K70661M18182K98832k24258P79529O9634
7822C9022122p2380Q31674J06484K90301K68312M96309M15366O65733K14859M48553
7812D2687333P03902K68299M24925m8776Q41960M87594O80650K23229M52039O70322
7802D7391477P38818N03599P25103N76163P45377P92625J048921N92195N98393
$$ y = [35359111, 34952758, 34784231, 34861568, 34925479, 34696735, 34707946, 34809098, 34331863, 34510792, 34087810, 34058162, 34032688, 34108363, 34130702, 34019996, 34313246, 34108972, 34576624, 34362939, 34260989, 34462189, 34468302, 34496225, 34378545, 33961417, 34080316, 34848804, 34813740, 34801250, 35084325, 35140522, 35357412, 35298660, 35371800, 35843496, 35861800, 36001457, 36173196, 36237249, 36652698, 36687945, 36799918, 36940723, 37409542, 37680203, 38098385, 38397217, 38172959, 38952488, 39022122, 38949742, 39781416, 39887900, 40178201, 40446513, 40942822, 41358188, 42023921, 42238780, 42687333, 43391235, 43659534, 44084459, 44035683, 44877643, 45365237, 46045887, 46269116, 46721155, 47391477, 48130295, 48633894, 49358997, 49935160, 50680537, 51473162, 52522083, 53114278, 53712671]
7793E3712671P46700Q87673O55348P36434J342497P11348J030216O94704Q60568
7784F1378159J459296J240503P89708J156224J174372R92291R13829J122050R19161
7775G1145593J286663J146609R47134J334567J247657J236293J439853Q72656
7767H0657025J289881J349919J037098J109748J149163J120439J045652J098676
7759H9857601Q69442J194267Q60228P41187R12012P45262Q27363P19604P39848
7750I7466814O36447N35327P79211N77567M9086N88056n9574K64092L66456j10758
7740A01092724J5727j98825q9657l71859j23760j72745m87306o59293n75732r49454
7730I7479820r51835o49100j181412q16948o83745j047817j005294j092648j462496
$$ y = [53712671, 54459371, 55347044, 56002392, 56738826, 58081323, 58792671, 59822887, 60517591, 61378159, 62837455, 64077958, 64867666, 66023890, 67198262, 68190553, 69104382, 70226432, 71145593, 72432256, 73578865, 74525999, 75860566, 77108223, 78344516, 79784369, 80657025, 81946906, 83296825, 84333923, 85443671, 86592834, 87713273, 88758925, 89857601, 90727043, 91921310, 92781538, 93522725, 94434737, 95179999, 96007362, 96726966, 97466814, 98103261, 98638588, 99417799, 99995366, 100044452, 100632508, 100572934, 100837026, 101203482, 101092724, 101108451, 100909626, 100819969, 100448110, 100324350, 100151605, 99664299, 99005006, 98429274, 97479820, 96527985, 95878885, 94697473, 93880525, 93196780, 92148963, 91143669, 90051021, 88588525]
7721H8588525j174033r41949j522718j131346j707307j241004j382032j191799
7713G8296337j070964j743086j435485j652815j364660q86761j318363j578097
7705F7246106j466659j283937j399432j459486j155581j413826r81882j058653
7697E7026650j430066r16144j161576j263961r60678j333095r80537j243050j031824
7688D6705719j075016r81476p04546p10884p41907q75152r64084j257864r57158
7679C8437632m02204m22842q97653n97325q79845n99931n9282j291674q88348
7670C2398528j52547n22614n38813n31603m59799m65627m26116r90132m11781
7661B7899496q5011o10779l80683k75301m68621m08847n31627m15614o03845p16966
$$ y = [88588525, 87414492, 86472543, 84949825, 83818479, 82111172, 80870168, 79488136, 78296337, 77225373, 75482287, 74046802, 72393987, 71029327, 70142566, 68824203, 67246106, 65779447, 64495510, 63096078, 61636592, 60481011, 59067185, 58085303, 57026650, 55596584, 54680440, 53518864, 52254903, 51294225, 49961130, 48980593, 47737543, 46705719, 45630703, 44649227, 43944681, 43233797, 42491890, 41616738, 40652654, 39394790, 38437632, 38035428, 37612586, 36714933, 36117608, 35237763, 34637832, 34578550, 33286876, 32398528, 32245981, 31723367, 31184554, 30652951, 30193152, 29727525, 29301409, 28311277, 27899496, 27814485, 27203706, 26823023, 26547722, 26079101, 25670254, 25138627, 24723013, 24119168, 23402202]
7651B3402202k587k14170j61428k22396l28423m43167k47434m34437k00819k40437
7641B0906904l08189m56395k60067j76667m32480l87643r0346j05182k47951j22799
7631A8319185j24819j31322l86496p45338M728J60442l92268j21585k53667J03414
7621A6432274j56346k03433m26402l79472p106j22126L4033k43209l54682l0805
7611A4542726K4148k54371N1304m27169k56088O1636m73094k63419n5553j07608
7601A2842512o6363N6531j23562J61417m02867p3059r4893j21134J32800l63441
7591A1947941l74546P0894O4252o4709j2250m81918R8376Q3097k59354k4605j83332
7580A0863846m1047k2882r1250j97668q5738j81207J55578o2066m28539j8723
$$ y = [23402202, 23399615, 23185445, 23024017, 22801621, 22473198, 22030031, 21782597, 21348160, 21147341, 20906904, 20598715, 20142320, 19882253, 19705586, 19273106, 18885463, 18795117, 18689935, 18441984, 18319185, 18194366, 18063044, 17676548, 16931210, 16935938, 17096380, 16704112, 16582527, 16328860, 16432274, 16275928, 16072495, 15646093, 15266621, 15259515, 15137389, 15171422, 14928213, 14573531, 14542726, 14566874, 14312503, 14363807, 13936638, 13680550, 13742186, 13269092, 13005673, 12950120, 12842512, 12776149, 12832680, 12709118, 12870535, 12467668, 12394609, 12299716, 12178582, 12311382, 11947941, 11573395, 11644289, 11708541, 11643832, 11631582, 11149664, 11248040, 11331137, 11071783, 11047178, 10863846, 10822799, 10799917, 10708667, 10510999, 10425261, 10244054, 10399632, 10337566, 9909027, 9890304]
7570I890304M16391m13825j51023K43977l7153l47978m548p4761K55358k02183
7560I574559j38341k57922k00862l08284Q0052o8365K71114k4370j7463l5062
7550H875056j84958l41025n4962J40998Q6781k92242k41807K50453N2742K72295
7540H563331m26159R5969j18992o1146j11526M12985l17741l5447j87535k98759
7530G514980J18254j76362k3429L25905k65691J76995N4087o3516q5352q6564
7520G489307j09860O5690j3223l16706l79294R3282K77602O3276k70110J662k1862
7509F879764j65162K63171J55149k72223O1811j9585j3205L9334K09327k24845
7499F913536j54624k9458J10508q3778o4516o5748j14959j98172j02720J98970
$$ y = [9890304, 10306695, 9892870, 9741847, 9985824, 9948671, 9600693, 9596145, 9521384, 9776742, 9574559, 9436218, 9178296, 8977434, 8669150, 8749202, 8680837, 8951951, 8927581, 8910118, 8875056, 8690098, 8349073, 8294111, 8435109, 8521890, 8229648, 7987841, 8238294, 8291036, 8563331, 8137172, 8233141, 8114149, 8053003, 7941477, 8354462, 8036721, 8001274, 7813739, 7514980, 7633234, 7456872, 7433443, 7759348, 7493657, 7670652, 7724739, 7661223, 7575871, 7489307, 7379447, 7445137, 7431914, 7115208, 6735914, 6829196, 7106798, 7170074, 6899964, 6901626, 6879764, 6714602, 6977773, 7132922, 6860699, 6922510, 6902925, 6889720, 6929054, 7138381, 6913536, 6758912, 6729454, 6839962, 6756184, 6691668, 6625920, 6510961, 6312789, 6210069, 6409039]
7489F409039J72644k51612j27897J30595K13412J04647l55299J46756N8774J34743
7479F635802j55822L3970J44648j53816K8792K62625n08840r5993L64479o7744
7469F488101K4145j15419J67012n0493m874j45156j02360L596Q4154J32177j05530
7458F375353P9175r961K19357J99502l12886q7732Q6031k47227J67708j56152
7448F313168J85102l9477K20850m45623J57678N9662K6994J67932k20760k33990
7438F191536j29620K62326l24609J89753J49314K4440j80171j84670n4399K65655
7428F209555K16389j92944M1391k22242k44507M4680L8107j80888Q5739l91852
7418E403428O6516j72616M225L54623k43240l1925j34479j94606j36113Q9621
$$ y = [6409039, 6581683, 6330071, 6202174, 6332769, 6546181, 6650828, 6295529, 6442285, 6501059, 6635802, 6479980, 6513950, 6658598, 6504782, 6533574, 6796199, 6287359, 6191366, 6555845, 6488101, 6512246, 6396827, 6563839, 6513346, 6508472, 6363316, 6260956, 6264552, 6348706, 6480883, 6375353, 6454528, 6444567, 6663924, 6863426, 6550540, 6462808, 6548839, 6301612, 6469320, 6313168, 6498270, 6458793, 6679643, 6234020, 6391698, 6451360, 6478354, 6646286, 6425526, 6191536, 6061916, 6324242, 5999633, 6189386, 6338700, 6363140, 6182969, 5998299, 5943900, 6209555, 6425944, 6233000, 6274391, 6052149, 5807642, 5852322, 5890429, 5709541, 5795280, 5403428, 5469944, 5297328, 5301553, 5656176, 5412936, 5381011, 5246532, 5051926, 4915813, 5005434]
7408E005434n3495O0460k559k2947J13179l6915k17162Q0446M1683l05972l94801
7397D267351J1075P9551j91142K22071K96394k78493j06737o6990K5293K49510
7387D507883j49422L8306k83955j73544l50858K72683m6151j34601J03512K60909
7377D044762q8477j53694l19917K86171l8188j24236J20980k27295J16253J12605
7367C728964Q4961j13771j51539k35856j1821K37172L15679l87513j39375m98889
7357B828012K23992K85177J14635Q3341N9960j79323K1654j9205N6382o12850
7347B861775K62441j68854J88089L04175l14235m4231K9269K9332p1637j93505
7337B882619n5389k80644J87073J69120M0796k6429k38522J34039J24840J43820
$$ y = [5005434, 4951939, 5012399, 5009840, 4986893, 5100072, 5063157, 4845995, 4926441, 4968124, 4662152, 4267351, 4278426, 4357977, 4166835, 4388906, 4685300, 4406807, 4300070, 4233080, 4258373, 4507883, 4358461, 4396767, 4112812, 3939268, 3588410, 3861093, 3814942, 3680341, 3783853, 4044762, 3956285, 3802591, 3482674, 3768845, 3730657, 3606421, 3727401, 3500106, 3616359, 3728964, 3813925, 3700154, 3548615, 3312759, 3300938, 3538110, 3853789, 3466276, 3326901, 2828012, 3052004, 3337181, 3451816, 3535157, 3595117, 3415794, 3437448, 3418243, 3474625, 2861775, 3124216, 2955362, 3143451, 3447626, 3133391, 3089160, 3118429, 3147761, 3076124, 2882619, 2827230, 2546586, 2733659, 2902779, 2943575, 2917146, 2678624, 2812663, 2937503, 3081323]
7327C081323k39317M2841j82755J43045L6158K22746k85987p4142j04401J41194
7317B780705K54541j64797m8265q9191l24851J76211K8928K5273N2684k00211
7307B491027K20707K4746O5915R476l07786K46130R3195r9295l2310J2971j92201
7296B532575p771J93042k35086N5780j58662J04710K21250r0272n3976m3208M8163
7285B566545q6396m5709Q0767O8731m1411q5650o5233j85178P6230J97996k23096
7274B257596K98855p8672N944j75776n1475L62831k99563M609O075k41614L46841
7263B435651k01407J23534J7783O6086l9888l15569J42900j34919J61589J1087
7253B266847J36290J31672l20498j04235J55325j86631J42746k09411J54482k28422
$$ y = [3081323, 2842006, 2884847, 2702092, 2845137, 2881295, 3104041, 2818054, 2743912, 2639511, 2780705, 3035246, 2870449, 2822184, 2732993, 2408142, 2584353, 2613281, 2638554, 2691238, 2491027, 2711734, 2736480, 2802395, 2811871, 2504085, 2750215, 2843410, 2744115, 2711805, 2724776, 2532575, 2524804, 2717846, 2482760, 2538540, 2379878, 2484588, 2705838, 2615566, 2561590, 2518382, 2566545, 2480149, 2434440, 2515207, 2583938, 2542527, 2456877, 2391644, 2206466, 2282696, 2480692, 2257596, 2556451, 2477779, 2483723, 2307947, 2256472, 2619303, 2319740, 2324349, 2330424, 2088810, 2435651, 2234244, 2357778, 2375561, 2441647, 2401759, 2086190, 2229090, 2094171, 2255760, 2266847, 2403137, 2534809, 2214311, 2110076, 2265401, 2078770, 2221516, 2012105, 2166587, 1938165]
7243A938165M9174J53049k11320k07118L93291R4407k50916r600R5594K1685j02059
7232A964352j6760K96832k8715l13469N7477L02476n0049P6250M0712j99294L9432
7221B169244k00556J13121J53883o7832M14963l35179k10956L30360k69880j79419
7211A917749J33256N7209Q6203J5601j3762K5313n2748K5310J06314m2777j75828
7200B081840K63937J06642M6706j24565j84046r6353K77086l63556p0917K25170
7190B161944K74616m7358n51230P2929J68261j67577R5533O0492k23797K3038
7180A866851K40627J62540j35928J14937O1609l59006K34882m5814P0663J88117
7170B399478j92851q0093Q4887n4995J08490j85576j86970K48583j40076J54595
$$ y = [1938165, 1987339, 2140388, 1929068, 1721950, 2115241, 2209648, 1958732, 1949132, 2044726, 2066411, 1964352, 1947592, 2244424, 2215709, 1902240, 1959717, 2262193, 2212144, 2288394, 2329106, 2129812, 2169244, 1968688, 2081809, 2235692, 2167860, 2582823, 2247644, 2036688, 2367048, 2097168, 1917749, 2051005, 2108214, 2194417, 2210018, 2196256, 2221569, 2168821, 2194131, 2300445, 2257668, 2081840, 2345777, 2452419, 2499125, 2374560, 2190514, 2094161, 2371247, 2007691, 1936774, 2161944, 2436560, 2389202, 1837972, 1910901, 2079162, 1911585, 2007118, 2067610, 1843813, 1866851, 2107478, 2270018, 2134090, 2249027, 2310636, 1951630, 2186512, 2140698, 2211361, 2399478, 2206627, 2126534, 2211421, 2156426, 2264916, 2079340, 1892370, 2140953, 2000877, 2155472]
7160B155472L8603k78251P2797J95312m1565j43499L38752j78253J40N1262M0011
7149B250781M5865k51141P897K39073k63729j21196P1471J71650o8065J05735
7139B188341Q6296j30222j82359P5674L10931j34686l2098n3610j69035n3534
7129A905698Q7384j05256J53205j7387j6654M2639l28711l32036Q9010K78179
7119A756071J20372l918k16441j59530K28142M96834L3879M8384k28162j59577
7109A916054j16414k93033K46410J10289J3102r8670K9486o8800N9283L059m6612
7098A754154j05059k906j67475J13619k11147k83617J18624N10672j56781k62719
7088A307365O7524J82902n5627M73163o4778k61080J24267m1821j76514k01558
$$ y = [2155472, 2194075, 1915824, 1988621, 2183933, 2142368, 1998869, 2337621, 2159368, 2159508, 2210770, 2250781, 2296646, 2045505, 2053402, 2292475, 2028746, 1907550, 1979021, 2150671, 2082606, 2188341, 2274637, 2144415, 1962056, 2037730, 2348661, 2213975, 2181877, 2128267, 1959232, 1905698, 1993082, 1887826, 2041031, 2023644, 2006990, 2049629, 1720918, 1388882, 1477892, 1756071, 1876443, 1872525, 1656084, 1496554, 1724696, 2221530, 2255409, 2303793, 2075631, 1916054, 1799640, 1506607, 1753017, 1863306, 1876408, 1777738, 1807224, 1738424, 1797707, 1800766, 1754154, 1649095, 1646189, 1478714, 1592333, 1381186, 1097569, 1216193, 1726865, 1570084, 1307365, 1374889, 1557791, 1502164, 1975327, 1910549, 1649469, 1773736, 1731915, 1555401, 1353843]
7078A353843R6029K29684j74482j23087J42802K5422j39976K820j471L27416J05909
7067A844909m8705n29321k5737K99091Q2786o5351k82524N47352n1113m13667
7057A357720P9897K11788j76886j39111N961J4753j67410j305k8229L14358n0065
7046A421471J04282m5147j77393k05232M2158j465n6818J38903J17276q6830J04496
7035A355701R3750J07745j81607j91728J54165q1693N3056M27611l13054J3616
7025A437562k66987o8615k67621L18668K34459J29450j72504m07103L68289n2160
7015A253438j27274R771K24692j84493J14724k9840J22277j89318j00213Q2988
7005A176752M0480k20654P195l9574J72693p9141L63404j18235J18635L31779
$$ y = [1353843, 1449872, 1679556, 1505074, 1381987, 1524789, 1550211, 1410235, 1413055, 1411584, 1739000, 1844909, 1796204, 1266883, 1241146, 1540237, 1623023, 1557672, 1275148, 1822500, 1771387, 1357720, 1437617, 1649405, 1472519, 1333408, 1339369, 1354122, 1186712, 1185407, 1157178, 1471536, 1421471, 1525753, 1480606, 1303213, 1097981, 1140139, 1138674, 1081856, 1220759, 1338035, 1251205, 1355701, 1449451, 1557196, 1375589, 1183861, 1338026, 1256333, 1309389, 1737000, 1423946, 1437562, 1170575, 1101960, 834339, 1153007, 1387466, 1516916, 1344412, 937309, 1305598, 1253438, 1126164, 1135935, 1360627, 1176134, 1290858, 1261018, 1383295, 1193977, 1093764, 1176752, 1217232, 996578, 1003773, 964199, 1136892, 1057751, 1421155, 1302920, 1421555, 1753334]
6995A753334k99279k72069O0873J47485k7103l1690J7269j14251k43326P7341
6985A068584j40395J11965o985J91418N1585j23199n1989r6904Q8132k50267J85214
6974A027159J55713k0853K12181j29385k60683o4533j22943J66445K31800P3821
6964A268722r9656R5038j28J28886J60650j71860j20370k10648J70128q1139k55267
6953H84356O39305j67344k93072j02844J23714J41878k30293K11509n1689j85157
6943I70363j98453L72759k47250M0970N24688q859m37127J5369J81160J15785
6933A329405K6512Q4969l95689N4576m2734K35788j43403p0793j22014p6704J55163
6922A035076o8298J30543O285k8847j8536N9043K39070R8000k72079m5343J84606
$$ y = [1753334, 1454055, 1181986, 1242859, 1390344, 1363241, 1331551, 1348820, 1234569, 991243, 1068584, 928189, 1040154, 1033169, 1224587, 1276172, 1152973, 1100984, 1004080, 1092212, 841945, 1027159, 1182872, 1162019, 1374200, 1244815, 984132, 919599, 796656, 963101, 1194901, 1268722, 1169066, 1264104, 1263976, 1392862, 1553512, 1381652, 1261282, 1050634, 1220762, 1139623, 884356, 1523661, 1356317, 1063245, 960401, 1084115, 1225993, 995700, 1207209, 1155520, 970363, 771910, 1144669, 897419, 938389, 1463077, 1454218, 1017091, 1032460, 1213620, 1329405, 1355917, 1440886, 1045197, 1099773, 1057039, 1292827, 1149424, 1078631, 956617, 879913, 1035076, 966778, 1097321, 1103606, 1074759, 1056223, 1115266, 1354336, 1452336, 1180257, 1134914, 1319520]
6911A319520k49470P922O5927k30259j5020o3343K60726M3246p610K12767J19015
6900A463421k76787j08020J11472p0819l06423J65243P6778l6847Q7624j33345
6890I72297R085q771K69761j108l76222J55009L1243l8069J2359J18735q8354
6879A055965m7602j3625k13226K05688J85700Q4968J99776j44912r5990k86760
6869I29982J83528J6835J44989K17763j80778j5940j70050P5342J7031P9011Q7292
6858A385005j67085o6763K50179p4609k12914k021j44711M3543M68035k58031
6848A220628J8440J16824L5206J2252j75173j29788j34579M33966J06668k03249
6838A301195k68148J18189J74909j97349j05580l542J2886j20465J49074j9543
$$ y = [1319520, 1070050, 1077972, 1143899, 913640, 898620, 835277, 1096003, 1139249, 1131639, 1344406, 1463421, 1186634, 1078614, 1190086, 1119267, 812844, 978087, 1054865, 1018018, 1105642, 972297, 981382, 972611, 1242372, 1241264, 865042, 1020051, 1051294, 1013225, 1025584, 1144319, 1055965, 1008363, 994738, 781512, 987200, 1172900, 1257868, 1457644, 1312732, 1216742, 929982, 1113510, 1130345, 1275334, 1493097, 1312319, 1296379, 1126329, 1201671, 1218702, 1297713, 1385005, 1217920, 1151157, 1401336, 1326727, 1113813, 1111792, 967081, 1010624, 1478659, 1220628, 1239068, 1355892, 1391098, 1403350, 1228177, 1098389, 963810, 1397776, 1504444, 1301195, 1033047, 1151236, 1326145, 1128796, 1023216, 1019674, 1032560, 912095, 1061169, 1041626]
6828A041626Q8304J60783j08395O6869k16323J07576r2646K5957j28777o8210
6818H76764K18366K2525k29881M3557J33983J78197j87701M8548j55504M3030
6808I91884M0383J91546L09982k22408l49837L07775J49501k39849O0206J37182
6798A376365l76941j97349K93741N9803J26184l9462O6581l72351j18812M23293
6788A241052k2502r1941J2659R6885q1692K08184R6975k16730j44268p8307L9884
6777A060199j04668j72145P3030L40918J47759p372J54781P490l38059J05499
6767A267432J61399l99317j36163K36365m58839J20063R5480L38078O8456L2455
6757A325409l5530j49769K72851P8382k72535O6179k69428M1372L15205m86114
$$ y = [1041626, 1129930, 1290713, 1182318, 1249187, 1032864, 1140440, 1047794, 1073751, 944974, 876764, 1095130, 1117655, 887774, 931331, 1065314, 1243511, 1055810, 1104358, 948854, 991884, 1032267, 1223813, 1533795, 1311387, 961550, 1269325, 1418826, 1178977, 1239183, 1376365, 999424, 802075, 1095816, 1155619, 1281803, 1242341, 1308922, 936571, 817759, 1241052, 1218550, 1126609, 1139268, 1236153, 1154461, 1362645, 1459620, 1242890, 1098622, 1020315, 1060199, 955531, 783386, 856416, 1197334, 1345093, 1337721, 1492502, 1499992, 1161933, 1267432, 1428831, 1029514, 893351, 1129716, 670877, 790940, 886420, 1224498, 1292954, 1325409, 1289879, 1140110, 1412961, 1491343, 1218808, 1284987, 1015559, 1056931, 1372136, 886022]
6747H86022j49894r6654L54413r3628J86115J29380k46103o4013j16057Q1J32269
6736I21931M04451j75181p1769k88610J3215K04029j3594R7383j75543l63267
6726E53045M83561J42577J00684j18549j92815k0950K43399n6057J60113k51661
6716A043347k7766K67655n0095k0161l68564l7683R3729n6031L0495l6586j26957
6705G11383k6255J2023M78587j47042k33817l5700K56922L15304k37094O8414
6695A162725J14563m79703J6862J13817P5159m7302j59269J14142K08936k15613
6685I04317K88684L38450m56645Q1343j14938N9842J3446j02323O3712K7828K5321
6674A129037j35635K5456L36710J78752k96293p2043l31839k97093L34941J97974
$$ y = [886022, 736128, 639474, 993887, 900259, 1086374, 1215754, 969651, 905638, 789581, 789662, 921931, 1326382, 1151201, 1079432, 790822, 804037, 1008066, 994472, 1091855, 916312, 553045, 1036606, 1179183, 1279867, 1161318, 968503, 947553, 1190952, 1134895, 1295008, 1043347, 1015581, 1283236, 1233141, 1212980, 844416, 806733, 900462, 844431, 874926, 838340, 711383, 685128, 697151, 1175738, 1028696, 794879, 759179, 1016101, 1331405, 1094311, 1162725, 1277288, 797585, 814447, 928264, 1003423, 956121, 796852, 910994, 1119930, 904317, 1193001, 1531451, 1074806, 1156149, 1041211, 1101053, 1114499, 1012176, 1075888, 1103716, 1129037, 993402, 1018858, 1355568, 1534320, 1238027, 1165984, 834145, 537052, 871993, 1069967]
6664A069967K82862p2341r2847M3905l11299j82584J58059K36759m64179J13122
6654G81424J88053j48664J93267L6945J94636l34305L33273j48424k15589L46088
6644A226704r2346J79916k79355j25134M780j43799K48369J91114j00665l1068
6634A078516L98107J6861l76167P8721k70050M8574J08486K31720k83195K4153
6624A055726k04229J95727P4430K36693k06590j60094M1176L9859J77571k935
6614A247334K4825q8446L4864k19611K60563K12845n59357j04737Q1431o5169
6604H24542L00934K6212J71469N7713k4417k7995o9657J2410j74567L8431K4327
6593A159402j74379k02493J94618R9900N1467j29192j50265l0520M2094J72357
$$ y = [1069967, 1352829, 1280488, 1187641, 1231546, 920247, 737663, 895722, 1132481, 668302, 781424, 969477, 820813, 1014080, 1051025, 1245661, 911356, 1244629, 1096205, 880616, 1226704, 1134358, 1314274, 1034919, 909785, 914565, 770766, 1019135, 1210249, 1109584, 1078516, 1476623, 1493484, 1117317, 1196038, 925988, 974562, 1083048, 1314768, 1031573, 1055726, 851497, 1047224, 1121654, 1358347, 1151757, 991663, 1032839, 1072698, 1250269, 1247334, 1272159, 1183713, 1218577, 998966, 1259529, 1472374, 913017, 808280, 889711, 824542, 1125476, 1151688, 1323157, 1380870, 1356453, 1328458, 1258801, 1271211, 1096644, 1135075, 1159402, 985023, 782530, 977148, 1077048, 1128515, 999323, 849058, 818538, 860632, 1032989]
6583A032989n1472J6980J13986L25732M6944r3830J53506n6146k31454j36134
6573A121101R6136J87387m2651n1848j87529P8526j08036l861k3589j9742J05621
6562A151515l02528K57451J51745j75080j18285L52585k03360m50115L11926J97651
6552A173505M0171M0857j12957J16553k34316p139j31447N8501L5326m8241J15517
6541A046330P4615J25152k61231o0843l07204M66568M1639J51694J8644L4167
6531A329531k57953L48178j17016l74560J36165O7560J18091k81949J64993M7711
6521A180751j16099J64390j01173n8750k4248K10442j06652J28003j92919J98005
6511A281750q2093n6603j21735L5481n5246Q4811l8018J34810J48168j42044J28012
$$ y = [1032989, 981517, 998497, 1112483, 1438215, 1485159, 1391329, 1544835, 1488689, 1257235, 1121101, 1217237, 1404624, 1361973, 1310125, 1122596, 1201122, 1093086, 1089225, 1065636, 1045894, 1151515, 848987, 1106438, 1258183, 1083103, 964818, 1317403, 1114043, 663928, 975854, 1173505, 1213676, 1254533, 1141576, 1258129, 1023813, 1016674, 885227, 943728, 979054, 930813, 1046330, 1120945, 1246097, 984866, 924023, 616819, 1083387, 1125026, 1276720, 1295364, 1329531, 1071578, 1419756, 1302740, 928180, 1064345, 1131905, 1249996, 968047, 1133040, 1180751, 1064652, 1229042, 1127869, 1069119, 1044871, 1255313, 1148661, 1276664, 1083745, 1281750, 1199657, 1143054, 1021319, 1056800, 1001554, 1086365, 1048347, 1183157, 1331325, 1189281, 1317293]
6500A317293L2115K27796l19654L44853n6535j13877K84363j85134l21074K31526
6490A441672K9204l31294M07599j0030m01460m2354K39514J1469j55619j27211
6480A061490K37011k26738j89238L58246K7789j19539J50894j89686K3008K22460
6470A355697j29552L44494k45359K43601j25183l2130J33486k39585J8898l7226
6460A287141O9035k59400l367J90814j86447N9820J21952K1390l20892j15583
6450H64463J04559L08339j72792L44576n0535k83880J92924j78426L3838J38272
6440A301338l0273J34606K70518q98l43943l237K0343r7734q374j99613o2339
6429I80394M46658k71510R7979j10119O9239J28640k7621M5036j19560J35990
$$ y = [1317293, 1349408, 1577204, 1257550, 1602403, 1545868, 1431991, 1716354, 1531220, 1210146, 1441672, 1470876, 1139582, 1547181, 1537151, 1135691, 1093337, 1332851, 1344320, 1188701, 1061490, 1298501, 1071763, 882525, 1240771, 1268560, 1149021, 1299915, 1110229, 1133237, 1355697, 1226145, 1570639, 1325280, 1568881, 1443698, 1411568, 1545054, 1305469, 1324367, 1287141, 1356176, 1096776, 1093409, 1284223, 1097776, 1157596, 1279548, 1300938, 980046, 864463, 969022, 1277361, 1104569, 1449145, 1398610, 1114730, 1307654, 1129228, 1163066, 1301338, 1271065, 1405671, 1676189, 1675291, 1331348, 1328111, 1348454, 1250720, 1242346, 1042733, 980394, 1427052, 1155542, 1253521, 1143402, 1212641, 1341281, 1313660, 1358696, 1239136, 1375126]
6419A375126j44752J12291m23152M29858K68793l19776N0003J35938o7520P8466
6409A495275k6763K49594q3208k92727J97712n16720J63048O049j44826p6189
6399I71245J66465k6803n0669J31856K55280j99074K33614K1230L15096j54051
6389A664189l92673J1203L72302L1412k12382l9281o4251N1856k25295K4114P4733
6378A295927K32488r8023K14614J78820j30847r7531j75290q8764K42146K7791
6368A601331J67842k2987r7059l33309K00164K29827r3038l84581J80396J12530
6358A561116J3552j49205j31847K74843R8737o5810K2183R2434q6285r5616K67801
6347A801903L1591j74523P0846k11751o454J87007k02619M09497J06692j86744
$$ y = [1375126, 1230374, 1342665, 919513, 1349371, 1618164, 1298388, 1348391, 1484329, 1416809, 1495275, 1468512, 1718106, 1634898, 1342171, 1539883, 1023163, 1186211, 1192260, 1047434, 971245, 1137710, 1110907, 1060238, 1192094, 1447374, 1248300, 1481914, 1503144, 1818240, 1664189, 1271516, 1282719, 1655021, 1686433, 1474051, 1434770, 1370519, 1422375, 1197080, 1221194, 1295927, 1528415, 1430392, 1645006, 1823826, 1692979, 1595448, 1420158, 1331394, 1573540, 1601331, 1769173, 1746186, 1649127, 1315818, 1515982, 1745809, 1652771, 1268190, 1448586, 1561116, 1574668, 1425463, 1293616, 1568459, 1667196, 1601386, 1623569, 1716003, 1629718, 1534102, 1801903, 1833494, 1658971, 1729817, 1518066, 1511612, 1698619, 1496000, 1905497, 2012189, 1825445]
6337A825445R107o5657j90981o2410K0765j46652K75138j31215j44587j26481
6327A262472R1899K49121r3888J67546M3874j70282K35051L06250k76359l7874
6317A777810J16737m51313J68328L28859J42679k6284l19510K48896K136m1845
6307A946493j68610R8657K3406r7147Q5944j6640r8933m811J29983K20493L2129
6296B150964L31003k23516j91995k75563J39034j11342K08794k20595J35088j19049
6286A822823M8238J00771k52459J75559J7612j52460J23090m3157n9229o2625
6276A718163n7684K35483M3847J29606k15848K06370l46517J04578L91081j56829
6266B052250k73046K11762l6236O2262k44277J34783k90k6324o745Q6771l9004
$$ y = [1825445, 1834552, 1768895, 1577914, 1515504, 1536269, 1389617, 1664755, 1533540, 1388953, 1262472, 1354371, 1603492, 1509604, 1677150, 1721024, 1550742, 1785793, 2092043, 1815684, 1777810, 1894547, 1443234, 1611562, 1940421, 2083100, 2056816, 1737306, 1986202, 1988338, 1946493, 1777883, 1876540, 1899946, 1802799, 1888743, 1872103, 1773170, 1768359, 1898342, 2118835, 2150964, 2481967, 2258451, 2066456, 1790893, 1929927, 1818585, 2027379, 1806784, 1941872, 1822823, 1871061, 1971832, 1719373, 1894932, 1912544, 1760084, 1883174, 1840017, 1780788, 1718163, 1660479, 1895962, 1939809, 2069415, 1853567, 2059937, 1713420, 1817998, 2209079, 2052250, 1779204, 1990966, 1954730, 2016992, 1772715, 1907498, 1907208, 1880884, 1874139, 1960910, 1921906]
6255A921906j00565m7551L23142j47780O589J2394o6309J09479K60616m13946
6245A857975Q1116j38360q2962J46260k0489K1191K21949k39869P9396r0683J76184
6234B011708K38289l85123N3378j90049J58480N5931J27019J02188l0735l4154
6224B106932n4689j1344J05406k23335n8022J58065r251j01766J16258L8228l21602
6213A744880M07136j46636J80654j0981j49482N3348k03713q5743k5577L72263
6203B136149J83273k21349j09630K19708n4062o862K70899k34055o35198M61843
6193B010716L57087N020l83922Q1996J71529j39728K3775K8435L6241r3975j47217
6182A949957K61579J9816J34459r8226k69922L106k9174j3214J6330R346J74917
$$ y = [1921906, 1821341, 1773790, 2096932, 1949152, 1955741, 1968135, 1901826, 2011305, 2271921, 1857975, 1939091, 1800731, 1717769, 1864029, 1843540, 1864731, 2086680, 1846811, 1926207, 1835524, 2011708, 2249997, 1864874, 1918252, 1728203, 1886683, 1942614, 2069633, 2171821, 2141086, 2106932, 2052243, 2040899, 2146305, 1922970, 1864948, 2023013, 2013762, 1911996, 2028254, 2066482, 1744880, 2152016, 2005380, 2186034, 2175053, 2025571, 2078919, 1875206, 1789463, 1763886, 2136149, 2319422, 2098073, 1988443, 2208151, 2154089, 2147227, 2418126, 2184071, 1548873, 2010716, 2367803, 2372823, 1988901, 2070897, 2242426, 2102698, 2126473, 2154908, 2191149, 2097174, 1949957, 2211536, 2231352, 2365811, 2267585, 1997663, 2000769, 1971595, 1958381, 1974711, 1984057, 2158974]
6171B158974K48976r2394N526P3152p4302l6877R4570K51977r2887m35397J91736
6160B293054K37388k14444J66861j9169k46136m6548J80691n6205J88576l27268
6150B156800O4909J95931K3804l78313M6429K027J85838J99305J28806j18572
6140B506964r4348K37825K15962j54875l74130L56810Q8296p4051M976j7530K2338
6129B718237M9397m1229r556k46530J8626L7008m4457Q0169k94991J03634L67488
6118B737796l9505r1304O5319j81957L3655j25072j1286O3430n016j15915Q971
6107B339116K69824J5769J8950M36234R658l89050k98643P5238K17780j68107
6097B526769Q2312M3434K01238j60810r3796J70258J35332K02840j34837Q242
$$ y = [2158974, 2407950, 2315556, 2321082, 2394234, 2319932, 2283055, 2377625, 2629602, 2536715, 2101318, 2293054, 2530442, 2315998, 2482859, 2463690, 2217554, 2171006, 2351697, 2295492, 2484068, 2156800, 2221709, 2417640, 2441444, 2063131, 2109560, 2111587, 2297425, 2496730, 2625536, 2506964, 2412616, 2650441, 2866403, 2711528, 2337398, 2694208, 2782504, 2708453, 2713429, 2695899, 2718237, 2767634, 2726405, 2716849, 2470319, 2488945, 2525953, 2481496, 2561665, 2266674, 2370308, 2737796, 2698291, 2606987, 2672306, 2490349, 2524004, 2398932, 2387646, 2451076, 2446060, 2330145, 2339116, 2608940, 2624709, 2643659, 3079893, 3089551, 2700501, 2401858, 2477096, 2694876, 2526769, 2609081, 2652515, 2853753, 2692943, 2599147, 2769405, 2904737, 3107577, 2972740, 2980982]
6087B980982J90384j69579J3372J70429n3605l34330K18117J58873k3685k11743
6077B939215l2349p0968j31672J25201M03954j85775K34934m03438J86952j79224
6067B886830N8676K72129l50894M58990J46015k04269O0901j54995j09802J51758
6057C215339K74652k8196k1902j55731r1865o0774j35838o436K3340J38273K81887
6046C432749j33178R6419R23R7980j06066L07843j03544k49197J13511O7537j49842
6035C375135K44677l00940q5458L45892k80148j70719M8956m982K49860K18497
6025C640770k48064K78614J83543l76064P2265L40211l20548J34695j96419J19987
6015C628990l02495L1883k1919K76609k573r8475K4651L20820k49447J19823o9268
$$ y = [2980982, 3171366, 3001787, 3015159, 3185588, 3131983, 2797653, 3015770, 3174643, 3150958, 2939215, 2906866, 2835898, 2704226, 2829427, 3233381, 3047606, 3282540, 2879102, 3066054, 2886830, 2945506, 3217635, 2866741, 3325731, 3471746, 3267477, 3328378, 3173383, 3063581, 3215339, 3489991, 3461795, 3439893, 3284162, 3192297, 3131523, 2995685, 2989249, 3012589, 3150862, 3432749, 3299571, 3395990, 3396913, 3494893, 3388827, 3696670, 3593126, 3343929, 3457440, 3524977, 3375135, 3619812, 3318872, 3233414, 3579306, 3299158, 3128439, 3177395, 3172413, 3422273, 3640770, 3392706, 3671320, 3854863, 3478799, 3551064, 3891275, 3570727, 3705422, 3509003, 3628990, 3326495, 3358378, 3336459, 3613068, 3610495, 3512020, 3536671, 3857491, 3608044, 3727867, 3658599]
6004C658599j06017L99090p6020k47862R0887j74188K11617K10820k67441P5279
5994C774764K03374j19630K14172L1923k90733l03832L10406O3498j7748j98820
5984C667374J25776L9831q9478o9274l2657J62573p2269k6994M4951L7617K01763
5973C989213O6567N9902k34811p0589k09727L70591L79503j55550j98955J18497
5963D114641j22047k25542K07712J62796l13747r811J42842k7934J50127m3522
5953D035515J56187J2970R1685n1250n8587j31540M16304m6400K6978j3218L97499
5942D836143R169j3537l0085p5620o154J02485j86232l69415J80714J17K17927
5931D665512J96404j58535k3020o4578p5446j7687K7361K06450K08255k80354
$$ y = [3658599, 3552582, 3951672, 3875652, 3627790, 3718677, 3544489, 3756106, 3966926, 3699485, 3774764, 3978138, 3858508, 4072680, 4104603, 3813870, 3510038, 3820444, 3883942, 3866194, 3667374, 3793150, 3832981, 3743503, 3674229, 3641572, 3804145, 3731876, 3704882, 3749833, 3787450, 3989213, 4055780, 4115682, 3880871, 3810282, 3600555, 3971146, 4350649, 4195099, 3996144, 4114641, 3992594, 3767052, 3974764, 4137560, 3823813, 3814002, 3956844, 3928910, 4079037, 4035515, 4191702, 4204672, 4296357, 4245107, 4186520, 4054980, 4471284, 4424884, 4451862, 4438644, 4836143, 4845312, 4831775, 4801690, 4726070, 4719916, 4822401, 4636169, 4266754, 4447468, 4447585, 4665512, 4861916, 4703381, 4680361, 4615783, 4540337, 4522650, 4550011, 4756461, 4964716, 4684362]
5921D684362J82268j08090q3926P9203K18000P4739J4665m2024K15502j15893
5911E118806n1793K57146o6856l34080L96147P540j56409l3870J44831N5308j35421
5900E201349l5192J67046k26641J15511L06067l44398q7698M1261J86891K3533
5890E347729j36710J3798K37532j45828o0526Q6377K70541n5259j07050j34602
5880E316002K52519J12110K56863k40457j39307J30101j51657o6561L35745l02686
5870E502672j58362L47677k49514J58807J14465L11250q4026j44126l8580K77499
5860F037762K90507j01175N4423j67706J01493J05846j08219K05413m5367L5499
5850F408476j41397j63238J41717L48774r8098J31825L4728J72342k30200K24943
$$ y = [4684362, 4866630, 4758540, 4674614, 4753817, 4971817, 5046556, 5061221, 5019197, 5234699, 5118806, 5067013, 5324159, 5257303, 4923223, 5319370, 5326910, 5170501, 5136631, 5281462, 5336770, 5201349, 5166157, 5333203, 5106562, 5222073, 5528140, 5183742, 5096044, 5137305, 5324196, 5347729, 5211019, 5224817, 5462349, 5316521, 5255995, 5342372, 5612913, 5557654, 5450604, 5316002, 5568521, 5680631, 5937494, 5697037, 5557730, 5687831, 5536174, 5469613, 5805358, 5502672, 5344310, 5691987, 5442473, 5601280, 5715745, 6026995, 5942969, 5798843, 5760263, 6037762, 6328269, 6227094, 6281517, 6113811, 6215304, 6321150, 6212931, 6418344, 6372977, 6408476, 6267079, 6103841, 6245558, 6594332, 6496234, 6628059, 6662787, 6835129, 6604929, 6829872]
5840F829872k29186J75417P8041r5991J12114m516J35285q1983K96745J70791
5830G386589k8132j69225J33781J4556k5312j26532l7884p2433M97682j37929
5820G435161O3468J11829J57757l87177j4171L04801R6096l5085J26264j53369
5810G705574J76997L01462J24925P3963J01020p7073j33854n0299J86028n9355
5800H349388N2054p4057K66685m5642m5642K36020l3843L8496K90325k28201P6069
5789H881652N489N6680L95533l63626L02755L85296j18785j54781n867n1003k6574
5778I306769L15314J20651j07739J19429j87001K99725L58671j58705O291M55402
5768A0528807M6953R1487K13593N4829j56812O10805j37156j55196Q3290L41758
$$ y = [6829872, 6600686, 6776103, 6854144, 6758153, 6870267, 6865751, 7001036, 6919053, 7215798, 7386589, 7358457, 7189232, 7323013, 7337569, 7312257, 7185725, 7147841, 7075408, 7573090, 7435161, 7498629, 7610458, 7768215, 7381038, 7366867, 7671668, 7767764, 7732679, 7858943, 7705574, 7882571, 8184033, 8308958, 8382921, 8483941, 8406868, 8273014, 8222715, 8408743, 8349388, 8401442, 8327385, 8594070, 8548428, 8502786, 8738806, 8704963, 8743459, 9033784, 8805583, 8881652, 8887141, 8943821, 9339354, 8975728, 9278483, 9663779, 9544994, 9390213, 9384346, 9333343, 9306769, 9622083, 9742734, 9634995, 9754424, 9567423, 9867148, 10225819, 10067114, 10073405, 10528807, 10575760, 10667247, 10880840, 10935669, 10778857, 11389662, 11252506, 11097310, 11180600, 11522358]
5758A1522358J68j65571L98965l7759m2735m38083K32064L7432J68642M97339
5748A2172820Q690N463q1459J92776J55474j83568m8816J18771L1048k8621L08066
5737A2650644O0902K9368l7564L81545j6628j30887R8026J55792o9490O3982O4472
5726A3250162k03321M21300m3819N762L33501k22642K15717J11110J70002p6518
5716A3961254N2926P5084k08522L86342L98734j07558J18470P6574k54281N5830
5706A4554853P3931K90330l9336K38532J03830J68066Q0630m4110j60888J79432
5696A5445270L83814M4750L20645Q7730j8833L45302Q3734N0645K1721K32166
5686A6996944J21817J23135K4169J15257j00537J84212k0856N26104K49293k73184
$$ y = [11522358, 11522526, 11356955, 11755920, 11718161, 11675426, 11237343, 11469407, 11506839, 11675481, 12172820, 12181510, 12186973, 12105514, 12298290, 12453764, 12270196, 12221380, 12340151, 12371199, 12342578, 12650644, 12711546, 12740914, 12703350, 13084895, 13068267, 12937380, 13035406, 13191198, 13121708, 13185690, 13250162, 13046841, 13468141, 13424322, 13430084, 13763585, 13540943, 13756660, 13867770, 14037772, 13961254, 14014180, 14089264, 13880742, 14267084, 14665818, 14558260, 14676730, 14753304, 14499023, 14554853, 14628784, 14919114, 14879778, 15118310, 15222140, 15390206, 15470836, 15426726, 15265838, 15445270, 15829084, 15873834, 16194479, 16282209, 16263376, 16608678, 16692412, 16743057, 16764778, 16996944, 17118761, 17241896, 17266065, 17381322, 17280785, 17464997, 17444141, 17970245, 18219538, 17946354]
5676A7946354N87004M23140J1883P5537J9716M06978n4289L26008L00859R6461
5666B0139651K50307K10952L0086K18949J39296J50992K83733L12255N7701L61207
5656B2155129K36706K98077J91088k531N43768J87240K22716M22425K52417K22405
5646B4729440J40522O95796M75466q6684K82760J83772O59534J15968R7600P82189
5636B8076363N50065M6863L52602M06925L45074L85927L01247M30761L60694N57913
5626C1814434M33929M98416O23130j09950R68764Q14445J30593M84374L89553
5617C6047688N79569N00543O32299N45476O71617M40328K85143Q06210R24660
5608D1433533R35963P47939L89392P02378Q20745O24201Q50872O02203P11005
$$ y = [17946354, 18533358, 18956498, 18968381, 19043918, 19063634, 19470612, 19416323, 19742331, 20043190, 20139651, 20389958, 20600910, 20630996, 20849945, 20989241, 21140233, 21423966, 21736221, 21793922, 22155129, 22391835, 22689912, 22881000, 22878469, 23422237, 23609477, 23832193, 24254618, 24507035, 24729440, 24869962, 25565758, 26041224, 25954540, 26237300, 26421072, 27080606, 27196574, 27294174, 28076363, 28626428, 28673291, 29025893, 29432818, 29777892, 30163819, 30465066, 30895827, 31256521, 31814434, 32248363, 32746779, 33369909, 33259959, 34228723, 35043168, 35173761, 35658135, 36047688, 36627257, 37127800, 37760099, 38305575, 38977192, 39417520, 39702663, 40508873, 41433533, 42369496, 43117435, 43506827, 44209205, 45029950, 45654151, 46505023, 47107226, 47818231]
5599D7818231Q63611R47505J035911R54782M07628Q89389J139008J107880J096456
5590E6260401O84144P94268J223358J298474J284428R58003J387256J262731J158043
5581F6311106J495218J427711J716330J514404J421299J633903J618564K010793
5573G9149328J636257J619891J914306K342834K238254K172864J942782K161736
5565I5178252K066833K471065K461520K312701K514165K820389K445622K422859
5557A14693406K760576K834653K949056L481681K992390K864040L137710L051084
5549A38764596L434397L550910L401116L017535L487613L100578L335063L504852
5541A65596660L131321L531752L149115L044734L047865L432856L142395K834243
$$ y = [47818231, 48681842, 49629347, 50665258, 51620040, 52027668, 52917057, 54056065, 55163945, 56260401, 56944545, 57738813, 58962171, 60260645, 61545073, 62503076, 63890332, 65153063, 66311106, 67806324, 69234035, 70950365, 72464769, 73886068, 75519971, 77138535, 79149328, 80785585, 82405476, 84319782, 86662616, 88900870, 91073734, 93016516, 95178252, 97245085, 99716150, 102177670, 104490371, 107004536, 109824925, 112270547, 114693406, 117453982, 120288635, 123237691, 126719372, 129711762, 132575802, 135713512, 138764596, 142198993, 145749903, 149151019, 152168554, 155656167, 158756745, 162091808, 165596660, 168727981, 172259733, 175408848, 178453582, 181501447, 184934303, 188076698, 190910941]
5533A90910941K881705K907369K933221K938188K679662K688221L003844K758114
5525B13701265K445741K984046K676063K388614K352619J747352K021887J719287
5517B32036874J479628J251675R91802P82517O03736K04276l81874k60660l75993
5508B36331981o52134m94116m64637j082032r31248p20119j014723o14455j161195
5499B29197322p19770j233550j089333j796446j781293k004343k631874k578682
5491B15362031k775289l020697l299499l358380l189014l199293l231692l630137
5483A89658030l229666l251442l216459l224717k693425k849761k789574k747923
5475A65655063k731348k552810k307154k724370k504061k889108k940354k497681
$$ y = [190910941, 193792646, 196700015, 199633236, 202571424, 205251086, 207939307, 210943151, 213701265, 216147006, 219131052, 221807115, 224195729, 226548348, 228295700, 230317587, 232036874, 233516502, 234768177, 235759979, 236542496, 237146232, 237350508, 236968634, 236707974, 236331981, 235679847, 235185731, 234721094, 233639062, 232707814, 231987695, 230972972, 230358517, 229197322, 228477552, 227244002, 226154669, 224358223, 222576930, 220572587, 217940713, 215362031, 212586742, 209566045, 206266546, 202908166, 199719152, 196519859, 193288167, 189658030, 186428364, 183176922, 179960463, 176735746, 174042321, 171192560, 168402986, 165655063, 162923715, 160370905, 158063751, 155339381, 152835320, 149946212, 147005858, 144508177]
5467A44508177k494783k692673k549696k445326k452576k468944k380038k088201
5459A24935940j868887j552133j654517j781948j334649j362771j256278j259479
5451A12865278j045809j153011p69372n46048q51345o68123m69997j94514p69277
5442A06397782j73612k08748K63973j5482o049J00717J49825L85453M26689P48623
5432A08069171M10247K48100R78084O71992R46853Q91937J153421J276742J236084
5423A15882631J404307J380990J470259J936587J820958J815228K115327K173328
5415A29999615K088692K328719K121516K532740K838787K773258L087341L307380
5407A51078048L002423L338114L315928L438145L842675L772659M656816M006119
$$ y = [144508177, 142013394, 139320721, 136771025, 134325699, 131873123, 129404179, 127024141, 124935940, 123067053, 121514920, 119860403, 118078455, 116743806, 115381035, 114124757, 112865278, 111819469, 110666458, 109897086, 109351038, 108499693, 107831570, 107361573, 107167059, 106397782, 106224170, 106015422, 106279395, 106263913, 106257864, 106358581, 106508406, 106893859, 107320548, 108069171, 108479418, 108727518, 109705602, 110377594, 111324447, 112216384, 113369805, 114646547, 115882631, 117286938, 118667928, 120138187, 122074774, 123895732, 125710960, 127826287, 129999615, 132088307, 134417026, 136538542, 139071282, 141910069, 144683327, 147770668, 151078048, 154080471, 157418585, 160734513, 164172658, 168015333, 171787992, 176444808, 180450927]
5399A80450927M023249M135170M710852N105259M506947N070020N030982N123025
5391B18156431N036026N367020N582010M826671N279086N065319N194036M923441
5383B59430040M675160M698594M786131L970705L662212L785011L344380L147797
5375B91500030K176254J489695J626598J324913l30137q01075j576591k685815
5367B92723872m059622n254240o176293o950224p901197p986757q347515q115522
5359B37932502q024671p828271p655164p179624o928424o747574o486656o150372
5351A80931746o072476n303225n134974n439468n140582m815194m514315m310809
5343A40200703m104689l782240l813741l613303l398154l494671l185372k832394
$$ y = [180450927, 184474176, 188609346, 193320198, 198425457, 202932404, 208002424, 213033406, 218156431, 223192457, 228559477, 234141487, 238968158, 244247244, 249312563, 254506599, 259430040, 264105200, 268803794, 273589925, 277560630, 281222842, 285007853, 288352233, 291500030, 293676284, 295165979, 296792577, 298117490, 297787353, 296986278, 295409687, 292723872, 288664250, 283410010, 277233717, 270283493, 262382296, 254395539, 246048024, 237932502, 229907831, 222079560, 214424396, 207244772, 200316348, 193568774, 187082118, 180931746, 174859270, 169556045, 164421071, 158981603, 153841021, 149025827, 144511512, 140200703, 136096014, 132313774, 128500033, 124886730, 121488576, 117993905, 114808533, 111976139]
5335A11976139k896017l142793k702457k714690k447354k349839k343355k319562
5327I1060072k142814k242399j808862j854568j885990j949537j738775j738368
5319G5698759j911027j253824j501348j423632j334080j384037j249204j359332
5311F4282275j103139j062271q36074j273596q14034j229347j008668j101084
5303E5854062o22293n47928j185552p81942j106451n80977n39722j199183o43189
5294D8646825o11883q00790n14995m93793o96910l19694n25121p47303o14593
5285D3321743n30477m94898o27283l06204J09340n34847o67606l17836m29908
5276C9522024n04168l28902j90565l86567k93151k94348q7466m46754j97636k63587
$$ y = [111976139, 109080122, 105937329, 103234872, 100520182, 98072828, 95722989, 93379634, 91060072, 88917258, 86674859, 84865997, 83011429, 81125439, 79175902, 77437127, 75698759, 73787732, 72533908, 71032560, 69608928, 68274848, 66890811, 65641607, 64282275, 63179136, 62116865, 61280791, 60007195, 59193161, 57963814, 56955146, 55854062, 55231769, 54683841, 53498289, 52716347, 51609896, 51028919, 50489197, 49290014, 48646825, 48034942, 47234152, 46719157, 46225364, 45528454, 45208760, 44683639, 43936336, 43321743, 42791266, 42296368, 41669085, 41362881, 41472221, 40937374, 40269768, 39951932, 39522024, 39017856, 38688954, 38498389, 38111822, 37818671, 37524323, 37436857, 36990103, 36792467, 36528880]
5266C6528880l25184j57749m33066l74363m581l61317j62917n8973k02327k30604
5256C4217799n53425l56018k61637l33269K0732j62841p8826m29050J237m6201
5246C2018501l73247n51876J41311L62451l90240j94976J45375j84183J42760
$$ y = [36528880, 36203696, 36045947, 35612881, 35238518, 35233937, 34872620, 34709703, 34650730, 34448403, 34217799, 33664374, 33308356, 33046719, 32713450, 32734182, 32571341, 32492515, 32063465, 32064702, 32018501, 31645254, 31093378, 31234689, 31597140, 31206900, 31011924, 31157299, 30973116, 31115876]
$$ [...]
##END NTUPLES=NMR SPECTRUM
##END=
