##TITLE=1H_CA-9306
 CDCl3
 8 sc, 
 2.12.2024
##JCAMPDX= 6.0         $$ Bruker NMR JCAMP-DX V2.0
##DATA TYPE= NMR SPECTRUM
##DATA CLASS= NTUPLES
##ORIGIN= UXNMR, Bruker Analytische Messtechnik GmbH
##OWNER= root
$$ XWIN-NMR		Version 3.5
$$ Mon Dec  2 14:05:20 2024 Russian Standard Time (UT+4h)  she@DPX200
##.OBSERVE FREQUENCY= 200.1315
##.OBSERVE NUCLEUS= ^1H
##.ACQUISITION MODE= SIMULTANEOUS
##.ACQUISITION SCHEME= undefined
##.AVERAGES= 8
##.DIGITISER RES= 18
##SPECTROMETER/DATA SYSTEM= spect
##.PULSE SEQUENCE= zg30
##.SOLVENT NAME= CDCl3
##.SHIFT REFERENCE= (INTERNAL, CDCl3, 0, 19.5797)
##AUDIT TRAIL= $$ (NUMBER, WHEN, WHO, WHERE, WHAT)
$$ ##TITLE= Audit trail, XWIN-NMR		Version 3.5
$$ ##JCAMPDX= 5.01
$$ ##ORIGIN= Bruker BioSpin GmbH
$$ ##OWNER= she
$$ F:/spectra/data/she/nmr/H-F/1/pdata/1/auditp.txt
$$ ##AUDIT TRAIL=  $$ (NUMBER, WHEN, WHO, WHERE, WHAT)
(   1,<2024-12-02 14:04:05.48 +0400>,<she>,<DPX200>,
      <created by zg, POWCHK disabled, PULCHK disabled
       configuration hash MD5:
       00 E9 B6 7A A2 85 ED C7 34 08 36 98 17 FE 4E 26
       data hash MD5: 16K
       7E 83 8E 53 27 DD 1F FA B2 22 C4 F0 5E 14 D2 9F>)
(   2,<2024-12-02 14:04:09.60 +0400>,<she>,<DPX200>,
      <Start of raw data processing
       efp BC_mod = 2 LB = 0.24 FT_mod = 6 PKNL = 1 PHC0 = -26718.81 PHC1 = 14.38744 SI = 16K 
       data hash MD5: 16K
       26 21 A2 13 91 DE A1 9C 55 43 AE 77 81 4E 28 79>)
(   3,<2024-12-02 14:04:27.20 +0400>,<she>,<DPX200>,
      <pk PHC0 = 1.567915 PHC1 = 0.2 
       data hash MD5: 16K
       08 C5 F6 9C 77 60 F6 EA C5 2D 2C B6 D6 EB 00 38>)
(   4,<2024-12-02 14:04:31.40 +0400>,<she>,<DPX200>,
      <abs ABSG = 5 
       data hash MD5: 16K
       E4 79 13 F0 8A 0D 0B F5 55 F3 96 7B DF 85 3C C5>)
$$ ##END=
$$ 
$$ hash MD5
$$ 7C A3 54 0D 92 01 E5 1B 0D FB 22 DC 0B 2A 0D 32
##$RELAX= 
##$RELAX= 
##$RELAX= 
##$RELAX= 
##$RELAX= 
##$RELAX= 
$$ Bruker specific parameters
$$ --------------------------
##$DU= <F:/spectra>
##$EXPNO= 1
##$NAME= <H-F>
##$PROCNO= 1
##$TYPE= <nmr>
##$USER= <she>
##$AMP= (0..31)
100 100 100 100 100 100 100 100 100 100 100 100 100 100 100 100 100 100 
100 100 100 100 100 100 100 100 100 100 100 100 100 100 
##$AQSEQ= 0
##$AQ_mod= 1
##$AUNM= <au_zg>
##$AUTOPOS= <>
##$BF1= 200.13
##$BF2= 200.13
##$BF3= 200.13
##$BF4= 200.13
##$BF5= 200.13
##$BF6= 200.13
##$BF7= 200.13
##$BF8= 200.13
##$BYTORDA= 1
##$CFDGTYP= 0
##$CFRGTYP= 5
##$CHEMSTR= <none>
##$CNST= (0..31)
1 1 145 1 1 1 1 1 1 1 1 1 1 1 1 1 1 1 1 1 1 1 1 1 1 1 1 1 1 1 1 1 
##$CPDPRG= <>
##$CPDPRG1= <>
##$CPDPRG2= <>
##$CPDPRG3= <>
##$CPDPRG4= <mlev>
##$CPDPRG5= <mlev>
##$CPDPRG6= <mlev>
##$CPDPRG7= <mlev>
##$CPDPRG8= <mlev>
##$CPDPRGB= <>
##$CPDPRGT= <>
##$D= (0..31)
0 1.2 0 0 0 0 0 0 0 0.06 0 0.03 0 0 0 0 0.0002 0 0 0 0 0 0 0 0 0 0 0 0 
0 0 0 
##$DATE= 1733133844
##$DBL= (0..7)
120 120 120 120 120 120 120 120 
##$DBP= (0..7)
150 150 150 150 150 150 150 150 
##$DBP07= 0
##$DBPNAM0= <>
##$DBPNAM1= <>
##$DBPNAM2= <>
##$DBPNAM3= <>
##$DBPNAM4= <>
##$DBPNAM5= <>
$$ [...]
##$SUBNAM3= <"">
##$SUBNAM4= <"">
##$SUBNAM5= <"">
##$SUBNAM6= <"">
##$SUBNAM7= <"">
##$SUBNAM8= <"">
##$SUBNAM9= <"">
##$SW= 24.0689530833862
##$SWIBOX= (0..15)
0 0 2 0 0 0 0 0 0 0 0 0 0 0 0 0 
##$SW_h= 4816.95568400771
##$TD= 16384
##$TD0= 1
##$TE= 0
##$TE2= 300
##$TE3= 300
##$TEG= 300
##$TL= (0..7)
0 120 120 120 120 120 120 120 
##$TP= (0..7)
150 150 150 150 150 150 150 150 
##$TP07= 0
##$TPNAME0= <>
##$TPNAME1= <>
##$TPNAME2= <>
##$TPNAME3= <>
##$TPNAME4= <>
##$TPNAME5= <>
##$TPNAME6= <>
##$TPNAME7= <>
##$TPOAL= (0..7)
0.5 0.5 0.5 0.5 0.5 0.5 0.5 0.5 
##$TPOFFS= (0..7)
0 0 0 0 0 0 0 0 
##$TUNHIN= 0
##$TUNHOUT= 0
##$TUNXOUT= 0
##$USERA1= <user>
##$USERA2= <user>
##$USERA3= <user>
##$USERA4= <user>
##$USERA5= <user>
##$V9= 5
##$VALIST= <valist>
##$VCLIST= <CCCCCCCCCCCCCCC>
##$VD= 0
##$VDLIST= <DDDDDDDDDDDDDDD>
##$VPLIST= <PPPPPPPPPPPPPPP>
##$VTLIST= <TTTTTTTTTTTTTTT>
##$WBST= 1024
##$WBSW= 4
##$XGAIN= (0..3)
0 0 0 0 
##$XL= 0
##$YL= 0
##$YMAX_a= 482893
##$YMIN_a= -462795
##$ZGOPTNS= <>
##$ZL1= 120
##$ZL2= 120
##$ZL3= 120
##$ZL4= 120
##$ABSF1= 19.55176
##$ABSF2= -4.517374
##$ABSG= 5
##$ABSL= 3
##$ALPHA= 0
##$AQORDER= 0
##$ASSFAC= 0
##$ASSFACI= 0
##$ASSFACX= 0
##$ASSWID= 0
##$AUNMP= <proc_1d>
##$AZFE= 0.1
##$AZFW= 0.1
##$BCFW= 0
##$BC_mod= 2
##$BYTORDP= 0
##$COROFFS= 0
##$CY= -3
##$DATMOD= 1
##$DC= 0
##$DFILT= <>
##$DTYPP= 0
##$F1P= 0
##$F2P= 0
##$FCOR= 1
##$FTSIZE= 16384
##$FT_mod= 6
##$GAMMA= 0
##$GB= 0
##$INTBC= 1
##$INTSCL= 2.524811e-10
##$ISEN= 128
##$LB= 0.24
##$LEV0= 0
##$LPBIN= 0
##$MAXI= 10000
##$MC2= 0
##$MEAN= 0
##$ME_mod= 0
##$MI= 1.114404
##$NCOEF= 0
##$NC_proc= -5
##$NLEV= 6
##$NOISF1= 3.799351
##$NOISF2= 2.8
##$NSP= 0
##$NTH_PI= 0
##$NZP= 0
##$OFFSET= 19.57968
##$PC= 1
##$PHC0= -26717.24
##$PHC1= 14.58744
##$PH_mod= 1
##$PKNL= yes
##$PPARMOD= 0
##$PSCAL= 0
##$PSIGN= 0
##$REVERSE= no
##$SF= 200.129989996413
##$SI= 16384
##$SIGF1= 3
##$SIGF2= 2
##$SINO= 5.538805
##$SIOLD= 16384
##$SREGLST= <1H.CDCl3>
##$SSB= 0
##$STSI= 16384
##$STSR= 0
##$SW_p= 4816.95568400771
##$SYMM= 0
##$S_DEV= 0
##$TDeff= 16384
##$TDoff= 0
##$TI= <>
##$TILT= no
##$TM1= 0
##$TM2= 0
##$TOPLEV= 0
##$USERP1= <user>
##$USERP2= <user>
##$USERP3= <user>
##$USERP4= <user>
##$USERP5= <user>
##$WDW= 1
##$XDIM= 16384
##$YMAX_p= 269632474
##$YMIN_p= -206146
$$ End of Bruker specific parameters
$$ ---------------------------------
##NTUPLES= NMR SPECTRUM
##VAR_NAME=  FREQUENCY,     SPECTRUM/REAL,   SPECTRUM/IMAG
##SYMBOL=    X,             R,               I
##VAR_TYPE=  INDEPENDENT,   DEPENDENT,       DEPENDENT
##VAR_FORM=  AFFN,          ASDF,            ASDF
##VAR_DIM=   16384,         16384,           16384
##UNITS=     HZ,            ARBITRARY UNITS, ARBITRARY UNITS
##FACTOR=    0.29402158847633, 1,            1
##FIRST=     3918.48106029371, 0,            0
##LAST=      -898.474623714001, 0,           0
##MIN=       -898.474623714001, -206146,     0
##MAX=       3918.48106029371, 269632474,    0
$$ Real data points
##PAGE= N=1
##DATA TABLE= (X++(R..R)), XYDATA
$$ [...]
6894c9981L5900M681M8396l2870N0066k1692j17096o29L2660l905M4477p7660
$$ -39981 -4081 600 48996 16126 66192 44500 -72596 -73225 -40565 -44470 7 -77653
6882g7653K1940p9773M1059L5313K0699K1972N808j5333K133k1531n0272O972
$$ -77653 -55713 -135486 -94427 -59114 -38415 -16443 -10635 -25968 -23835 -45366 -95638 -88666
6870h8666K8225L0979J6380k1620p932l9547J083P4632l7791J6113J2065o9369
$$ -88666 -60441 -29462 -13082 -34702 -42634 -82181 -81098 -6466 -44257 -28144 -16079 -85448
6858h5448K5477K8671K3067J15149o4390n3349m4557k886K0470K1684K5196K2734
$$ -85448 -59971 -31300 -8233 106916 42526 -10823 -55380 -58266 -37796 -16112 9084 31818
6846C1818q603m9846m3771L1550m5848K3185l5868P5266l1645Q084P578j4633
$$ 31818 23215 -26631 -70402 -38852 -84700 -61515 -97383 -22117 -53762 -45678 -38100 -52733
6834e2733L3592r841l2724j3630o825m688L8501o0355K6197M4092Q969R3848m5796
$$ -52733 -19141 -28982 -61706 -75336 -82161 -86849 -48348 -108703 -82506 -38414 -29445 64403 18607
6821A8607n6592J4633l3624K1698K8890m2490R307J06137r6126n6566L2426L4927
$$ 18607 -37985 -23352 -56976 -35278 -6388 -48878 -39571 66566 -29560 -86126 -53700 -18773
6809a8773M6236q4075q7834P6282Q8594r8609m2618J15002j6755K2695m3369k5720
$$ -18773 27463 -56612 -144446 -68164 20430 -78179 -120797 -5795 -22550 145 -43224 -68944
6797f8944N6408l2591J17924n2993m7300j1392L6379K4271l9189M5439p0850N576
$$ -68944 -12536 -45127 72797 19804 -27496 -38888 -2509 21762 -17427 28012 -42838 -37262
6785c7262N7961p8344j6875K7969k1689J3404j8918k842R6511j07214J6401P1633
$$ -37262 20699 -57645 -74520 -46551 -68240 -54836 -73754 -76596 19915 -87299 -70898 735
6773G35n1798L0932M1145j0283n8494J9442n988k3836J05614p2646n1210J6257
$$ 735 -51063 -20131 21014 10731 -47763 -28321 -34309 -58145 47469 -25177 -76387 -60130
6761f0130K0886l26n8261K3640N2002l3479k6132j9089M9294M80m5458L0410o4749
$$ -60130 -39244 -39570 -97831 -74191 -22189 -55668 -81800 -100889 -51595 -51115 -96573 -66163 -130912
6748a30912l9843J6393P2759N4824J1879j2511o1039N1564J9001l8034N866M3942
$$ -130912 -170755 -154362 -81603 -26779 -14900 -27411 -88450 -36886 -17885 -55919 -50053 -6111
6736f111o2322L651J06722k2996l3108K8938K6307Q156n7316j7146m5147l2570
$$ -6111 -68433 -64782 41940 18944 -14164 14774 41081 49237 -8079 -25225 -70372 -102942
6724a02942L4114P5416P7611m4463j7596m2525K6003k8981l2354p6227Q052O4449
$$ -102942 -68828 6588 84199 39736 22140 -20385 5618 -23363 -55717 -131944 -123892 -59443
6712e9443M0184o5657o635K1886J0275L9604o892L5925j7130P173q861m2483L5259
$$ -59443 -19259 -84916 -91551 -69665 -59390 -19786 -26678 9247 -7883 -710 -9571 -52054 -16795
6699a6795J8247m746r919j4411K4784O9547k5948n4845r7973O966L3766m096O0677
$$ -16795 1452 -3294 -13213 -27624 -2840 66707 40759 -14086 -112059 -105093 -71327 -75423 -14746
6686a4746M0464o5541P7020j8804m746K3084j04728p855J4488M8168J252j1821
$$ -14746 25718 -39823 37197 18393 13647 36731 -67997 -75852 -61364 -13196 -11944 -23765
6674b3765k5003J6130l2096N8477O2227o8646o1568l6107N6213r372k4750n4561
$$ -23765 -48768 -32638 -64734 -6257 55970 -12676 -74244 -110351 -54138 -63510 -88260 -142821
6662a42821J5008N9157K2619p8501P2557O333M4612m076L7868p1747l2284J60873
$$ -142821 -127813 -68656 -46037 -124538 -51981 -45648 -1036 -5112 32756 -38991 -71275 89598
6650H9598q0784n1001l5638N604M0261l1214K9315L6205o1849J0457j1443l4784
$$ 89598 8814 -42187 -77825 -72221 -31960 -63174 -33859 2346 -59503 -49046 -60489 -95273
6638i5273L5323N1025n6351m3738R6301N8105n1137q7840L6965M2525L9679m6174
$$ -95273 -59950 -8925 -65276 -109014 -12713 45392 -5745 -93585 -56620 -14095 25584 -20590
6626b0590M4240j9303l3644p1799L9983R1809q3773P1071J9545l6125l7464n2219
$$ -20590 23650 4347 -29297 -101096 -61113 30696 -53077 17994 37539 1414 -36050 -88269
6614h8269l9886O3227n9046J00640L8932q402m1901p75l5904Q5989n7987n619
$$ -88269 -128155 -64928 -123974 -23334 15598 7196 -34705 -35480 -71384 14605 -43382 -49001
6602d9001J075K3416P2407m5247l7502l9989K6208j8153M1997K0146J8710j1293
$$ -49001 -47926 -24510 47897 2650 -34852 -74841 -48633 -66786 -24789 -4643 14067 2774
6590B774l0940L2079J9304j6931q9444L7972k839K5293p1167L7713K5974J2382
$$ 2774 -28166 3913 23217 6286 -83158 -45186 -48025 -22732 -93899 -56186 -30212 -17830
6578a7830K7607r8601K7698K1393k0634P535M4021K8133k844n7674P761J9963
$$ -17830 9777 -88824 -61126 -39733 -60367 -52832 -8811 19322 16478 -41196 -33435 -13472
6566a3472J5304J0792p13K2244J1546r1130P418L5958p0500P297N4391j07601
$$ -13472 1832 12624 11911 34155 45701 -45429 -38011 -2053 -72553 -65256 -10865 -118466
6554a18466n4045O8991k1351O8294Q497l957O5538j4927k5182j9571L7030q1342
$$ -118466 -172511 -103520 -124871 -56577 -48080 -52037 13501 -1426 -26608 -46179 -9149 -90491
6542i0491M8630L1474n573m1552M149M324N865j7346O1914k0969L0576Q471k3840
$$ -90491 -41861 -10387 -15960 -57512 -53363 -49039 -43174 -60520 1394 -19575 11001 19472 -4368
6529d368O7271q2727M1115P796K0335o7645l4838q1171M1323L7072K4945m2072
$$ -4368 62903 -19824 21291 29087 49422 -18223 -53061 -134232 -92909 -55837 -30892 -72964
6517g2964L4961o9657k086J3461j2965M2107m3747J7965j4687J3197O0413o540
$$ -72964 -38003 -107660 -109746 -96285 -109250 -67143 -110890 -92925 -107612 -94415 -34002 -40542
6505d0542M730k5467j4767L9110r9970M5019M0742J8620p4874J18022J6088l0723
$$ -40542 -35812 -61279 -76046 -36936 -136906 -91887 -51145 -32525 -107399 10623 26711 -4012
6493d012l9073k0436n1010L5665l7312K5414n050J2775N3502J12201q0375p1862
$$ -4012 -43085 -63521 -114531 -78866 -116178 -90764 -95814 -83039 -29537 82664 2289 -69573
6481f9573K8948L00Q1057m7592M6313m8470j00233O0714K5149m2300M0704l9891
$$ -69573 -40625 -40325 40732 -6860 39453 -9017 -109250 -48536 -23387 -65687 -24983 -64874
6469f4874l0195j2110K9714l4023J8378j8997M6689J104O1439J7206p0809J9257
$$ -64874 -95069 -107179 -77465 -111488 -93110 -112107 -65418 -64314 -2875 14331 -56478 -37221
6457c7221K6886j9873l1226L1472K1518o547m6136J8607P1630l7499N1020M5327
$$ -37221 -10335 -30208 -61434 -29962 -8444 -14991 -61127 -42520 29110 -8389 42631 87958
6445H7958n2409p0571n8319N0672m1815O376L3553n8344O9357k257m1248J3769
$$ 87958 35549 -35022 -93341 -42669 -84484 -78108 -44555 -102899 -33542 -35799 -77047 -63278
6433f3278K2975K4565k846j2571L732L7339k7166k7188J7367r340J7331L4391
$$ -63278 -40303 -15738 -18584 -31155 -27423 9916 -17250 -44438 -27071 -36411 -19080 15311
6421A5311q1215M5990P156K3367k0291j9843j9044k4146M2722O576m3852L3196
$$ 15311 -65904 -19914 -12758 10609 -9682 -29525 -48569 -72715 -29993 -23417 -67269 -34073
6409c4073j8906P247L5243k8568K2441k4360p5474o068Q1235j10347L0780J09978
$$ -34073 -52979 -45732 -10489 -39057 -16616 -40976 -116450 -122518 -41283 -151630 -120850 -10872
6397a0872j8748l0758O759N0045n3767P584j1822P60K9082j989L372K8908L0977
$$ -10872 -29620 -60378 -53619 -3574 -57341 -49757 -61579 -60819 -31737 -33726 -30354 -1446 29531
6384B9531r3573L8612j1114L4634k1166L1149k1320L356J8170K418K9347o8081
$$ 29531 -64042 -25430 -36544 -1910 -23076 8073 -13247 -9891 8279 10697 40044 -28037
6372b8037j5054j0354J8748J6010k5083j8046Q3732o66m5680N6272l939r9398
$$ -28037 -43091 -53445 -34697 -18687 -43770 -61816 21916 21250 -24430 31842 27903 -71495
6360g1495m760N911k4937N3907r242j7313P2287o3913N934R0619K8090l5633o6521
$$ -71495 -76255 -70344 -95281 -41374 -50616 -67929 4358 -59555 -53621 36998 65088 29455 -37066
6347c7066k3101j4311j6968L8084O8711j1030o3854L3784q489J2289m730J0227
$$ -37066 -60167 -74478 -91446 -53362 15349 4319 -59535 -25751 -34240 -21951 -26681 -16454
6335a6454M7103n0367j086j4325l9672j8602N8187K6348n6098L999N0300k2724
$$ -16454 30649 -19718 -20804 -35129 -74801 -93403 -35216 -8868 -64966 -60967 -10667 -33391
6323c3391k2803K1831J1139l2994l4382m6000O4171Q497J1538M0234l5794K2413
$$ -33391 -56194 -34363 -23224 -56218 -90600 -136600 -72429 -63932 -52394 -12160 -47954 -25541
6311b5541L1763p7367M6304J4660l8939m2845N1496o0844L3842o4801P1034J3719
$$ -25541 6222 -71145 -24841 -10181 -49120 -91965 -40469 -101313 -67471 -132272 -61238 -47519
6299d7519N9797j6170m6612R5018j38660k9261J37385q2906Q379J29720p9184
$$ -47519 12278 -3892 -50504 44514 -94146 -123407 13978 -68928 -60549 69171 -10013
6288a0013Q106r7954N3128p0804J9323P4719K153M46M270j8263p6590K0722J296
$$ -10013 -1907 -99861 -46733 -117537 -98214 -23495 -21342 -20896 -16626 -34889 -111479 -90757 -89461
6275h9461m3746O0718K3890M9264n7495P4709q3299K9855n2596J6929L7564P2088
$$ -89461 -133207 -72489 -48599 665 -56830 17879 -65420 -35565 -88161 -71232 -33668 38420
6263C8420K9029m4276n053m702j21072k1723M5544K9596J0210q2243P7489k6399
$$ 38420 67449 23173 18120 13418 -107654 -129377 -83833 -54237 -44027 -126270 -48781 -75180
6251g5180o1875Q9772M439L0445M1864p1962J4400j91O2822o9795m3511M7296
$$ -75180 -137055 -47283 -42844 -12399 29465 -42497 -28097 -28288 34534 -35261 -78772 -31476
6239c1476k6259L9884L557p9452J10377r9229k6483J07391J0289j1822n9113N2953
$$ -31476 -57735 -17851 -14294 -93746 16631 -82598 -109081 -1690 8599 -3223 -62336 -9383
6227i383K730J736r753j5490J937R2275q82l9545n9649K0429J2205q2549P476
$$ -9383 -6653 -4917 -14670 -30160 -28223 64052 63170 23625 -36024 -15595 -3390 -85939 -78463
6214g8463k8348J10167k4556M9722j762j1331j00744j6466J5613N9118J941M112
$$ -78463 -106811 3356 -21200 28522 26760 15429 -85315 -101781 -86168 -27050 -25109 -20997
6202b0997l6874K8250M7318k2874J7480j5664L4155l0768k0414j24727N029R6310
$$ -20997 -57871 -29621 17697 -5177 12303 -3361 30794 26 -20388 -145115 -140086 -43776
6190d3776l2635l7348O9222M6645m8458O6874K0945p5434L3339o109q135p122
$$ -43776 -76411 -113759 -44537 2108 -46350 20524 41469 -33965 -626 -6735 -14870 -21992
6178b1992o6861P9190O977n8654J0399k8505L4422K7302k3527k95j01648M9759
$$ -21992 -88853 -9663 -2686 -61340 -50941 -79446 -45024 -17722 -41249 -41544 -143192 -93433
6166i3433N0537n478P9838k2886j1848k1823M8819l1883m4741r375L5767J4881
$$ -93433 -42896 -48374 31464 8578 -3270 -25093 23726 -8157 -52898 -62273 -26506 -11625
6154a1625j9523k6572K0406n8611J072P4287j7095m7268j0166K2034J9022K2258
$$ -11625 -31148 -57720 -37314 -95925 -94853 -20566 -37661 -84929 -95095 -73061 -54039 -31781
6142c1781l1500P0986m8453q865l770K3296M9605R287k4577m7324j7755l463M0561
$$ -31781 -63281 7705 -40748 -49613 -53383 -30087 19518 28805 4228 -43096 -60851 -64314 -23753
6129b3753n2831O6744K3416K6616j6186j14426L8707M7024j12500R0818O3288
$$ -23753 -76584 -9840 13576 40192 24006 -90420 -51713 -4689 -117189 -26371 36917
6118C6917n8426m6730O2268J3127o8274L4428O172R5996o2944p3845j9522M326
$$ 36917 -21509 -68239 -5971 7156 -61118 -26690 -20518 75478 12534 -61311 -80833 -76507
6106g6507k3445N2762K4446n3950P936J0567J44564l6084j38370N7095o600k1909
$$ -76507 -99952 -47190 -22744 -76694 -68758 -58191 86373 50289 -88081 -30986 -37586 -59495
6094e9495j9479L4429k5469J838j2606M5091l0604N2810m7327j6097O7449j2479
$$ -59495 -78974 -44545 -70014 -68176 -80782 -35691 -66295 -13485 -60812 -76909 -9460 -21939
6082b1939K1145L3029j8896l3673O1628m4958L5713q2915O660k026O9492p4154
$$ -21939 -794 32235 13339 -20334 41294 -3664 32049 -50866 -44206 -46232 23260 -50894
6070e0894P893l1749L9662k9348l6691M9573K2704J3672j08450N1036L2889n2778
$$ -50894 -43001 -74750 -35088 -64436 -101127 -51554 -28850 -15178 -123628 -72592 -39703 -92481
6058i2481n538O707O9394N6401n0412k5513l8802L1047P1768J6495n9165J9563
$$ -92481 -98019 -91312 -21918 34483 -15929 -41442 -80244 -49197 22571 39066 -20099 -536
6046e36K9608k887o4720M165M4977o4733M8826l2046J11549j7314k841O064o7376
$$ -536 29072 26185 -38535 -34370 10607 -54126 -5300 -37346 74203 56889 54048 60112 -7264
6033g264N3478j0668k7054n227n3287l4980O4069l3515O3570K0668M7024j07066
$$ -7264 46214 35546 8492 3265 -50022 -85002 -20933 -54448 9122 29790 76814 -30252
6021c0252L9899j2149J6560N7711r7394k7035J12005k591K8655l3131n0149L8015
$$ -30252 9647 -2502 14058 71769 -25625 -52660 59345 56754 85409 52278 2129 40144
6009D0144j3211l3395J0724R611j0168k8369p5402J2981P4569J6470O0302k9390
$$ 40144 26933 -6462 4262 13873 3705 -24664 -100066 -87085 -12516 3954 64256 34866
5997C4866l7717m487j01507O9684M1121N5982p7360Q6806K1354n4339J8373k9108
$$ 34866 -2851 -7338 -108845 -39161 1960 57942 -19418 67388 88742 34403 52776 23668
5985B3668J9639m682L0299J8152l3243l524J4320p928J5545M2067n5785O2078
$$ 23668 43307 38625 68924 87076 53833 50309 64629 56701 72246 114313 58528 120606
5973A20606L5166m8803l6561L7743m3408j5757m4921L1145k3665N9010L1774j8256
$$ 120606 155772 106969 70408 108151 64743 48986 4065 35210 11545 70555 102329 84073
5961H4073P508N7641l4364o7765n534m29J24040m9578l1580o4022N9465Q7914
$$ 84073 91581 149222 114858 47093 41559 41130 165170 115592 84012 19990 79455 167369
5949A67369l5558J8059m5978o6500p182J644N3339j4196M5145n4654J4819K9731
$$ 167369 131811 149870 103892 37392 30210 31854 85193 70997 116142 61488 76307 106038
5937A06038k9663l4858K3047j472P9910m3165n9515j5243Q6707L4662q705l2588
$$ 106038 76375 41517 64564 63092 143002 99837 40322 25079 111786 146448 137743 105155
5925A05155l1583L9328k5721J6144j1504j972J6150j527m7592n4741J8917M1057
$$ 105155 73572 112900 87179 103323 91819 89847 105997 104470 56878 2137 21054 62111
5913F2111k1852j8674Q4423M872p1950o869m244K5864m8551j6009O8245J0884
$$ 62111 40259 21585 106008 110880 38930 32061 27817 53681 5130 -10879 57366 68250
5901F8250n446l7955L2331l1555l5875K0330p204O7560o092n7780K8160L0216
$$ 68250 62804 24849 57180 25625 -10250 10080 2876 70436 64344 6564 34724 64940
5889F4940m8901l2886J75457j9116j8765j2825j09592j3368N0535P4248k3760
$$ 64940 16039 -16847 158610 139494 120729 107904 -1688 -15056 35479 109727 85967
5878H5967k2796J7098m3874o3411L610p0683O9509N9216O8271j04824p052N6803
$$ 85967 63171 80269 36395 -27016 -23406 -94089 -24580 34636 102907 -1917 -8969 47834
5866D7834N0414K1294k0295M5935n2029L398k3155j5315L3507j8637l5069K4996
$$ 47834 98248 119542 99247 145182 93153 96551 73396 58081 91588 72951 37882 62878
5854F2878j6104j01213L5218k2325M1186M1952p6671L7601j813K9846k6369M1108
$$ 62878 46774 -54439 -19221 -41546 -360 41592 -35079 2522 709 30555 4186 45294
5842D5294k1183R084N0146r7174o06R808N2169m472k4995N0107j2214n8636o3928
$$ 45294 24111 33195 83341 -13833 -14439 -4631 47538 43066 18071 68178 55964 -2672 -66600
5829f6600Q5756M5007o3473M6139R794l3751k0271r058N9633M4097k1010j2218
$$ -66600 19156 64163 690 46829 56623 22872 2601 -6457 53176 97273 76263 64045
5817F4045m7894r833k7387L7770n559M9683r854l0388O5400k5107j14471L6988
$$ 64045 16151 6318 -21069 16701 11142 60825 50971 20583 85983 60876 -53595 -16607
5805a6607L6831k687q1981K5250M4140m3995O3375p862N8648N177n2007n1926
$$ -16607 20224 17537 -64444 -39194 4946 -39049 24326 16464 75112 80289 28282 -23644
5793b3644k405R6694J9302j5521K0676J1011l2161m3134k8081j2110J5611j8904
$$ -23644 -26049 70645 89947 74426 95102 106113 73952 30818 2737 -9373 6238 -12666
5781a2666k8681L6733J1506l4776R289P0010M3209m6221K689l2292o3275N5109
$$ -12666 -41347 -4614 6892 -27884 -18595 51415 94624 48403 51092 18800 -44475 10634
5769A0634P8471O513l4835p0933j6848N8708K5967m3274p8955N3655O5784n4958
$$ 10634 89105 95618 60783 -10150 -26998 31710 57677 14403 -64552 -10897 54887 -71
5757g1j7903J9870k9789j5716O5022m3727J8526O693j6861K8655j6917j0744M5397
$$ -71 -17974 1896 -27893 -43609 21413 -22314 -3788 2905 -13956 14699 -2218 -12962 32435
5744C2435J9254l0570n6181n9701L4319j2453P0185J3870j3760n2887J0110l1071
$$ 32435 51689 21119 -35062 -94763 -60444 -72897 -2712 11158 -2602 -55489 -45379 -76450
5732g6450N9695K2756m0015K4786o130R9386k7367p7267P5N4347j8508P8160j4657
$$ -76450 -16755 6001 -34014 -9228 -15358 84028 56661 -20606 -20531 33816 15308 93468 78811
5719G8811j8403j11379R208Q7261j4205j7639p6963q320M6403K6292O6365j5985
$$ 78811 60408 -50971 -41763 45498 31293 13654 -63309 -71629 -25226 1066 67431 51446
5707E1446p4187K6024j4479n7480Q3496p401J4102K8323j1060m216J165j4599
$$ 51446 -22741 3283 -11196 -68676 14820 7419 21521 49844 38784 34568 35733 21134
5695B1134k1266r054Q7292n0716l7459O0872n4928q827m1464M6458j618j9929
$$ 21134 -132 -9186 78106 27390 -10069 50803 -4125 -12952 -54416 -7958 -9576 -29505
5683b9505j4940K4540R3404p1114P9600k0054l9658j6061N0527R96K5171q4862
$$ -29505 -44445 -19905 73499 2385 81985 61931 22273 6212 56739 57735 82906 -1956
5671a956o7119P1321n0563R4006o3905N6751P0813p5382M2548k8671K6080L2120
$$ -1956 -69075 2246 -48317 45689 -18216 38535 109348 33966 76514 47843 73923 106043
5659A06043n0244j4384q926j282R637j07693K281J11490j6018j898n837Q7582
$$ 106043 55799 41415 32489 31207 40844 -66849 -64568 46922 30904 29006 23169 110751
5647A10751J972k4808k786o0690j8182K2201p5161J5257p494L4068q177O0416
$$ 110751 112723 87915 85129 24439 6257 28458 -46703 -31446 -38940 -4872 -13049 47367
5635D7367J2407k6774n0962M4861N2076m6431N0265k0020K4210L6840q3407r3950
$$ 47367 59774 33000 -17962 26899 78975 32544 82809 62789 86999 123839 40432 -53518
5623e3518p965N3652J8688K0045m9535j4557L6436J0892K1059j6647L1715J5618
$$ -53518 -61483 -7831 10857 30902 -18633 -33190 3246 14138 35197 18550 50265 65883
5611F5883o81p2616M8214j5811j2818L3872r3341J24714K1179M069k9375k728
$$ 65883 65202 -7414 40800 24989 12171 46043 -47298 77416 98595 102664 73289 70561
5599G0561m1674k71j9291L0668p3014Q209O8284k1914P079k4940L4265N1479N2754
$$ 70561 28887 28616 9325 39993 -33021 -24812 43472 21558 28637 3697 37962 89441 142195
5586A42195m7494l6468m7308L2210J8978J01285n947k1980n8644k1777k076j4765
$$ 142195 94701 58233 10925 43135 62113 163398 157451 135471 76827 55050 52974 38209
5574C8209k5247L3308P0147k2030J0109J2026m6747j3122N3324j2595m6695r825
$$ 38209 12962 46270 116417 94387 104496 116522 69775 56653 109977 97382 50687 40862
5562D0862O5548n1766k0643P7203M7185m184l8688j0217l6987N2051l2553K7419
$$ 40862 106410 54644 34001 111204 158389 154205 115517 105300 68313 120364 87811 115230
5550A15230k8927l4680Q1377M400j0148M641o1111k7987r786k7094J1055M1075
$$ 115230 86303 51623 133000 137400 127252 131893 70782 42795 33009 5915 16970 58045
5538E8045K9795j7566J4231q020Q6741r8328k4262L7831K0055j6593l1133l3593
$$ 58045 87840 70274 84505 76485 163226 64898 40636 78467 98522 81929 50796 17203
5526A7203K020K9563N5583M5328m1570K7531L2267o2910K2408m992j7087K4183
$$ 17203 19223 48786 104369 149697 108127 135658 167925 105015 127423 122431 105344 129527
5514A29527M5377m4101J1847k636k7832m734o0954M514J7828m5030l5869P9832
$$ 129527 174904 130803 142650 140014 112182 107448 46494 51008 68836 23806 -12063 67769
5502F7769N721R1384n4284m8061M2292R245n1251l2587L530J4235K8960K548j0529
$$ 67769 73490 164874 110590 62529 104821 114066 62815 30228 33758 47993 76953 79501 68972
5489F8972j4143q5693J18146J671n3402M354O7220k3014o2590j876Q3429l0053
$$ 68972 54829 -30864 87282 88953 35551 39905 107125 84111 21521 19645 103074 73021
5477G3021k6547J32644q646j28786J5567j779K4028n8504p099K3922K9927J0326
$$ 73021 46474 179118 170472 41686 57253 55474 79502 20998 13899 37821 67748 78074
5465G8074L3587k523p0191k8534L7709r403n529Q3550j7277P0254q8560p658q963
$$ 78074 111661 109138 38947 10413 48122 38719 33190 116740 99463 169717 81157 73499 64536
5452F4536k7106n2657P0656R4544o6252j9502Q082j0284j0138p8369O3561m660
$$ 64536 37430 -15227 55429 149973 83721 64219 72301 62017 51879 -26490 37071 32411
5440C2411P5060N4312p0280J5225l220q72l112R569m1941M4335k2542L9561j7579
$$ 32411 107471 161783 91503 106728 103508 102636 99524 109093 67152 111487 88945 128506 110927
5427A10927q8665O1749L8495P782k4734K5268j5416K9320n6042n101R1385J9728
$$ 110927 22262 84011 122506 130288 105554 130822 115406 144726 88684 83583 174968 194696
5415A94696j1066K289J1407m5616J1859J6196L9797l9365m2957j7253J0993L5541
$$ 194696 183630 185919 197326 151710 163569 179765 219562 180197 137240 119987 130980 166521
5403A66521M003P8613j00821k9697R9769l7677j6002p614j4807Q5041l5891r470
$$ 166521 170524 249137 148316 118619 218388 180711 164709 157095 142288 227329 191438 181968
5391A81968l8068l9185J8984J7164O6187M850P7609p3036l3558N2795L2394N8112
$$ 181968 143900 104715 123699 140863 207050 211900 289509 216473 182915 235710 268104 326216
5379C26216n2135p3127o5568L5698o8989N5734m7907k9923N8319n666L0665K1698
$$ 326216 274081 200954 135386 171084 102095 157829 109922 79999 138318 132652 163317 185015
5367A85015N1111j21451k0579M1154J4683J3315J0730k2598l6204p6352M6709
$$ 185015 236126 114675 94096 135250 149933 163248 173978 151380 115176 38824 85533
5356H5533K8015j02806N6955J5915O201M1251M8859m5737L6092l4888l4943k7372
$$ 85533 113548 10742 67697 83612 89813 131064 179923 134186 170278 135390 100447 73075
5344G3075K0870R6037K8826K517o2382j926k1551p6861Q9224R5917o0702L6226
$$ 73075 93945 189982 218808 221325 158943 157017 135466 58605 147829 243746 183044 219270
5332B19270M6666p6655K2799M3454J09719j4439k0434M6881K4042P6890L3642
$$ 219270 265936 189281 212080 255534 365253 350814 330380 377261 401303 478193 511835
5321E11835K6900O2211K3457k8085Q6311O1202j14080j7163l0563j12282m3302
$$ 511835 538735 600946 624403 596318 682629 743831 629751 612588 582025 469743 426441
5310D26441n7778L7389q4438k3948m9998R210l0648l3477k8556N4113p6870K0423
$$ 426441 368663 406052 321614 297666 247668 256878 226230 192753 164197 218310 141440 161863
5298A61863N3399J8413k6765r959Q405p2078l4464l2620Q9437l5048j03505N7021
$$ 161863 215262 233675 206910 196951 205356 133278 98814 66194 155631 120583 17078 74099
5286G4099N697K4539m5984O2390m0333k4726J2962j633K207o540M5443O593m2472
$$ 74099 79796 104335 58351 120741 80408 55682 68644 67011 69218 62678 108121 114714 72242
5273G2242j02298Q6888M4041N33K843L1994r1964L0073j5016j8909k9662O4552
$$ 72242 -30056 56832 100873 101406 104249 136243 44279 74352 59336 40427 10765 75317
5261G5317M9384k1373m3469K7168L63m6892j3812J45743n2048m9522N5512j02608
$$ 75317 124701 103328 59859 87027 87390 40498 26686 172429 120381 70859 126371 23763
5249B3763P9672n1221N7737J4476p3826K4142j0932R9846o8865j4640K1909M930
$$ 23763 103435 52214 109951 124427 50601 74743 63811 163657 94792 80152 102061 106991
5237A06991m7289l8935J01179l1422l7955L0426L7133j4818N114k6702l2664k3143
$$ 106991 59702 20767 121946 90524 52569 82995 120128 105310 110424 83722 51058 27915
5225B7915L4741L9650L6688p0883J2872l7042R385J4056j0220q89m6357L3034
$$ 27915 62656 102306 138994 68111 80983 43941 53326 67382 57162 56273 9916 42950
5213D2950j5482j6204n4088J7337N6896O8391j5279l9987M2109N3408j46020n2321
$$ 42950 27468 11264 -42824 -25487 31409 99800 84521 44534 86643 140051 -5969 -58290
5201e8290P0516O1150L5029j38442O8576K9361Q064j3311K9737m909L0326l0193
$$ -58290 12226 73376 108405 -30037 38539 67900 75964 62653 92390 87481 117807 87614
5189H7614P578p060m3769n0834J9210J03659j04873n3784Q2843J23772j44942
$$ 87614 95192 88132 44363 -6471 12739 116398 11525 -42259 40584 164356 19414
5178A9414j8827M137J2416J22242n5089j11968Q5636o39R569J05786j13696K2246
$$ 19414 587 4724 17140 139382 84293 -27675 57961 57322 66891 172677 58981 81227
5166H1227k93K0737m0923o4831K5999K5878j2651M8775N99j8142l1134J3611Q8232
$$ 81227 80934 101671 60748 -4083 21916 47794 35143 83918 84517 66375 35241 48852 137084
5153A37084p359j8257n8465n5775J8812P8528m4317L2644l2264m4200j5672J41087
$$ 137084 129725 111468 53003 -2772 16040 94568 50251 82895 50631 6431 -9241 131846
5141A31846o344l3973p0453q0152O6507K2632M298J4688Q0776J2654q0544K4349
$$ 131846 125502 91529 21076 -59076 7431 30063 34361 49049 129825 142479 61935 86284
5129H6284R052j6596k2027L3851k99k919J409K0293p0594j8329O9651K0941k1514
$$ 86284 95336 78740 56713 90564 90265 87346 88755 109048 38454 20125 89776 110717 89203
5116H9203N689l2909N6648R793m2042m29J8401L6705m0714l6707r25J4169N9l7455
$$ 89203 94892 61983 118631 128424 86382 85953 104354 141059 100345 63638 62713 76882 76941 39486
5102C9486j5956L6755J9189k1120L4520j0986J0172N158n1902L9847j3245L8247
$$ 39486 23530 60285 79474 58354 92874 81888 92060 97218 45316 85163 71918 110165
5090A10165l6476m4152M4370j0778J5259l8384m1198J20975m4032K3668q0350
$$ 110165 73689 29537 73907 63129 78388 40004 -1194 119781 75749 99417 19067
5079A9067N8331L4865j6063n8099j4872M2671N5951K5972j9611l8331j6733l5091
$$ 19067 77398 112263 96200 38101 23229 65900 121851 147823 128212 89881 73148 38057
5067C8057j7246J5280P1242L1506j1746k0403K5276j3379l6935l7902m6582L8196
$$ 38057 20811 36091 107333 138839 127093 106690 131966 118587 81652 43750 -2832 35364
5055C5364L7978j4953O5493r1895L764L1099l8899M9545K0715M5717o9953L0963
$$ 35364 73342 58389 123882 31987 35751 66850 27951 77496 98211 143928 73975 104938
5043A04938r3120K4131L76k3176k8791L1011L4302n5608J03680m6867l2234M7984
$$ 104938 11818 35949 36325 13149 -15642 15369 49671 -5937 97743 50876 18642 66626
5031F6626Q22O0137n6172N4510q797o1388l2673K0416J2948N693K4745K5278n5999
$$ 66626 67448 127585 71413 125923 117126 55738 23065 43481 56429 62122 86867 112145 56146
5018E6146M0213O3951j7977k7584m2223k4050Q5594J5414m4437m3897k6888J13177
$$ 56146 96359 160310 142333 114749 72526 48476 134070 149484 105047 61150 34262 147439
5006A47439k0838k9357p525N2821L360l4966m8893N8814m9559l1961M2291J0348
$$ 147439 126601 97244 89719 142540 145900 110934 62041 120855 71296 39335 81626 91974
4994I1974O3399K3590L0936j11450N1644l268j9754L3757n9911J1647O5514j2255
$$ 91974 155373 178963 209899 98449 150093 146825 127071 160828 100917 112564 178078 165823
4982A65823K0118K0188K8666n6497l0281L6224l1408m7052K1794K3307J633j017
$$ 165823 185941 206129 234795 178298 148017 184241 152833 105781 127575 150882 152515 151498
4970A51498k9173R839L3313J6445o0612k602p007J8104o8844K7441R901Q2119
$$ 151498 122325 132164 165477 181922 121310 118708 111701 129805 60961 88402 98303 180422
4958A80422o6333N041P996k7982L9981q627R082l9000N7735R499l0616P9327q9759
$$ 180422 114089 119130 127126 99144 139125 130498 139580 100580 158315 167814 137198 216525 126766
4945A26766j139L035K2783L3599J9239N719j1254J4875j336j4024j575p4180l2970
$$ 126766 125627 128662 151445 185044 204283 210002 198748 213623 212287 198263 196688 122508 89538
4932H9538N9963l6020O8399o3539m291o0348O5080Q2128N062M8407l7433J4333
$$ 89538 149501 113481 181880 118341 114050 53702 118782 200910 205972 254379 216946 231279
4920B31279k5226k326L9169R149m3514K6318p235j14803J42845M2210q1190o9
$$ 231279 206053 203727 242896 252045 208531 234849 227614 112811 255656 297866 216676 216607
4908B16607M4947m691m5965l9162O0741O0945n8022M4498j2575m9523K7250n801
$$ 216607 261554 256863 210898 171736 232477 293422 235400 279898 267323 217800 245050 239249
4896B39249K8192k1089L7241J1569J3343J6755L1063k6859P6248p6365k7056Q249
$$ 239249 267441 246352 283593 295162 308505 325260 356323 329464 405712 329347 302291 310540
4884C10540J08081l5155q1568J4489M3526M1144r5228L542O8309j0365k7550K8952
$$ 310540 418621 383466 301898 316387 359913 401057 305829 309371 377680 367315 339765 368717
4872C68717m9253l6325P1230n9900k5599J16228J8299J7595o3087L5038K7123
$$ 368717 319464 283139 354369 294469 268870 385098 403397 420992 357905 392943 420066
4861D20066M0304N3617r2196k8516O8340l9732J0306Q9491M3088o7715J15741
$$ 420066 460370 513987 421791 393275 461615 421883 432189 521680 564768 497053 612794
4850F12794K815k7688K8882P5291j11587P8486L419O4526J47076N431J59111j48748
$$ 612794 615609 587921 616803 692094 580507 658993 662412 726938 874014 879445 1038556 889808
4838H89808O0274J23195l480L8808N5546N2004J7242J0362o445J3189r14m2552
$$ 889808 950082 1073277 1069797 1108605 1164151 1216155 1233397 1243759 1237314 1250503 1249589 1207037
4826A207037k5182l0801P245k9886l3017n8787p7410p5611j4772n4855j4381j1272
$$ 1207037 1181855 1151054 1158299 1128413 1095396 1036609 959199 883588 868816 813961 799580 788308
4814G88308j21422L7286j7713j889r1905L7566K4853l0675q9259L6403L2348q283
$$ 788308 666886 704172 686459 684570 592665 630231 655084 624409 535150 571553 603901 595618
4802E95618j0807o6470l2756J3037K7886J5370m0685M796M1514N7062q5238L6671
$$ 595618 584811 518341 485585 498622 526508 541878 501193 505989 547503 604565 519327 555998
4790E55998k5776N4978M7973q4099n3386L0882N6409j3710O398m6033M3178k8911
$$ 555998 530222 585200 633173 549074 495688 526570 582979 569269 575667 529634 572812 543901
4778E43901l5482O6436o1714n9455k1513M6302K570l4745Q8552L6871n302j3813
$$ 543901 508419 574855 513141 453686 432173 478475 481045 446300 534852 571723 566421 552608
4766E52608P0461q6958O0392n5338m9175l0604M2607O3278N611p940n8690p663
$$ 552608 623069 536111 596503 541165 491990 461386 503993 567271 572882 564942 506252 498589
4754D98589N8403J014k656L7077M9413j37178J1428K6261k1472m1893P4305K5548
$$ 498589 556992 558006 555350 592427 641840 504662 516090 542351 520879 478986 553291 578839
4742E78839n83m4134j0349m2633q598P5688J2386J5038k5054J0539m2510q3911
$$ 578839 578256 534122 523773 481140 472542 548230 560616 575654 550600 561139 518629 434718
4730D34718Q7812K0501k8379Q576n5249l0166O3938M7109j108j3595K8120L2609
$$ 434718 522530 543031 514652 523228 467979 437813 501751 548860 547752 534157 562277 594886
4718E94886l3498K73l521M181L413l9666L2502N1170m2661J671J8291n99P681
$$ 594886 561388 561661 558140 562321 565734 526068 558570 609740 567079 568750 587041 586442 594123
4705E94123j4275L5706M5374p5369k7094M2184J243n523O148k7885J8058J0279
$$ 594123 579848 615554 660928 585559 558465 600649 601892 596369 602517 574632 592690 602969
4693F02969K1425j9707M8957m9519O2857k2139m1155Q4807j1300j3130M8404j06
$$ 602969 624394 604687 653644 604125 666982 644843 603688 688495 677195 664065 712469 712363
4681G12363N1508N4764o0957o2081M9007R810p9988j1358J04249P2145n0489n981
$$ 712363 763871 818635 757678 695597 744604 754414 674426 663068 767317 839462 788973 782992
4669G82992M9203K7271J149k7543J3803K4862P509k0459M5099J7812L7629k161
$$ 782992 832195 859466 860615 833072 846875 871737 879246 858787 903886 921698 959327 957166
4657I57166M2557L9730m1846k0947N2132j2607M9465L0446n7727k6040M8689R4793
$$ 957166 999723 1039453 997607 976660 1028792 1016185 1065650 1096096 1038369 1012329 1061018 1155811
4645A155811k9381J5855Q950J2610L7401M5151L3343l952P1973k2280P8108L8086
$$ 1155811 1126430 1142285 1151235 1163845 1201246 1246397 1279740 1275788 1347761 1325481 1403589 1441675
4633A441675l1194O2294N0591J8734Q5763J816P8337L0311R4273O0745J5648Q5210
$$ 1441675 1410481 1472775 1523366 1542100 1627863 1629679 1708016 1738327 1832600 1893345 1908993 1994203
4621A994203J4009N9538N4211J40262J11484N5661J25528J16827J7085J49440
$$ 1994203 2008212 2067750 2121961 2262223 2373707 2429368 2554896 2671723 2688808 2838248
4611B838248J49522J15284J18128R8304J51314J21997J27151J83286K00249K45084
$$ 2838248 2987770 3103054 3221182 3319486 3470800 3592797 3719948 3903234 4103483 4348567
4601D348567J01009K04760J84915K12535K55839K88639K34560K59725L93791K34282
$$ 4348567 4449576 4654336 4839251 5051786 5307625 5596264 5830824 6090549 6484340 6718622
4591F718622L26580M21239L77464N16888M25841N33394M41773N80573O58782N01919
$$ 6718622 7045202 7466441 7843905 8360793 8786634 9320028 9761801 10342374 11001156 11503075
4581A1503075O44961O78529O60011P65093P84079P70915P16908Q60742P87596
$$ 11503075 12148036 12826565 13486576 14251669 15035748 15806663 16523571 17384313 18171909
4572A8171909Q50321Q75097P77078Q62535Q81611Q02324Q40987P05110N34369
$$ 18171909 19022230 19897327 20674405 21536940 22418551 23220875 24061862 24766972 25301341
4563B5301341N80802N35517M12811M90215M45463L36593K73348Q2631J41248m3754
$$ 25301341 25882143 26417660 26830471 27320686 27766149 28102742 28376090 28458721 28599969 28556215
4553B8556215l36162k80899l12719l99848m78754m02241n24167n58250o64720
$$ 28556215 28220053 27939154 27626435 27226587 26747833 26345592 25821425 25263175 24598455
4544B4598455p62607p80873q25445q28961r08514r71478q44157o85035r22309
$$ 24598455 23835848 23054975 22229530 21400569 20492055 19520577 18676420 17991385 17069076
4535A7069076p97374p86593p47436p41152p06415o84339o74612o18591n89705
$$ 17069076 16271702 15485109 14737673 13996521 13290106 12605767 11931155 11312564 10722859
4526A0722859o41292m97087m36304m58842l85522l86894m32451l97354k88853
$$ 10722859 10081567 9584480 9148176 8689334 8303812 7916918 7484467 7087113 6798260
4517F798260k92312j78651k46617l05051k01330k45096j41004k27392j42185j31669
$$ 6798260 6505948 6327297 6080680 5775629 5574299 5329203 5188199 4960807 4818622 4686953
4507D686953r4910j72535j57666q9913j42120j50460j11321l0706j27781j15899
$$ 4686953 4592043 4419508 4261842 4171929 4029809 3879349 3768028 3737322 3609541 3493642
4497C493642J7750r9502q9002j48551M3616n2865r6034k7701j0501r204j15847
$$ 3493642 3511392 3411890 3322888 3174337 3217953 3165088 3069054 3041353 3030852 3021648 2905801
4486B905801m8463m6689m4744k1313l8806m1873p0496l797p1629P7990J0013p6314
$$ 2905801 2857338 2810649 2765905 2744592 2705786 2663913 2593417 2589620 2517991 2595981 2605994 2529680
4474B529680J5410l5475n4491k9793M136l3599N9432K1693l8410M061m2787K171
$$ 2529680 2545090 2509615 2455124 2425331 2429467 2395868 2455300 2476993 2438583 2442644 2399857 2402028
4462B402028k1500r1787N0702M595J22014n315m3451k8380n6091O784P8029J5926
$$ 2402028 2380528 2288741 2339443 2344038 2466052 2460737 2417286 2388906 2332815 2339599 2417628 2433554
4450B433554J2044k0975O3349m8142k9951P836J6046M4522M1020l6172K0478K7022
$$ 2433554 2445598 2424623 2487972 2439830 2409879 2417715 2433761 2478283 2519303 2483131 2503609 2530631
4438B530631M4364J7369P6030l4009j2454R0993Q7649R0613K1722K436K5277O7116
$$ 2530631 2574995 2592364 2668394 2634385 2621931 2712924 2800573 2891186 2912908 2915344 2940621 3007737
4426C007737N8337M2840L6869n5194Q8521R4968K266P5309L9514O90M6736J31330
$$ 3007737 3066074 3108914 3145783 3090589 3179110 3274078 3276344 3351653 3391167 3391857 3438593 3569923
4414C569923m5660m0950O5816M9072Q5037Q8005M4011K7491j6009P4670O1820
$$ 3569923 3524263 3483313 3549129 3598201 3683238 3771243 3815254 3842745 3826736 3901406 3963226
4403C963226J23783L0948J1673O3439M7650O3673J23305j8413L3835J91581N0542
$$ 3963226 4087009 4117957 4129630 4193069 4240719 4304392 4427697 4409284 4443119 4634700 4685242
4392D685242J31212J54140J11947J80621J33984O6526J21541K95416K02896J35449
$$ 4685242 4816454 4970594 5082541 5263162 5397146 5463672 5585213 5880629 6083525 6218974
4382F218974K07725J98515J55671K14147K32929K04480L06588L08887K22490K83020
$$ 6218974 6426699 6625214 6780885 6995032 7227961 7432441 7739029 8047916 8270406 8553426
4372H553426L30667K40591L95462L89261K83148K38424M52285M67035M74355M46720
$$ 8553426 8884093 9124684 9520146 9909407 10192555 10430979 10883264 11350299 11824654 12271374
4362A2271374N12241N16915M86325N45003N97403O33431O80370P71369Q24160
$$ 12271374 12783615 13300530 13786855 14331858 14929261 15562692 16243062 17014431 17838591
4353A7838591P76563Q78281R92796R89288J052018J235081J321586J360245J495370
$$ 17838591 18615154 19493435 20486231 21475519 22527537 23762618 25084204 26444449 27939819
4344B7939819J667338J767287J930006K106709K192398K391789K554384K743376
$$ 27939819 29607157 31374444 33304450 35411159 37603557 39995346 42549730 45293106
4336D5293106K758016K916946K791588K711111K469212K285376J966970J617531
$$ 45293106 48051122 50968068 53759656 56470767 58939979 61225355 63192325 64809856
4328F4809856J132515O92507M59975n8903k70416m37716p33117r91706j344444
$$ 64809856 65942371 66634878 67094853 67035950 66765534 66327818 65594701 64602995 63258551
4319F3258551j481044j897038k235434k483696k698829k777117k784926k739884
$$ 63258551 61777507 59880469 57645035 55161339 52462510 49685393 46900467 44160583
4311D4160583k719155k511750k338791k115350k062672j825968j623928j581831
$$ 44160583 41441428 38929678 36590887 34475537 32412865 30586897 28962969 27381138
4303B7381138j338125j287230j139148r69808q85244q81758p72692n97028o43260
$$ 27381138 26043013 24755783 23616635 22646827 21761583 20879825 20107133 19510105 18866845
4294A8866845o83312m74135m72229l53872m80645l94098l59958k54592k54488
$$ 18866845 18183533 17709398 17237169 16883297 16402652 16008554 15648596 15394004 15139516
4285A5139516l71697k89643k48360j19779k06531k27567m3463o2511j62598r4747
$$ 15139516 14767819 14478176 14229816 14110037 13903506 13675939 13632476 13569965 13407367 13312620
4275A3312620m4185j10507k4759L9791k0291O2192K5235J38968N9604K47314J45171
$$ 13312620 13268435 13157928 13133169 13172960 13152669 13214861 13240096 13379064 13438668 13685982 13831153
4264A3831153K29884K18320K33006L94292L07634L50954K85247N29257O31933
$$ 13831153 14061037 14279357 14512363 14906655 15214289 15565243 15850490 16379747 17011680
4255A7011680N43971N78192O08905P04319P93310Q59609Q24839R01680R15913
$$ 17011680 17555651 18133843 18742748 19447067 20240377 21099986 21924825 22826505 23742418
4246B3742418R31531Q77542P74076O79220N30250M63076K53427J46411R7952O423
$$ 23742418 24673949 25551491 26325567 27004787 27535037 27998113 28251540 28397951 28495903 28502326
4236B8502326R8671J46771J48331K85987L45436M71980N86932P78779P73077Q73195
$$ 28502326 28600997 28747768 28896099 29182086 29527522 29999502 30586434 31365213 32138290 33011485
4226C3011485J016182J208130J279894J355446J564905J751958J924475K055346
$$ 33011485 34027667 35235797 36515691 37871137 39436042 41188000 43112475 45167821
4218D5167821K338648K523212K773909L012079L284893L572495L865296M063046
$$ 45167821 47506469 50029681 52803590 55815669 59100562 62673057 66538353 70601399
4210G0601399M357923M499728M583007M484680M347472L981112L601182K865927
$$ 70601399 74959322 79459050 84042057 88526737 92874209 96855321 100456503 103322430
4202A03322430K247505J609744J022586M66994M570k81532o96219p68212q87800
$$ 103322430 105569935 107179679 108202265 108669259 108673829 108392297 107696078 106927866 106040066
4193A06040066j216440j393160j674618j920488k251536k753935l057668l337088
$$ 106040066 104823626 103430466 101755848 99835360 97583824 94829889 91772221 88435133
4185H8435133l749962l872507l961471m132417m018983l869266l752788l563178
$$ 88435133 84685171 80812664 76851193 72718776 68699793 64830527 61077739 57514561
4177E7514561l381943k976773k823329k638239k336035k119129k041215j691129
$$ 57514561 54132618 51155845 48332516 45694277 43358242 41239113 39197898 37506769
4169C7506769j552281j431957j295437j112717j090533q30654p84579p14923m76119
$$ 37506769 35954488 34522531 33227094 32114377 31023844 30193190 29408611 28693688 28217569
4160B8217569n57520l65035l65571j94609j76791j37633j51975q6766j98736j23650
$$ 28217569 27660049 27295014 26929443 26734834 26558043 26420410 26268435 26181669 25982933 25859283
4150B5859283l20709l62335m47053o09241o92824o78099q28750q19662r04231
$$ 25859283 25538574 25176239 24729186 24119945 23427121 22749022 21920272 21100610 20196379
4141B0196379q88230q39806q67671p52615p07768o37800o75420n24788m85680
$$ 20196379 19308149 18468343 17600672 16848057 16140289 15502489 14827069 14302281 13816601
4132A3816601n06876l81356m76002l52742l29064l44043k87745l55949k53511
$$ 13816601 13309725 12928369 12452367 12099625 11770561 11426518 11138773 10782824 10529313
4123A0529313j96849k44244j21453k30991k34554j42446k51446r0518r7467k58325
$$ 10529313 10332464 10088220 9966767 9735776 9501222 9358776 9107330 9016812 8919345 8661020
4113H661020r0161j54529j59253r4381j19440j19625p3006m8104j01736p4747
$$ 8661020 8570859 8416330 8257077 8162696 8043256 7923631 7850625 7802521 7700785 7626038
4103G626038p4434j56117q1024l0490J547j5649o3717m9456n4672O290q2291q8711
$$ 7626038 7551604 7395487 7314463 7283973 7285520 7269871 7206154 7156698 7102026 7108316 7026025 6937314
4091F937314R98r4231n0884M0130j2907J6743P7105k4196m2172J03209K3183J07481
$$ 6937314 6938312 6844081 6793197 6833327 6820420 6837163 6914268 6890072 6847900 6951109 6974292 7081773
4079G081773M1237K7384K4424P3393J42897J9611J04250P4527J50120L6111J35006
$$ 7081773 7123010 7150394 7174818 7248211 7391108 7410719 7514969 7589496 7739616 7775727 7910733
4068G910733P2806Q0435J82585J53669R9917K02036J28859J30538K77633J27375
$$ 7910733 7983539 8063974 8246559 8400228 8500145 8702181 8831040 8961578 9239211 9366586
4058I366586K53940K91045J96572K96707L80383L69218L95384L74905M78815M27803
$$ 9366586 9620526 9911571 10108143 10404850 10785233 11154451 11549835 11924740 12403555 12831358
4048A2831358N21356N84062O47158O89580P28715P65402O99666P26893R54856
$$ 12831358 13352714 13936776 14583934 15273514 16002229 16767631 17467297 18194190 19149046
4039A9149046Q46214Q24937P24641O23013N28721O21459M56365L94725L40959
$$ 19149046 19995260 20820197 21544838 22167851 22696572 23318031 23774396 24169121 24510080
4030B4510080L46458K62950K20942L13831J86645O6221Q2939N2208k3351P9457
$$ 24510080 24856538 25119488 25340430 25654261 25840906 25907127 25990066 26042274 26018923 26098380
4020B6098380j7284J1426J69375K73816K54167M17135O03962O66104P70772Q03778
$$ 26098380 26081096 26092522 26261897 26535713 26789880 27207015 27810977 28477081 29247853 30051631
4010C0051631R70358J196410J294611J411892J623058J682903J906258K093853
$$ 30051631 31021989 32218399 33513010 34924902 36547960 38230863 40137121 42230974
4002D2230974K266913K453336K447256K654769K723454K734926K577423K629703
$$ 42230974 44497887 46951223 49398479 52053248 54776702 57511628 60089051 62718754
3994F2718754K395665K113866J808650J554714J341419J152225P94736N81756
$$ 62718754 65114419 67228285 69036935 70591649 71933068 73085293 73880029 74461785
3986G4461785M67024K91158J94797j81140l15837l60848l94550n70223n21285
$$ 74461785 74928809 75219967 75414764 75233624 74917787 74556939 74162389 73592166 73070881
3977G3070881m05653l21836k29186o3861Q9363K85506M58816L32834L81173L82141
$$ 73070881 72665228 72343392 72114206 72050345 72139708 72425214 72884030 73216864 73598037 73980178
3967G3980178J09377J29531j21288l39371m66521p32139q50922j068021j338823
$$ 73980178 74089555 74219086 74097798 73758427 73291906 72559767 71708845 70640824 69302001
3958F9302001j591859j738059j947281k151752k439275k580487k568944k467539
$$ 69302001 67710142 65972083 64024802 61873050 59433775 56853288 54284344 51816805
3950E1816805k530131k322175k279235k240629j978276j784091j611769j488020
$$ 51816805 49286674 46964499 44685264 42444635 40466359 38682268 37070499 35582479
3942C5582479j231826j139595r94798q36353p21350n94176m65268l58092j75473
$$ 35582479 34350653 33211058 32216260 31379907 30658557 30064381 29599113 29241021 29065548
3933B9065548j49951o7568K6988J64627J96479J37786K87005K61583K27152J72135
$$ 29065548 28915597 28848029 28875017 29039644 29236123 29373909 29660914 29922497 30149649 30321784
3923C0321784l7061P3427l8068k384r540n0463k9136j50828j46068k52997l52470
$$ 30321784 30284723 30358150 30320082 30317698 30308158 30257695 30228559 30077731 29931663 29678666 29326196
3912B9326196k13540l73408m82664m54510o04343o19323o42777o17624o18736
$$ 29326196 29112656 28739248 28256584 27802074 27197731 26578408 25935631 25318007 24699271
3903B4699271o26120m48292n52112m85435l64972l17161k63498j77642j09646
$$ 24699271 24073151 23624859 23072747 22587312 22222340 21905179 21641681 21464039 21354393
3894B1354393n4980o6061J41242K46477K00913L11262K46262M26894N83368O21702
$$ 21354393 21299413 21233352 21374594 21621071 21821984 22133246 22379508 22806402 23389770 24011472
3884B4011472N13712P89486Q42336Q41892R72639J166018J167187J377149J413575
$$ 24011472 24525184 25314670 26157006 26998898 27971537 29137555 30304742 31681891 33095466
3875C3095466J543283J789707J949304K095396K179833K325781K494260K618835
$$ 33095466 34638749 36428456 38377760 40473156 42652989 44978770 47473030 50091865
3867E0091865K607544K604771K585896K309674K178877J937423J741599J408627
$$ 50091865 52699409 55304180 57890076 60199750 62378627 64316050 66057649 67466276
3859F7466276R86181N61801P5025m50681q29857j302120j804213k162295k602430
$$ 67466276 68452457 69014258 69089283 68638602 67808745 66506625 64702412 62540117 59937687
3850E9937687k884375l073591l174514l131311k995001k895215k683737k519130
$$ 59937687 57053312 53979721 50805207 47673896 44678895 41783680 39099943 36580813
3842C6580813k378268k151964j804132j711959j592972j452394j336517j172492
$$ 36580813 34202545 32050581 30246449 28534490 26941518 25489124 24152607 22980115
3834B2980115j042188q57284q33406p33407p61671o77213n44354o46580m68919
$$ 22980115 21937927 21080643 20247237 19513830 18752159 18074946 17530592 16884012 16415093
3825A6415093m70900l60051l47137k88580k39742k82929k13368k23595j58415
$$ 16415093 15944193 15584142 15237005 14948425 14708683 14425754 14212386 13988791 13830376
3816A3830376j57847m2786j47170j56445r6776j79171k28261k00221k42924l70610
$$ 13830376 13672529 13629743 13482573 13326128 13229352 13050181 12821920 12621699 12378775 12008165
3806A2008165m21104l92268m06657k82014l48555l25430l21473l36104k07970
$$ 12008165 11587061 11194793 10788136 10506122 10157567 9832137 9510664 9174560 8966590
3797H966590l27979k94590k51240j44815j58548q2727j24109j71996j22093k1524
$$ 8966590 8638611 8344021 8092781 7947966 7789418 7706691 7582582 7410586 7288493 7266969
3787G266969j06904j29285p8677n4616j04677j33078l5598k9728j6319k7357j67609
$$ 7266969 7160065 7030780 6952103 6897487 6792810 6659732 6624134 6594406 6578087 6550730 6383121
3776F383121j1584l2681m9919o0538K3347L9461p8327P177N2560J8214r7332o2606
$$ 6383121 6371537 6338856 6288937 6228399 6251746 6291207 6212880 6220057 6272617 6290831 6193499 6130893
3764F130893m2483j6460n7045L997M9310l8981n9777m4194p808k5184K5404N1870
$$ 6130893 6088410 6071950 6014905 6018902 6068212 6029231 5969454 5925260 5917452 5892268 5917672 5969542
3752E969542K4197n2519k9594J8880J23161r6929M5365K2676J4362N3434j0653
$$ 5969542 5993739 5941220 5911626 5930506 6053667 5956738 6002103 6024779 6039141 6092575 6081922
3741F081922L87M0296l165O8430Q3454j3158J48786q48R7508J01842L4871L9230
$$ 6081922 6082309 6122605 6119440 6187870 6271324 6258166 6406952 6406104 6503612 6605454 6640325 6679555
3729F679555J20778J19307J14687J50144Q5379O4138J38881J76699P6650J63306
$$ 6679555 6800333 6919640 7034327 7184471 7269850 7333988 7472869 7649568 7726218 7889524
3719G889524J41737P9326K23983J22905J81267K41498L07878K79952K58897K61198
$$ 7889524 8031261 8110587 8334570 8457475 8638742 8880240 9188118 9468070 9726967 9988165
3709I988165L25757L48499L68156L72616L32005M28971M39566M45789M73415M26581
$$ 9988165 10313922 10662421 11030577 11403193 11735198 12164169 12603735 13049524 13522939 13949520
3699A3949520N32704N65818N50710N81276N47105O93485P65287O79850P64037
$$ 13949520 14482224 15048042 15598752 16180028 16727133 17420618 18185905 18865755 19629792
3690A9629792O65665O98150P55881Q06615R15527R05633J004012R97313J059797
$$ 19629792 20295457 20993607 21749488 22556103 23471630 24377263 25381275 26378588 27438385
3681B7438385J168969J238278J313107J466612J488621J623492J784596J835058
$$ 27438385 28607354 29845632 31158739 32625351 34113972 35737464 37522060 39357118
3673C9357118K009743K039302K199127K381522K483877K612280K827917K920437
$$ 39357118 41366861 43406163 45605290 47986812 50470689 53082969 55910886 58831323
3665E8831323L110626L335060L552899L892086M281857M667942N146522N602999
$$ 58831323 61941949 65277009 68829908 72721994 77003851 81671793 86818315 92421314
3657I2421314O205312O977346P795933Q598853R485903J0499781J1685269J2827938
$$ 92421314 98626626 105603972 113399905 121998758 131484661 141984442 153669711 166497649
3649A66497649J3899611J4940108J5719896J6038587J5419161J3336940R624794
$$ 166497649 180397260 195337368 211057264 227095851 242515012 255851952 265476746
3642B65476746M155728k617718q905014j3781128j6801235j8000560j7649836
$$ 265476746 269632474 267014756 258109742 244328614 227527379 209526819 191876983
3635A91876983j6575529j5142856j3555700j2136206j0893072r740808q745490
$$ 191876983 175301454 160158598 146602898 134466692 123573620 113832812 105087322
3628A05087322p815963p108011o260894n709961n049963m376587l909583l592958
$$ 105087322 97271359 90163348 83902454 78192493 73142530 68765943 64856360 61263402
3620F1263402l273933k952723k593989k391102k191661k108321k003416j843347
$$ 61263402 57989469 55036746 52442757 50051655 47859994 45751673 43748257 41904910
3612D1904910j720758j585283j663002j508930j453607j392008j271078j220482
$$ 41904910 40184152 38598869 36935867 35426937 33973330 32581322 31310244 30089762
3604C0089762j230584j090441j081341r60353r79699q88120r40673p81737p37524
$$ 30089762 28859178 27768737 26687396 25727043 24747344 23859224 22918551 22136814 21399290
3595B1399290p71179p75145p03608o63093n92314o73459o31227m73903n52348
$$ 21399290 20628111 19852966 19149358 18486265 17893951 17220492 16589265 16115362 15563014
3586A5563014o14615m99788l77418m88668l78942m11142l28413l60976l23775
$$ 15563014 14948399 14448611 14071193 13582525 13203583 12792441 12464028 12103052 11779277
3577A1779277l55015l46159k96266l27576j61978k20390k97232k33491k25599
$$ 11779277 11424262 11078103 10781837 10454261 10292283 10071893 9774661 9541170 9315571
3568I315571k77934k29837k35819l07674k01966k90514j99491j11005k78199j36059
$$ 9315571 9037637 8807800 8571981 8264307 8062341 7771827 7572336 7461331 7183132 7047073
3558G047073k22433j10673k74458j45362o6100n1841j96625j67818j56797j66907
$$ 7047073 6824640 6713967 6439509 6294147 6228047 6176206 5979581 5811763 5654966 5488059
3548E488059n9711j01649r5746k05940q6916o7640r5890k13720k6859j45224k9326
$$ 5488059 5428348 5326699 5230953 5025013 4938097 4870457 4774567 4560847 4533988 4388764 4359438
3537D359438j07861j65276n6577m6750j16286p5565j08507j17431m1742p0085
$$ 4359438 4251577 4086301 4029724 3982974 3866688 3791123 3682616 3565185 3523443 3453358
3527C453358o0097j13150o7081o8070K2938k9130j74498q0881o5453n4646j3445
$$ 3453358 3393261 3280111 3213030 3144960 3167898 3138768 2964270 2883389 2817936 2763290 2749845
3516B749845m2116l5745j02201J9823K9291r4802q139q4538j7905K8176J8405
$$ 2749845 2707729 2671984 2569783 2589606 2618897 2524095 2515956 2431418 2413513 2441689 2460094
3505B460094j03475K8623o6286J63j8516k4982l9590j6146q3115r4855K0168J2851
$$ 2460094 2356619 2385242 2318956 2319119 2300603 2275621 2236031 2219885 2136770 2041915 2062083 2074934
3493B074934n5328r3567L7704q9974j1670m1527J8931O4132q2377l5017o0746
$$ 2074934 2019606 1926039 1963743 1873769 1862099 1820572 1839503 1903635 1821258 1786241 1725495
3482A725495o8577n4734O9281L1360n1321j00293K0102O9536o3344J4891K3997
$$ 1725495 1656918 1602184 1671465 1702825 1651504 1551211 1571313 1640849 1577505 1592396 1616393
3471A616393L4712r7776L3742p8852l3985K5228l179n8064P2735L9553k2667l6883
$$ 1616393 1651105 1553329 1587071 1508219 1474234 1499462 1496283 1438219 1510954 1550507 1527840 1490957
3459A490957j76M4223q8562N461N5936M5782m3269o2376N4955r209j2303K2599
$$ 1490957 1490781 1535004 1446442 1451903 1507839 1553621 1510352 1447976 1502931 1493722 1481419 1504018
3447A504018N3476J6579n1377O1530K1963L5830O9P2587N3658P0006J10232j5502
$$ 1504018 1557494 1574073 1522696 1584226 1606189 1642019 1642088 1714675 1768333 1838339 1948571 1933069
3435A933069R9472K8901M2914J16441M319N6284j5506q1649m6397j4026j0725
$$ 1933069 2032541 2061442 2104356 2220797 2225116 2281400 2265894 2184245 2137848 2123822 2113097
3424B113097q2456m2908l5716j24251o9265j19757o8854o247q8946j08658p3534
$$ 2113097 2030641 1987733 1952017 1827766 1758501 1638744 1569890 1563643 1474697 1366039 1292505
3413A292505k3741o2691N312k5764J497n8460L0231n7700n6892m2903k4791j3842
$$ 1292505 1268764 1206073 1211385 1185621 1187118 1128658 1158889 1101189 1044297 1001394 976603 962761
3401I62761l638Q1383p9035k8352K1281p3228J7311o266r8971M5204n5543m9868
$$ 962761 959123 1040506 961471 933119 954400 881172 898483 892217 793246 838450 782907 733039
3389G33039N1296J3565l7409m3046o179k1135o7328K7472l1561l2245k4996M826
$$ 733039 784335 797900 760491 717445 711266 690131 622803 650275 618714 586469 561473 566299
3377E66299N4549l9043o0407k2687M2328o3563K0593Q8333q2240j2319M1544m4330
$$ 566299 620848 581805 521398 498711 541039 477476 498069 586402 504162 491843 533387 489057
3365D89057O3194p1441O1341J6807K7977l0035l5172K6272k7822m7595n8558N0462
$$ 489057 552251 480810 542151 558958 586935 556900 521728 548000 520178 472583 414025 464487
3353D64487J7602N624p4654Q2375R279m6863k1295p1011R6268N3397n4041J3058
$$ 464487 482089 487713 413059 495434 504713 457850 436555 365544 461812 515209 461168 474226
3341D74226k7366r7944j0191J9379K122K5939L9735k3125Q8061n4713p0135J6400
$$ 474226 446860 348916 338725 358104 360226 386165 425900 402775 490836 436123 365988 382388
3329C82388l7327j6724j3261O0138m6701O2027m7894K7710o7135R0376J523o1358
$$ 382388 345061 328337 315076 375214 328513 390540 342646 370356 303221 393597 395120 333762
3317C33762j0502k4286O1701J4553o6171K0865K2567l9618M9793n6602K3262J6696
$$ 333762 323260 298974 360675 375228 309057 329922 352489 312871 362664 306062 329324 346020
3305C46020J6317N8684m71q8473n5367J11514L8817P147r8075l5994N9227K0474
$$ 346020 362337 421021 420550 332077 276710 388224 427041 434188 336113 300119 359346 379820
3293C79820p4264l8268K8974k7205k1611L5898M5163R257k0823q9370o291O4444
$$ 379820 305556 267288 296262 269057 247446 283344 328507 337764 316941 227571 221280 285724
3281B85724K5675j38241M7609P7238j4487n148J1704p1551L1665j7397k2523M7496
$$ 285724 311399 173158 220767 298005 283518 278370 290074 218523 250188 232791 210268 257764
3269B57764L814m1418L404J12115o6668o2371O608M622l527L6954M4664L4176
$$ 257764 261578 220160 223564 335679 269011 206640 213248 217870 214343 251297 295961 330137
3257C30137n8041p928n6803J8137P7457k001J3219q2550K6847k1804J16357n2375
$$ 330137 272096 264168 207365 225502 302959 300958 314177 231627 258474 236670 353027 300652
3245C00652j7875L8341m8007n2611l8230M5160N5273o261q8834L4374K9180l3870
$$ 300652 282777 321118 273111 220500 182270 227430 282703 276442 187608 221982 251162 217292
3233B17292r5327M0721N4906M8166k2955n0730o9885O4592M6952K3970o7261O9119
$$ 217292 121965 162686 217592 265758 242803 192073 122188 186780 233732 257702 190441 259560
3221B59560J3387l4579L008q8559Q7136J1896L0253j01941j2539R434O1516L5709
$$ 259560 272947 238368 241376 152817 239953 251849 282102 180161 167622 177056 238572 274281
3209B74281j4951o9131j5172K5060J9600O1919j3335j06857L7828K5377j07971
$$ 274281 259330 190199 175027 200087 219687 281606 268271 161414 199242 224619 116648
3198A16648R1287k5802N9810L4950j1017j909o5096j7330l3885k0957Q057L3379
$$ 116648 207935 182133 241943 276893 265876 263967 198871 181541 147656 126699 134756 168135
3186A68135O131M2133J6490o2180m1309M2497j5375N124m2555K8592J3179j8954
$$ 168135 174266 216399 232889 170709 129400 171897 156522 161646 119091 147683 160862 141908
3174A41908J6589N4205p459j6768J1482o7438P4442m403J0326j4718J4724l1104
$$ 141908 158497 212702 205243 188475 199957 132519 206961 202558 212884 198166 212890 181786
3162A81786J973K542N3526k4575l7455m7079Q80O6422Q1449j995q4993n156n1012
$$ 181786 183759 186301 239827 215252 177797 130718 131598 198020 279469 277474 192481 187325 136313
3149A36313r835m5081R8508n250k132M7834L2540o4705J4532n921l4646M4449
$$ 136313 126478 81397 179905 174655 172523 220357 252897 188192 202724 196803 162157 206606
3137B06606J2647n486r925L5098J420K8259p038p46N070l5056L8417P4720J2632
$$ 206606 219253 213767 203842 238940 240360 268619 261581 260835 265905 230849 269266 343986 356618
3124C56618p3183N8592J5410J8892j5182o7729J0507L7892K7366K3019m6969L0002
$$ 356618 283435 342027 357437 376329 361147 293418 303925 341817 369183 392202 345233 375235
3112C75235P405j164O7617P356r324J5443N2492J08660Q284R3419m0535j18831
$$ 375235 382640 381476 449093 456449 447125 462568 515060 623720 632004 725423 684888 566057
3100E66057P4495L2240M9652K8950k0976K9518K4794O4311O6766l7924Q3027O5778
$$ 566057 640552 672792 722444 751394 730418 759936 784730 849041 915807 877883 960910 1026688
3088A026688j1282O6025K25658N2568N8866K2966O2821J12598R2450J0033R1615
$$ 1026688 1015406 1081431 1307089 1359657 1418523 1441489 1504310 1616908 1709358 1719391 1811006
3077A811006J43414J07694Q3330K32815J44669J58553K39166K91290L02031K81776
$$ 1811006 1954420 2062114 2145444 2378259 2522928 2681481 2920647 3211937 3513968 3795744
3067C795744J91040M12670M94511M72757N52086P35590Q70803J005460J246073
$$ 3795744 3986784 4399454 4893965 5366722 5918808 6654398 7525201 8530661 9776734
3058I776734J259790R91284K10966p72255j237976j439755j367422j104765p46979
$$ 9776734 11036524 12027808 12238774 11466519 10228543 8788788 7421366 6316601 5569622
3049E569622o00238m97117m84360l43706k07836l38186k75351k51724j91646j75504
$$ 5569622 4969384 4472267 3987907 3644201 3436365 3098179 2822828 2571104 2379458 2203954
3039B203954j77872j65331j6068j02084j14630j69967j8249j295j36337j09465
$$ 2203954 2026082 1860751 1844683 1742599 1627969 1458002 1439753 1438458 1302121 1192656
3029A192656p7384j9893p387j3581n4304l5441K1259j27378L8505o1932m5866
$$ 1192656 1115272 1095379 1087992 1074411 1020107 984666 1005925 878547 917052 855120 809254
3018H09254M7038m4467n3462m9673k9257k5026p0511K1357l0580q196k4821o7292
$$ 809254 856292 811825 758363 708690 679433 654407 583896 605253 574673 566477 541656 474364
3006D74364m5728m179p4453Q3959N233k881m2773o0784Q813j7416M0364p5918
$$ 474364 428636 424457 350004 433963 439196 436315 393542 332758 341571 324155 364519 288601
2994B88601j8126Q421K9034R5753j08522Q674m5868k3859K3430o3274K5231j0450
$$ 288601 270475 278896 307930 403683 295161 303835 257967 234108 257538 194264 219495 209045
2982B09045M0389K2653j1548K2663n371p405j04049l1516Q1152r940j963N369
$$ 209045 249434 272087 260539 283202 277831 270426 166377 134861 216013 206073 204110 209479
2970B09479R292k0470L700k1000k61N0197k4804j6173p0238K7609R9943j34054
$$ 209479 218771 198301 202001 181001 180740 230937 206133 189960 119722 147331 247274 113220
2958A13220K8362p4516J7782K2365o3801k1452J13375O4544q745p3279j6084K6986
$$ 113220 141582 67066 84848 107213 43412 21960 135335 199879 191134 117855 101771 128757
2946A28757P4391O910p2103m9035n1169M2565l0418r8171Q2505R4582m7292J7480
$$ 128757 203148 210058 137955 88920 37751 80316 49898 -48273 34232 128814 81522 99002
2934I9002n1527J2451n721L194m792Q9560L4802j1500J2537j26576m2637N1908
$$ 99002 47475 59926 54205 57399 52607 142167 176969 165469 178006 51430 8793 60701
2922F0701m9946L5076L2194K1426o7088J5660Q2288k4245r063k6864r204j1076
$$ 60701 10755 45831 78025 99451 32363 48023 130311 106066 97003 70139 60935 49859
2910D9859K8569O5541J1147l2081k0881O3974N820j2791j6287r6596j7705o874
$$ 49859 78428 143969 155116 123035 102154 166128 171948 159157 142870 46274 28569 21695
2898B1695L9518J8329k3441n9302J7301k3199O0189m0311K1547K616Q2463n4496
$$ 21695 61213 79542 56101 -3201 14100 -9099 51090 10779 32326 34942 117405 62909
2886F2909P049K0453r250j4905L4813m9466k2680L662L7744j9172k2246l656M5827
$$ 62909 69958 90411 81161 66256 101069 51603 28923 32585 70329 51157 28911 25255 71082
2873G1082M845l1070q7332P861Q0835j3001M0862l972K170j3352K4454j8953k8919
$$ 71082 75927 44857 -42475 -34614 46221 33220 74082 70110 72280 58928 83382 64429 35510
2860C5510m7194L4579O3242m8039m2804Q8604r3475K8887M9969O616n099R230
$$ 35510 -11684 22895 86137 38098 -4706 83898 -9577 19310 69279 75895 70796 80026
2848H0026k516M0189n0407N9444o4307j00438O3486k6035N3225N0324o3468m6713
$$ 80026 77510 117699 67292 126736 62429 -38009 25477 -558 52667 102991 39523 -7190
2836g190p966L8387p0879K9652N1328Q0736p9358J997J6484q0935N0004L4123
$$ -7190 -15156 23231 -47648 -17996 33332 114068 34710 36707 53191 -27744 22260 56383
2824E6383o4706K5760L5699o4686O273l3927P9637l5512k8318J00379o0243j9341
$$ 56383 -8323 17437 53136 -11550 -5277 -39204 40433 4921 -23397 76982 16739 -2602
2812b602K045l7416L574r9516N0171R0136R8731l8264p9606N1289j14678M2195
$$ -2602 -557 -37973 -34399 -133915 -83744 6392 105123 66859 -12747 38542 -76136 -33941
2800c3941Q9547P9o4494k3667L6784L5920O043L3972k9362n8708l0209M6697m7730
$$ -33941 55606 55685 -8809 -32476 4308 40228 46271 80243 50881 -7827 -38036 8661 -39069
2787c9069Q069Q155p238L1426l8870P018M0687j9594K2176J7320P7261q9013l2084
$$ -39069 -31000 -22845 -30083 1343 -37527 -30509 10178 -9416 12760 30080 107341 18328 -13756
2774a3756m428M0146n7108m0286J35648m6784L9399J7261k6079n2165M1788k0216
$$ -13756 -18184 21962 -35146 -75432 60216 13432 52831 70092 44013 -8152 33636 13420
2762A3420j9334M0434l8746j3279P2446m2463q3559J0894K6192j390N3190p0770
$$ 13420 -5914 34520 -4226 -17505 54941 12478 -71081 -60187 -33995 -35385 17805 -52965
2750e2965N6224M478j0482J0188k6929j656O7840l1871m814R792m7559j9k9827
$$ -52965 3259 7737 -2745 7443 -19486 -21142 46698 14827 10013 19805 -27754 -27773 -57600
2737e7600O5564k320o1297M5615J9052j9153N6291j4431r784M3970r8313m9382
$$ -57600 7964 5644 -55653 -10038 9014 -10139 46152 31721 21937 65907 -32406 -81788
2725h1788K5913N2790J1577m1077O0642Q995m7044K4866l5721o2845R8602J5837
$$ -81788 -55875 -3085 8492 -32585 28057 37052 -9992 14874 -20847 -83692 14910 30747
2713C0747q258J9281l1285K5548l7865j0412k803P7187J9106l5951l8720j8133
$$ 30747 22489 41770 10485 36033 -1832 -12244 -15047 62140 81246 45295 6575 -11558
2701a1558n0833l3707M6597J04397L26o3985P1475o9111L993J11436l6408n7270
$$ -11558 -62391 -96098 -49501 54896 55222 -8763 62712 -6399 -2406 109030 72622 15352
2689A5352O600K3178j734r734j4681L17m9876o562r1181P7640K0798o163P966
$$ 15352 21952 45130 43396 33662 18981 19298 -30578 -37140 -128321 -50681 -29883 -36046 -28080
2676b8080L2630l3780j5581M5946j7010K0238n8699L7087J5736k5384K0645K3802
$$ -28080 4550 -29230 -44811 1135 -15875 4363 -54336 -17249 -1513 -26897 -6252 17550
2664A7550N2114J929o0737k0498P6669l0583q3331M7358l1422Q128K8137k1384
$$ 17550 69664 71593 10856 -9642 67027 36444 -46887 471 -30951 -22823 5314 -16070
2652a6070q160r871J5853Q2533n9147l1453j9446M5674J6768p5687N3315P2917
$$ -16070 -24230 -34101 -18248 64285 5138 -26315 -45761 -87 16681 -59006 -5691 67226
2640F7226p3215n517J6292N251o3351K8666M6320O224J0429K8053p8416K885P2135
$$ 67226 -5989 -11506 4786 10037 -53314 -24648 21672 27896 38325 66378 -12038 -9153 62982
2627F2982l1009N6972l3631k3356j4831J2654K3643r6163j0655O326R7046J8281
$$ 62982 31973 88945 55314 31958 17127 29781 53424 -42739 -53394 -47068 49978 68259
2615F8259o7907m8301j8855N2932K2962N5681l6993l7487K3409j2325l0711R5245
$$ 68259 352 -47949 -66804 -13872 9090 64771 27778 -9709 13700 1375 -29336 65909
2603F5909k7818n4471K984l5787l8089K0764J0507J4441P3748J4926k7709n6795
$$ 65909 38091 -16380 -13396 -49183 -87272 -66508 -56001 -41560 32188 47114 19405 -37390
2591c7390l0970L8408J23993o7585n7938k203J4234L8297O2703j7314j8735j1970
$$ -37390 -68360 -29952 94041 26456 -31482 -33685 -19451 18846 81549 64235 45500 33530
2579C3530k3890J7932k2498K4153J7685o2728p218n8498O1399o5246m0940J20150
$$ 33530 9640 27572 5074 29227 46912 -15816 -23034 -81532 -20133 -85379 -126319 -6169
2567f169m0268N3663l4173o4316j4912M1451L9973l0433N3814L248r8608o45L7874
$$ -6169 -46437 7226 -26947 -91263 -106175 -64724 -24751 -55184 -1370 1878 -96730 -97375 -59501
2554e9501P5043k2481K5851L7317J901r968k7752j2336J3793q1002k249J4395
$$ -59501 15542 -6939 18912 56229 58130 48162 20410 8074 21867 -59135 -61384 -46989
2542d6989J4280K1946j13687L7184O5017m1938n1308Q5168l1706J5743N5173L1862
$$ -46989 -32709 -10763 -124450 -87266 -22249 -64187 -115495 -30327 -62033 -46290 8883 40745
2530D0745M683J872r0900Q4513M6833j20138N2797k337k3713J402M4868q279l9290
$$ 40745 45428 47300 -43600 40913 87746 -32392 20405 18068 -5645 -4243 40625 32346 -6944
2517f944k4621o9965L0011Q7677o3430L300K5079M793M6649j50234j4599Q6267
$$ -6944 -31565 -101530 -71519 16158 -47272 -43972 -18893 -14100 32549 -117685 -132284 -46017
2505d6017N8943k2506p1924R4351M8018n9015l5669P4820N5127k7622m3089J2642
$$ -46017 12926 -9580 -81504 12847 60865 1850 -33819 41001 96128 68506 25417 38059
2493C8059o9289L3237o2797J4642P6833m2306L0191L5833m8668J4253k6967k2480
$$ 38059 -31230 2007 -60790 -46148 30685 -11621 18570 54403 5735 19988 -6979 -29459
2481b9459m1077j274J4333R6065k7904l4699P8989o5949k0135L8785q02M4551
$$ -29459 -70536 -71810 -57477 38588 10684 -24015 54974 -10975 -31110 7675 6873 51424
2469E1424p6550p4707J42721M3616j4119j05173j9074N8685j2332K384j5541J1286
$$ 51424 -25126 -99833 42888 86504 72385 -32788 -51862 6823 -5509 -3125 -18666 -7380
2457g380l2522M3813R999l0452L5729m410K3846j6447L1146N2185q15j06368j03682
$$ -7380 -39902 3911 13910 -16542 19187 14777 38623 22176 53322 105507 104692 -1676 -105358
2444a05358J05527Q2138o4135L2594K3699n7273k3175r6871K0344P7545J4573
$$ -105358 169 82307 18172 50766 74465 17192 -5983 -102854 -82510 -4965 9608
2433I608O0576l4929j23508L9960j2210J0706L5452p070n7331o306n2536J16795
$$ 9608 70184 35255 -88253 -48293 -60503 -49797 -14345 -21415 -78746 -85052 -137588 -20793
2421b0793n3541l8512M4224Q0367K3356p4338L1378j1222K5925R656O370j9782
$$ -20793 -74334 -112846 -68622 11745 35101 -39237 -7859 -19081 6844 16500 22870 3088
2409C088m8535N8791j5940o4672m217j1323J2423L4085P4272o3182l6730k9582
$$ 3088 -45447 13344 -2596 -67268 -71485 -82808 -70385 -36300 37972 -25210 -61940 -91522
2397i1522J03501o9101N6232l6917L4812J1899m1343M4412o24l8256j3636J8028
$$ -91522 11979 -57122 -890 -37807 -2995 8904 -32439 11973 11349 -26907 -40543 -22515
2385b2515L9625l7180J5117J7426k8267o7173P8946l0040J0710j2820M7278j4686
$$ -22515 17110 -20070 -4953 12473 -15794 -82967 -4021 -34061 -23351 -36171 11107 -3579
2373c579j0955L3463p4012M2940m6805L2099P1903o6907j02468M9596K4739p663
$$ -3579 -14534 18929 -55083 -12143 -58948 -26849 45054 -21853 -124321 -74725 -49986 -57649
2361e7649p632P6636n1877P733J9939Q838J1702R424p7735N1149m040j1308L8951
$$ -57649 -65281 11355 -40522 -32789 -12850 -4012 7690 17114 -60621 -9472 -13512 -24820 14131
2348A4131r3042N6523l9799l220k27L2140m0693L1063L516K8164L4695p669k3668
$$ 14131 -78911 -22388 -62187 -65407 -65634 -33494 -74187 -43124 -39608 -11444 23251 15582 -8086
2335h086M4385k2066j4026l9448R612R58n1688K6452J4457K455n692L4068N8103
$$ -8086 36299 14233 207 -39241 -29629 -28671 -80359 -53907 -39450 -36995 -42687 -8619 49484
2322D9484m4218k6401M0609J4201j7489r3k6893p9276N2398Q4409j8779m9883
$$ 49484 5266 -21135 19474 33675 16186 16093 -10800 -90076 -37678 46731 27952 -21931
2310b1931L1119j3436N5998O1887K6433l3315j7800n6142j9362r5940L674R4179
$$ -21931 9188 -4248 51750 113637 140070 106755 88955 32813 13451 -82489 -78815 15364
2298A5364m4907M2282O3237n5957n8278j1884Q8728r9474J9732K7033n3360j6371
$$ 15364 -29543 12739 75976 20019 -38259 -50143 38585 -60889 -41157 -14124 -67484 -83855
2286h3855K1337L5500K4172J7427m7912K6694K8024k372o532N241J4375o6568
$$ -83855 -62518 -27018 -2846 14581 -33331 -6637 21387 19015 12483 17724 32099 -34469
2274c4469r810L7430l0328j6311k4470N0492O7710o5749k7958O640L7234K158
$$ -34469 -44279 -6849 -37177 -53488 -77958 -27466 40244 -25505 -53463 -46823 -9589 -7431
2262g431k4078M124N9406m5720J37634j61628Q858N364k6208L6404m370j7180
$$ -7431 -31509 -27385 32021 -13699 123935 -37693 -28835 -23471 -49679 -13275 -17645 -34825
2250c4825k1475l2365k9419O406O2717k7390k4522P6079j8334K1152K1992k2935
$$ -34825 -56300 -88665 -118084 -111678 -48961 -76351 -100873 -24794 -43128 -21976 16 -22919
2238b2919m1077P5477L2525n2168j3818k4863k6740N3440m1356N6214J01664m0254
$$ -22919 -63996 11481 44006 -8162 -21980 -46843 -73583 -20143 -61499 -5285 96379 56125
2226E6125r0622n4431L3163k7472K8921M7508M8416o9002j7429N4063K1216l3551
$$ 56125 -34497 -88928 -55765 -83237 -54316 -6808 41608 -27394 -44823 9240 30456 -3095
2214c095m6075J3789j06025R0378j8405O2205P259p2377j4689N5056Q3987K6822
$$ -3095 -49170 -35381 -141406 -51028 -69433 -7228 31 -72346 -87035 -31979 52008 78830
2202G8830m2426m962k1566j980K0491m3799k8960M4285o5030L5636r8485N0204
$$ 78830 36404 31442 9876 7896 28387 -15412 -44372 -87 -65117 -29481 -127966 -77762
2190g7762R1130j0979n902O1158n8359n772k9223l8468N9879m8509N9737J742
$$ -77762 13368 2389 -3513 57645 -714 -6486 -35709 -74177 -14298 -62807 -3070 -1328
2178a328j02433N3190K1420M8258j7587l0539J6112r315O4681O382p7735k1344
$$ -1328 -103761 -50571 -29151 19107 1520 -29019 -12907 -22222 42459 48841 -28894 -50238
2166e0238J9417K225k1417O3118k2639L4872L7086o7627k9428L6058P6601j6495
$$ -50238 -30821 -28596 -50013 13105 -9534 25338 62424 -5203 -34631 1427 78028 61533
2154F1533j37767K1722P9325k8040m4889M1487p14l2028n1149Q5233L3752o1976
$$ 61533 -76234 -54512 24813 -3227 -48116 -6629 -7343 -39371 -90520 -5287 28465 -33511
2142c3511l4862l8287j3188P7002M7350n658N7587k7832m5628l0905M4820K7301
$$ -33511 -68373 -106660 -119848 -42846 4504 -1154 56433 28601 -17027 -47932 -3112 24189
2130B4189l2316k5685O5592k0133N7059J6154j25608l9026M6876n5287m4623Q9467
$$ 24189 -8127 -33812 31780 11647 68706 84860 -40748 -79774 -32898 -88185 -132808 -43341
2118d3341K1815r7858R9039K2194N9902r1486P1324M4013j05743m2026o304j7621
$$ -43341 -21526 -119384 -20345 1849 61751 -29735 41589 85602 -20141 -62167 -68471 -86092
2106h6092m7393Q9727m3779j3384J54705n5210o409j229k822N1344m2798o7194
$$ -86092 -133485 -43758 -87537 -100921 53784 -1426 -7835 -9064 -11886 39458 -3340 -70534
2094g0534J5013K525L9314J2667o2707m905N4244L6154o2977K4622L9195L0794
$$ -70534 -55521 -52996 -13682 -1015 -63722 -68627 -14383 21771 -41206 -16584 22611 53405
2082E3405k3337o4046n1260J6165J11312q2539m72K5433J1582l0203l7955j6865
$$ 53405 30068 -33978 -85238 -69073 42239 -40300 -40772 -15339 -3757 -33960 -71915 -88780
2070h8780J4985L9855K9344k7587k7136J0324L0250M1859j3953k3987k790J7043
$$ -88780 -73795 -33940 -4596 -32183 -59319 -48995 -18745 23114 9161 -14826 -17616 -573
2058e73O082p283M6778l8363l6841l9089J1593Q8578J0841j5538j031l4850m024
$$ -573 5509 -1774 45004 6641 -30200 -69289 -57696 30882 41723 26185 25154 -9696 -13720
2045a3720N160l7147J136L5976k0152l3264L9001m3633k112K899o537n910L1762
$$ -13720 -8560 -45707 -44571 -8595 -28747 -62011 -23010 -66643 -68755 -65856 -72393 -78303 -46541
2032d6541K5659k6548q178k7664R484J00823J2062p2770Q265O2678m4418J8350
$$ -46541 -20882 -47430 -55608 -83272 -73788 27035 39097 -33673 -25408 37270 -7148 11202
2020A1202m1726K7878J00193k2743r628m3305J4181L3382l2745l0686o0104M8969
$$ 11202 -30524 -2646 97547 74804 65176 21871 36052 69434 36689 6003 -54101 -5132
2008e132l9130Q25K7155O4309k3470J077n1231k3108P4635j0925k4737o961Q357
$$ -5132 -44262 -43437 -16282 48027 24557 25634 -25597 -48705 25930 15005 -9732 -16693 -8336
1995h336j0867j3191L8249O0285j01287J4886L7327K8776n130n2325K0021K383
$$ -8336 -19203 -32394 5855 66140 -35147 -20261 17066 45842 40712 -11613 8408 10791
1983A0791J0003l4029l2421R2605K4513j6603k9905o0984K5550q545r9721K4210
$$ 10791 20794 -13235 -45656 46949 71462 54859 24954 -36030 -10480 -19025 -118746 -94536
1971i4536M3391R8691k0366k4540K0344k4792P5168j4982m589l0288J0438o499
$$ -94536 -51145 47546 27180 2640 22984 -1808 73360 58378 53789 23501 33939 27440
1959B7440n1280o183j0297O9412q5973j9579J14768j1950P628O063K8945N174
$$ 27440 -23840 -30023 -40320 29092 -56881 -76460 38308 26358 33986 40049 68994 74168
1947G4168q4386P732Q371j05469K1828R9425M819o8410L2083N1458j0026o1821
$$ 74168 -10218 -2486 5885 -99584 -77756 21669 26488 -41922 -9839 41619 31593 -30228
1935c0228M2220l1021p5829O9829J17223m8284J6938l5821k0590m2396L0638j1682
$$ -30228 11992 -19029 -94858 -25029 92194 43910 60848 25027 4437 -37959 -7321 -19003
1923a9003l433L8848q4584m2212P8430O2687r5585K3127O3959K9857l5236p6940
$$ -19003 -22436 16412 -68172 -110384 -31954 30733 -64852 -41725 22234 52091 16855 -60085
1911f0085Q4344L1679l3680l9512m3018L3776J8151l0211J6778K9182o6036N4310
$$ -60085 24259 55938 22258 -17254 -60272 -26496 -8345 -38556 -21778 7404 -58632 -4322
1899d322j9408O002p641K8523O4705L0369j2226o9689j0938M4238N1794r1162
$$ -4322 -23730 -17728 -25369 3154 67859 98228 86002 16313 5375 49613 101407 10245
1887A0245k0790m033k7213k1235M1390j282l6504J3742K115P0909k7491k3463
$$ 10245 -10545 -14578 -41791 -63026 -21636 -22918 -59422 -45680 -43565 27344 -147 -23610
1875b3610J2758O0763K5257p7579n4789P5098k456n7560M8054K57L0628m7229
$$ -23610 -10852 49911 75168 -2411 -57200 17898 15442 -42118 5936 6193 36821 -10408
1863a0408l5492L3180k0454J860j0201J01447o8560k12O1835q7344o2820L6115
$$ -10408 -45900 -12720 -33174 -31314 -41515 59932 -8628 -8840 52995 -34349 -97169 -61054
1851f1054L6832M2620r020K3629P17q5206P552L2671N3824o371M7897L7100N108
$$ -61054 -24222 18398 9378 33007 33724 -51482 -43930 -11259 42565 36194 84091 121191 126299
1838A26299j22027m0490N1754l2466q086q92L5439n111J8664p092K9030j13194
$$ 126299 4272 -36218 15536 -16930 -25016 -25908 9531 4420 23084 15992 45022 -68172
1826f8172J7571m466K0751L3443o5336O3986j9497o0445L7850p559p6336P7525
$$ -68172 -50601 -55067 -34316 -873 -66209 -2223 -21720 -82165 -44315 -51874 -128210 -50685
1814e0685P0456j9785Q7687j9099j1712l6561l9622n4333K1138r057L3896P5066
$$ -50685 19771 -14 87673 68574 56862 20301 -19321 -73654 -52516 -61573 -27677 47389
1802D7389m5534K5446j9651l8147L0777K6573q9881M7111K1806l1427M8078J4200
$$ 47389 1855 27301 7650 -30497 280 26853 -63028 -15917 5889 -25538 22540 36740
1790C6740O285n8344j8363N1513j8965n3844q69J11806Q866j6011J0618q79l0176
$$ 36740 43025 -15319 -33682 17831 -1134 -54978 -55847 55959 64825 48814 59432 58553 28377
1777B8377n8241K0228J434O0324j3927k0374m2831m6689j0148N5934K8841q963
$$ 28377 -29864 -9636 -8202 52122 38195 17821 -25010 -71699 -81847 -25913 2928 -6035
1765f035N0156l3005m7190O098P3405n3518J2412J5565n2771j2589l3724O0540
$$ -6035 44121 11116 -36074 -29976 43429 -10089 2323 17888 -34883 -47472 -81196 -20656
1753b0656l5417M7980K1037q432M891l4273L4037n2147L2367k7507k6200l0700
$$ -20656 -56073 -8093 12944 4512 9403 -24870 9167 -42980 -10613 -38120 -64320 -95020
1741i5020M8086R2872P4674j44538J0707K5983j3595N857r244P347M4559m9460
$$ -95020 -46934 45938 120612 -23926 -13219 12764 -831 5026 -4218 3129 47688 -1772
1729a772K568r3211N2945K5315p5831N0930J4042L2206k3219q067O5575k2238
$$ -1772 796 -92415 -39470 -14155 -89986 -39056 -25014 7192 -16027 -24094 41481 19243
1717A9243l2696l816n5877N1283Q989O413L5158l6488r35O4277j47248N3136j2808
$$ 19243 -13453 -17269 -73146 -21863 -12874 -6461 28697 -7791 -8726 55551 -91697 -38561 -51369
1704e1369J0781K7865j441O6546k0871N0405K2830l3557m3519k7869k0598M6308
$$ -51369 -40588 -12723 -14164 52382 31511 81916 104746 71189 27670 -199 -20797 25511
1692B5511j1536J820j5242k9502q991j9855J0897J8135K3756J6886L4833J9089
$$ 25511 13975 15795 553 -28949 -37940 -57795 -46898 -28763 -5007 11879 46712 65801
1680F5801K6107p655r2566o1701o2996N0150J3940J03080R1531o2986n0298k146
$$ 65801 91908 84253 -8313 -70014 -133010 -82860 -68920 34160 125691 62705 12407 10261
1668A0261L0161m8533q117R0569m7894l8435o6827J2552O3498r6159n129M7344
$$ 10261 40422 -8111 -16228 74341 26447 -11988 -78815 -66263 -2765 -98924 -104053 -56709
1656e6709K4246J3433N8984p1030O0974l1797k930N283n8501n6903L2975j6285
$$ -56709 -32463 -19030 39954 -31076 29898 -1899 -4829 454 -58047 -114950 -81975 -98260
1644i8260L7440l7281n689J4609K5136K5838P6569M168j5090k534r8412j2933
$$ -98260 -60820 -98101 -103790 -89181 -64045 -38207 38362 42530 27440 24906 -73506 -86439
1632h6439Q9796K2963R442Q890o4638L0880l9889M0394M3967l2464l5254N1199
$$ -86439 3357 26320 35762 44652 -19986 10894 -28995 11399 55366 22902 -12352 38847
1620C8847q7194l4095Q2283n1084L6827M721m4532O0827M2495l8924o8868K9270
$$ 38847 -48347 -82442 -159 -51243 -14416 -9695 -54227 6600 49095 10171 -58697 -29427
1608b9427l2768N5349N5484n3864m1542R8391q3598j3192O690K0675l1287L0918
$$ -29427 -62195 -6846 48638 -5226 -46768 51623 -31975 -45167 -38477 -17802 -49089 -18171
1596a8171l044m5174K5411k1415N2210J5143j7580l6175M1523r812q4154M2097
$$ -18171 -21215 -66389 -40978 -62393 -10183 4960 -12620 -48795 -7272 -17084 -101238 -59141
1584e9141P2421J054J5483J6854M9456l3139k4632k8655n0708O7946J0583k3492
$$ -59141 13280 14334 29817 46671 96127 62988 38356 9701 -41007 26939 37522 14030
1572A4030q2769O8981K8156J492o3446j468M0112o5081K4736p1906q5P4618L2041
$$ 14030 -68739 242 28398 29890 -33556 -35024 5088 -59993 -35257 -107163 -107248 -32630 -589
1559e89L1484K4343j17656k8745J04992n8572j06228J07298L7733R1097n0723
$$ -589 30895 55238 -62418 -91163 13829 -44743 -150971 -43673 -5940 85157 34434
1548C4434j83m801J676J1431O665j687o4038o8672L0845L6820q977n6587J9707
$$ 34434 34251 29450 31126 42557 49222 47535 -16503 -85175 -54330 -17510 -26487 -83074 -63367
1535f3367K0704K021M9215k1556k0984J9055l277K3779k5373l0242p3124M6424
$$ -63367 -42663 -40642 8573 -12983 -33967 -14912 -18189 5590 -19783 -50025 -123149 -76725
1523g6725K4532N9150R339n4868j4590n0921L0141M2058Q29M1217j9883N857N870
$$ -76725 -52193 6957 16296 -38572 -53162 -104083 -73942 -31884 -31055 10162 -9721 -3864 2006
1510B006N347R037n1904J6816n32l3412R97O513K1688j851P5850j4438k9420J7503
$$ 2006 7353 16390 -35514 -18698 -19230 -52642 -51645 -45132 -23444 -25295 50555 36117 6697 24200
1496B4200P957p870n6835K4456j9917L4746P11n5802o8503N931L9837M9831j03297
$$ 24200 32157 24287 -32548 -8092 -28009 6737 7448 -48354 -116857 -110926 -71089 -21258 -124555
1483a24555Q620j434K9686Q8636P0403n5300J5483k5m9640k0249O0161N2078l8383
$$ -124555 -115935 -117369 -87683 953 71356 16056 31539 31514 -18126 -38375 21786 73864 35481
1470C5481p0526L7826j7374o1967j7729M1015M4670J3950l9381j3832m900m5314
$$ 35481 -35045 2781 -14593 -76560 -94289 -53274 -8604 5346 -34035 -47867 -52767 -98081
1458i8081L4369P6500j41528L1673K9164j4334P399J6204J03508q7076N5348j02690
$$ -98081 -63712 12788 -128740 -97067 -67903 -82237 -74838 -58634 44874 -42202 13146 -89544
1446h9544m9030l402R2575K9120j1877J8957k7030L2154o284J7231p1819M9104
$$ -89544 -138574 -141976 -49401 -20281 -32158 -13201 -40231 -8077 -14361 2870 -68949 -19845
1434a9845L5815k6675n6106N4430l1821J549O537k9483j4170L7071Q8911j5923
$$ -19845 15970 -10705 -66811 -12381 -44202 -42653 -36116 -65599 -79769 -42698 46213 30290
1422C0290o5336J8902J4016o640n757O9442q2471m3824O7425L7521j6923l3931
$$ 30290 -35046 -16144 -2128 -8768 -14525 54917 -27554 -71378 -3953 33568 16645 -17286
1410a7286l6994J4561J1112k8521j9289R9892p223o2944P8542L6870k8784m8148
$$ -17286 -54280 -39719 -28607 -57128 -76417 23475 16252 -46692 31850 68720 39936 -8212
1398h212j0097n6453O0733J04317J2197l9382m6664k7873N7194p4284N0028j3633
$$ -8212 -18309 -74762 -14029 90288 102485 63103 16439 -11434 45760 -28524 21504 7871
1386G871o4067k1624M625J1394M8459J66l9034K0608L3525k3003n7558M5755l419
$$ 7871 -56196 -77820 -73195 -61801 -13342 -13176 -52210 -31602 1923 -21080 -78638 -32883 -36302
1373c6302j8699O1636j4079O7676k9010r2215N5625R331L5936K7946o7014L9085
$$ -36302 -55001 6635 -7444 60232 31222 -60993 -5368 3963 39899 67845 831 39916
1361C9916o6101m4803k3797R316J25836P0228k1335n8101j23820k4131P6858P5619
$$ 39916 -26185 -70988 -94785 -85469 40367 110595 89260 31159 -92661 -116792 -39934 35685
1349C5685j7064K0378J918p5032L8095K8773J533K7110l8076k9567o180M3400
$$ 35685 18621 38999 40917 -34115 3980 32753 34286 61396 23320 -6247 -12427 30973
1337C0973P440M4876J6806o7088K1259k4526q336j3751l8191j9853J15303l3905
$$ 30973 38413 83289 100095 33007 54266 29740 21404 7653 -30538 -50391 64912 31007
1325C1007l8678P9945j21107L1589P0343J6457j2420j5720J445n1154K4703p723
$$ 31007 -7671 72274 -48833 -17244 53099 69556 57136 41416 42861 -8293 16410 8687
1313H687o4573L7117k1076J23503r313R859J6448k0525r2639k2238L1490m683
$$ 8687 -55886 -18769 -39845 83658 74345 84204 100652 80127 -12512 -34750 -3260 -7943
1301g943J4349P2219k9961L4857K8091o2818P345k2092j3375j1023L4683R13l2432
$$ -7943 6406 78625 48664 83521 111612 48794 56139 34047 20672 9649 44332 45245 12813
1288A2813k5949r556K3404K4331K193l6081n5539J3419O9609L3289R428p7937
$$ 12813 -13136 -22692 712 25043 27236 -8845 -64384 -50965 18644 51933 61361 -16576
1276a6576m7534n8249M3626Q5323p1073J14038p4742J8067Q1362L0012p4099N1874
$$ -16576 -64110 -122359 -78733 6590 -64483 49555 -25187 -7120 74242 104254 30155 82029
1264H2029J4255m0399n873k4173j6401m2199J4755L3924n5L2189p6356K4494J1764
$$ 82029 96284 55885 50012 25839 9438 -32761 -18006 15918 15863 48052 -28304 -3810 7954
1251G954J1469O050P0492p1964k0454k8540L0970Q539k0502M2367p600p7375L9777
$$ 7954 19423 25473 95965 24001 3547 -24993 5977 14516 -5986 36381 28781 -48594 -8817
1238h817N6915M0107n0878n9071K1311j2361j0673P5531l3231O951J7316O425
$$ -8817 48098 88205 37327 -21744 -433 -12794 -23467 52064 18833 25784 43100 49525
1226D9525R298r9903j6294M7269p395K0870M4468R954k0091l5334j3422l8597
$$ 49525 58823 -41080 -57374 -10105 -17500 3370 47838 57792 37701 2367 -11055 -49652
1214d9652K9491o9628J33018n6798L4046R8216r0917m0780M0612k3609J871n1890
$$ -49652 -20161 -89789 43229 -13569 20477 118693 27776 -13004 27608 3999 5870 -46020
1202d6020O8386k9688j9180R9498l7140Q947N454M7316p7696q878q2992K1039
$$ -46020 22366 -7322 -26502 72996 35856 44803 50257 97573 19877 10999 -71993 -50954
1190e0954M7196n9703N1959n3608K9509k9670M8696Q305J4165N4963J16007p3112
$$ -50954 -3758 -63461 -11502 -65110 -35601 -65271 -16575 -8270 5895 60858 176865 103753
1178A03753m4950J3858p5692j3796N0745N6471j5796l8o9998n4200j3874m8378
$$ 103753 58803 72661 -3031 -16827 33918 90389 74593 74555 4557 -49643 -63517 -111895
1166a11895N0108L4572N2176J0031k429N7093j01987R16N3319J9493l6010n760
$$ -111895 -61787 -27215 24961 34992 32563 89656 -12331 -11415 41904 61397 25387 19627
1154A9627L3775m5059O490l5932K3385L974o0078J02316n993j08363M3111L5621
$$ 19627 53402 8343 14833 -21099 2286 6260 -53818 48498 42505 -65858 -22747 12874
1142A2874K1702L5181q2964k7758J3N849K8809M1416P58o7036o8266L3517K7614
$$ 12874 34576 69757 -13207 -40965 -40952 -35103 -6294 35122 35880 -31156 -99422 -65905 -38291
1129c8291O3505j157j9923n1040j1376M032L1100K9459K479K8242M5109m5204
$$ -38291 25214 24057 4134 -46906 -58282 -54250 -23150 6309 8788 37030 82139 36935
1117C6935k2866l1163m0702K6436O8040m6785J4455J5596j0390j0268P8313m3876
$$ 36935 14069 -17094 -57796 -31360 36680 -10105 4350 19946 9556 -712 77601 33725
1105C3725j23204J5019K4100O9847j2832q818J9694m6384l8124N7583L1520N7925
$$ 33725 -89479 -74460 -50360 19487 6655 -2163 17531 -28853 -66977 -9394 22126 80051
1093H0051q3209n57l003j03L3652P3647o5608m1885m9568J3025j7225P106K1099
$$ 80051 -3158 -3715 -6718 -6821 26831 100478 34870 -7015 -56583 -43558 -60783 -53677 -32578
1080c2578m265L1725L7429K7701K2524p2413j2520J9194n4204k4173N0176P9831
$$ -32578 -36843 -5118 32311 60012 82536 10123 -2397 16797 -37407 -61580 -11404 68427
1068F8427N4842L2325j77390J16947k6889q6414N6083k9030M6366k6609j550k0090
$$ 68427 123269 155594 -21796 95151 68262 -18152 37931 8901 55267 28658 27108 7018
1056G018q0415J8051O0863l8724O544l0394R3423K074L1147K9923r4598L494o975
$$ 7018 -73397 -55346 5517 -33207 -26663 -57057 36366 38440 69587 99510 4912 8406 1431
1043A431j2414N86Q306L0825p1206K3526l189o4537P4603N3689J2167n7828o181
$$ 1431 -10983 -10397 -2091 28734 -42472 -18946 -22135 -86672 -12069 41620 53787 -4041 -10222
1030a0222J1534n1151M2572l829j850J0564Q8404r3497p558P2100m0527k543O537
$$ -10222 1312 -49839 -7267 -11096 -12946 -2382 86022 -7475 -15033 57067 16540 13997 20534
1017B0534L602m5451p6187J8367N3296j7302Q886O603Q799m0814K3756J1963K7297
$$ 20534 24136 -21315 -97502 -79135 -25839 -43141 -34255 -27652 -18853 -59667 -35911 -23948 3349
1004C349K1377k1569J7340L7065k433M9502q8646L6995m0221n0121P731k0647
$$ 3349 24726 3157 20497 57562 55129 104631 15985 52980 12759 -37362 -29631 -50278
992e0278K5678n8002K5558M5292j2628O4587j7411p402q4863P6638O642O1781
$$ -50278 -24600 -82602 -57044 -11752 -24380 40207 22796 15394 -69469 7169 13811 75592
980G5592l3861m7401K796k1064n3820L2890M8847o1875L5928l8366J3928J1106
$$ 75592 41731 -5670 -2874 -23938 -77758 -44868 3979 -57896 -21968 -60334 -46406 -35300
968c5300J8828K5693K5301l1089R333q107k7638N0236l6683l69j4884l9598L8000
$$ -35300 -16472 9221 34522 3433 12766 4659 -22979 27257 -9426 -9795 -24679 -64277 -26277
955b6277q916Q1621J0941m1215N319K4040n6477j4662M4445k899k9730k4768J0802
$$ -26277 -35193 46428 57369 16154 21473 45513 -10964 -25626 18819 15920 -13810 -38578 -27776
942b7776L4213N8367m2082j9525l0372N2373J0662j7458k4056n3956K8164l7048
$$ -27776 6437 64804 22722 3197 -27175 25198 35860 18402 -5654 -59610 -31446 -68494
930f8494m4089R320J11884J5015K0277n501j6973J3021J5907l4147o6468J2437
$$ -68494 -112583 -103263 8621 23636 43913 38412 21439 34460 50367 16220 -50248 -37811
918c7811N0162j0928m1290K6271J7780N7470J3176L1005n1380l4263n4203J9349
$$ -37811 12351 1423 -39867 -13596 4184 61654 74830 105835 54455 20192 -34011 -14662
906a4662n0046J1024j6733N4837j335j00412Q5246J8794n2986J6129K0556N2540
$$ -14662 -64708 -53684 -70417 -15580 -16915 -117327 -32081 -13287 -66273 -50144 -29588 22952
894B2952K3505l7524O1285p7872q687J8049j7678N9233Q2827m5521k7305K9431
$$ 22952 46457 8933 70218 -7654 -16341 1708 -15970 43263 126090 80569 53264 82695
882H2695J9454q0975j0764J5763m9314N6949M0530J4947K2224o2109o3880M8387
$$ 82695 102149 21174 10410 26173 -23141 33808 74338 89285 111509 49400 -14480 33907
870C3907L4523k8701M4768j23651o0566K2191K1022N031L5828k5620L3351J25978
$$ 33907 68430 39729 84497 -39154 -99720 -77529 -56507 -51476 -15648 -41268 -7917 118061
858A18061k9003m6877n6846N7069n2332j3347j2573q26J4652j5042k7510j519
$$ 118061 89058 42181 -14665 42404 -9928 -23275 -35848 -36674 -22022 -37064 -64574 -66093
846f6093R4607n8436k1163j7758L6963L4725l8704k5091Q8758n4997K1926K6940
$$ -66093 28514 -29922 -51085 -68843 -31880 2845 -35859 -60950 27808 -27189 -5263 21677
834B1677l463N094P644n2353p3550N3926N4213P95k2668K6308j7809J5897J3215
$$ 21677 18214 23308 30952 -21401 -94951 -41025 13188 13983 -8685 17623 -186 15711 28926
821B8926j1352j5375j9931K6660P9697o4922M3788J68p7524L7825j24080R3510
$$ 28926 17574 2199 -17732 8928 88625 23703 67491 67659 -9865 27960 -96120 -2610
809b610O1142j6290q8426O3405m645K3827J3273m9943r6277R1966J00240o9719
$$ -2610 58532 42242 -46184 17221 12576 36403 49676 -267 -96544 -4578 95662 25943
797B5943q318m7762j2814n200K6210R3158n9571L3155N6252k2271k7172j09190
$$ 25943 17625 -30137 -42951 -48151 -21941 71217 11646 44801 101053 78782 51610 -57580
785e7580J13254M153J0261k7622K9200q5988j1324M6577M1613l3235k0000J380
$$ -57580 55674 59827 70088 42466 71666 -14322 -25646 20931 62544 29309 9309 10689
773A0689k838m2460N8540k4002J6427J8520J8574q226L6405j138n0879J7352O0407
$$ 10689 7851 -34609 23931 -71 16356 34876 53450 45224 81629 80491 29612 46964 107371
760A07371n8781j7271L0432k0667K6564n5636k4801j3439K5253L6435l491m403
$$ 107371 48590 31319 61751 41084 67648 12012 -12789 -26228 -975 35460 31969 27566
748B7566N629l5001N6650k6533k4613L1514K9701q5208K5477Q8825j0095o2714
$$ 27566 33195 -1806 54844 28311 3698 35212 64913 -20295 5182 94007 83912 21198
736B1198J3766J4854m345m2502j0892P7342P015j3018m149M799o7929P487N3754
$$ 21198 34964 49818 45473 2971 -7921 69421 76436 63418 59269 64068 -3861 3626 57380
723E7380m653j4907J3730o7735J0966R9851l5694L2996M4099o0007o2816K878
$$ 57380 52727 37820 51550 -16185 -5219 94632 58938 91934 136033 76026 13210 16088
711A6088k9426P223L7724J0970l9433n3256Q7628O6362L4601j9544m4001m3537
$$ 16088 -13338 -6115 31609 42579 3146 -50110 37518 103880 138481 118937 74936 31399
699C1399m0451o6541L7713l0275J4249R2593p2150J3659M1874k3237J1012l4927
$$ 31399 -9052 -75593 -37880 -68155 -53906 38687 -33463 -19804 22070 -1167 9845 -25082
687b5082M7922K8168k1982R700M5053r9728j5119K9369J6218p7925J7205O1964
$$ -25082 22840 51008 29026 38726 83779 -15949 -31068 -1699 14519 -63406 -46201 15763
675A5763L2786k0549M1346j5868P459n547o8456K3310Q052l0688j7649L9497K1750
$$ 15763 48549 28000 69346 53478 60937 55390 -13066 10244 18296 -12392 -30041 9456 31206
662C1206j7669p7459N1449P3809l2207l0436p402K6135J13904r3539k7172M2422
$$ 31206 13537 -63922 -12473 61336 29129 -1307 -8709 17426 131330 37791 10619 53041
650E3041K0989k7369l2798j6456R3243j04775j4856O7327o3358L4847o2391N233
$$ 53041 74030 46661 13863 -2593 90650 -14125 -28981 38346 -25012 9835 -52556 -47323
638d7323L8191K25q985m2468J1211L7300q3283K5445M0639k0242j265L5404P8847
$$ -47323 -9132 -8907 -17892 -60360 -49149 -11849 -95132 -69687 -29048 -49290 -50555 -15151 63696
625F3696r8698J34180r595j07712M4248p1101R167O0652j5137O8762M932n6711
$$ 63696 -35002 99178 89583 -18129 26119 -44982 -35815 24837 9700 78462 83394 26683
613B6683p8339J03680o0347K6029J03721m2534L550J8200j7489k8510k5820k7136
$$ 26683 -51656 52024 -8323 17706 121427 78893 82443 100643 83154 54644 28824 1688
601A688k8447k2681P1772q15l2777m4n08l089N3901m1924j4820N5767K5113n4028
$$ 1688 -26759 -49440 22332 21517 -11260 -11304 -11812 -14901 39000 -2924 -17744 38023 63136 9108
587I108k1944L8339j09031k947O6556L5175O205J5848l0898k1092j3821q301j6587
$$ 9108 -12836 25503 -83528 -86475 -19919 15256 21461 37309 6411 -14681 -28502 -36803 -53390
574e3390R6518L0030m1792r545j4822j4462J5190n001j8040L0270J3109K1823
$$ -53390 43128 73158 31366 21821 6999 -7463 7727 2726 -15314 14956 28065 49888
562D9888j8022p0018k5886O055J9852P366K4757M7297r601N350p5246l7810K5403
$$ 49888 31866 -38152 -64038 -57983 -38131 -30765 -6008 41289 31688 37038 -38208 -76018 -50615
549e0615j7072K6674J9202L1633j5328n2027N3465Q2948j8275j76q8571j7183
$$ -50615 -67687 -41013 -21811 9822 -5506 -57533 -4068 78880 60605 60429 -28142 -45325
537d5325Q2512K1354K2995n0438j3637N068q440m0259O5765j8893J8461k2639
$$ -45325 37187 58541 81536 31098 17461 22529 14089 -26170 39595 20702 39163 16524
525A6524m798N66r117L3636l2780o6723J8982j6453O3902m012K8124J1503N6745
$$ 16524 11726 12292 3175 36811 4031 -62692 -43710 -60163 3739 -273 27851 39354 96099
512I6099j9662r0361q5323L7257R5105o1309M4326j5951m3349K6025Q3595l4539
$$ 96099 76437 -13924 -99247 -61990 33115 -28194 16132 181 -43168 -17143 66452 31913
500C1913n8069K7986j2546M9780r034J2298J1930K5702j30610K5935j9002N5351
$$ 31913 -26156 1830 -10716 39064 30030 42328 54258 79960 -50650 -24715 -43717 11634
488A1634L3750j3242K3077o7305l8066j4201J05165j0717J3012P0945J0233j3011
$$ 11634 45384 32142 55219 -12086 -50152 -64353 40812 30095 43107 114052 124285 111274
476A11274m8454o4388q5725J09016N8232q9965L8713k4812m4565J608q211J8172
$$ 111274 62820 -1568 -87293 21723 79955 -10010 28703 3891 -40674 -39066 -47277 -29105
464b9105k3248K7344J925P2691L4003o6105J8861m8249J6452K734l953J3801L1360
$$ -29105 -52353 -25009 -23084 49607 83610 17505 36366 -11883 4569 7303 3350 17151 48511
451D8511k7273O3002L401j6620o2278o511O8774J9905L9547p2314j1746o177R459
$$ 48511 21238 84240 87641 71021 8743 2232 71006 90911 130458 58144 46398 40221 49680
438D9680o5442p826N1943n3638n1146M2287M0147m3951O5495M9486k8508j33218
$$ 49680 -15762 -23588 28355 -25283 -76429 -34142 6005 -37946 27549 77035 48527 -84691
426h4691N8336K1889M7683k8250q0317q147J05481o5475p0276p908N0403P6035
$$ -84691 -26355 -4466 43217 14967 -65350 -73497 31984 -33491 -103767 -111675 -61272 14763
414A4763J1744q6189J3100N4162m3858q490J5261l5337Q1746n8145l8174O2872
$$ 14763 26507 -59682 -46582 7580 -36278 -44768 -29507 -64844 16902 -41243 -79417 -16545
402a6545q837P445j5379O654m5042R259R6174N045l3010n910L1122n886l4057
$$ -16545 -25382 -17937 -33316 -26662 -71704 -62445 33729 38774 5764 -146 30976 25090 -8967
389h967O3020q5523L2428O174l5652j9997J6092J255P713j1429K3115m6986j6486
$$ -8967 54053 -31470 958 7132 -28520 -48517 -32425 -31170 -23457 -34886 -11771 -58757 -75243
376g5243j1181K5229O5493O6456p8121l1282M177j34544J13873J8511o8711l973
$$ -75243 -86424 -61195 4298 70754 -7367 -38649 -34472 -169016 -55143 -36632 -105343 -109316
364a09316O1531O3374m7311J9702J01390o3013k4110j8091K6312k5890K9069k5784
$$ -109316 -47785 15589 -31722 -12020 89370 26357 2247 -15844 10468 -15422 13647 -12137
352a2137k6139O9680L7365m3520l8719j2516J4274Q5519p9690J5632q354N0332
$$ -12137 -38276 31404 68769 25249 -13470 -25986 -11712 73807 -5883 9749 1395 51727
340E1727O475q5816l4374m884j37P15L0472L3652p0180M402r888J8130P4899n1126
$$ 51727 58202 -27614 -61988 -66872 -67009 -66294 -35822 -2170 -72350 -67948 -77836 -59706 15193 -35933
326c5933N5159M1319j42206M7697j0132n537m1911P204Q9668n2675O233m4144
$$ -35933 19226 60545 -81661 -33964 -44096 -49633 -91544 -84340 5328 -47347 -41114 -85258
314h5258K5188O4236m3634J4437k9753K3548O515m44M1617M4061k3380k8796O3143
$$ -85258 -60070 4166 -39468 -25031 -54784 -31236 -24721 -25165 16452 60513 37133 8337 71480
301G1480j2966p9221l944M7297q1209l2670J7628L6554N0383k2066j5061K4054
$$ 71480 58514 -20707 -24651 22646 -58563 -91233 -73605 -37051 13332 -8734 -23795 259
289B59m999M2245m1271m8212k2283k4419O3520K0862q4128n4131O9309Q4035M690
$$ 259 -4740 37505 -3766 -51978 -74261 -98680 -35160 -14298 -98426 -152557 -83248 787 5477
276E477k8055J765K3152j5385n7654p894J4835j6745p6487P2059M8442K0657M8468
$$ 5477 -22578 -20813 2339 -13046 -70700 -78594 -63759 -80504 -156991 -84932 -36490 -15833 32635
263C2635j1545j9567n1566l1234N388M3170j5811K6547k419j2845O6021J6573
$$ 32635 21090 1523 -50043 -81277 -75889 -32719 -48530 -21983 -24402 -37247 28774 45347
251D5347m4340q7310m8647M6796N5076P42p517M3002k9090q0803K386K4712P907
$$ 45347 1007 -86303 -134950 -88154 -33078 -32336 -39853 3149 -25941 -106744 -104358 -79646 -71739
238g1739J3736J2101k4436M3386L2960o6333R2312l5928J4902j19642O5504O0638
$$ -71739 -58003 -45902 -70338 -26952 6008 -60325 31987 -3941 10961 -108681 -43177 17461
226A7461k9395k6201M826N266l577J07131r1443K9851k2196p3106J4863R0131
$$ 17461 -11934 -38135 -33309 -28043 -31620 75511 -15932 13919 -8277 -81383 -66520 23611
214B3611n7193R541k6171Q5495q428k397R64p017k4533p206o0544K7171K9690
$$ 23611 -33582 -24041 -50212 35283 26855 24458 25422 18405 -6128 -13334 -73878 -46707 -17017
201a7017q3219k149O6139P6460j2770L803m4887M2961k6889q622o7178L2509N5332
$$ -17017 -100236 -102385 -36246 40214 27444 31247 -13640 29321 2432 -6190 -73368 -40859 14473
188A4473j5566J4742j38l7561n3632j2973n785l2508P2617N113q602K6999P002
$$ 14473 -1093 13649 13511 -24050 -77682 -90655 -96440 -128948 -56331 -51218 -59820 -32821 -25819
175b5819J4089q274k5352n4283L1111J6791J3569J2884j02026R2606J581j2013
$$ -25819 -11730 -20004 -45356 -99639 -68528 -51737 -38168 -25284 -127310 -34704 -33123 -45136
163d5136N321J5096j4714L5306L6123m3386L7580m461o2384J2520j974k5430M015
$$ -45136 -39815 -24719 -39433 -4127 31996 -11390 26190 21729 -40655 -28135 -30109 -55539 -51524
150e1524L1292m9792k787J603j2547N2345l3844O2254m1300M8221R60n5250L4862
$$ -51524 -20232 -70024 -72811 -71208 -83755 -31410 -65254 -3000 -44300 3921 4881 -50369 -15507
$$ [...]
##END NTUPLES=NMR SPECTRUM
##END=
