##TITLE=1H_CA-9306-1
 CDCl3
 8 sc, 
 6.12.2024
##JCAMPDX= 6.0         $$ Bruker NMR JCAMP-DX V2.0
##DATA TYPE= NMR SPECTRUM
##DATA CLASS= NTUPLES
##ORIGIN= UXNMR, Bruker Analytische Messtechnik GmbH
##OWNER= root
$$ XWIN-NMR		Version 3.5
$$ Fri Dec  6 14:18:19 2024 Russian Standard Time (UT+4h)  she@DPX200
##.OBSERVE FREQUENCY= 200.1315
##.OBSERVE NUCLEUS= ^1H
##.ACQUISITION MODE= SIMULTANEOUS
##.ACQUISITION SCHEME= undefined
##.AVERAGES= 8
##.DIGITISER RES= 18
##SPECTROMETER/DATA SYSTEM= spect
##.PULSE SEQUENCE= zg30
##.SOLVENT NAME= CDCl3
##.SHIFT REFERENCE= (INTERNAL, CDCl3, 0, 19.5165)
##AUDIT TRAIL= $$ (NUMBER, WHEN, WHO, WHERE, WHAT)
$$ ##TITLE= Audit trail, XWIN-NMR		Version 3.5
$$ ##JCAMPDX= 5.01
$$ ##ORIGIN= Bruker BioSpin GmbH
$$ ##OWNER= she
$$ F:/spectra/data/she/nmr/H-F/1/pdata/1/auditp.txt
$$ ##AUDIT TRAIL=  $$ (NUMBER, WHEN, WHO, WHERE, WHAT)
(   1,<2024-12-06 14:16:57.43 +0400>,<she>,<DPX200>,
      <created by zg, POWCHK disabled, PULCHK disabled
       configuration hash MD5:
       00 E9 B6 7A A2 85 ED C7 34 08 36 98 17 FE 4E 26
       data hash MD5: 16K
       98 A0 DF 9A 67 08 52 83 0B F0 62 4A AC 08 CD 8B>)
(   2,<2024-12-06 14:17:00.31 +0400>,<she>,<DPX200>,
      <Start of raw data processing
       efp BC_mod = 2 LB = 0.24 FT_mod = 6 PKNL = 1 PHC0 = -26710.42 PHC1 = 21.78744 SI = 16K 
       data hash MD5: 16K
       F3 35 94 14 DF 62 53 2E 93 8F 44 9D 1E 19 35 CD>)
(   3,<2024-12-06 14:17:21.42 +0400>,<she>,<DPX200>,
      <pk PHC0 = 4.499254 PHC1 = -8 
       data hash MD5: 16K
       B0 2A BC 94 A3 DF BF F5 0A 59 B0 42 B3 F7 29 5A>)
(   4,<2024-12-06 14:17:25.35 +0400>,<she>,<DPX200>,
      <abs ABSG = 5 
       data hash MD5: 16K
       CB E9 CF 74 1D EC D3 03 94 00 DF 74 56 B5 78 97>)
$$ ##END=
$$ 
$$ hash MD5
$$ 73 69 AB CA 85 01 E5 FA B7 B0 7C 02 7A B4 78 A9
##$RELAX= 
##$RELAX= 
##$RELAX= 
##$RELAX= 
##$RELAX= 
##$RELAX= 
$$ Bruker specific parameters
$$ --------------------------
##$DU= <F:/spectra>
##$EXPNO= 1
##$NAME= <H-F>
##$PROCNO= 1
##$TYPE= <nmr>
##$USER= <she>
##$AMP= (0..31)
100 100 100 100 100 100 100 100 100 100 100 100 100 100 100 100 100 100 
100 100 100 100 100 100 100 100 100 100 100 100 100 100 
##$AQSEQ= 0
##$AQ_mod= 1
##$AUNM= <au_zg>
##$AUTOPOS= <>
##$BF1= 200.13
##$BF2= 200.13
##$BF3= 200.13
##$BF4= 200.13
##$BF5= 200.13
##$BF6= 200.13
##$BF7= 200.13
##$BF8= 200.13
##$BYTORDA= 1
##$CFDGTYP= 0
##$CFRGTYP= 5
##$CHEMSTR= <none>
##$CNST= (0..31)
1 1 145 1 1 1 1 1 1 1 1 1 1 1 1 1 1 1 1 1 1 1 1 1 1 1 1 1 1 1 1 1 
##$CPDPRG= <>
##$CPDPRG1= <>
##$CPDPRG2= <>
##$CPDPRG3= <>
##$CPDPRG4= <mlev>
##$CPDPRG5= <mlev>
##$CPDPRG6= <mlev>
##$CPDPRG7= <mlev>
##$CPDPRG8= <mlev>
##$CPDPRGB= <>
##$CPDPRGT= <>
##$D= (0..31)
0 1.2 0 0 0 0 0 0 0 0.06 0 0.03 0 0 0 0 0.0002 0 0 0 0 0 0 0 0 0 0 0 0 
0 0 0 
##$DATE= 1733480216
##$DBL= (0..7)
120 120 120 120 120 120 120 120 
##$DBP= (0..7)
150 150 150 150 150 150 150 150 
##$DBP07= 0
##$DBPNAM0= <>
##$DBPNAM1= <>
##$DBPNAM2= <>
##$DBPNAM3= <>
##$DBPNAM4= <>
##$DBPNAM5= <>
$$ [...]
##$SUBNAM3= <"">
##$SUBNAM4= <"">
##$SUBNAM5= <"">
##$SUBNAM6= <"">
##$SUBNAM7= <"">
##$SUBNAM8= <"">
##$SUBNAM9= <"">
##$SW= 24.0689530833862
##$SWIBOX= (0..15)
0 0 2 0 0 0 0 0 0 0 0 0 0 0 0 0 
##$SW_h= 4816.95568400771
##$TD= 16384
##$TD0= 1
##$TE= 0
##$TE2= 300
##$TE3= 300
##$TEG= 300
##$TL= (0..7)
0 120 120 120 120 120 120 120 
##$TP= (0..7)
150 150 150 150 150 150 150 150 
##$TP07= 0
##$TPNAME0= <>
##$TPNAME1= <>
##$TPNAME2= <>
##$TPNAME3= <>
##$TPNAME4= <>
##$TPNAME5= <>
##$TPNAME6= <>
##$TPNAME7= <>
##$TPOAL= (0..7)
0.5 0.5 0.5 0.5 0.5 0.5 0.5 0.5 
##$TPOFFS= (0..7)
0 0 0 0 0 0 0 0 
##$TUNHIN= 0
##$TUNHOUT= 0
##$TUNXOUT= 0
##$USERA1= <user>
##$USERA2= <user>
##$USERA3= <user>
##$USERA4= <user>
##$USERA5= <user>
##$V9= 5
##$VALIST= <valist>
##$VCLIST= <CCCCCCCCCCCCCCC>
##$VD= 0
##$VDLIST= <DDDDDDDDDDDDDDD>
##$VPLIST= <PPPPPPPPPPPPPPP>
##$VTLIST= <TTTTTTTTTTTTTTT>
##$WBST= 1024
##$WBSW= 4
##$XGAIN= (0..3)
0 0 0 0 
##$XL= 0
##$YL= 0
##$YMAX_a= 619959
##$YMIN_a= -533489
##$ZGOPTNS= <>
##$ZL1= 120
##$ZL2= 120
##$ZL3= 120
##$ZL4= 120
##$ABSF1= 19.53854
##$ABSF2= -4.530594
##$ABSG= 5
##$ABSL= 3
##$ALPHA= 0
##$AQORDER= 0
##$ASSFAC= 0
##$ASSFACI= 0
##$ASSFACX= 0
##$ASSWID= 0
##$AUNMP= <proc_1d>
##$AZFE= 0.1
##$AZFW= 0.1
##$BCFW= 0
##$BC_mod= 2
##$BYTORDP= 0
##$COROFFS= 0
##$CY= -3
##$DATMOD= 1
##$DC= 0
##$DFILT= <>
##$DTYPP= 0
##$F1P= 0
##$F2P= 0
##$FCOR= 1
##$FTSIZE= 16384
##$FT_mod= 6
##$GAMMA= 0
##$GB= 0
##$INTBC= 1
##$INTSCL= 2.524811e-10
##$ISEN= 128
##$LB= 0.24
##$LEV0= 0
##$LPBIN= 0
##$MAXI= 10000
##$MC2= 0
##$MEAN= 0
##$ME_mod= 0
##$MI= 1.114404
##$NCOEF= 0
##$NC_proc= -5
##$NLEV= 6
##$NOISF1= 3.799351
##$NOISF2= 2.8
##$NSP= 0
##$NTH_PI= 0
##$NZP= 0
##$OFFSET= 19.51651
##$PC= 1
##$PHC0= -26705.92
##$PHC1= 13.78744
##$PH_mod= 1
##$PKNL= yes
##$PPARMOD= 0
##$PSCAL= 0
##$PSIGN= 0
##$REVERSE= no
##$SF= 200.130002639521
##$SI= 16384
##$SIGF1= 3
##$SIGF2= 2
##$SINO= 5.538805
##$SIOLD= 16384
##$SREGLST= <1H.CDCl3>
##$SSB= 0
##$STSI= 16384
##$STSR= 0
##$SW_p= 4816.95568400771
##$SYMM= 0
##$S_DEV= 0
##$TDeff= 16384
##$TDoff= 0
##$TI= <>
##$TILT= no
##$TM1= 0
##$TM2= 0
##$TOPLEV= 0
##$USERP1= <user>
##$USERP2= <user>
##$USERP3= <user>
##$USERP4= <user>
##$USERP5= <user>
##$WDW= 1
##$XDIM= 16384
##$YMAX_p= 360236901
##$YMIN_p= -182178
$$ End of Bruker specific parameters
$$ ---------------------------------
##NTUPLES= NMR SPECTRUM
##VAR_NAME=  FREQUENCY,     SPECTRUM/REAL,   SPECTRUM/IMAG
##SYMBOL=    X,             R,               I
##VAR_TYPE=  INDEPENDENT,   DEPENDENT,       DEPENDENT
##VAR_FORM=  AFFN,          ASDF,            ASDF
##VAR_DIM=   16384,         16384,           16384
##UNITS=     HZ,            ARBITRARY UNITS, ARBITRARY UNITS
##FACTOR=    0.29402158847633, 1,            1
##FIRST=     3905.83919976863, 0,            0
##LAST=      -911.116484239078, 0,           0
##MIN=       -911.116484239078, -182178,     0
##MAX=       3905.83919976863, 360236901,    0
$$ Real data points
##PAGE= N=1
##DATA TABLE= (X++(R..R)), XYDATA
$$ [...]
6790d4359n1197J6051o9342N7421m6761J0929N1785P4087J3311p8268R864P9320
6778B2841q1353j9899Q5304l9120n2892K7395j9290j2492O3432k9753J8857Q331
6766b8639m7369j5481K9155k8821Q4993P4539j36710m6092K2638n8038J28303
6755b1522J5837J4573n0855N7894j7379q6988q4259R3461L5867l5675j1007M7061
6743d2992l1775n1501M8163l7719N2802q565M1597J174J1404M137j11325j546
6731a26146J1935P3114Q108m1308K9878o9962N4106k4743K1487K1150m0460o9005
6719a51846K4872L8317N9884q2052Q3274o0565M916L6225J5573j2287K7144N3326
6707C6781q6749j4677O6842j7088j9393l6140j0611j4124l2432M9890M2581m8376
$$ y = [-44359, -95556, -79505, -148847, -91426, -138187, -127258, -75473, -1386, 11925, -66343, -56479, 22841, -58512, -78411, 6893, -32227, -85119, -57724, -77014, -89506, -26074, -55827, -36970, -28639, -76008, -91489, -62334, -91155, -6162, 68377, -68333, -114425, -91787, -149825, -21522, -5685, 8888, -41967, 15927, -1452, -88440, -172699, -79238, -43371, -79046, -90053, -42992, -74767, -126268, -78105, -115824, -63022, -71587, -29990, -28816, -17412, -13275, -124600, -126146, -114211, -41097, -32989, -74297, -44419, -114381, -60275, -85018, -63531, -42381, -82841, -151846, -126974, -88657, -28773, -110825, -27551, -88116, -83200, -46975, -31402, -43689, -16545, 36781, -49968, -64645, 2197, -14891, -34284, -70424, -81035, -95159, -127591, -77701, -35120, -83496]
6695h3496k8783K2734M5096j587L1175l698m2433q533k6080J0970O2134m147k9740
6682e6388M4809r6938K9810O823k8J7043n229j109k6340j2899k3677L5253Q733
6669h0137N0502P5m7961k0583M2140K1639q7162n8124M8311M5802k8861l4569
6657a48928P4624O5991J463o3790n0568M5522K7676k3216K8753m1014l849Q321
6645g9015K105L6087K7663Q412n4386j1568l6895K156N2246j4695R1924l4183
6633a0149L73l232r1324M6478K8615K246O271m0856r835N9631l6184m7182j6622
6620a11770R8326k4446N7357J7207r2525p7881N7985n9036L6074K0537J9097O2831
6608C756l5868l0432j2656l7719K1809o106N1262k9708m50k8066M11P8908N9037
$$ y = [-83496, -112279, -89545, -44449, -46036, -14861, -18559, -60992, -69525, -95605, -84635, -22501, -26648, -56388, -11579, -108517, -78707, -71884, -71912, -54869, -60098, -61207, -87547, -100446, -124123, -88870, -80137, -29635, -29560, -77521, -98104, -55964, -34325, -121487, -179611, -131300, -85498, -114359, -148928, -74304, -8313, -6850, -70640, -121208, -75686, -48010, -71226, -42473, -83487, -87336, -79015, -76910, -40823, -13160, -4748, -59134, -70702, -107597, -105441, -53195, -67890, 24034, -10149, -9776, -13008, -104332, -57854, -29239, -26993, -20722, -61578, -71413, -11782, -47966, -95148, -111770, -13444, -37890, 19467, 36674, -55851, -133732, -75747, -134783, -98709, -78172, -59075, 3756, -32112, -62544, -75200, -112919, -91110, -97216, -45954, -75662, -76112, -104178, -103767, -24859, 34178]
6595C4178j7500q3227O1594K5887r1827l0365K9174k8620J0594o1057M4963k7305
6583a33511L4569l5827M3534k2336j0795J17486o0852O221L6741q8419N8291M9421
6571e477m4187k8580P0307J4566n6100l2480K4854k6400Q4433L8886J8747K4946
6559H3515j11486Q306n9051j1135J8482J7169K1126n629j1452J6466j1456N8724
6547A3579M536m7762j6561M0649j22012M5050P6840k9335J5420k5143o746o4811
6535a16296O6492M0869l4597L3930M7470J6525p6207o4933p4993R6116k2560k5450
6523a13634J2536k2968M6271O086J9388M268k4498P8498k7253j02901n105K3667
6511a05645K4747l0492M7183J1713k053l9561L1859o3465n029O6555J5902M0665
$$ y = [34178, 16678, -66549, -4955, 20932, -70895, -101260, -72086, -100706, -90112, -151169, -106206, -133511, -98942, -134769, -91235, -113571, -124366, -6880, -67732, -61511, -24770, -113189, -54898, -5477, -49664, -78244, -7937, 6629, -49471, -81951, -57097, -83497, 936, 39822, 58569, 83515, -27971, -19665, -78716, -89851, -71369, -54200, -33074, -38703, -50155, -33689, -45145, 13579, 18115, -29647, -46208, -5559, -127571, -82521, -5681, -35016, -19596, -44739, -51485, -116296, -49804, -8935, -43532, -9602, 37868, 54393, -21814, -86747, -161740, -65624, -88184, -113634, -101098, -124066, -77795, -71709, -52321, -48053, -72551, 5947, -21306, -124207, -129312, -105645, -80898, -111390, -64207, -52494, -54547, -94108, -62249, -125714, -130743, -64188, -48286, -7621]
6499g621q2196l0334L1159p258J3249O9267L9615n1298n7339p1013O1289k501
6487i4981J3484p453N9935P115p8531l2338O0991N6741l3776j04583J7383J02997
6475c3016o2222N6507j5838k0225j9623K1033J8970k1621o669L8141p8722p346
6463a30631P1946Q340J962K2640p8949L871Q5620l7455j4749n6545L2853M7829
6451d3268j15581R2385K9634n2359Q9563j7985r5634L352J9604K031k768J3236
6439g7790q810P701M5140r8030Q1396L4020l4486k847J222o2029K9829j7957M5958
6426e6683p2213L6634l6578N2111M5170k8280R398k2485r013o310J2375M9711
6414b6163K1632p1295j7882l7287J7580N5429J6955q0065J0556P0315N0775l0798
$$ y = [-7621, -89817, -120151, -88992, -96250, -83001, -13734, 25881, -25417, -82756, -153769, -92480, -94981, -81497, -88950, -29015, -21900, -100431, -132769, -71778, -15037, -48813, -153396, -136013, -33016, -95238, -38731, -54569, -74794, -94417, -73384, -54414, -76035, -82704, -44563, -123285, -130631, -58685, -50345, -48383, -25743, -104692, -100821, -15201, -52656, -67405, -123950, -91097, -43268, -158849, -66464, -36830, -89189, 374, -17611, -113245, -109893, -90289, -88258, -91026, -77790, -86600, -78899, -33759, -131789, -50393, -16373, -50859, -53706, -52484, -114513, -84684, -102641, -56683, -128896, -92262, -128840, -76729, -31559, -59839, -50441, -72926, -81939, -88249, -75874, -26163, -4531, -75826, -93708, -130995, -113415, -57986, -41031, -121096, -110540, -40225, 10550, -20248]
6402b0248J2287q2835l4668M4044J05129j06945J9665J7654N9352k1584k4599
6391c2748l4214l2372L445N4851k235j4833J12826r5547Q536n9361L3175n0971
6379a09448n9689N3655R9119q0385o3317J2642J25232o9409j7927O0209O875J5941
6367b6502k6508k7015R107m9863j0033L4307Q9569n4509n3821J509j3880K1063
6355a06576P5093n7941K28P6659j1474j3260m4995K6454j6983l905N2382m4759
6343f9077j3572O7055k9702N1391J0218j0725r2735P6018l8039k9322M972K7431
6331d6087q9064O3978p0459Q2031P291l2465l2492N7072O2641l3274j2163p9810
6319a22801J3240J01095o2409n4156q338L6141K043P8923j9662k1172j7982p012
$$ y = [-20248, -7961, -90796, -125464, -81420, 23709, -83236, -63571, -45917, 13435, -8149, -32748, -66962, -99334, -95889, -41038, -43273, -58106, 54720, -40827, -32291, -91652, -58477, -109448, -169137, -115482, -16363, -96748, -160065, -147423, -22191, -91600, -109527, -49318, -42443, -26502, -53010, -80025, -70918, -120781, -130814, -96507, -6938, -61447, -115268, -113759, -127639, -106576, -31483, -89424, -89196, -12537, -24011, -37271, -82266, -55812, -72795, -76700, -24318, -69077, -82649, -15594, -45296, 6095, 16313, 5588, -87147, -11129, -49168, -78490, -73518, -46087, -135151, -71173, -141632, -59601, -52310, -84775, -117267, -60195, 2446, -30828, -42991, -122801, -109561, -8466, -70875, -125031, -133369, -97228, -95185, -16262, -35924, -57096, -75078, -82090]
6307h2090O7284j7225R885q2164L0547K9611k7957L5503M0460m5388o0267L3997
6295f7804l5783J2009M8193L5168Q6628n3164l0960j6376m1516Q901o122j3062
6283g3888p552m3564M1519o111J01968L2761n0234J5065L3907p2649O197k197
6271b4778m0794k1489k725R4869J365j04839M3018M9581j874p5737K3087K0453
6259c9863J37865j5783j08416m4093N6222n014O0308L0821j14851l5209M6932
6248c1081K2864j7449J4300K0367k2514P2668j707n8571R762K6016l7517K8678
6236B5816j9626l0188J5440k761J7973j2162o0422N7542j5580K8240M3123p5454
6224b8059N4634l379k8446o5753p382L9181m2069J9148M7081J5660l5049j4975
$$ y = [-82090, -14806, -32031, -22146, -104310, -73763, -44152, -72109, -36606, 3854, -41534, -101801, -67804, -103587, -91578, -43385, -8217, 78411, 25247, -5713, -22089, -63605, -54704, -60826, -73888, -81440, -125004, -83485, -89596, 12372, 45133, -5101, 9964, 43871, -28778, -22581, -24778, -65572, -87061, -89786, 5083, 6448, -98391, -55373, -5792, -7666, -83403, -60316, -39863, 98002, 82219, -26197, -70290, -14068, -19082, 41226, 72047, -42804, -78013, -31081, -8217, -25666, -11366, 9001, -13513, 59155, 57448, -1123, 8639, 34655, -2862, 25816, 6190, -23998, -8558, -11319, 6654, -5508, -65930, -8388, -23968, 4272, 47395, -28059, 26575, 23196, -5250, -71003, -78385, -39204, -81273, -62125, -15044, 616, -34433, -49408]
6212d9408J2130n037o3590P5907O450O5666K2162r4038O6034m4218l4417O622
6200c5737m6433m4776N8226M8485J0904L0528p01m0246l1329L060K8855j6819
6188c5983M6958R052J5251l7326P1295j20630P780J7927J07667j9189m7941k7290
6176a2429R508p191L9606j4453j0917O194L1991O905j1025j6340j1951N2032j4551
6163D7379l4866r419P4382j9248q7459N6356L8955m2777j787j5399M5328j4169
6151C7276N9466J6756o0669n3381J3323J7700j3669N3121J1425r5286L1084N137
6139B2283o7322Q7222K7154N0513l3327n133j2353r1812N8436K075L380j4937
6127B6179j3572J03665J6322p500n9533j8970P2563n0187J0592n3510Q767P8401
$$ y = [-49408, -37278, -42315, -105905, -29998, -23548, 42118, 64280, -29758, 36276, -7942, -42359, -35737, -82170, -126946, -68720, -20235, -9331, 21197, 20496, -19750, -51079, -48019, -19164, -35983, 10975, 20027, 35278, -2048, 69247, -51383, -43603, -25676, 81991, 62802, 14861, -12429, -2921, -10112, 29494, 15041, 4124, 10318, 42309, 49214, 38189, 21849, 9898, 61930, 47379, 12513, 3094, 77476, 58228, -29231, 27125, 66080, 23303, 21516, 6117, 51445, 37276, 96742, 113498, 52829, -552, 12771, 30471, 16802, 69923, 81348, -13938, 17146, 22283, -45039, 42183, 69337, 119850, 86523, 81390, 69037, -22775, 35661, 37736, 41116, 26179, 12607, 116272, 132594, 125094, 65561, 46591, 119154, 68967, 79559, 26049, 34816, 113217]
6115A13217L082k3343l451K2322M8818L353l2528k0212L33J0120N5138k2608K0476
6102A74717l2427q2254N4366L2194P527R7944k1466p5036O3550K0826k7090L5071
6090B47922l2019j2656k5384O2352Q7736J6370k3427l9841k6305Q6077M2615k638
6078C80802L5081l3308O2212p746K9331K4255K8172J14391j3205k5548l276R8342
6066F89503M4148K0315L3922L3922R3425m4173J77936P9625O262J76200N8337
6055A369422R5565J16940K11898J46516K59081K85160J78191J45383J23655j37851
6045B793960r4525j01238j29613j25063p6788l1805L2198J12769R8883J4542J11636
6034B604956J99630J61827K63174K80305L65527L27794L87877N78040N52640M57518
$$ y = [113217, 116299, 92956, 89505, 111827, 160645, 163998, 131470, 111258, 111591, 121711, 176849, 154241, 174717, 142290, 60036, 114402, 146596, 154123, 252067, 230601, 155565, 219115, 239941, 212851, 247922, 215903, 203247, 177863, 240215, 327951, 344321, 320894, 281053, 254748, 340825, 383440, 380802, 415883, 382575, 444787, 437041, 466372, 490627, 518799, 633190, 619985, 594437, 591161, 689503, 733651, 753966, 787888, 821810, 915235, 871062, 1048998, 1128623, 1134885, 1311085, 1369422, 1464987, 1581927, 1793825, 1940341, 2199422, 2484582, 2662773, 2808156, 2931811, 2793960, 2699435, 2598197, 2468584, 2343521, 2266733, 2234928, 2267126, 2379895, 2478778, 2493320, 2604956, 2804586, 2966413, 3229587, 3509892, 3875419, 4203213, 4591090, 5169130, 5721770, 6179288]
6024F179288M83772K15961k39101m51965n65053n74609m78540k91215k48987k43599
6014C785952j69872n5543j2303N2023N2560K8704J60569K07941K36828K25558
6004D512417L70693N28835N01924N32931M47753J60959j42373n21466n79011o89157
5994E123505n17515m42056l68885l06102k52173j89732j57307j51577j02735j2826
5984B622597m0657l1076O8070j0549r40J20927J31367J83954J79014J0063j00313
5973C132457j82900k05356k40471k03723k61495j03750k05532q6541k6368k7762
5963A588559j12994P785j21462n3937M151j33773l1463j07970o5637J6899o194
5952I83964o6734m48m3150J9895p2156m9837k3709J7589P1063j18306l1457l3957
$$ y = [6179288, 6663060, 6879021, 6639920, 6187955, 5622902, 5048293, 4569753, 4278538, 4029551, 3785952, 3616080, 3560537, 3548234, 3600257, 3652817, 3681521, 3842090, 4050031, 4286859, 4512417, 4883110, 5411945, 5913869, 6446800, 6894553, 7055512, 6913139, 6391673, 5812662, 5123505, 4605990, 4163934, 3795049, 3488947, 3236774, 3047042, 2889735, 2738158, 2635423, 2622597, 2581940, 2550864, 2618934, 2608385, 2607445, 2728372, 2859739, 3043693, 3222707, 3232770, 3132457, 2949557, 2744201, 2503730, 2300007, 2038512, 1934762, 1729230, 1642689, 1616321, 1588559, 1475565, 1483350, 1361888, 1307951, 1312102, 1178329, 1146866, 1038896, 973259, 990158, 983964, 917230, 916782, 873632, 893527, 821371, 771534, 747825, 765414, 836477, 718171, 686714, 652757]
5940F52757k217l1435N1812m782p9906P27j7136M5137K6704n3725m3372q164n7347
5927D79053N2585k4918j458q926m1668l9705O1080l9153K1478J2077m8618K6531
5915D48358K950j02532n1041J13105n96n3854k2334L5492j6087j5525K0399j4382
5903C43953Q0379o8012m943L9698M4140n2595o2343k2461k468K003K0935L9984
5891C58270Q72J0369J9926p8653m029M5115o032n2803k5820n683J6582Q357M9227
5878C35698m5307K2151J6555j2747m7775P1667O1992j6933J3544J5999r249J12508
5866E18103o8105j7575L0688m23P2774K8579J0950Q0639n611J3869M3181J881
5854G08950m454n8905l788N5023N157p7690J1151j706Q549P7456M5764o1715K0315
$$ y = [652757, 650540, 619105, 670917, 666135, 586229, 586956, 569820, 614957, 641661, 587936, 544564, 536400, 479053, 531638, 506720, 505262, 496336, 454668, 414963, 476043, 436890, 458368, 470445, 421827, 448358, 451308, 348776, 297735, 410840, 410244, 356390, 334056, 369548, 353461, 337936, 358335, 343953, 424332, 356320, 351377, 391075, 435215, 382620, 320277, 297816, 295348, 297351, 318286, 358270, 359142, 369511, 389437, 310784, 306755, 351870, 345838, 293035, 267215, 261532, 278114, 286471, 335698, 290391, 312542, 329097, 316350, 268575, 340242, 402234, 385301, 398845, 414844, 405595, 518103, 449998, 432423, 463111, 462688, 535462, 564041, 574991, 655630, 650019, 663888, 707069, 708950, 704496, 645591, 641803, 696826, 701983, 624293, 635444, 633738, 642287, 719743, 765507, 703792, 724107]
5841G24107l7318j42031j3501L8495m3204o8407o0037Q5697o2714Q73Q5093k0945
5829D86108p5874q17P250k8328j278K0082k0889L1057l1770r7026M6477l0013
5817C04979N2357L1400j3310L5797R499J6225l4989k3205P9140P9427n2103J1307
5805D96524k4976j0568m1638q151K5288J02571L342N2290k120o3897p6398M1565
5793D93832J2484Q9486q903K4215J4761M1838J8404m853K8920N3382O9940m3527
5781G89979J114j5069O0672j1134j6747L6956J54565K841M542J8082m2194M2951
5769A026558Q0285K2896k2664O1416L1181J70635Q6280m4203P3801Q8991L0578
5758A605754P3185J48194P1420J35403O7171L7342Q2345J11665J82952L6189J06220
$$ y = [724107, 686789, 544758, 531257, 569752, 526548, 458141, 398104, 483801, 421087, 421960, 507053, 486108, 410234, 409417, 416667, 388339, 387061, 407143, 386254, 417311, 385541, 288515, 334992, 304979, 357336, 388736, 375426, 411223, 420722, 436947, 401958, 378753, 457893, 537320, 485217, 496524, 471548, 460980, 419342, 411191, 436479, 539050, 542392, 594682, 592562, 528665, 452267, 493832, 506316, 595802, 586899, 611114, 625875, 667713, 686117, 681264, 710184, 763566, 833506, 789979, 791093, 776024, 836696, 825562, 808815, 845771, 1000336, 1003177, 1007719, 1025801, 983607, 1026558, 1106843, 1129739, 1107075, 1168491, 1199672, 1370307, 1456587, 1412384, 1486185, 1575176, 1605754, 1678939, 1827133, 1898553, 2033956, 2101127, 2138469, 2220814, 2332479, 2515431, 2551620, 2657840]
5747B657840O0786J09946K2202J74044K15401J33181J34705K14334J30242K01082
5737D053763J81702J65808K57744J84082K96522K65921K90692L32567L57432L32348
5727F718581N33961M69450N24143N55705O24463Q09187R02403J056784J302318
5718A3496995J373229J497555J861751K345798K761724L304878L762921M318163
5710C4723014M282034K995712O63390k245503m247899m839446m439748l736332
5702B3155222k948799k260334j972477j610517j393665j082277j058899p76050
5694A0052204o30346m85358m77080n33837m61010m64084l51312l26185l87423
5685E935569l14985j23194k46190j47631k10684k26394j84800j42717j94605j74507
$$ y = [2657840, 2718626, 2828572, 2850774, 3024818, 3240219, 3373400, 3508105, 3722439, 3852681, 4053763, 4235465, 4401273, 4659017, 4843099, 5139621, 5405542, 5696234, 6028801, 6386233, 6718581, 7252542, 7721992, 8246135, 8801840, 9426303, 10235490, 11137893, 12194677, 13496995, 14870224, 16367779, 18229530, 20575328, 23337052, 26641930, 30404851, 34723014, 39005048, 42000760, 42664150, 40418647, 36170748, 31331302, 26891554, 23155222, 20206423, 17946089, 15973612, 14363095, 12969430, 11887153, 10828254, 10052204, 9421858, 8936500, 8459420, 7925583, 7464573, 7000489, 6649177, 6322992, 5935569, 5620584, 5497390, 5251200, 5103569, 4892885, 4666491, 4481691, 4338974, 4144369, 3969862]
5675C969862k55123k61840j17684j88054j32887j17906j8998j46542j56714j34392
5665B439722q7331r6369M7820p8439r7010m5710l6003P880l783o1098o7260n1290
5653A871129L348o5345j47684L0353o1584l536n3120m8071q346L743o8591k7178
5641A425118k2651o1663n6580N709M6552o234j5718l8609j3444J1057j7169R256
5629A265624k3175P4323j5760m4681O9503M4639N9894K5039N2117J372R8995K4909
5617A632799r9289p756k4992o6076j07979k7126m853j15429r6939O5550m6604
5606A101306K784K6493j2178m9231J7823M5945k1708K7590j4052k7299K053r13
5594A098613P6346K699O7402L934K4110J03696Q8423M1684J2626L0742J331M3489
$$ y = [3969862, 3714739, 3452899, 3335215, 3147161, 3014274, 2896368, 2877370, 2730828, 2574114, 2439722, 2352391, 2256022, 2303842, 2225403, 2128393, 2082683, 2046680, 2054560, 2050777, 1989679, 1922419, 1871129, 1874477, 1809132, 1661448, 1691801, 1630217, 1626681, 1573561, 1525490, 1517144, 1520887, 1452296, 1425118, 1402467, 1340804, 1284224, 1289933, 1336485, 1330251, 1314533, 1275924, 1262480, 1273537, 1256368, 1265624, 1242449, 1316772, 1301012, 1256331, 1325834, 1370473, 1430367, 1455406, 1507523, 1508895, 1607890, 1632799, 1533510, 1525754, 1500762, 1434686, 1326707, 1299581, 1294728, 1179299, 1082360, 1147910, 1101306, 1104090, 1130583, 1118405, 1069174, 1086997, 1132942, 1111234, 1138824, 1124772, 1097473, 1099526, 1098613, 1174959, 1177658, 1245060, 1248994, 1273104, 1376800, 1465223, 1506907, 1519533, 1550275, 1551606, 1595095]
5582A595095P9007J428k5465p5929q1653o1042p8819r416j23908K2189J840l2585
5570A210742K7702k7892j7306j7558j108L5633p2544n0729q086J9615n231k2232
5558A071006M2568M6345P208m136M3976M1919r4228m4794J04827o3828N1609j3839
5546A188633r3559J36062P0484L9156K9682n0562M9129L0671O9227Q6487P4570
5535A629980l5826Q6211K0327k0586J03279P9761J6972Q2254P6298K8502R3858
5524B161030q473R6442J07999J41039J57167N5210J35897R6926O5172J04784J46158
5513C259351K4737J15701J23896R7365J80096J74039J45733J88433J58155J38185
5503D605691K82271K14959K81323J85883K08632L26949L22406L34270L99905L43688
$$ y = [1595095, 1674102, 1675530, 1650065, 1574136, 1492483, 1431441, 1352622, 1343206, 1219298, 1241487, 1243327, 1210742, 1238444, 1210552, 1193246, 1175688, 1174580, 1210213, 1137669, 1086940, 1078854, 1098469, 1093238, 1071006, 1113574, 1159919, 1167127, 1162991, 1206967, 1248886, 1154658, 1109864, 1214691, 1150863, 1202472, 1188633, 1095074, 1231136, 1301620, 1340776, 1370458, 1319896, 1369025, 1399696, 1468923, 1555410, 1629980, 1594154, 1680365, 1700692, 1680106, 1783385, 1863146, 1880118, 1962372, 2038670, 2067172, 2161030, 2152557, 2248999, 2356998, 2498037, 2655204, 2710414, 2846311, 2943237, 3008409, 3113193, 3259351, 3284088, 3399789, 3523685, 3621050, 3801146, 3975185, 4120918, 4309351, 4467506, 4605691, 4887962, 5102921, 5384244, 5570127, 5778759, 6105708, 6428114, 6762384, 7162289, 7505977]
5493G505977N19392N22007M41139N78733O76973P45294Q29047J039021J076718
5484A3934301J196170J512768J712036K160137K427665K833692K929672K669241
5476C1375682J650281J20525j435597k312130k448965k296330j707122j113862
5468B1832482p07264j32624J91873O06321Q96338Q44090O60532p0189j037363
5459B3084196j723739k009312j933588j579644j409407j279977r82182q56046
5451A1310301p55007n64297m43203m81739m23900l03327k72186k84287l06473
5442G475882l05364l10986k61651k52880j28122j89988j66987j01826l6771j67069
5432E554238p2431o0431m1896O8368o4962j29246m2043n0461o242N4022Q1054
$$ y = [7505977, 8025369, 8547376, 8988515, 9567248, 10244221, 10989515, 11818562, 12857583, 13934301, 15130471, 16643239, 18355275, 20515412, 22943077, 25776769, 28706441, 31375682, 33025963, 33146488, 31710891, 29398761, 26949796, 24653466, 22946344, 21832482, 21125218, 20992594, 21184467, 21790788, 22687126, 23531216, 24191748, 24121559, 23084196, 21360457, 19351145, 17417557, 15837913, 14428506, 13148529, 12166347, 11310301, 10555294, 9990997, 9547794, 9066055, 8642155, 8338828, 8066642, 7782355, 7475882, 7170518, 6859532, 6597881, 6345001, 6216879, 6026891, 5859904, 5758078, 5721307, 5554238, 5481807, 5421376, 5379480, 5447848, 5382886, 5253640, 5211597, 5161136, 5154894, 5208916, 5289970]
5421E289970K3779M2456j2782k1358J17504P9775K0116M9181Q0535J35740J54417
5410E959333J62496J58906J91361J53209K83755K82780J89549L80028K73106K31771
5400H266294L04134M77719L87302L18328L56108L70970L41240K51614M20123L96446
5390A1890278O18299M90929N01024N76528O35423P06911P62361O96665Q59064
5381A7737482Q85015R18896J003257J103067J186964J271013J425296J583473
5373B7114463J760966J966620K148031K402802K724954K897883L349872L895295
5365D8260886M362603M979680N556594O306458P638385R323107J0818854J2346539
5357A09593106J3501702J3175159J0168081L884962l959207j0831102j4199149
$$ y = [5289970, 5313749, 5356205, 5343423, 5322065, 5439569, 5519344, 5539460, 5588641, 5669176, 5804916, 5959333, 6121829, 6280735, 6472096, 6625305, 6909060, 7191840, 7381389, 7761417, 8034523, 8266294, 8570428, 9048147, 9435449, 9753777, 10109885, 10480855, 10822095, 11073709, 11493832, 11890278, 12508577, 12999506, 13500530, 14077058, 14712481, 15419392, 16181753, 16878418, 17737482, 18622497, 19541393, 20544650, 21647717, 22834681, 24105694, 25530990, 27114463, 28875429, 30842049, 32990080, 35392882, 38117836, 41015719, 44365591, 48260886, 52623489, 57603169, 63159763, 69466221, 77104606, 86427713, 97246567, 109593106, 123094808, 136269967, 146438048, 150323010, 146363803, 135532701, 121333552]
5350A21333552j4578737j3166288j1303061r304208p491182o176058n408258m709675
5342D9196085l980849l296339k898670k428992k162907k007868j902104j771618
5334B8746738j693275j603524j467675j276674j230025j075642q64042p64551
5326A8771330p62011o80216p21459q25864p31984p71320p48325p01569o57970
5317A2170612o96031m89763n56445m97190m64143m31444l21512k54888k10705
5308H248491l44961l03159k43103k93179k22966j87847j57988j23196j59668k42111
5298E970313j70375r4878k52335j99340j48677j16572j36665j14606k06445k39604
5288D290816n8832j17367j23998j24022j14163r9752j14546o5355j10604j01362
$$ y = [121333552, 106754815, 93588527, 82285466, 72981258, 65490076, 59314018, 53905760, 49196085, 45215236, 41918897, 39020227, 36591235, 34428328, 32420460, 30518356, 28746738, 27053463, 25449939, 23982264, 22705590, 21475565, 20399923, 19535881, 18771330, 18009319, 17329103, 16607644, 15781780, 15049796, 14278476, 13530151, 12828582, 12170612, 11474581, 10984818, 10428373, 9931183, 9467040, 9035596, 8714084, 8459196, 8248491, 7903530, 7600371, 7357268, 7064089, 6841123, 6653276, 6495288, 6372092, 6212424, 5970313, 5799938, 5705060, 5452725, 5253385, 5104708, 4988136, 4851471, 4736865, 4530420, 4290816, 4231984, 4114617, 3990619, 3866597, 3752434, 3652682, 3538136, 3472781, 3362177, 3260815]
5278C260815o9435j20274j5445l0061j61254j13247l5908r3314q3152r1673K4086
5267B471138m4234j06058j12474J9540N726j06800M3960j36048K1188q5511n0298
5256A920129l7961l6510p0504n2868L1963k0084r4602k1918J6356M0564k4053
5245A650512j6398m1878p3098q468P454n452j05704Q687L1674l5332r2907p7704
5233A241386o4027J8525n3089q6404l961Q8297j4100n4375q2134j3018m0005J6870
5221I53965j35461m0937J45644M8685n7072m8624q2637P452n5990n3411P4825
5210G56439O4027q7120o8007j8293L5881p984p8247K9743N6565m2777l8949O6055
5198F67333k8855L027Q5540j07386p3605L5231L4516o208l3546k9419J5205m34
$$ y = [3260815, 3191380, 3071106, 3055661, 3025600, 2864346, 2751099, 2715191, 2621877, 2538725, 2447052, 2471138, 2426904, 2320846, 2208372, 2227912, 2233638, 2126838, 2170798, 2034750, 2055938, 1970427, 1920129, 1882168, 1845658, 1775154, 1722286, 1754249, 1734165, 1639563, 1617645, 1634001, 1674565, 1650512, 1634114, 1592236, 1519138, 1510670, 1518124, 1512672, 1406968, 1415655, 1447329, 1411997, 1319090, 1241386, 1177359, 1195884, 1142795, 1056391, 1052430, 1140727, 1126627, 1072252, 990118, 977100, 937095, 953965, 818504, 777567, 923211, 971896, 914824, 866200, 783563, 791015, 735025, 681614, 756439, 820466, 733346, 665339, 647046, 682927, 674943, 596696, 626439, 683004, 640227, 601278, 667333, 638478, 641505, 727045, 619659, 546054, 581285, 615801, 609593, 576047, 546628, 561833, 561399]
5186E61399M961Q735J3105l0211J1387J9032l0034k4494J193J4924m1413L1448
5174E40032q36q7328L6240M1053K8875j02465K8726R5420o0169q6805M5115P5856
5162E53714n0116L5261P6661J2565p6686r5847J7950L817n4324L4669q3636J01462
5150D75490m8232N1093k8363O7973l0867n8269p4224J01541J02787j61O227R386
5138E74381J9867q6516J02021M0048j7748j0855M6364Q2145k2029N3501N1473
5127H32652Q1007K3506L4874J19030j9888j3223j22358m5327m5367r5410m7916
5116G01580o4980m9954k6287j9432k7278p210L6694n2149K0614O8986p6348j07926
5104C96310O356l0126k4218O544n11N3626m1184m2195r071n5340j6602J03732
$$ y = [561399, 566360, 575095, 588200, 557989, 569376, 588408, 558374, 533880, 535073, 549997, 508584, 540032, 539196, 451868, 488108, 529161, 558036, 455571, 484297, 579717, 519548, 432743, 477858, 553714, 503598, 538859, 615520, 628085, 551399, 455552, 473502, 477319, 422995, 457664, 374028, 475490, 427258, 478351, 449988, 517961, 487094, 428825, 354601, 456142, 558929, 558768, 564995, 574381, 594248, 507732, 609753, 649801, 632053, 621198, 667562, 749707, 727678, 781179, 832652, 913659, 937165, 972039, 1091069, 1071181, 1057958, 935600, 890273, 844906, 749496, 701580, 636600, 586646, 560359, 540927, 513649, 506439, 543133, 490984, 511598, 580584, 504236, 396310, 402666, 372540, 348322, 354866, 354355, 407981, 366797, 324602, 315531, 260191, 243589, 347321]
5092C47321m6879J731M1898k7615r8298n396O0288m831k6233M4506l4987l0241
5080B21264j4954k693L1719o7937N5260m1442Q988N0829j6316L7894l0506J7625
5068B49731k1127r6148P2431J6331J6416j1511j4704N9905k8992p3649k77j3563
5056A54843K863n149l3262m053K592K4327Q626m8927O9119M0042k2184l6887L1664
5043A83614l3684k0504K2180n7570N598j3625J00169N1067o1188p0278m7291O3126
5031A21614r22O3623p8781r471N3645M7136M417r1436o0732M5831K5313O570P0690
5018A97497j06311K2361m9662J9259J18792m1302r2810j2607M5373k1777K3775
5007A02588O8786j213l7801N357l5999k0807P4797o2799L384M1909k7965l179
$$ y = [347321, 300442, 302173, 344071, 316456, 218158, 212762, 273050, 268219, 241986, 286492, 251505, 221264, 206310, 203617, 235336, 167399, 222659, 181217, 190205, 241034, 224718, 262612, 232106, 249731, 228604, 132456, 204887, 221218, 237634, 226123, 211419, 271324, 242332, 168683, 168406, 154843, 157706, 152557, 119295, 115242, 117834, 142161, 150787, 101860, 170979, 211021, 188837, 151950, 183614, 149930, 129426, 151606, 94036, 99634, 86009, 186178, 237245, 176057, 105779, 58488, 121614, 120692, 184315, 105534, 96063, 149708, 196844, 201261, 109825, 49093, 94924, 120237, 126807, 197497, 91186, 113547, 63885, 83144, 201936, 160634, 67824, 55217, 100590, 78813, 102588, 171374, 170161, 132360, 137717, 101718, 80911, 155708, 92909, 96293, 138202, 110237, 107058]
4995A07058L1183q7195M5351j8641o3428J25452r9622L3829O5814k0653O542m0615
4983H5075j7598k511N5959N7451j11881m318N1971J2474p3197M2450J747L0860
4971A28482J2268N0125J1502l9042L5359m6076k0882o5937K6273k6638j7967N0902
4959I8369M0818K469K2778k4387m7155N4892l6845k0040k316j0254k7448L9151
4947I0032M6604j10178M5944O6132l2810L6056k2416M7942L9792k4415O0725j02895
4935A40513l8389j1602j1299J0072K6667l8226K7459N4191L302L179m3707k4597
4923I7563j0064J4035m5662L5462N636J6868N1833k004M9323p7899L9440n7830
4911A16701j6529J2087O858N0285r077n7468K904L6855l2141J403N408Q3357J4526
$$ y = [107058, 138241, 51046, 96397, 77756, 14328, 139780, 40158, 73987, 139801, 119148, 125690, 85075, 67477, 64966, 120925, 178376, 66495, 62177, 114148, 126622, 53425, 95875, 97622, 128482, 140750, 190875, 202377, 163335, 198694, 152618, 131736, 65799, 92072, 65434, 47467, 98369, 139187, 141656, 164434, 140047, 92892, 147784, 110939, 90899, 88583, 78329, 50881, 90032, 136636, 26458, 72402, 138534, 105724, 141780, 119364, 167306, 207098, 182683, 243408, 140513, 102124, 90522, 79223, 89295, 115962, 77736, 105195, 159386, 162688, 165867, 122160, 97563, 87499, 101534, 55872, 91334, 96970, 113838, 165671, 163667, 212990, 135091, 174531, 116701, 100172, 112259, 119117, 169402, 160325, 102857, 105761, 142616, 110475, 111878, 117286, 200643, 215169]
4898B15169n2481k8051k5188O1080k375l1461R3209j2418o0685O2380q5494O2881
4886A96566O2100j27412P4462R951l8296o904K0360l1960N8829j9337n4298J9215
4874A63276L9682K4576n4272J6087j569M4641O7363p5625o1777L6495K4r293R3851
4861B83459L6496k4623n8721M6632M2371l445K8938o2919o9307Q8118L9848k196
4849C44651m4172J1996O8886M0843K6503o0045k9627O080j2732j7957K2495N7720
4837D14641L3683q4603O63P9624N0367l7390n3738l6945k7837r5607J04595M2238
4825C89691N655J6979o3826M7571J2167L6544Q742p2521k0355l9141K5986M2970
4813C90462L4764q777j06175k2464R4996m9210k6577M5515K2405J5366n8615p0590
$$ y = [215169, 162688, 134637, 109449, 170529, 168154, 136693, 229902, 217484, 156799, 219179, 133685, 196566, 258666, 131254, 205716, 215667, 177371, 170467, 190827, 158867, 217696, 198359, 144061, 163276, 202958, 227534, 173262, 189349, 187780, 232421, 299784, 224159, 162382, 198877, 198901, 189608, 283459, 319955, 295332, 236611, 283243, 325614, 322169, 351107, 288188, 218881, 306999, 346847, 344651, 300479, 312475, 381361, 422204, 448707, 388662, 359035, 365115, 352383, 334426, 356921, 414641, 448324, 363721, 364384, 444008, 494375, 456985, 403247, 366302, 338465, 242858, 347453, 389691, 395346, 412325, 348499, 396070, 408237, 444781, 453523, 381002, 360647, 321506, 347492, 390462, 425226, 416449, 310274, 287810, 382806, 333596, 307019, 352534, 374939, 390305, 331690, 261100]
4801B61100J6873N9128k7827M225j2326O8247L8387n0025k2939Q342n581O3400
4789D01004l3524O1349l746k7023m340n5971P024J13619K9315l2315j7977k8534
4777D08881Q0445k065p3034J7800k525N1595O3448k5046k0336j1319k0977j7356
4765D49511L7476O0996j5756j5925J7677o9800Q1877N1400o9791N2495J5561j2150
4753E83571n154l0735Q742Q1038O1474r8272K1315p896o4130M5513k3471Q4207
4741F56202k4025L896N6653j13906l2649P2471J6009l108j0426k9093m0123P3045
4729F24946P2161p802k0001Q357R4615K6367k8092Q1122m2740J5106M1872l8178
4717H27733N7605r8017L2597k6779K1275J12264N8852k7643J8733N4478J8437
$$ y = [261100, 277973, 337101, 309274, 313499, 301173, 369420, 407807, 357782, 334843, 343185, 337604, 401004, 367480, 428829, 425083, 398060, 393720, 337749, 344773, 458392, 487707, 455392, 437415, 408881, 489326, 487261, 414227, 432027, 429502, 481097, 544545, 519499, 499163, 487844, 466867, 449511, 486987, 547983, 532227, 516302, 533979, 464179, 546056, 597456, 527665, 580160, 595721, 583571, 578417, 547682, 556424, 637462, 698936, 600664, 621979, 614083, 549953, 595466, 571995, 656202, 632177, 636073, 692726, 578820, 546171, 618642, 634651, 631543, 621117, 592024, 551901, 624946, 697107, 689305, 669304, 677661, 772276, 798643, 770551, 851673, 808933, 824039, 865911, 827733, 885338, 787321, 819918, 793139, 814414, 926678, 985530, 957887, 976620, 1031098, 1049535]
4706A049535o6189j9062N8277q067J17550q6940M5362R1357M4329P6256l2952
4695A269456J4949L4873M8428L4507k0720M6987J23504N8285k0332J06332K145
4684A698414m026J29697K7296R4591Q7736L7619P0502K08514j2363J5390N3695
4673B407065J70629J82711K3448R6936J21875J17566K06287R4826Q9376J98122
4663C708841K14661J50596J78697J22814K95671K14555K28620K21489K72668K73064
4653E881676L23420K92954L51374M28740K93574L93699M34728M71067N38650N05205
4643I915087N71644O73300O36501P44786O79675Q50085Q89090Q40521R33891R34209
4633A7668789Q95585J026156J052854J040025J118084J052726J109113J206548
$$ y = [1049535, 983346, 964284, 1022561, 1014494, 1132044, 1045104, 1090466, 1181823, 1226152, 1302408, 1269456, 1284405, 1319278, 1367706, 1402213, 1381493, 1428480, 1551984, 1610269, 1589937, 1696269, 1698414, 1694388, 1824085, 1851381, 1945972, 2033708, 2071327, 2141829, 2350343, 2337980, 2353370, 2407065, 2577694, 2760405, 2783853, 2880789, 3002664, 3120230, 3326517, 3421343, 3510719, 3708841, 3923502, 4074098, 4252795, 4375609, 4671280, 4885835, 5114455, 5335944, 5608612, 5881676, 6205096, 6498050, 6849424, 7278164, 7571738, 7965437, 8400165, 8871232, 9409882, 9915087, 10486731, 11160031, 11796532, 12541318, 13220993, 14071078, 14960168, 15800689, 16734580, 17668789, 18564374, 19590530, 20643384, 21683409, 22801493, 23854219, 24963332, 26169880]
4625B6169880J128970J153025R99934R28591Q43050P95597O92056O41798O85642
4616C4038543O03035N04439N87080L30732K05680l6141j65812l30467m20326m57187
4606C4859576o04080o16097n95842o06892o27715q38403j074736j032780r96848
4597B7866183j174434j116241j134986j068280j039984r86442j007933r86365
4589A9351518r14634r56700r58077q72327p95158q68775p04442p77746o86166
4580A1817493n44647o25560n60893m86765n12979n02039m09642m15671m06053
4571G353244l32212k45706k41268k76091k88478k37711k27228j84394j71913k58094
4561D890149j91738j03926k01431j35898j49571k15318p7503j57679j23894r3524
$$ y = [26169880, 27298850, 28451875, 29451809, 30380400, 31223450, 32019047, 32711103, 33352901, 34038543, 34641578, 35146017, 35733097, 36063829, 36269509, 36233368, 36067556, 35737089, 35316763, 34859576, 34255496, 33639399, 33043557, 32436665, 31808950, 30970547, 29895811, 28863031, 27866183, 26691749, 25575508, 24440522, 23372242, 22332258, 21345816, 20337883, 19351518, 18436884, 17480184, 16522107, 15649780, 14854622, 13985847, 13281405, 12503659, 11817493, 11272846, 10647286, 10086393, 9599628, 9086649, 8584610, 8174968, 7759297, 7353244, 7021032, 6775326, 6534058, 6257967, 5969489, 5731778, 5504550, 5320156, 5148243, 4890149, 4698411, 4594485, 4393054, 4257156, 4107585, 3892267, 3814764, 3657085, 3533191, 3439667]
4551C439667j03608m2255n1083j57604o3696j04622m2376m3478j33778L3722r6525
4540B634364r5732l228p8629k2785q4808Q180l9013R796j28670j8487K9642m7489
4528B163141m4076j2920k9495n6118K0669N7920j1701j8383l0384L3122m3429
4517B028346k1921R2886j0829j21850M931q5487o2259J08664L025m2500l1134
4506A861872m8462L819n9232o714m8960l3862L8836j04100j3338N2646j02806
4495A539699K1588N2625p7942K6772j07935l5254k9360L6999K1804l5935k2142
4484A390919N1488N05l9973L5302j5589j2846J635O5393p1072k5746M6515j2841
4472A413690M275j4698P2245l5366j4964J6851j0256P8070p5592j6056K0911N7787
$$ y = [3439667, 3336059, 3293804, 3242721, 3085117, 3021421, 2916799, 2874423, 2830945, 2697167, 2730889, 2634364, 2538632, 2535404, 2456775, 2433990, 2349182, 2357362, 2318349, 2328145, 2199475, 2180988, 2210630, 2163141, 2119065, 2106145, 2076650, 2020532, 2041201, 2099121, 2087420, 2069037, 2038653, 2071775, 2028346, 2006425, 2099311, 2088482, 1966632, 1971563, 1886076, 1823817, 1932481, 1935506, 1893006, 1861872, 1813410, 1817229, 1757997, 1751283, 1702323, 1668461, 1707297, 1603197, 1589859, 1642505, 1539699, 1561287, 1613912, 1535970, 1562742, 1454807, 1419553, 1390193, 1427192, 1448996, 1413061, 1390919, 1442407, 1442912, 1402939, 1438241, 1422652, 1409806, 1411441, 1476834, 1405762, 1380016, 1426531, 1413690, 1417965, 1403267, 1475512, 1440146, 1425182, 1442033, 1431777, 1509847, 1434255, 1418199, 1439110, 1496897]
4460A496897L8592p3238J0956N2421j5027j8275m18K832J57248p986j0534M3087
4448A676555P364K4611L6035p762J4489k8318J7240n364K3141L0605m795O1943
4436A845744M4842m6225K5791M6676r944P735J342m774J5515L7721L3812j5295
4424A982940M7735J10210J09252j26187Q8082o90L7203Q831n246K6050N9323Q3268
4412B420771l051P4834k4915P7628K4096J11249R189R5145J85175M0401l4522
4401B976000P6585N2898M6535L0865j6039J44600O7804J1504O9311N9711Q0168
4390C599942O5547K6868O7838O3996Q6888J39541L7762K0649M3406J5742J2692
4379D180871R0887Q7123O8595J29030M354M8084K7288J08293Q3642J54399Q4550
$$ y = [1496897, 1535489, 1462251, 1473207, 1525628, 1510601, 1492326, 1491908, 1494740, 1651988, 1644002, 1633468, 1676555, 1683919, 1708530, 1744565, 1736803, 1751292, 1722974, 1740214, 1734850, 1757991, 1788596, 1783801, 1845744, 1890586, 1844361, 1870152, 1916828, 1906884, 1914619, 1915961, 1911187, 1926702, 1964423, 1998235, 1982940, 2030675, 2140885, 2250137, 2123950, 2212032, 2211342, 2248545, 2257376, 2252130, 2278180, 2337503, 2420771, 2417720, 2492554, 2467639, 2545267, 2569363, 2680612, 2689801, 2784946, 2970121, 3010522, 2976000, 3052585, 3105483, 3152018, 3182883, 3166844, 3311444, 3379248, 3390752, 3460063, 3519774, 3599942, 3665489, 3692357, 3760195, 3824191, 3911079, 4050620, 4088382, 4109031, 4152437, 4168179, 4180871, 4271758, 4358881, 4427476, 4556506, 4560860, 4608944, 4636232, 4744525, 4828167, 4982566, 5067116]
4368E067116o2411Q5301M3555J89883J22281J59156J52488J59838R9438J62569
4358F179214K44466J95719O7079K11390K87368J38253K47688R2030K47395L66621
4348H277223L04709K61194L24037L05792L06315K85539L54673M27945L26245M75239
4338A1648911L69410M47477M21471N29715M57175N30063O02283N94703N10138
4329A6111346O52540O63840P41855Q10522Q82668R36246R12487J013014J096127
4320B3820645J209089J332083J437846J605450J618123J825706K113577K197119
4312C7159638K401428K716814K969232L158095L485434L574381L847124L944073
4304F3256219M064414L967980L736709L371089K984067K481597J896042J330041
$$ y = [5067116, 5004705, 5090006, 5133561, 5323444, 5445725, 5604881, 5757369, 5917207, 6016645, 6179214, 6423680, 6619399, 6686478, 6897868, 7185236, 7323489, 7571177, 7663207, 7910602, 8277223, 8581932, 8843126, 9167163, 9472955, 9779270, 10064809, 10419482, 10847427, 11173672, 11648911, 12018321, 12465798, 12887269, 13416984, 13874159, 14404222, 15006505, 15601208, 16111346, 16763886, 17427726, 18169581, 18980103, 19862771, 20799017, 21711504, 22724518, 23820645, 25029734, 26361817, 27799663, 29405113, 31023236, 32848942, 34962519, 37159638, 39561066, 42277880, 45247112, 48405207, 51890641, 55465022, 59312146, 63256219, 67320633, 71288613, 75025322, 78396411, 81380478, 83862075, 85758117, 87088158]
4296H7088158Q27895M29622M3645k46538o27653r02895j315227j757244k217591
4287H1322172k695224l092400l452306l661329l733065l814115l715928l497043
4279E3660762l353563k991422k677622k525034k303174k008096j840499j604357
4271C4356995j554565j309305j292444j146980r50360r18195q25497p64376q21055
4262B4774218o22863n77376n63347n03564n48431m35173l22264l49017k96116
4253B0556067l16355k36879j94131j54298j29288j38183o8482K586O0091L2493
4243A9413621J24574J09147J57021K09199L73050L10138L25441M58922N57335
4234B2038448N79006O30221Q02376Q98132R86831J008927J045746J242211J191964
$$ y = [87088158, 87916053, 88345675, 88389320, 88142782, 87515129, 86612234, 85297007, 83539763, 81322172, 78626948, 75534548, 72082242, 68420913, 64687848, 60873733, 57157805, 53660762, 50307199, 47315777, 44638155, 42113121, 39809947, 37801851, 35961352, 34356995, 32802430, 31493125, 30200681, 29053701, 28103341, 27185146, 26359649, 25595273, 24774218, 24151355, 23573979, 23010632, 22507068, 21958637, 21523464, 21201200, 20852183, 20556067, 20239712, 20002833, 19808702, 19654404, 19525116, 19386933, 19318451, 19321037, 19381128, 19413621, 19538195, 19647342, 19804363, 20013562, 20386612, 20696750, 21022191, 21481113, 22038448, 22617454, 23247675, 24050051, 24948183, 25935014, 26943941, 27989687, 29231898, 30423862]
4225C0423862J358457J366857J189851J052735J091303Q22090N14200L01678J66976
4216C8288009o9103j63601j86088k28015r5833j34052O1541J75774L22030O02136
4206C8572798O42876P14192R77037J057819J331748J436559J649304J848044K049259
4197E0279636K234531K478428K832640L135982L436174L785691M222648M518137
4189G6923867M872077N291901N504041N741479N584011N492068N184211M511038
4181A19104693L828737L025600K072089J144438M76808j21183n55737p38979q19632
4172A27416834p82814n00649m48905l43034l53714m15823o82693j015998j405357
4163A21467847k060557k606408l137241l770870m199465m526909m834761m801191
$$ y = [30423862, 31782319, 33149176, 34339027, 35391762, 36483065, 37305155, 37819355, 38121033, 38288009, 38218906, 38055305, 37869217, 37641202, 37545369, 37411317, 37472858, 37648632, 37970662, 38572798, 39215674, 39929866, 40906903, 41964722, 43296470, 44733029, 46382333, 48230377, 50279636, 52514167, 54992595, 57825235, 60961217, 64397391, 68183082, 72405730, 76923867, 81795944, 87087845, 92591886, 98333365, 103917376, 109409444, 114593655, 119104693, 122933430, 125959030, 128031119, 129175557, 129652365, 129531182, 128975445, 128236466, 127416834, 126634020, 126133371, 125684466, 125341432, 124987718, 124571895, 123889202, 122873204, 121467847, 119407290, 116800882, 113663641, 109892771, 105693306, 101166397, 96331636, 91530445]
4155I1530445m795954m735356m480415m263635l933255l768813l355925k918311
4147E9278781k779494k546329k223850j932677j735325j619681j388265j229315
4139D3823845j067046r35588p15695m82410m52867k27463j74156m9477J57918
4130C9877061N1024P3871K78029J78114R3084R53n1232k11044l54383n14912n70699
4119C8849866p45851p55928p34669q26198p51202o56693m71033n21689k17801
4110C3168802k20949N4026J62967K92846M00621M16174O36304P97461P90651O09285
4100C7108188P61174P38043O18295N26781M65220M99596L28670J91742Q6244N821
4090D1329774K0026m1661k65417k75020k65572k62929l58186n42714m39417m52446
$$ y = [91530445, 86734491, 81999135, 77518720, 73255085, 69321830, 65553017, 62197092, 59278781, 56499287, 53952958, 51729108, 49796431, 48061106, 46441425, 45053160, 43823845, 42756799, 41821211, 41105516, 40623106, 40170239, 39942776, 39768620, 39719143, 39877061, 39928085, 40001956, 40279985, 40458099, 40551183, 40552136, 40500904, 40289860, 39935477, 39420565, 38849866, 38104015, 37348087, 36613418, 35787220, 35036018, 34379325, 33908292, 33386603, 33168802, 32947853, 33001879, 33164846, 33457692, 33858313, 34274487, 34910791, 35708252, 36498903, 37108188, 37869362, 38607405, 39225700, 39752481, 40217701, 40717297, 41045967, 41237709, 41323953, 41329774, 41349800, 41308139, 41042722, 40767702, 40502130, 40239201, 39881015, 39338301, 38898884, 38446438]
4080C8446438l82093k55710k52583L5072J85098L37567L96144O35589Q80589R50505
4070D0976616J128118J344488J479853J762619K049205K168433K460010K631433
4062E6000775K754542K987057L088085L055332K980256K834228K630851K304186
4054G8635312K066024J781482J438539J043457P76184L89895J32463k81973m71365
4045H5510018q41990j110567j303181j377135j614216j725815j776538j717655
4037G4042921j639475j351903j136350p79555m26129n2075L94657P49051J061703
4028G0862845J053269R92813Q78100J054941J312627J576494J797255J956176
4020H1484520J811848J805262J576528J394407J180088Q55758O84822L89595J61960
$$ y = [38446438, 38064345, 37808635, 37556052, 37591124, 37776222, 38113789, 38509933, 39145522, 40026111, 40976616, 42104734, 43449222, 44929075, 46691694, 48740899, 50909332, 53369342, 56000775, 58755317, 61742374, 64830459, 67885791, 70866047, 73700275, 76331126, 78635312, 80701336, 82482818, 83921357, 84964814, 85740998, 86130893, 86263356, 85981383, 85510018, 84668028, 83557461, 82254280, 80877145, 79262929, 77537114, 75760576, 74042921, 72403446, 71051543, 69915193, 69135638, 68709509, 68657434, 69052091, 69801142, 70862845, 71916114, 72908927, 73787027, 74841968, 76154595, 77731089, 79528344, 81484520, 83296368, 85101630, 86678158, 88072565, 89252653, 90108411, 90793233, 91182828, 91344788]
4011I1344788K2130j00851k94290n98433o26012q78405j312376k032820k890691
4002H2633040l787047m249298m116875l822762l459938l184925k667117k401776
3994E4943302k014956j725303j450330j228563r04770p00387m33725j74858P6294
3985D6386704L65120N24447P69183J027117J149871J053533Q16812M46658K28829
3976E2768274J03915R506J7393o8808p8763r9388l49644m84380o08519o76801
3966E0532785q48946r11360r67291j051209j221860j221215j193228j244963j159196
3957D0713517j017892j006317q63787p71256o38243m52326l06296k35520o9288
3948C5352592M1840K12561L26195M37399N96321P98119Q84338J191648J228317
$$ y = [91344788, 91366918, 91266067, 90971777, 90373344, 89747332, 88868927, 87556551, 85523731, 82633040, 78845993, 74596695, 70479820, 66657058, 63197120, 60012195, 57345078, 54943302, 52928346, 51203043, 49752713, 48524150, 47619380, 46918993, 46485268, 46310410, 46386704, 46751824, 47276271, 48045454, 49072571, 50222442, 51275975, 52092787, 52539445, 52768274, 52872189, 52881695, 52899088, 52830280, 52751517, 52652129, 52302485, 51818105, 51209586, 50532785, 49683839, 48772479, 47805188, 46753979, 45532119, 44310904, 43117676, 41872713, 40713517, 39695625, 38689308, 37825521, 37054265, 36416022, 35963696, 35657400, 35421880, 35352592, 35394432, 35606993, 35933188, 36370587, 36966908, 37765027, 38649365, 39841013, 41069330]
3939D1069330J395635J634774J812322K031477K068425K128992K161141K110495
3931E6412591K099157J983351J676793J513870J191769Q85700N81745K68204K2223
3922F6635403j82114l13800m40881m46975l64246l32573K1003J81588J93244K92191
3912F5242840M36007L54727J31546j27769n32642q57789j389648j871688k255891
3903E9129693k469649k627904k794308k854240k744245k634895k459937k287402
3895C8257113k105544j943509j738009j564967j386617j242182j289381j071258
3887B5915646q69233q27731q22319p90933o37702n46473n95255m00874k84105
3878B0141021k88276k27592k11201j56609M4218N7745Q7592J6797J07084J59942
$$ y = [41069330, 42464965, 44099739, 45912061, 47943538, 50011963, 52140955, 54302096, 56412591, 58511748, 60495099, 62171892, 63685762, 64877531, 65763231, 66344976, 66613180, 66635403, 66453289, 66139489, 65698608, 65251633, 64887387, 64554814, 64575817, 64757405, 64950649, 65242840, 65678847, 66033574, 66165120, 66037351, 65504709, 64646920, 63257272, 61385584, 59129693, 56660044, 54032140, 51237832, 48383592, 45639347, 43004452, 40544515, 38257113, 36151569, 34208060, 32470051, 30905084, 29518467, 28276285, 26986904, 25915646, 25046413, 24218682, 23396363, 22605430, 21967728, 21421255, 20826000, 20425126, 20141021, 19852745, 19625153, 19413952, 19257343, 19301561, 19359306, 19446898, 19463695, 19570779, 19730721]
3868A9730721J03203O6660L0105j10113k42844k76549l95852m78037n35977o57458
3858A7233859n78617o41844o88321n53107n22754n10190m11087m54260l44614
3849A2529065l96987l98813l16010k23115j25877k84865j83140j61348k02928
3840A0235982j77388j37447j07283j87963k03467r1042j21492j35542l4845j56021
3830H883492j47159j33350n0132n3289m4297o6180n7484r8814n4209L9108j11579
3819H106107k025L724j3635R262R68M866P4303Q9849J2916M4873Q2908N5581L0258
3806H499955N882L1105J1263j3406J16805J52542P6120P5805J40998N5010M4813
3795I196892J38322J37000J46145J27491J83014J43909J62338J45240J17595K71987
$$ y = [19730721, 19833924, 19900584, 19930689, 19820576, 19577732, 19301183, 18905331, 18427294, 17891317, 17233859, 16655242, 16013398, 15325077, 14771970, 14249216, 13739026, 13327939, 12873679, 12529065, 12132078, 11733265, 11417255, 11194140, 11068263, 10783398, 10600258, 10438910, 10235982, 10058594, 9921147, 9813864, 9625901, 9422434, 9331392, 9209900, 9074358, 9039513, 8883492, 8736333, 8602983, 8552851, 8499562, 8455265, 8389085, 8331601, 8232787, 8178578, 8217686, 8106107, 8104082, 8107806, 8094171, 8103433, 8104401, 8109267, 8183570, 8273419, 8286335, 8331208, 8414116, 8469697, 8499955, 8505837, 8536942, 8548205, 8534799, 8651604, 8804146, 8880266, 8956071, 9097069, 9152079, 9196892, 9335214, 9472214, 9618359, 9745850, 9928864, 10072773, 10235111, 10380351, 10497946, 10769933]
3785A0769933K24219K07663K59552J88492K39150K28768K39264K93153L23823
3776A2974017L41450L33459L61056L81089L75993M95574M41126M11933N90693
3767A6706390O38292N79059N57247P50366Q60479Q23806Q49050R23790R80202
3758B3668681J018423J024312J135657J229994J148287J182149J221833J289601
3750C2918937J291977J290974J343638J542934J579367J726184J875791J918810
3742D5488612J994817K268830K383677K497309K608878K923080L060909L243069
3734F6469181L560871L839934M277982M549158M974114N487508O066984O680912
3726A05906644P443585Q215724R214551J0272138J1513242J2774301J4275348
$$ y = [10769933, 10994152, 11201815, 11461367, 11649859, 11889009, 12117777, 12357041, 12650194, 12974017, 13315467, 13648926, 14009982, 14391071, 14767064, 15262638, 15703764, 16115697, 16706390, 17344682, 17923741, 18480988, 19231354, 20091833, 20915639, 21764689, 22688479, 23668681, 24687104, 25711416, 26847073, 28077067, 29225354, 30407503, 31629336, 32918937, 34210914, 35501888, 36845526, 38388460, 39967827, 41694011, 43569802, 45488612, 47483429, 49752259, 52135936, 54633245, 57242123, 60165203, 63226112, 66469181, 70030052, 73869986, 78147968, 82697126, 87671240, 93158748, 99225732, 105906644, 113350229, 121565953, 130780504, 141052642, 152565884, 165340185, 179615533]
3719A79615533J5785387J7422116J9351736K1142218K2627433K3389565K2729996
3712C22063984J9493391J3614828N064698m730844j3690269k0382103k3827500
3705B97606185k4590626k3722081k1652531j9535684j7452942j5438950j3684191
3698A61529180j2208472j0744972r345553q321406p353761o723393n997507n437274
3690I5396842n186517m704317m281883l917468l659266l480886l194525k973386
3682F3998594k815293k605818k548492k492213k486175k385866k237292k189255
3674D4238190k061667j915276j881174j716382j548575j502779j322498j160727
3666C1129112j118158j119707j053150q91814r39484q91321q15945p84292o73009
$$ y = [179615533, 195400920, 212823036, 232174772, 253316990, 275944423, 299333988, 322063984, 341557375, 355172203, 360236901, 355506057, 341815788, 321433685, 297606185, 273015559, 249293478, 227640947, 208105263, 190652321, 175213371, 161529180, 149320708, 138575736, 129230183, 120908777, 113555016, 106831623, 100834116, 95396842, 90210325, 85506008, 81224125, 77306657, 73647391, 70166505, 66971980, 63998594, 61183301, 58577483, 56028991, 53536778, 51050603, 48664737, 46427445, 44238190, 42176523, 40261247, 38380073, 36663691, 35115116, 33612337, 32289839, 31129112, 30010954, 28891247, 27838097, 26946283, 26006799, 25115478, 24299533, 23515241, 22842232]
3657B2842232o57310n54216n61359o70651o48411n16950n43000o29914o32338
3648A7428083m64369n32932n27151m76883m67274n23878l65341m07825k87236
3639A3375194l26667l86257l84174k84648l13407k72016k91693k96335k67943
3630A0552054k27409k75495l00008l07082j46778j77545j83003j44904k88004
3621H501826j68343j53038k47822j05729j99113j60943j44101k59227j24185j55760
3611F783565j76949n3788j16839j98949j22753j66958j22438j31148r7579j04534
3601E491630l1036q0009r2573k05224j95803n2437o6403j08315j05302j66059
3591D388469o0861M2509q2797k22707r568j20615r7143o2983n5960q5076j24601
$$ y = [22842232, 22184922, 21630706, 21069347, 20398696, 19750285, 19233335, 18690335, 18060421, 17428083, 16963714, 16430782, 15903631, 15426748, 14959474, 14435596, 14070255, 13662430, 13375194, 13048527, 12662270, 12278096, 11993448, 11680041, 11408025, 11116332, 10819997, 10552054, 10324645, 10049150, 9749142, 9442060, 9295282, 9117737, 8934734, 8789830, 8501826, 8333483, 8180445, 7932623, 7826894, 7627781, 7466838, 7322737, 7063510, 6939325, 6783565, 6606616, 6552828, 6435989, 6237040, 6114287, 5947329, 5824891, 5693743, 5596164, 5491630, 5460594, 5380585, 5288012, 5082788, 4886985, 4834548, 4768145, 4659830, 4554528, 4388469, 4327608, 4370117, 4287320, 4064613, 4055045, 3934430, 3837287, 3774304, 3718344, 3633268, 3508667]
3580C508667j12843m3849p6707p7736N8397j4694m7491m7767o4992n4474q3190
3569B943321m8618j20264Q1307n4910q1292k3836o3649l9888r5460O8373l337
3558B561747L098q0768j6936o620p1967j4522q170L0035l8092m8854O1288J9302
3546B389541j5651K3805j1711J3682n017l5403m4759m1969J8369N3451m9585q9502
3534B205251L2435j663m8723P8241J0770o8503j3603n2188K550r325L2098m914
3522B162426l3443K5746k0817K3791k4505R933P1512o6799M9239O1461k5463J2425
3510B245506L4377N3232O3512L7190P1996J5571J07782Q4683L9514K1218J18007
3499B892588Q5372J45712O3884p8211p7621r9930j6406q7170j77465r0498r8598
$$ y = [3508667, 3395824, 3351975, 3275268, 3197532, 3255929, 3241235, 3193744, 3145977, 3080985, 3026511, 2943321, 2894703, 2774439, 2855746, 2800836, 2719544, 2695708, 2632059, 2592171, 2496711, 2565084, 2561747, 2564845, 2484077, 2467141, 2460521, 2388554, 2374032, 2365862, 2395897, 2357805, 2308951, 2370239, 2389541, 2373890, 2397695, 2385984, 2399666, 2394649, 2359246, 2314487, 2272518, 2290887, 2344338, 2294753, 2205251, 2237686, 2236023, 2187300, 2265541, 2276311, 2207808, 2194205, 2142017, 2144567, 2135242, 2167340, 2162426, 2128983, 2154729, 2133912, 2157703, 2133198, 2143131, 2214643, 2147844, 2197083, 2258544, 2233081, 2245506, 2279883, 2333115, 2396627, 2433817, 2505813, 2521384, 2629166, 2713849, 2753363, 2774581, 2892588, 2977960, 3123672, 3187556, 3109345, 3031724, 2931794, 2915388, 2828218, 2650753, 2560255, 2461657]
3488B461657j67338j26932o4299q361j14142O4451j19546J8906q5049o9578q2040
3477A707729K8637l7340j18385k3398l6687j5306m4705p7828L5314o260o7768
3466A344003P8704r1336m7057k8020j2639k3223k3265n4102J13347n8010L4735
3455A233137o6918n2772k7372L6235O5574q2780j4375k9615K1294q5070P0349
3444A067687L1832j15297j7633K6772M7761p5362n3279L7597l2497l0191k0453
3433H66937L4977m3120k7481Q528K3141O186M8584m5227n5321Q287Q8626m4168
3421H69949n5522m0909q6071K8908l5180N6362J18188l8765k5833K241j12004
3410F81364R0592m051j40044j1014Q7669q377p5454j5427L8262K5994j2719p6155
$$ y = [2461657, 2294319, 2167387, 2103088, 2094727, 1980585, 2045036, 1925490, 1944396, 1859347, 1789769, 1707729, 1736366, 1699026, 1580641, 1557243, 1520556, 1505250, 1460545, 1382717, 1418031, 1411771, 1344003, 1422707, 1331371, 1284314, 1256294, 1243655, 1220432, 1197167, 1143065, 1256412, 1198402, 1233137, 1166219, 1113447, 1086075, 1122310, 1187884, 1105104, 1090729, 1061114, 1082408, 997338, 1067687, 1099519, 984222, 966589, 993361, 1041122, 965760, 912481, 950078, 917581, 887390, 866937, 901914, 858794, 831313, 839841, 862982, 869168, 917752, 872525, 817204, 825491, 914117, 869949, 814427, 773518, 687447, 716355, 681175, 737537, 855725, 816960, 791127, 793368, 681364, 771956, 767905, 627861, 616847, 704516, 696139, 620685, 605258, 643520, 669514, 656795, 580640]
3398E80640P5601q6911M6616n6673M869O3684Q587l3501p6372m2281K1378K1399
3386E27036K9282K2047k7662l339N531l109j20693Q3139N766m8964K4081J12243
3374F05358m7310p217k5720k9772j02082M8156J27539r4113m9879n7694K8248
3363C95514K346J18495l768l2838j7197l1210l6513k3355P7644j1873K0043m837
3351D52451k253r1351q145J5935o0468R8203P2162k9546k4934J9781k8256o431
3339D07148M4906r7799m3427P0490o2079r06O2144L3014n6068q6771M7708L8547
3327C56907L135j683N7036o2118J04854j04038P118N9534n3028l3691K8137n4582
3315C07581m2707O3756L879p298L3749m8284K9036O301j6004L0571L523l8250
$$ y = [580640, 656241, 569330, 615946, 559273, 564142, 627826, 636413, 602912, 526540, 484259, 505637, 527036, 556318, 578365, 550703, 547364, 552895, 549786, 429093, 512232, 517998, 469034, 493115, 605358, 558048, 550831, 525111, 495339, 393257, 441413, 568952, 474839, 424960, 367266, 395514, 397860, 516355, 512587, 479749, 462552, 431342, 394829, 371474, 449118, 437245, 457288, 452451, 450198, 358847, 350702, 366637, 306169, 404372, 476534, 446988, 422054, 441835, 413579, 407148, 452054, 354255, 310828, 381318, 319239, 318333, 380477, 413491, 357423, 270652, 318360, 356907, 360042, 358359, 415395, 353277, 458131, 354093, 361211, 420745, 367717, 334026, 362163, 307581, 264874, 328630, 332509, 325211, 358960, 310676, 339712, 346013, 330009, 360580, 364103, 325853]
3303C25853n955N7114q1410J5182K3336K7110o5367K8864L2481n8536j057L0448
3291C28063P779J005L0597n5337j7281J7488r0098N3150m9210M8566o800J4453
3279B82375L7898m3714j1684L1927K7886l2136n8313o0682P5345O8055k7540n7656
3267B31761Q8478l7141j3153l9921k3043l157L6034P8188j35143J20749k0128
3256B83524o7595N6007J6942p1556J0611r407r93j5317N4974N1008J1586N0125
3244C69909j02796p852K564k1569K864K5455j8899Q898k3324M7220k4505j5828
3232B42137j3460O183K8790L941M8636m5289k7713M0025m3811l5495q0519R0107
3220B13532k6496M3733j2772j7631K7627K5619M81m6557k1512M608N6464k8235
$$ y = [325853, 319898, 377012, 295602, 310784, 334120, 361230, 295863, 324727, 357208, 298672, 297615, 328063, 335842, 336847, 367444, 312107, 294826, 312314, 222216, 275366, 226156, 274722, 267922, 282375, 320273, 276559, 264875, 296802, 324688, 292552, 234239, 173557, 248902, 316957, 289417, 231761, 320239, 283098, 269945, 230024, 206981, 203824, 239858, 318046, 182903, 303652, 283524, 215929, 271936, 288878, 217322, 227933, 218526, 217533, 202216, 257190, 308198, 319784, 369909, 267113, 259261, 261825, 240256, 243120, 268575, 249676, 258574, 235250, 282470, 257965, 242137, 228677, 234860, 263650, 267591, 316227, 270938, 243225, 283250, 239439, 203944, 123425, 213532, 187036, 230769, 217997, 200366, 227993, 253612, 254093, 207536, 186024, 190632, 247096, 218861]
3208B18861P5568j2922k4704O810K0704L4786J7368n2736j5871L5641J056k4166
3196B80395R0n7575J1657j2541J0365j3978O2472m858m6179j8862n6253Q7260
3184B41993P659N703j5391j8262O608N5606N8961o2319L7807l0173J5038K1943
3172C25173K5531M1953q1984n8221N7393l2958J7625O0385K5678l4369J4858L1915
3160C92979k3365M975N5198o4596L5981j9889k7818P4427J04803l3677J7029l1103
3148D84944K2757M4859n585L3737J14964N8162n5670K0596O6983K6298l4305L6201
3136H13941Q8211L9506o073P2038m3619J33243J5086J38376j00792Q1487J22953
3125A354357L1180P3355N2311J16489m700J09726J37274Q8924J47997J07910J55761
$$ y = [218861, 294429, 281507, 256803, 263613, 284317, 319103, 336471, 283735, 267864, 303505, 304561, 280395, 280485, 222910, 234567, 222026, 232391, 218413, 280885, 276027, 229848, 210986, 154733, 241993, 249652, 255355, 239964, 221702, 228310, 283916, 342877, 280558, 318365, 288192, 303230, 325173, 350704, 392657, 310673, 252452, 309845, 276887, 294512, 354897, 380575, 346206, 361064, 392979, 369614, 374589, 429787, 365191, 401172, 381283, 353465, 427892, 532695, 499018, 516047, 484944, 507701, 552560, 546975, 580712, 695676, 753838, 698168, 718764, 785747, 812045, 777740, 813941, 902152, 941658, 935585, 1007623, 964004, 1097247, 1112333, 1250709, 1149917, 1231404, 1354357, 1385537, 1458892, 1511203, 1627692, 1622992, 1732718, 1869992, 1958916, 2106913, 2214823, 2370584]
3114B370584J53911K14311K52309K47816K44975L91421L70683L78016M39875N75897
3104E639798P43453Q21460J072828J193787J129440Q66065L07028o70750j173949
3095I929160j290017j148971r84957q82565o35116m66085l30939l83277l42702
3086C464531l34697k51095j43060j44777j56339j36772j33896j00700j06752j17516
3076A838927j68456j5927q5274r9615m0876j29173k7717N6102r8256r8065j0713
3065A120957q3987p4262p062R261n2337r0910o0128L0897j4008n2022j8759p9989
3053F27651o6823K1259K8733p6041m0061M6778o0707L1804k404k2922j2487m0465
3041D34315J6882M3031n8280L1524j18751l5753J3709L3037o4032L498m8518M7478
$$ y = [2370584, 2524495, 2738806, 2991115, 3238931, 3483906, 3875327, 4246010, 4624026, 5063901, 5639798, 6383251, 7204711, 8277539, 9471326, 10600766, 11466831, 11773859, 11103109, 9929160, 8639143, 7490172, 6505215, 5622650, 4987534, 4521449, 4190510, 3807233, 3464531, 3129834, 2878739, 2735679, 2590902, 2434563, 2297791, 2163895, 2063195, 1956443, 1838927, 1670471, 1654544, 1569270, 1469655, 1428779, 1299606, 1271889, 1327991, 1229735, 1131670, 1120957, 1036970, 962708, 955646, 964907, 912570, 821660, 761532, 792429, 778421, 726399, 707640, 627651, 560828, 582087, 610820, 534779, 494718, 541496, 480789, 512593, 510189, 487267, 474780, 434315, 451197, 494228, 435948, 467472, 348721, 312968, 326677, 359714, 295682, 299180, 250662, 298140]
3029B98140L7434K3640l3050n9956M7757M4840p8695M447L9345m0474k6337N1674
3017C08765P501q9016O1494j2739j12400K750J9719l2601P2862K4298q0696J3295
3005A83232l5659k3901O1591o6673L3491J8018k5272m5746K5911m448l6611O1225
2993A45158j6151p6936k3957P7946L7073o9561R5984j8200j7726n3898N6667K1947
2981A58346l1876K8847N491p062l7770K6575N9152l0650p5301J6223j5561n4516
2969D1898M9219J4810K1033n9012J6260k009o391P3475o6185L8693l9310j6734
2957F5747N5861q3290n8478N7516K3215m0136J03725J8565l0475k3201L6895o0560
2945F5384j2113P6998m3802N1192k5429l5644o1111J2608J07204N6736m8940p6193
$$ y = [298140, 335574, 359214, 326164, 266208, 313965, 358805, 280110, 284557, 323902, 283428, 257091, 308765, 316266, 227250, 288744, 276005, 163605, 166355, 186074, 153473, 226335, 250633, 169937, 183232, 147573, 123672, 185263, 118590, 152081, 170099, 144827, 99081, 124992, 120544, 83933, 145158, 129007, 52071, 28114, 106060, 143133, 73572, 169556, 151356, 133630, 79732, 136399, 158346, 126470, 155317, 160808, 153746, 115976, 142551, 201703, 171053, 95752, 111975, 96414, 41898, 91117, 105927, 126960, 67948, 84208, 82199, 75808, 149283, 83098, 121791, 82481, 65747, 121608, 38318, -20160, 37356, 60571, 20435, 124160, 142725, 112250, 89049, 125944, 65384, 53271, 130269, 86467, 137659, 112230, 76586, 15475, 28083, 135287, 192023, 143083, 66890]
2933F6890K2114r9531N087M1405m9417N7720L4027k9k9641m5770L2792P3247J0774
2920A19668o048m2211K4911N6046j16960j02241N3783O9630K8382J4391l145j1413
2908H4793l3819j5897J27620K2868r2712M8829l8391l11l0655n555L7789j6031
2896H8528N7632p089N264o4211k2353J7661K7998l915q1167N4510J2778j9336
2884F6300M6470j3431j717n2782O9312j6394q2662R986N5188K8251l7158n7479
2872A3884J01071q585m8934n9446L6877J11310m8115m6615j5324M0171j8246N9753
2860A17801k5242n5329L337R908M4001J5905o1848m1218L2308N0336N1957m7936
2848I3980o940j3101L503J9951q5337O1610O485p3444l2743O5950m7005O0434
$$ y = [66890, 89004, -10527, -5440, 35965, -13452, 44268, 78295, 78266, 48625, 2855, 35647, 108894, 119668, 113620, 71409, 96320, 152366, 35406, -66835, -13052, 56578, 84960, 99351, 96206, 84793, 50974, 35077, 162697, 185565, 92853, 141682, 103291, 102980, 72325, 66770, 104559, 88528, 146160, 139071, 144335, 80124, 57771, 75432, 103430, 99515, 18348, 72858, 85636, 66300, 112770, 99339, 97622, 44840, 114152, 97758, 15096, 25082, 80270, 108521, 71363, 13884, 114955, 106370, 57436, -2010, 34867, 146177, 98062, 51447, 36123, 76294, 58048, 117801, 92559, 37230, 40567, 50475, 94476, 110381, 48533, 7315, 39623, 89959, 141916, 93980, 87040, 73939, 77442, 97393, 12056, 73666, 80151, 6707, -26036, 39914, -7091, 53343]
2836E3343j3448k1755m5404M380N7974n4653Q8213o0724L2172O1910n5692o3719
2824a7403J16216o3219o579N0701J5362j9383k5591k383o8546p5335M8347M9839
2812B026m8854M944K8798N3141l4555K3469L6335j00466M1141L1294K0341j1532
2800D6082Q319P1326k8677O824m9170M7700L1522q6055p913j5887J4455J1981
2788E0507K4084M004m0063M8550l9167L9664p7999k9936j6417R4772j1231k6986
2776A9782L0388o6476L2622M5479J5315l9953K0086L3801m9446k1269K9349k0151
2764B9527J2745m2993L8209l2147J1361l683k2587N5194k8644m4403j8052M4846
2752f27r152J034J1011n407k5049L2291M8666q286k8059o800M6433O0454n4026
$$ y = [53343, 39895, 18140, -27264, -22884, 35090, -19563, 68650, 7926, 40098, 102008, 46316, -17403, 98813, 35594, 29015, 79716, 95078, 75695, 50104, 47721, -20825, -96160, -47813, 2026, -46828, -41884, -13086, 40055, 5500, 28969, 65304, -35162, 5979, 37273, 57614, 46082, 54401, 125727, 97050, 103874, 54704, 102404, 133926, 47871, 39958, 24071, 38526, 50507, 74591, 78595, 38532, 87082, 47915, 87579, 9580, -20356, -36773, 57999, 46768, 19782, 50170, -16306, 16316, 61795, 77110, 37157, 57243, 91044, 41598, 20329, 49678, 29527, 42272, -721, 37488, 5341, 16702, 13019, -9568, 45626, 16982, -27421, -45473, -627, -9779, -8745, 2266, -3141, -28190, 4101, 52767, 44481, 16422, 9622, 56055, 116509, 62483]
2739F2483N0905j3575J5122j9723j17799l3251M1089M9035r980J833k882o446
2727A6811K9094N183M7382m2518j812k3674L1396m5031j9368p784l5947M3805
2715b463P921J4679p0571M6331k1593J4521J2810J15628p5492m5463R25J4991
2703A2224M355k575K8519j02090j8986N5894L4431j0793k6394M2879K8767l4001
2691A2230K6316r5282j5516Q7485p6256l0009l3113Q1220O4595j6806M5838K5278
2679G5980n8618K5890J6527m7285J9262m3534L577Q571L3817R638p1126k6848
2667e4149P8071m6338Q79M9506K014P411R5435n4408j48016Q0338n517k0645q3152
2654i8571L4946Q2718K110o4237l393l8600J6241J3619K2606L346K5964j268o535
$$ y = [62483, 113388, 99813, 114935, 95212, -22587, -55838, -14749, 34286, 24306, 26139, 23257, 16811, 45905, 51088, 98470, 55952, 54140, 30466, 61862, 16831, -2537, -10321, -46268, -2463, 5458, 20137, -50434, -4103, -25696, -11175, 1635, 117263, 41771, -3692, -2767, 12224, 16579, 14004, 42523, -59567, -78553, -22659, 11772, 979, -25415, 17464, 46231, 12230, 38546, -56736, -72252, 15233, -61023, -91032, -124145, -42925, 21670, 4864, 50702, 75980, 17362, 43252, 59779, 12494, 31756, -11778, -8201, 370, 34187, 43825, -27301, -54149, 23922, -22416, -21537, 27969, 29983, 37394, 132829, 78421, -69595, 10743, 5226, -15419, -98571, -63625, 19093, 21203, -43034, -46427, -85027, -68786, -55167, -32561, -29215, -3251, -4519, -11054]
2641a1054o957q3985N6112K6089n1296M8884N0832j5713Q2893q2386J8805K3500
2629E5724q2381m003L9049j0121r2915O2049j069n4416j6997Q0411Q1298m4420
2617A2209K4856n2828K4143J0311m562J03452n9952n58n4135l1519K83m9344K7200
2604e0444o722J9975J9877l942K6445l598j6165m551N583j02q3838Q2466J6192
2591A176k3983O130l5119j7899O7024k203M4097p507k1765k4257K8074o3658j6826
2578f6716Q6965l4746L6117l155o3634j067P8501n1380p5480J38935l9603l0126
2566b5389J0522r6882O430N7951P4601l0465l9208j5662N201L4626N0976N01n1605
2553a8403m7134j0574L5846K5134P8271L6033k7322q0086n2947j187N3496P7914
$$ y = [-11054, -18011, -101996, -45884, -19795, -71091, -22207, 28625, 12912, 95805, 13419, 32224, 55724, -26657, -30660, 8389, -1732, -94647, -32598, -33667, -88083, -105080, -24669, 56629, 12209, 37065, -15763, 8380, 18691, 14129, 117581, 57629, 57071, 2936, -28583, -28300, -77644, -50444, -57166, -37191, -17314, -21256, 5189, 1591, -14574, -19125, -13542, -13644, -97482, -15016, 1176, -22807, -16677, -51796, -69695, -2671, -4874, 39223, 31716, 9951, -14306, 13768, -49890, -66716, 20249, -14497, 21620, 18465, -45169, -46236, 32265, -19115, -94595, 44340, 4737, -25389, -14867, -111749, -105319, -47368, 27233, -3232, -42440, -58102, -52901, -18275, 32701, 33202, -18403, -65537, -76111, -40265, -15131, 63140, 99173, 71851, -8235, -61182, -62369, -8873, 69041]
2541F9041k8560r346q3199N3511j0208r271N582K3983R235R461m9569n8372L1695
2528d6017k144o7840J01360J8086j09117P6874M3506j5989n9809J6038L1136P7240
2516F3324j5272r0514L7185l6781K0037m0227k6052P5285k4674m2187L478J1866
2504f4532o2052P8875J1938J1751k2242K8268L557j0688M8475l4537R712j0826
2492a2301Q91P1180m2686l8340M7526K0478l1107l1475j2846K5505m6079j3671
2480f2925N9951N2657m2908p1150k6924N7749R8541j863o5262J0442J15584j23131
2468G61k1842n1530k3749M9462k0158K8957n5924K9394O60j4880L5252K4202l98
2455a9793j6463M9194k0845j234k2494j3863M0763N891K6825p4338r862N7763
$$ y = [69041, 40481, 31135, -52064, 1447, -8761, -18032, -12450, 11533, 20768, 30229, -19340, -77712, -46017, -48161, -116001, -14641, 3445, -105672, -28798, 14708, -1281, -61090, -45052, -13916, 63324, 48052, -42462, -5277, -42058, -22021, -62248, -88300, -13015, -37689, -79876, -76398, -64532, -126584, -47709, -35771, -24020, -46262, -17994, -14437, -25125, 23350, -11187, -1475, -12301, -11410, 59770, 17084, -21256, 26270, 46748, 15641, -15834, -28680, -3175, -49254, -62925, -2974, 49683, 6775, -64375, -91299, -33550, 64991, 63128, -2134, 8308, 123892, 761, -21081, -72611, -96360, -46898, -67056, -38099, -94023, -64629, -63969, -78849, -43597, -19395, -19793, -36256, 12938, -7907, -9141, -31635, -45498, -4735, 1156, 27981, -46357, -56219, 1544]
2443A544L2330o87L283R651l1845J2986n6589J5476N1201j4848m0791j3819N9364
2430B7256k114p2239L6782l4717L2283k239m0024N2100L399O1524q7097J1829
2418a3257N9890k8252j5692L632j2612l8525k5003l2878P2737o3891l5125O2412
2406f6564Q9397j0814m4696P7498o085j5421r163L84j3631J0471r7326j9150J4079
2393i1021L4436K7526k1814J3777M667o3229K1538R9057k8316K686n5898N2184
2381d407m9549O49j9796n282K2434O5918p2010k5570O6376M2834N5734n4028o10
2368B2693O718N8698J5905q3628p7480j5498Q7873j435L7637o3520L6538k3631
2356H70j4226K5373l5480N1634m8517j6913K4923k4111l4003P0842m3243J27867
$$ y = [1544, 33874, 33187, 36470, 46121, 14276, 27262, -29327, -13851, 37350, 22502, -18289, -32108, 27256, 25142, -47097, -10315, -45032, -12749, -14988, -55012, -2912, 487, 62011, -25086, -13257, 46633, 18381, 2689, 6321, -6291, -44816, -69819, -102697, -29960, -93851, -128976, -66564, 22833, 12019, -32677, 44821, 38736, 23315, 14152, 14536, 905, 11376, -85950, -105100, -91021, -56585, -29059, -50873, -37096, -32429, -95658, -74120, 24937, -3379, -693, -56591, -4407, -53956, -53307, -73103, -78385, -55951, 9967, -62043, -87613, -21237, 21597, 77331, 23303, 22693, 29411, 88109, 104014, 20386, -57094, -72592, 15281, 13846, 51483, -12037, 24501, 870, -13356, 12017, -23463, 28171, -20346, -37259, -12336, -36447, -70450, 392, -42851, 85016]
2344H5016q365p9992n3883l874o249L4630o8793p176J8610J07549K7331o4975
2332b0171K4202l2222K9706m1960J7572O6020L4057p8395o7079L6326N5870k0146
2320C780P129K2262j1798q1888K5984O0887j36512K9806N8568k4164p1452O4743
2308e2655K9912M4377J3625J1189j6716o024j2105p932m1313M1299L9385l6534
2296F508k3662O152K522O4911q5286N7118j0279K1524J3361q3489q21J9620J68
2283a1653j04348Q1711L1085J8073M1994q9003J377O7716r4520O9761k6407L172
2271a1042N0563k5755o1378l9549K5585K1973O2554n0244m5621N9756p0575j9245
2259a02978L3356M1588j23098L0736J18502k0550o6862Q9821m9773L7951j2919
$$ y = [85016, 76651, -3341, -57224, -61098, -67347, -32717, -101510, -108686, -90076, 17473, 44804, -20171, 4031, -28191, 1515, -40445, -22873, 43147, 77204, -1191, -68270, -31944, 23926, 3780, 10909, 33171, 21373, -60515, -34531, 26356, -110156, -80350, -21782, -45946, -117398, -52655, -22743, 21634, 35259, 46448, 29732, 23708, 11603, 3671, -37642, 3657, 43042, 6508, -17154, -11002, -8480, 56431, -28855, 28263, 17984, 39508, 52869, -30620, -31441, -11821, -11653, -116001, -34290, -3205, 14868, 56862, -32141, -30764, 36952, -57568, 12193, -14214, -11042, 39521, 13766, -47612, -87161, -61576, -39603, 22951, -27293, -72914, -13158, -83733, -102978, -69622, -28034, -151132, -120396, -1894, -22444, -89306, 515, -49258, -11307, -24226]
2248b4226m987j01O1263l2992r4788M7746j5906N4396p8421k7625O6432O1511
2236A2302l7096O1505M749j5356l4931q3293O626O3698K828M4911K3796l9572
2224A0167m5021l577M3185n9227P5814q497l0379N0944m639o9799l8296m3537
2212a22862k763K8291P3598M2484l5038o7565L1196k4797j7747J9645J19384j03184
2200e9358q114K9287p201K6198l4734M1670O4241n6842l6129P3913N8702o8177
2188B3456n9726R151p9820M409O4839l704M01K8687m073N7239r738q6900q615
2175f4394J5245k261O9415m1959J7984l7701j8912o3409L1066N2210m699j5431
2163f2846O5062n7548L9524M9569j07731N7872m6321K5526J9172j19045J27477
$$ y = [-24226, -29213, -29314, 31949, -1043, -95831, -48085, -63991, -9595, -88016, -115641, -49209, 12302, -24794, 36711, 41460, 26104, -8827, -92120, -85494, -21796, -18968, 25943, 49739, 10167, -34854, -38431, 4754, -54473, 21341, 12844, -17535, 33409, 28770, -41029, -79325, -122862, -125625, -97334, -23736, 18748, -16290, -83855, -52659, -77456, -95203, -75558, 43826, -59358, -67472, -38185, -45386, -19188, -53922, -12252, 51989, -4853, -40982, 32931, 91633, 23456, -36270, -27119, -106939, -102530, -37691, -41395, -40994, -12307, -16380, 40859, 31121, -55779, -64394, -49149, -51410, 18005, -23954, -5970, -43671, -62583, -125992, -94926, -42716, -47415, -62846, 2216, -55332, -15808, 33761, -73970, -16098, -62419, -36893, -17721, -136766, -9289]
2152i289K4752p9795j1570r394K0706N7626l0847k5126P8622o6212p4928J14790
2140a0665o7663J5083M6380p3881J07889k3005n231J450j36618K7349L3373J09275
2128B3736L7508j7848o4000o2421J0751J4152n040M7433l6056j0891m97J4265
2116d8908m4820L1553M4030L6858o4005J6846J2399k816k1327q1554M4209m1937
2104a19472K9046N2295K1033l2169o7257O8278m2359j3495K5393K4322j0578J7823
2092d7140J24450q552m6022j3797o761l297M8675m2426p1702j2518K5478J329
2080e2283m3701k4619P8152k1369K7564q541M2590L1867k0168n162M0848K3884
2068F9062k7684n0q2752m501K00140q7352n8497p240M961J264m9434P878j5383
$$ y = [-9289, 15463, -64332, -75902, -85296, -64590, -6964, -37811, -62937, 15685, -50527, -125455, -10665, -78328, -63245, -16865, -90746, 17143, -5862, -11093, -9643, -146261, -118912, -85539, 23736, 61244, 43396, -20604, -83025, -72274, -58122, -63162, -15729, -51785, -62676, -63173, -48908, -93728, -62175, -18145, 18713, -45292, -28446, -16047, -18863, -40190, -121744, -77535, -119472, -90426, -38131, -17098, -49267, -116524, -48246, -90605, -104100, -78707, -54385, -64963, -47140, 77310, 68758, 22736, 8939, 2178, -1119, 47556, 5130, -66572, -79090, -53612, -52283, -95984, -120603, -42451, -63820, -36256, -44797, -2207, 29660, 9492, 4330, 45178, 69062, 41378, 41328, -41424, -45925, 154215, 66863, 8366, 1126, 6087, 7351, -42083, -34205, -49588]
2055d9588k6875K4217k3636M5838l3635j4945l6831J2894M2052L4655n2214M879
2043g3189L72N9K1466j780P1746k6291j1920J3907J481l1532m6224p806Q4084
2030e627k5599j7125k3335J2497K5210J755L4975k6434M5959j7836j0371J0124
2018D193o766q481Q240m0663O7876M1152j7409n1516k6523J8183k0892m6202P1912
2005f896K1537n5842J7288R0557k7185Q793k4293n3521k3722k4306j7191k2068
1993a16849O0420M1183k0461K018M8807r8249N0838L9922l6625l8899k4417Q4720
1981g592K7987j2424J6701k8963J26475j02949r269l026p4530q7672P6367K3025
1969e5870N9369J4178N447l3693l7847j5280M747L95m4629Q4597J2429L9580o9687
$$ y = [-49588, -76463, -52246, -75882, -30044, -63679, -78624, -115455, -102561, -60509, -25854, -78068, -73189, -72817, -72758, -51292, -53072, 18674, -7617, -19537, -5630, -4149, -35681, -81905, -89711, -5627, -31226, -48351, -71686, -59189, -33979, -32224, 2751, -23683, 22276, 4440, -5931, 4193, -2573, -11054, -2814, -43477, 24399, 65551, 48142, -3374, -29897, -11714, -32606, -78808, -6896, 14641, -41201, -23913, 66644, 39459, 48252, 23959, -29562, -53284, -77590, -94781, -116849, -56429, -15246, -35707, -33689, 15118, -83131, -32293, 7629, -28996, -67895, -92312, -7592, 20395, 7971, 24672, -4291, 122184, 19235, 9966, 6940, -67590, -155262, -78895, -55870, 3499, 17677, 23124, -10569, -48416, -63696, -58949, -58554, -103183, -18586, -6157, 33423, -36264]
1956c6264L122p577M7824l0152j0751l7471Q2337L4171q4138J4832k0011M3532
1944e46J9491J2453k4191j6673q4681P5455k1976m6286M955J8761l9959N9968
1932d3229o319N8244l5491J1229O1384p4442O45L1980k7003j0515P1879r5983
1920e7621m1356N9707M7351L997r5140M6013m8095N1141m0861J0339K5658L6428
1908b439O0934o2818M842J30L3898n8099k6784K8182K7839M1472n5374q8151J13027
1895A6659o946j2706o7811L1768L2137j5264K2935m3752o0936K3087K1317p611
1883f7123N663K7635J9032k8729K0927M9474r873K3290l0802k3505j4646P254
1871b1403r348m4362l83P8910p5416M1745K1038o3303M7366N232q0577P2763N9067
$$ y = [-36264, -33142, -40719, 7105, -23047, -33798, -71269, 11068, 45239, -38899, -24067, -44078, -546, 18945, 31398, 7207, -9466, -94147, -18692, -40668, -86954, -81999, -63238, -103197, -43229, -49548, 8696, -26795, -15566, 45818, -28624, -27979, 4001, -23002, -33517, 38362, -57621, -98977, -39270, 8081, 12078, -83062, -37049, -85144, -34003, -74864, -64525, -38867, -2439, 58495, -4323, 519, 649, 34547, -23552, -50336, -22154, 5685, 47157, -8217, -96368, 16659, 9713, -2993, -70804, -39036, -6899, -22163, 772, -42980, -103916, -80829, -59512, -67123, -61460, -33825, -14793, -43522, -22595, 26879, 17006, 40296, 9494, -14011, -28657, -21403, -30751, -75113, -75496, 3414, -72002, -30257, -9219, -72522, -25156, -19924, -100501, -27738, 31329]
1858C1329m5273q9519j0439N9539J5421m3924R4793K4600K9368j9659m4894k4248
1846b2906O6523n5674j0301N5585r0826N3171K1887m5043k0932J1838K7961N0761
1834D2044m0055j3852r9014N505Q3886q649l2504M8668k19l8876p558L145J3002
1821d4477j364l6666j1455N9358j6061o0951J31444R0690j44458p0764M6442n180
1809f3442J7579L9035n4769O730N6847r759K4480n9191k2385Q5924n4633Q49N39
1796c2196p1464p535Q128O7484Q015n4176P2976j1028k3279j1675J0077k1621
1784f6294m4725P7224K2656m09k3627q7565O3960M6914M74k0006K2892J4319M131
1771I944K3533j9401m7533p0922L4679Q6992J7909q2249k0779L122J9502O8444
$$ y = [31329, -13944, -103463, -113902, -54363, -38942, -82866, 11927, 36527, 65895, 46236, 1342, -22906, 43617, -12057, -22358, 33227, -57599, -4428, 17459, -27584, -48516, -36678, -8717, 42044, 1989, -11863, -110877, -105372, -21486, -30135, -62639, -13971, -14190, -53066, -60624, -57479, -44477, -45841, -82507, -93962, -34604, -50665, -111616, 19828, 110518, -33940, -104704, -58262, -63442, -45863, -6828, -61597, -54867, 1980, -7779, 16701, -42490, -64875, 21049, -33584, -32735, -32196, -103660, -111195, -103067, -35583, -27568, -81744, -8768, -19796, -43075, -54750, -44673, -66294, -111019, -33795, -11139, -11548, -35175, -122740, -58780, -11866, -11392, -31398, -8506, 5813, 9944, 33477, 14076, -33457, -104379, -69700, 17292, 35201, -47048, -67827, -64705, -45203, 23241]
1759B3241k4076N148L4176j62820Q0918l0787J00909m0938j6241M4758j445l9418
1747b6575L3691k2130j0364K0600n0085N8062J0791r3675J6344L2045N0678K1151
1735D0533R173k7768l1034N2182m6457K4484l9742n7939m5885N468K0339k8825
1723a25471N042K650L4068O3860k0004N6976m6098M4759M654p1084N8748k7064
1711a8964l1867K2976O2075K1615q5846k9984j1409K710K0050J6239J4151P1334
1699E3080j05740m8701p1410O8512R920M7781J02950o2490J300n4012m0657M5819
1687e3648O7943K5805K4962m9689l6998J3658k2053j5370N3685k5987n8144J4239
1675f1597K4914M0425k0774l4683N915O8970o6743M465R3559o5479K1982l5054
$$ y = [23241, -835, 4313, 38489, -124331, -43413, -74200, 26709, -14229, -30470, 14288, 12843, -26575, 7116, -15014, -25378, -4778, -54863, 3199, 13990, -79685, -63341, -31296, 19382, 40533, 49706, 21938, -9096, 43086, -3371, 21113, -18629, -76568, -122453, -116985, -96646, -125471, -120429, -117779, -83711, -19851, -39855, 17121, -28977, 15782, 20436, -50648, 8100, -18964, -50831, -27855, 34220, 55835, -30011, -59995, -71404, -68694, -48644, -32405, -18254, 53080, -52660, -101361, -172771, -104259, -94339, -46558, 56392, -6098, -4798, -58810, -99467, -53648, 14295, 40100, 65062, 15373, -21625, -7967, -30020, -45390, 8295, -17692, -75836, -61597, -36683, 3742, -17032, -51715, -45800, 23170, -43573, -39108, 54451, -11028, 10954, -24100]
1663b4100N5155l4525K0077Q443J9505k4536j4873N139j2544n109K8919p5678
1651e4127O6082O6833n2966o8888K4626J00734o3589L3675n7909K9630l7149n0610
1639f3658J04265l2816J6460K0571n0196j9295m586J5298O3184N8547q9949r6350
1627g8525l7661J50725j488J3000o5849L0569m8817p17O468j0130N4824l2390
1615a9991O8554j1751k1369q3018l5124M9537M6354M0099l7846J8272r05l1712
1603a8900n8310L2328J13455l3528r7929Q8526n9933M9041l7550o8015Q8575o1026
1591f3266K9989J0988J4491J3223M2586L6731n9268m2763J2198M1509m0918n8527
1579f3027o235K4648j3094M651l0617O8705L8006o627K8446k797j0816k7784k4395
$$ y = [-24100, 31055, -3470, 16607, 25050, 44555, 20019, 5146, 10285, -2259, -7368, 21551, -54127, 11955, 78788, 25822, -43066, -18440, 82294, 18705, 52380, -5529, 24101, -13048, -63658, 40607, 7791, 24251, 44822, -5374, -24669, -29255, -13957, 49227, 107774, 17825, -78525, -116186, 34539, 33051, 46051, -19798, 10771, -38046, -38763, -32295, -42425, 12399, -19991, 48563, 36812, 15443, -67575, -102699, -53162, -6808, 33291, -4555, 13717, 12812, -18900, -77210, -44882, 68573, 35045, -62884, 25642, -34291, 14750, -22800, -90815, -2240, -63266, -33277, -22289, -7798, 5425, 48011, 84742, 25474, -17289, -5091, 36418, -4500, -63027, -69262, -44614, -57708, -53057, -83674, -14969, 23037, 16410, 44856, 42059, 31243, 3459, -20936]
1566b0936l8113N9583L6511n7358j1282N1465l5455l0718o2367N8410K8957o8577
1554h9880M5445K4302N7601n6719Q292M3786n2057J00301n5728p4419K0412P3997
1542D5333l8079n8769J3999P010j7869O699J6989M3108o804j695O647l8081K2771
1529A259l5655p2864O2018M8716j1874k7660J0502K1864L5665j10242L4838p879
1517e1312R963m266l1486P5806J2557j197m2162k9093J8917K2608P7597k4058
1505C3874j0397q4119K0314j3682J7228K3584M3410l1356M0715r6732J8758L4982
1493c421m7965J78192m8874k3997m8778m5983R644j21662K2967O4600K3974M0972
1481c31K907m819k8843J3014j3746j4504l3116k4463Q1258J10544r8929L9776
$$ y = [-20936, -59049, 534, 37045, -20313, -31595, 19870, -15585, -46303, -108670, -50260, -21303, -89880, -44435, -20133, 37468, -19251, -10959, 32827, -19230, 81071, 25343, -49076, -28664, 45333, 7254, -51515, -37516, -30506, -48375, -41676, -24687, 18421, 11617, 9922, 16569, -21512, 1259, -34396, -107260, -45242, 3474, -8400, -36060, -25558, -3694, 31971, -78271, -43433, -51312, -41349, -45615, -77101, -1295, 11262, 10065, -32097, -61190, -42273, -19665, 57932, 33874, 23477, -60642, -40328, -54010, -36782, -13198, 30212, -1144, 39571, -57161, -38403, -3421, -51386, 126806, 77932, 53935, 5157, -40826, -31182, -152844, -129877, -65277, -41303, -331, 2576, -2243, -31086, -18072, -31818, -46322, -79438, -103901, -22643, 87901, -11028, 28748]
1469B8748j315m0677k9366M6671J5212M5515q8505l2807J6629M2558J9758n1656
1457b9235o6242Q2841N4925r1744K0762L2406K0827L2759j24629j2464O612q156
1445h1338Q0147L9347o2407k1909P0187k1929m4188l471j508k9860N3532J27000
1433A03603m0193k8868n7627j2880K0143L744o1268M5476K6946K200J8411K3897
1421D3584r2972J4596M6825r725N5317m4835J973k2564J5350m7423k0177N972
1409e4079M8157k360J5596o4065K8316l7679L2252m5524P6868r43R722P7889j902
1396H2248q7131k0095k1822M7302k598q6271m809J05433M6345p8064j382n9191
1384h0035R3660k0950L7901k9516j6364N6475M3573n7310k6672J6438m0101M473
$$ y = [28748, 27433, -13244, -42610, 4061, 19273, 64788, -23717, -56524, -39895, 2663, 22421, -29235, -95477, -12636, 42289, -49455, -28693, 3713, 24540, 57299, -67330, -79794, -73182, -81338, -1191, 38156, -24251, -46160, 24027, 2098, -42090, -45561, -47069, -76929, -23397, 103603, 63410, 34542, -23085, -35965, -15822, -12078, -73346, -27870, -924, 1276, 19687, 43584, -49388, -34792, 12033, 2308, 57625, 12790, 14763, -7801, 7549, -39874, -60051, -54079, -5922, -8282, 7314, -56751, -28435, -66114, -33862, -79386, -2518, -3461, 6261, 84150, 82248, -4883, -24978, -46800, 502, -2096, -88367, -93176, 12257, 58602, -19462, -20844, -80035, 13625, -7325, 30576, 1060, -15304, 41171, 84744, 27434, 762, 17200, -22901, -18428]
1372a8428L3020r7792N2778l0562P1751n0147K1408j5420j8403M8379K7646k0364
1360C866o4920N8036J3216n0324K5218M4153k6682n0211N6490O1564n2570R054
1348B6890n4255L3263K4762m4883K6716K1724m1219J0963j139k3072l4934O1449
1336F265j436J192l0402m1581n5496Q780Q5012O6263k0699j1066l0157j273j6062
1323d0660M9001l6888j3387K625N8331m2704J8231k9354Q900j4575O5839k6974
1311a615n7997J0068R7638N7106o5496n4302l96O7551p1998o5003J411P3941J1938
1298B846M708k0635k8611o1210L7989n604N7306k5283J8221K4940m449l3402K3272
1285i912j4090r8756N9884K3708K2752J2445k1440O5295m5497N1431n9523n122
$$ y = [-18428, 14592, -83200, -30422, -60984, 10767, -39380, -17972, -33392, -51795, -3416, 24230, 3866, -61054, -3018, 10198, -40126, -14908, 29245, 2563, -47648, 8842, 70406, 17836, 26890, -27365, 5898, 30660, -14223, 12493, 34217, -7002, 3961, 2822, -20250, -55184, 6265, 4829, 6021, -24381, -65962, -121458, -112678, -27666, 38597, 17898, 6832, -23325, -24598, -40660, 8341, -28547, -41934, -39309, 19022, -23682, -5451, -34805, -25905, -40480, 25359, -1615, -59612, -49544, 48094, 105200, 39704, -14598, -14994, 52557, -19441, -84444, -83033, -9092, 2846, 7554, -13081, -41692, -102902, -64913, -70517, -13211, -38494, -20273, 4667, 218, -33184, -9912, -24002, -122758, -62874, -39166, -16414, -3969, -25409, 39886, -5611, 45820, -13703, -18825]
1273a8825M3319q1530l0430r658N6780n8785Q5007P0275k5957k7147L7583M84
1261D1116o2865L7334j2877J9129J3810r748k3453J189K7162j1894q21p3137L7329
1248a7726L6591J3025J4483n3111J1115j3K4308M4806K3609o6922m6064o8146
1236h4045J05262k6918j2027O1414m5091j7519J7445r112j8850M4506n8969O0934
1224A7030J0817k6458l9483K2046K7119R0101m1191m0703j5354l4641J01828q0057
1212h946n4204P9755k441n9705J9309J5232j5189K1962m7236n0250J0436J67433
1200G6156m6182o3774L8031n1511J2844O0942J5903j3294p837j2201m078o499
1188a500N1280o5707L4068p44R187m8364n5426J2933M1134m9441K0095J2288M7944
$$ y = [-18825, 24494, -57036, -87466, -97124, -40344, -99129, -14122, 56153, 30196, 3049, 40632, 41116, -21749, 15585, 2708, 21837, 35647, 25899, 2446, 3635, 30797, 18903, 18082, -55055, -17726, 18865, 31890, 46373, -6738, 4377, 4364, 28672, 73478, 97087, 30165, -15899, -84045, 21217, -5701, -17728, 43686, -1405, -18924, -1479, -10591, -29441, 15065, -43904, 17030, 27847, 1389, -38094, -16048, 11071, 101172, 59981, 19278, 3924, -30717, 71111, -8946, -63150, 16605, 14164, -45541, -26232, -11000, -26189, -4227, -51463, -101713, -91277, 76156, 29974, -33800, 4231, -47280, -34436, 26506, 42409, 29115, 21278, 9077, 4999, -1500, 49780, -15927, 18141, 17397, 26584, -21780, -77206, -64273, -23139, -72580, -52485, -40197, 7747]
1175G747m3236k1430R8759j7979P2381m2296n1981n1621p136N5514O5643j5266
1163D9099J2814m1530j25264O1559Q1960N739o7578N9166m463k1928J904K1096
1151C2574K7500k1383n1577O7478L7417j0593L110k8571n2217n2872K8162l2360
1139e3332N600l3274R8825l2042k3106j8593N2794L6737n3399M8970o795L904
1127B6289O612M913q6218l3488J5943j8882P2970J0719j282j0656J1909K3212
1115B2041j4950j8733R4997m877k0680m6513k3062j8376p4733M0989L3336K460
1103b8101K0979j5097l7070L2498l1233K7576K1286N5575l7146j3021j2828j3514
1091c0096j7215J7598k6962k2681J6162P7237n1889o8849L7352n8862P3065J43289
$$ y = [7747, -35489, -56919, 41840, 23861, 96242, 53946, 1965, -49656, -56792, -1278, 64365, 49099, 61913, 20383, -104881, -43322, 38638, 44377, -23201, 35965, 31502, 9574, 11478, 32574, 60074, 38691, -12886, 54592, 92009, 81416, 84526, 55955, 3738, -49134, -20972, -53332, -47732, -81006, 17819, -14223, -37329, -55922, -3128, 33609, -19790, 29180, 22385, 26289, 32901, 37814, -48404, -81892, -65949, -84831, -11861, -1142, -2424, -13080, -1171, 22041, 7091, -11642, 83355, 78478, 57798, 11285, -11777, -30153, -104886, -63897, -30561, -28101, -7122, -22219, -59289, -26791, -58024, -30448, -9162, 46413, 9267, -3754, -16582, -30096, -47311, -29713, -56675, -79356, -63194, 14043, -37846, -106695, -69343, -128205, -55140, 88149]
1079H8149j00869l3827O7998n7980M4583K1744K9667m550m5583P5451m6591j7433
1067B0759J8218l917N9804p2684J1816J3093L7617j00996j4268O0940k8114N6162
1055E8430o9939n03o323J8133j050m2254r232K1317K6755k1014L7379M859J2766
1042B9324j5619J4664j10K2055j520j26360Q5832K3965k3957m0638j3697k089
1030d8150O9755J5574j294m0587o1405L4707N1677K3743J4078k9898n48L1271
1018E8923j9923L264k1070N214O057P2331m1394q2073L2668M6814l3512O6378
1006I3677m8755O172n6089J0958m4674Q7808n259m5216L1210j1017l6122k5139
994d2446M7351l3126l9647P1125O117J7876q2263N5650l1819m5195o079R0764
$$ y = [88149, -12720, -46547, 21451, -36529, 8054, 29798, 59465, 54915, 9332, 84783, 38192, 20759, 38977, 35060, 94864, 22180, 33996, 47089, 84706, -16290, -30558, 30382, 2268, 58430, -11509, -12012, -18335, -202, -1252, -43506, -52738, -31421, -4666, -25680, 11699, 16558, 29324, 13705, 28369, 28259, 50314, 48794, -77566, 8266, 32231, 8274, -32364, -46061, -48150, 21605, 37179, 35885, -4702, -66107, -31400, 20277, 44020, 58098, 28200, 27652, 58923, 39000, 42264, 21194, 26408, 32465, 104796, 63402, -18671, 13997, 60811, 27299, 93677, 44922, 51094, -4995, 5963, -38711, 49097, 43838, -1378, 29832, 18815, -17307, -42446, 4905, -28221, -67868, 3257, 9374, 27250, -55013, 637, -31182, -76377, -82456, 8308]
982H308L1406m7449L5401k8632n3737j9345k0541k9726P9013K2603R4565k4408
970D7458o424P4243k2415k0836m1020m5287p396J104l5662o187J07392o9886p012
957c1928M2279j7221K9772K1221o0654J1042M1428l0159j7702N897l974K8807
945A8808L069M8744j30056O9996L5584J3463Q491o3668L4222l8565o4679O1805
933b786j7200n1566O4472k1360j502q937L8013j4850J350K7265n0208J23127k9548
920E6270j5197J9711p890o9252p994M3101J68l2310M9589K6375n591o0221o0602
907f3843O4078j2951q172O2780j8268j8898J2595m2552n0438O4768L513N0261
895D2873M092J9314n2829l4938K4537l0976O1431J5244k9950K8596l5388j5168
$$ y = [8308, 39714, -7735, 27666, -966, -54703, -74048, -94589, -124315, -45302, -22699, 71866, 47458, 41034, 115277, 92862, 72026, 31006, -14281, -21677, -20573, -56235, -62422, 44970, -24916, -31928, 10351, -6870, 22902, 44123, -16531, -5489, 35939, 5780, -11922, -6025, -9999, 18808, 21877, 70621, -59435, 10561, 46145, 59608, 68099, 4431, 38653, 88, -64591, -2786, -19986, -71552, -7080, -28440, -29942, -38879, -866, -15716, -14366, 12899, -37309, 85818, 56270, 41073, 60784, 52894, -16358, -24352, 18749, 18917, -13393, 36196, 62571, 56980, -3241, -63843, 235, -12716, -20888, 41892, 23624, 4726, 17321, -25231, -75669, -10901, -7388, 42873, 46965, 66279, 13450, -21488, 3049, -27927, 33504, 48748, 18798, 47394, 12006, -3162]
883c162k2362M6925k8151O158J8627o0212P1113j0147J0639K803l8194m3501J3653
870c5811k292K1042l4588P0138o72J9928j7848P2572o9576p6252O1121J8331P257
857C3350o5651L9541m7132n8748N7881P3409k1144M0860p205o7240N0995q2171
845e3255k8582K1406K7534N9852P5096q9137j3396K2846j5990j8705P3194J4080
833G4943n2970m8463j6065L8517j7905k7072m0634O1023P6544k049k0990n6785
821c1906J6853J2611O1674L735k8900q3820K808R8528j8230l9213J8663j4901
809b098j2254J7330R4635k1260R916q435Q165m1970k5789N8640m4774l86l20M3820
795G5220n5557q722K5001r088m1019L8521J6795p959q0850O9872K6420L5265J6585
$$ y = [-3162, -25524, 21401, -6750, -592, 18035, -42177, 28936, 18789, 29428, 32231, -5963, -49464, -35811, -38103, -17061, -51649, 18489, 17817, 37745, 19897, 92469, 22893, -53359, 7762, 26093, 33350, -32301, 7240, -39892, -98640, -40759, 32650, 11506, 52366, 45161, -22079, 28916, -53255, -81837, -60431, -32897, 26955, 102051, 12914, -482, 22364, 6374, -12331, 60863, 74943, 21973, -26490, -42555, -4038, -21943, -49015, -89649, -28626, 47918, 45869, 24879, -31906, -15053, -2442, 59232, 62967, 34067, -49753, -46945, 51583, 33353, -5860, 12803, -2098, -14352, 2978, 97613, 76353, 86269, 77834, 85999, 44029, 18240, 76880, 32106, 31720, 31400, 75220, 19663, 10941, 35942, 26854, -14165, 24356, 41151, 33192, -47658, 22214, 48634, 83899, 100484]
782A00484m6515R658j10284P6179J2872Q679p5704J3216J9779k8845k190J274
770b1397J7480N8576Q173r6653K8754l2711j1564M1225J0917K3455r848l7066
758b0659L1785k7879M1360j6646j5518j2922n699j737P0065q266n4526N0245L0880
745F0483l3956M464P581k4864j7795N178m1851L2092M8605M7962r0761k6893L9774
732A0019N437p065L8773q7508M5208J66260q6302m6010p3099K1369M9588J2057
720D8727k6326j0902j1375j560K9095j3305q4262N4605p052O0446J008m7836J6858
707H121N6618j9204l1371P8885P042o564o0463j9536l0587M6467n7867K9406L786
694D733O112M7606k8168m7604m2711j4727J4289J2301P045K6208J09898n2941
$$ y = [100484, 53969, 63627, -46657, 29522, 42394, 51073, -24631, -11415, 8364, -20481, -22671, -21397, -3917, 54659, 62832, -33821, -5067, -37778, -49342, -8117, 2800, 26255, 16407, -20659, 11126, -16753, 24607, 7961, -7557, -20479, -26178, -27915, 42150, 33884, -20642, 29603, 60483, 26527, 30991, 38572, 13708, -4087, 1091, -40760, -8668, 39937, 87899, -2862, -29755, 10019, 15456, 8391, 47164, -40344, 4864, 171124, 84822, 38812, -34287, -12918, 36670, 48727, 22401, 11499, 124, -1436, 27659, 14354, -69908, -15303, -22355, 38091, 39099, -8737, 8121, 64739, 45535, 14164, 93049, 100091, 93527, 33064, 13528, -17059, 29408, -28459, 947, 4733, 10845, 58451, 30283, -17321, -60032, -74759, -60470, -48169, -41124, -14916, 94982, 42041]
682D2041l9218N4039o3392j5850K9782j7048R057J615R6941K6806j24500l4174
670c3901J8717N6409r410P5348m4765p8983Q9361L6141n8597k1910j3820M5272
658E9862L8949j6790m9749L9599o6317q1960P4772n2182L5630J4414L4374k6486
646D116q812P0127m1411n5704L0622o5565J1875q651m2947O7248K1968O8999m3076
633H789l2560R079P0308k5075l8104Q533L6879l7559o6573M0824J08956n0470
621C3027j1779k5690m6757r521J21393l2652o075M730m9820m3943M9429k835l3306
608e3799N8459o298J09545j0863n059k2170k9666L6793l35l3861p02k6982L2655
595D7717l4095k5622N7075j8058l2748N6460K480j9645R35r8513R876N4742O1044
$$ y = [42041, 2823, 56862, -6530, -22380, 7402, -9646, -589, 1026, 97967, 124773, 273, -33901, -15184, 41225, 31815, 107163, 62398, -16585, 72776, 108917, 50320, 28410, 14590, 59862, 98811, 82021, 32272, 71871, 5554, -76406, -1634, -53816, -18186, -3772, 30602, 4116, -4696, 65431, 24020, -31684, -1062, -66627, -54752, -63403, -106350, -39102, -17134, 51865, 8789, -23771, -14692, 55616, 30541, -7563, 970, 37849, 290, -66283, -25459, 83497, 33027, 21248, -4442, -51199, -60720, 60673, 28021, 21946, 26676, -23144, -67087, -17658, -20493, -53799, 4660, -1638, 107907, 97044, 91985, 69815, 40149, 76942, 76607, 42746, 42044, 15062, 47717, 13622, -12000, 45075, 27017, -5731, 50729, 53209, 33564, 34499, -64014, -54138, 604, 61648]
582F1648o9650l387J0748n7512K3400J0081L1188R0545j22977J9368k6041o6525
570i9114N695O0490K9698k9535j6706N7646Q0426k9582J9870l6910K0553m0929
558B1602L271m6817N6072J0497M9332l9434j1626K091k094k9585M5265K85j1073
545D7786j2155n816l4900P3629k5345k6942N9197l5815o899r2155M262M1423N6094
532D2364O6401K199l5189l7373n411n0768l4368l2009N0036J0049o202M1706L551
519A4986M0392l9675n6601j2595P0090L7726p5408j8609L4068r608R8322N090
507H8178m3325n7605k9739L2835O0206l5006j2001O3440o87j6380n3567R1356
495H7705o3605o9778Q6685M7862M0359p7467o1352m0095L0720J10670n2315q4109
$$ y = [61648, -8002, -11389, -641, -58153, -34753, -24672, 6516, 97061, -25916, -6548, -32589, -99114, -93419, -32929, -3231, -32766, -49472, 8174, 88600, 59018, 78888, 41978, 62531, 21602, 24873, -21944, 34128, 44625, 93957, 54523, 42897, 44988, 42894, 13309, 58574, 58859, 47786, 35631, 29815, -5085, 68544, 43199, 16257, 75454, 39639, 32740, -59415, -55153, -13730, 42364, 108765, 110964, 75775, 38402, 32991, -17777, -52145, -84154, -34118, -24069, -30271, 11435, 14986, 55378, 15703, -40898, -53493, 16597, 54323, -21085, -39694, -5626, -15234, 83088, 88178, 44853, -12752, -42491, -9656, 50550, 15544, 3543, 66983, 66296, 49916, -3651, 87705, 24100, -45678, 41007, 88869, 129228, 51761, -9591, -49686, -18966, 91704, 39389, -44720]
483d4720J14283m7241o4790L4632K5267L0043l5416K6957M3276l8859l5902N0387
471E7917J1983o521o3983N2737p292n4116N992M253L7089l2123K3838l0774r22
458a922J2996j522K7436L0558l7588K4982k6789m6088k8841O3743J4822N343M6049
445H3179o9862p5155J4968J2309R0942k3627j6505j8835P6256l0007n1000K1389
433A4052L5899Q188m7011j9004J55J02327o5299j9373J0092j4397L731O0405o9280
420D85k3658j259j5727K7870J2164R8924k3565n0433N3879l3064n8965k2011j5551
407e0911J07154L3615l2196l3081r298Q4748n3983m5712O3391M9618n5413K8201
395H6133j78m7740Q5500m4815l3453n195K2920n3260J5275N2155n83J4518j05734
$$ y = [-44720, 69563, 22322, -42468, -7836, 17431, 47474, 12058, 39015, 82291, 43432, 7530, 57917, 69900, 63379, -604, 52133, 44841, -9275, -3283, 970, 38059, 5936, 29774, -1000, -1922, 11074, 9552, 36988, 67546, 29958, 54940, 28151, -17937, -46778, 16965, 31787, 37130, 83179, 13317, -61838, -46870, -34561, 56381, 32754, 16249, -2586, 73670, 43663, -7337, 14052, 49951, 58139, 11128, -7876, -7721, 94606, 29307, 9934, 20026, 5629, 9360, 69765, 485, -23173, -24432, -40159, -12289, -125, 98799, 75234, 24801, 78680, 45616, -13349, -35360, -50911, 56243, 89858, 57662, 24581, 15283, 100031, 46048, 336, 63727, 113345, 57932, 86133, 85955, 38215, 123715, 78900, 45447, 40252, 63172, 9912, 25187, 77342, 76759, 91277, -14457]
382a4457K6610l5605L67L1882k7597L1977J4709K6436J0297l9171P010J6876M4287
369I3621k0391l4536L749M824k2955j3186J5986J5925o967k5418p042J8291L2329
356E4230O1528j33114L7859K1559m52k4864L8953j4775N3833m8214Q388M1301
344I6232j12837O5626J01434j7533o8083n7026n6601m0792Q6479l561j188O3220
332E5370K9627K9341m0081K8558n3020k2296j2119l6261J2430J7456J5895l5347
320a0447L859J1868k0795K9418Q9640Q8363j00660l8419J2300K4409n8979J9428
308D9985m3378M0432m2943k3608O3087N3173O1078J9029r4011j292q633n5712
296A7207l5377J7368L1380Q4512n4045K1148J16188j2999j4982r1709o3868l053
$$ y = [-14457, 12153, -23452, -23085, 8797, -18800, 13177, 27886, 54322, 64619, 25448, 32458, 49334, 93621, 73230, 38694, 42443, 47267, 24312, 11126, 27112, 43037, 36070, 10652, 3610, 21901, 54230, 115758, -17356, 20503, 42062, 41610, 16746, 55699, 40924, 94757, 46543, 54931, 96232, -16605, 49021, 150455, 132922, 64839, 7813, -48788, -89580, -3101, -6662, -7850, 55370, 84997, 114338, 74257, 102815, 49795, 27499, 15380, -20881, -8451, 9005, 24900, -10447, -6588, 5280, -15515, 13903, 103543, 191906, 91246, 52827, 65127, 89536, 30557, 49985, 6607, 47039, 4096, -19512, 43575, 96748, 157826, 176855, 82844, 81552, 72919, 17207, -18170, -802, 30578, 115090, 61045, 82193, 198381, 185382, 170400, 78691, 14823, 11770]
284A1770k6928J14219n5975M74j7428j9338k6059m831R3525L2938J5316r002k4116
271H4565l4622m4684J0904J07826j25028k5542O0464j2693J8839O185O452n4669
259b003l1326N4320O701R210o802k5936O1616l812m8712J17630o6540J6163j9098
$$ y = [11770, -15158, 99061, 43086, 43560, 26132, 6794, -19265, -24096, 69429, 102367, 117683, 108681, 84565, 49943, 5259, 16163, 123989, -1039, -26581, 33883, 21190, 40029, 46214, 52666, -2003, -33329, 20991, 27692, 36902, 30100, 4164, 65780, 61968, 13256, 130886, 64346, 80509, 61411]
$$ [...]
##END NTUPLES=NMR SPECTRUM
##END=
