##TITLE=1H_CA-9304-1
 DMSO-d6
 8 sc, 
 27.11.2024
##JCAMPDX= 6.0         $$ Bruker NMR JCAMP-DX V2.0
##DATA TYPE= NMR SPECTRUM
##DATA CLASS= NTUPLES
##ORIGIN= UXNMR, Bruker Analytische Messtechnik GmbH
##OWNER= root
$$ XWIN-NMR		Version 3.5
$$ Wed Nov 27 13:56:31 2024 Russian Standard Time (UT+4h)  she@DPX200
##.OBSERVE FREQUENCY= 200.1315
##.OBSERVE NUCLEUS= ^1H
##.ACQUISITION MODE= SIMULTANEOUS
##.ACQUISITION SCHEME= undefined
##.AVERAGES= 8
##.DIGITISER RES= 18
##SPECTROMETER/DATA SYSTEM= spect
##.PULSE SEQUENCE= zg30
##.SOLVENT NAME= DMSO
##.SHIFT REFERENCE= (INTERNAL, DMSO, 0, 19.5283)
##AUDIT TRAIL= $$ (NUMBER, WHEN, WHO, WHERE, WHAT)
$$ ##TITLE= Audit trail, XWIN-NMR		Version 3.5
$$ ##JCAMPDX= 5.01
$$ ##ORIGIN= Bruker BioSpin GmbH
$$ ##OWNER= she
$$ F:/spectra/data/she/nmr/H-F/1/pdata/1/auditp.txt
$$ ##AUDIT TRAIL=  $$ (NUMBER, WHEN, WHO, WHERE, WHAT)
(   1,<2024-11-27 13:55:15.71 +0400>,<she>,<DPX200>,
      <created by zg, POWCHK disabled, PULCHK disabled
       configuration hash MD5:
       00 E9 B6 7A A2 85 ED C7 34 08 36 98 17 FE 4E 26
       data hash MD5: 16K
       6E 64 5C C8 3D DC 3B 7C 7B 34 E9 6C A4 05 5F 34>)
(   2,<2024-11-27 13:55:17.85 +0400>,<she>,<DPX200>,
      <Start of raw data processing
       efp BC_mod = 2 LB = 0.24 FT_mod = 6 PKNL = 1 PHC0 = -26714.85 PHC1 = 8.787449 SI = 16K 
       data hash MD5: 16K
       58 B1 D7 00 22 3C AB D7 66 7E 0D DE 1C F0 82 DA>)
(   3,<2024-11-27 13:55:41.21 +0400>,<she>,<DPX200>,
      <pk PHC0 = -3.976606 PHC1 = 3.4 
       data hash MD5: 16K
       83 3C 7A 37 E0 F0 B9 16 BE D0 D6 9B 69 C4 90 35>)
(   4,<2024-11-27 13:55:44.64 +0400>,<she>,<DPX200>,
      <abs ABSG = 5 
       data hash MD5: 16K
       1C 07 60 EE 96 C3 50 74 82 0B 7B 7B 73 0B 55 0A>)
$$ ##END=
$$ 
$$ hash MD5
$$ 6F 20 16 4C 0B FB CA C4 5D 3E 7B 3A F9 7A A3 52
##$RELAX= 
##$RELAX= 
##$RELAX= 
##$RELAX= 
##$RELAX= 
##$RELAX= 
$$ Bruker specific parameters
$$ --------------------------
##$DU= <F:/spectra>
##$EXPNO= 1
##$NAME= <H-F>
##$PROCNO= 1
##$TYPE= <nmr>
##$USER= <she>
##$AMP= (0..31)
100 100 100 100 100 100 100 100 100 100 100 100 100 100 100 100 100 100 
100 100 100 100 100 100 100 100 100 100 100 100 100 100 
##$AQSEQ= 0
##$AQ_mod= 1
##$AUNM= <au_zg>
##$AUTOPOS= <>
##$BF1= 200.13
##$BF2= 200.13
##$BF3= 200.13
##$BF4= 200.13
##$BF5= 200.13
##$BF6= 200.13
##$BF7= 200.13
##$BF8= 200.13
##$BYTORDA= 1
##$CFDGTYP= 0
##$CFRGTYP= 5
##$CHEMSTR= <none>
##$CNST= (0..31)
1 1 145 1 1 1 1 1 1 1 1 1 1 1 1 1 1 1 1 1 1 1 1 1 1 1 1 1 1 1 1 1 
##$CPDPRG= <>
##$CPDPRG1= <>
##$CPDPRG2= <>
##$CPDPRG3= <>
##$CPDPRG4= <mlev>
##$CPDPRG5= <mlev>
##$CPDPRG6= <mlev>
##$CPDPRG7= <mlev>
##$CPDPRG8= <mlev>
##$CPDPRGB= <>
##$CPDPRGT= <>
##$D= (0..31)
0 1.2 0 0 0 0 0 0 0 0.06 0 0.03 0 0 0 0 0.0002 0 0 0 0 0 0 0 0 0 0 0 0 
0 0 0 
##$DATE= 1732701315
##$DBL= (0..7)
120 120 120 120 120 120 120 120 
##$DBP= (0..7)
150 150 150 150 150 150 150 150 
##$DBP07= 0
##$DBPNAM0= <>
##$DBPNAM1= <>
##$DBPNAM2= <>
##$DBPNAM3= <>
##$DBPNAM4= <>
$$ [...]
##$SUBNAM3= <"">
##$SUBNAM4= <"">
##$SUBNAM5= <"">
##$SUBNAM6= <"">
##$SUBNAM7= <"">
##$SUBNAM8= <"">
##$SUBNAM9= <"">
##$SW= 24.0689530833862
##$SWIBOX= (0..15)
0 0 2 0 0 0 0 0 0 0 0 0 0 0 0 0 
##$SW_h= 4816.95568400771
##$TD= 16384
##$TD0= 1
##$TE= 0
##$TE2= 300
##$TE3= 300
##$TEG= 300
##$TL= (0..7)
0 120 120 120 120 120 120 120 
##$TP= (0..7)
150 150 150 150 150 150 150 150 
##$TP07= 0
##$TPNAME0= <>
##$TPNAME1= <>
##$TPNAME2= <>
##$TPNAME3= <>
##$TPNAME4= <>
##$TPNAME5= <>
##$TPNAME6= <>
##$TPNAME7= <>
##$TPOAL= (0..7)
0.5 0.5 0.5 0.5 0.5 0.5 0.5 0.5 
##$TPOFFS= (0..7)
0 0 0 0 0 0 0 0 
##$TUNHIN= 0
##$TUNHOUT= 0
##$TUNXOUT= 0
##$USERA1= <user>
##$USERA2= <user>
##$USERA3= <user>
##$USERA4= <user>
##$USERA5= <user>
##$V9= 5
##$VALIST= <valist>
##$VCLIST= <CCCCCCCCCCCCCCC>
##$VD= 0
##$VDLIST= <DDDDDDDDDDDDDDD>
##$VPLIST= <PPPPPPPPPPPPPPP>
##$VTLIST= <TTTTTTTTTTTTTTT>
##$WBST= 1024
##$WBSW= 4
##$XGAIN= (0..3)
0 0 0 0 
##$XL= 0
##$YL= 0
##$YMAX_a= 624650
##$YMIN_a= -410683
##$ZGOPTNS= <>
##$ZL1= 120
##$ZL2= 120
##$ZL3= 120
##$ZL4= 120
##$ABSF1= 19.47537
##$ABSF2= -4.593761
##$ABSG= 5
##$ABSL= 3
##$ALPHA= 0
##$AQORDER= 0
##$ASSFAC= 0
##$ASSFACI= 0
##$ASSFACX= 0
##$ASSWID= 0
##$AUNMP= <proc_1d>
##$AZFE= 0.1
##$AZFW= 0.1
##$BCFW= 0
##$BC_mod= 2
##$BYTORDP= 0
##$COROFFS= 0
##$CY= -3
##$DATMOD= 1
##$DC= 0
##$DFILT= <>
##$DTYPP= 0
##$F1P= 0
##$F2P= 0
##$FCOR= 1
##$FTSIZE= 16384
##$FT_mod= 6
##$GAMMA= 0
##$GB= 0
##$INTBC= 1
##$INTSCL= 2.524811e-10
##$ISEN= 128
##$LB= 0.24
##$LEV0= 0
##$LPBIN= 0
##$MAXI= 10000
##$MC2= 0
##$MEAN= 0
##$ME_mod= 0
##$MI= 1.114404
##$NCOEF= 0
##$NC_proc= -6
##$NLEV= 6
##$NOISF1= 3.799351
##$NOISF2= 2.8
##$NSP= 0
##$NTH_PI= 0
##$NZP= 0
##$OFFSET= 19.52826
##$PC= 1
##$PHC0= -26718.83
##$PHC1= 12.18745
##$PH_mod= 1
##$PKNL= yes
##$PPARMOD= 0
##$PSCAL= 0
##$PSIGN= 0
##$REVERSE= no
##$SF= 200.130000287115
##$SI= 16384
##$SIGF1= 3
##$SIGF2= 2
##$SINO= 5.538805
##$SIOLD= 16384
##$SREGLST= <1H.CDCl3>
##$SSB= 0
##$STSI= 16384
##$STSR= 0
##$SW_p= 4816.95568400771
##$SYMM= 0
##$S_DEV= 0
##$TDeff= 16384
##$TDoff= 0
##$TI= <>
##$TILT= no
##$TM1= 0
##$TM2= 0
##$TOPLEV= 0
##$USERP1= <user>
##$USERP2= <user>
##$USERP3= <user>
##$USERP4= <user>
##$USERP5= <user>
##$WDW= 1
##$XDIM= 16384
##$YMAX_p= 353733899
##$YMIN_p= -389497
$$ End of Bruker specific parameters
$$ ---------------------------------
##NTUPLES= NMR SPECTRUM
##VAR_NAME=  FREQUENCY,     SPECTRUM/REAL,   SPECTRUM/IMAG
##SYMBOL=    X,             R,               I
##VAR_TYPE=  INDEPENDENT,   DEPENDENT,       DEPENDENT
##VAR_FORM=  AFFN,          ASDF,            ASDF
##VAR_DIM=   16384,         16384,           16384
##UNITS=     HZ,            ARBITRARY UNITS, ARBITRARY UNITS
##FACTOR=    0.29402158847633, 1,            1
##FIRST=     3908.19053478166, 0,            0
##LAST=      -908.765149226049, 0,           0
##MIN=       -908.765149226049, -389497,     0
##MAX=       3908.19053478166, 353733899,    0
$$ Real data points
##PAGE= N=1
##DATA TABLE= (X++(R..R)), XYDATA
$$ [...]
7194d1514m4532J6141K8501O282j11153K05696k2257j98083M9889Q6408p0884
$$ -41514 -86046 -69905 -41404 -35122 -146275 59421 37164 -160919 -111030 -24622 -95506
7183i5506K8642k5713P3394M2264n3989o8499q0724J93168n9741l6389K07670
$$ -95506 -66864 -92577 -19183 23081 -30908 -99407 -180131 13037 -46704 -83093 124577
7172A24577j61086j37923P4154l4840K56287q0132k61112J43807L9885j31982
$$ 124577 -36509 -174432 -100278 -135118 121169 41037 -220075 -76268 -36383 -168365
7162a68365L8661j5352R3139j89801K54681J05035j98637J58042m3478q4408Q4263
$$ -168365 -129704 -145056 -51917 -241718 12963 117998 -80639 77403 33925 -50483 33780
7151C3780p6360J7946j4805o1767J06784j5219o5569j657J22305j73548r0144
$$ 33780 -42580 -24634 -39439 -101206 5578 -9641 -75210 -76867 45438 -128110 -218254
7140b18254J03598N8389l1885j679K7719K32363K3583p6238K9716M7234J1073
$$ -218254 -114656 -56267 -88152 -89831 -62112 170251 193834 117596 147312 194546 205619
7129B05619k49378L6519l0173j01886p969N5493L3337J04659J37218L1903j5523
$$ 205619 -43759 -7240 -37413 -139299 -147268 -91775 -58438 46221 183439 215342 199819
7118A99819j56831p4924o8075P6618n244J17068j07860j1289R0020q6023q0683
$$ 199819 42988 -31936 -100011 -23393 -28637 88431 -19429 -30718 59302 -26721 -107404
7107a07404J43162o7497P7510n7293k9497J3478r5976m4582P4479K1267N7493
$$ -107404 35758 -31739 45771 -11522 -41019 -27541 -123517 -168099 -93620 -72353 -14860
7096a4860r0064Q8559O0987r7689k9920m8581J73900R1877j02672r0360r6276
$$ -14860 -104924 -16365 44622 -53067 -82987 -131568 42332 134209 31537 -58823 -155099
7085a55099L9148J47366j3820r3842M0120m3134n5760L3283J22137o8004l2877
$$ -155099 -115951 31415 17595 -76247 -36127 -79261 -135021 -101738 20399 -47605 -80482
7074h0482l1974j11230J09286k5930K3041P7204o4592o1835J36068m3442O9995
$$ -80482 -112456 -223686 -114400 -140330 -117289 -40085 -104677 -166512 -30444 -73886 -3891
7063c891j72945O4232n2356K3367J64731k6748n9318O7385Q2084j25889K9632
$$ -3891 -176836 -112604 -164960 -141593 23138 -3610 -62928 4457 86541 -39348 -9716
7052i716m5118J8091j50122J00565j9550P1478l1734r9192P74Q4486K0372P282
$$ -9716 -54834 -36743 -186865 -86300 -105850 -34372 -66106 -165298 -164524 -80038 -59666 -52384
7040e2384P958J6580J6729M7980l1008m5158j3185L0022p5465m7473Q4854p6366
$$ -52384 -44426 -27846 -11117 36863 5855 -39303 -52488 -22466 -97931 -145404 -60550 -136916
7028a36916K22495m4747k40977k6430P3769J8716J40678r6265p7215n3827R4498
$$ -136916 85579 40832 -200145 -226575 -152806 -134090 6588 -89677 -166892 -220719 -126221
7017a26221J6814k3920J53377N91Q2390J23377r5160k6214r8253P4035j47897
$$ -126221 -109407 -133327 20050 20641 103031 226408 131248 105034 6781 80816 -67081
7006f7081p2801Q9982J13650j13598K6066J34422j02645k2952q748R2082k7771
$$ -67081 -139882 -49900 63750 -49848 -23782 110640 7995 -14957 -23705 68377 40606
6995D0606n459J8547j59013j0305J07341J0050p0829j6831O48M9472Q5856n4182
$$ 40606 35147 53694 -105319 -115624 -8283 1767 -69062 -85893 -85245 -35773 50083 -4099
6983d099j21793O1316J208J05175j70681r664R1568P0013M8441p5292J92946q1996
$$ -4099 -125892 -64576 -63368 41807 -128874 -138538 -46970 23043 71484 -3808 189138 107142
6971A07142K4699j293j29322J17750j37881k0092J36677L1001o6260j63696P7277
$$ 107142 131841 130548 1226 118976 -18905 -38997 97680 128681 62421 -101275 -23998
6960b3998p1131J8167J23061J53217N4360j35973n7560j8228n7201M7386j04084
$$ -23998 -95129 -76962 46099 199316 253676 117703 60143 41915 -15286 32100 -71984
6949g1984M6026R390K5568n496o2061n5913O9036M6465k3453p7066P3718J5815
$$ -71984 -25958 -16568 9000 3504 -58557 -114470 -45434 1031 -22422 -99488 -25770 -9955
6937i955J04769j74971N1299N0307j5593l5393o3159R4509o5468M0504j12923
$$ -9955 94814 -80157 -28858 21449 5856 -29537 -92696 1813 -63655 -23151 -136074
6926a36074J2640J06168l988l2786q1708n3986M7841K1582m9288J5269Q2243J3947
$$ -136074 -123434 -17266 -21254 -54040 -135748 -189734 -141893 -120311 -169599 -154330 -72087 -58140
6914e8140Q3493r460R8383j191m5673j26572j28381J43271K951O5419q3644r2848
$$ -58140 25353 15893 114276 113085 67412 -59160 -187541 -44270 -41319 24100 -59544 -152392
6902a52392J22324k8824J03296j89828o0275o3286N7285k8415K5262P1964J10203
$$ -152392 -30068 -58892 44404 -145424 -205699 -268985 -211700 -240115 -214853 -142889 -32686
6891c2686j44182K19643M0156l3732l7182p3859m4746O6361q386k56504J66135
$$ -32686 -176868 42775 82931 49199 12017 -61842 -106588 -40227 -48613 -305117 -138982
6880a38982O1013m3198M4423J16205r6647p5538L8703n1403j38665J23425J65555
$$ -138982 -77969 -121167 -76744 39461 -57186 -132724 -94021 -145424 -284089 -160664 4891
6869D891m9345m811J39942m3619j42629L0934p6771j23597K22540m5066q2100
$$ 4891 -44454 -49265 90677 47058 -95571 -64637 -141408 -265005 -42465 -87531 -169631
6858a69631J85865Q2202p0174n8715l0495K6463p8325l2766P9369N5609j34411
$$ -169631 16234 98436 28262 -30453 -60948 -34485 -112810 -145576 -66207 -10598 -145009
6847a45009K6307Q8806k522j931j07946K51658o5292l2486q757p4378J28826j48797
$$ -145009 -118702 -29896 -32418 -34349 -142295 109363 44071 11585 2828 -71550 57276 -91521
6835i1521R0326K2141j28411n814O1824k897l8025M2031J01077L8451o8894L4744
$$ -91521 -1195 20946 -107465 -113279 -51455 -54352 -92377 -50346 50731 89182 20288 55032
6823E5032N2682j35813o4402O4562P7704k13898K90044j34290m3770J76014j96751
$$ 55032 107714 -28099 -92501 -27939 49765 -164133 125911 -8379 -52149 123865 -72886
6812g2886p7372J02704k5611N2791J0080r3416k7471J54277Q7722r034q7824Q4581
$$ -72886 -150258 -47554 -73165 -20374 -10294 -103710 -131181 23096 110818 101784 13960 98541
6800I8541j96977r0797M8752R248J44320J7818M1051j39283m5751p361m1031Q7235
$$ 98541 -98436 -189233 -140481 -131233 13087 30905 71956 -67327 -113078 -120439 -161470 -74235
6788g4235P9203j11834J06366J5470o848l8244j85948K6603P4049O0253J87933
$$ -74235 4968 -106866 -500 14970 8122 -30122 -216070 -189467 -115418 -55165 132768
6777A32768j79082m8071q3920Q4692R6762J1802P023k57206J00460O8613J04265
$$ 132768 -46314 -94385 -178305 -93613 3149 14951 21974 -235232 -134772 -66159 38106
6766C8106M2280q8424J9680r432N3904j28209j67853K40680J17251J7671j6364
$$ 38106 80386 -8038 11642 2210 56114 -72095 -239948 732 117983 135654 119290
6755A19290k27118R4123o101N2302l287m9610q319n2302j16593M5158J81248m6029
$$ 119290 -107828 -13705 -19806 32496 29209 -20401 -28720 -81022 -197615 -152457 28791 -17238
6743a7238L8640k7885M014L555P959K13446k07921p4508p5408k9958o21K0932
$$ -17238 21402 -6483 -2469 1086 9045 222491 14570 -59938 -135346 -165304 -165925 -144993
6731a44993J1671J46731N1901j55239N3426K1450n7231J78157J22127j81522j53313
$$ -144993 -133322 13409 65310 -89929 -36503 -15053 -72284 105873 228000 46478 -106835
6720a06835k6430P2538K02385k21706p0039M1426Q3341M8532R451r5804Q4585
$$ -106835 -133265 -60727 141658 -80048 -150087 -108661 -25320 23212 32663 -63141 21444
6709B1444J7075j38499Q5566j5840N2481O3356j5740j11539J42527P7696j69210
$$ 21444 38519 -99980 -14414 -30254 22227 85583 69843 -41696 100831 178527 9317
6698I317j37981J04208M8192K4221M4988r4130j01229M5792j03863L8024m0778
$$ 9317 -128664 -24456 23736 47957 92945 -1185 -102414 -56622 -160485 -122461 -163239
6687a63239J83110o3421k4149J65314n9759j11750k2791j8448J6413j6482L5780
$$ -163239 19871 -43550 -67699 97615 37856 -73894 -96685 -115133 -98720 -115202 -79422
6676g9422N3448q0013m048k5969O8027K5561J30518M346L1660r9408k6858o531
$$ -79422 -25974 -105987 -110035 -136004 -67977 -42416 88102 92448 124108 24700 -2158 -8689
6664h689j9753J63541J10085k00698J39859j41877j84428J13219j2191q1088n9264
$$ -8689 -28442 135099 245184 44486 184345 42468 -141960 -28741 -40932 -122020 -181284
6653a81284R1091J62889Q0375j98221J33407K3152n5393M1480K9990j77204O9738
$$ -181284 -90193 72696 153071 -45150 88257 111409 56016 97496 127486 -49718 20020
6642B0020j04541n8794n4733J11442J08405n8373k1926N0694j17095J31458R117
$$ 20020 -84521 -143315 -198048 -86606 21799 -36574 -58500 -7806 -124901 6557 15674
6631A5674l4412J663M816O7293P2190O9386j27311k2181j00246R270m3497n1254
$$ 15674 -18738 -17075 -12259 55034 127224 196610 69299 47118 -53128 -43858 -87355 -138609
6619a38609J80297J29109j04042j99149J89124K8397j44311O6037n940J21520
$$ -138609 41688 170797 66755 -132394 56730 85127 -59184 6853 913 122433
6609A22433j84192j9108J40013r5958k5785J36598o5044n7870O0211n0967J64170
$$ 122433 -61759 -80867 59146 -36812 -62597 74001 8957 -48913 11298 -39669 124501
6598A24501n7396p8976J38577j63767K6722L9322j24371K4301K39098j24983j21291
$$ 124501 67105 -11871 126706 -37061 -10339 28983 -95388 -71087 168011 43028 -78263
6587g8263P7673k9444K7366K0597j56149J56095l6976M2189j48602R8778K4916
$$ -78263 -590 -30034 -2668 17929 -138220 17875 -19101 23088 -125514 -26736 -1820
6576a820Q8888r1834j00466O8791m5127J57526K4973j5761O2196M1035k0340j43846
$$ -1820 87068 -4766 -105232 -36441 -81568 75958 100931 85170 147366 188401 168061 24215
6564B4215O6043J60724k09528q7590n6899J4113J50875k332K5665J03606j35258
$$ 24215 90258 250982 41454 -46136 -103035 -88922 61953 59621 85286 188892 53634
6553E3634k1994l4511Q1775l2262P0674K5325P1875K9597j21611O9755n1274L594
$$ 53634 31640 -2871 78904 46642 117316 142641 214516 244113 122502 192257 140983 144577
6541A44577K8826J128Q0133p5248q9895K0348n1867j5945K22909j14275k2159
$$ 144577 173403 174531 254664 179416 89521 109869 58002 42057 264966 150691 128532
6530A28532J7529M6740k09432M1993J09477N0895L2290l4237L7942j0378j07773
$$ 128532 146061 192801 -16631 25362 134839 185734 218024 183787 221729 211351 103578
6519A03578m9692q4652J12496J52065M5073j3401k14077N1902R8642q0747j31809
$$ 103578 53886 -30766 81730 233795 278868 265467 51390 103292 201934 121187 -10622
6508a0622P3325O7657N4384j25012J40283j47728r1159J01226j5981p6210J42238
$$ -10622 62703 130360 184744 59732 200015 52287 -38872 62354 46373 -29837 112401
6497A12401p0920o0018K71749j12293k2431K22871j56335q3883l3714l2839N2657
$$ 112401 41481 -18537 253212 140919 118488 341359 185024 101141 67427 34588 87245
6486H7245j74520M1458J2837p353J02741J97589j12344l9425J31144o8196n8754
$$ 87245 -87275 -45817 -32980 -40333 62408 259997 147653 108228 239372 171176 112422
6475A12422l4340P1652l940j15339q7819N3771J24898p2795J88200j75462N270
$$ 112422 78082 149734 145794 30455 -57364 -3593 121305 48510 236710 61248 66518
6464F6518N4868j4775N5875M4349k3643p8337J36813j29617k3904j09766J9927
$$ 66518 121386 106611 162486 206835 183192 104855 241668 112051 88147 -21619 -1692
6453a692K94998j72465N1174O0920j7141m1946K30121j53254j14415m3724k15580
$$ -1692 293306 120841 172015 232935 215794 173848 403969 250715 136300 92576 -123004
6442a23004N6346O9816J96050O2108j19880m9176R8051q6043L1740l604p9378
$$ -123004 -66658 3158 199208 261316 141436 92260 190311 104268 136008 132404 53026
6431E3026K4177k02398j0739J08652k7371J03101M3618K7516J2296k9216j88439
$$ 53026 77203 -125195 -135934 -27282 -54653 48448 92066 119582 131878 102662 -85777
6420h5777J41729R5592J6003j4838r6629J08292p9235j67352J04972p6865O9637
$$ -85777 55952 151544 167547 152709 56080 164372 85137 -82215 22757 -54108 15529
6409A5529m9081P1535J57151o4299m0977J96708O9794j13215L0694P0905k20135
$$ 15529 -33552 37983 195134 130835 89858 286566 356360 243145 273839 344744 124609
6398A24609q4756J26541l0672n1521n0724L0934J65023N5350j36466m7487M6864
$$ 124609 39853 166394 135722 84201 33477 64411 229434 284784 148318 100831 147695
6387A47695p9713k0862M3170m5291R8622j17028n5604J28232j02730M3747J47604
$$ 147695 67982 47120 90290 44999 143621 26593 -29011 99221 -3509 40238 187842
6376A87842M2592k8459j8636K0089n6591p1551J57588q5325J18259j22335J0798
$$ 187842 230434 201975 183339 203428 146837 75286 232874 147549 265808 143473 154271
6365A54271m3689J12077q6635j78527K14583L0106j56371J4544k0020J04730Q8469
$$ 154271 110582 222659 136024 -42503 172080 202186 45815 60359 40339 145069 233538
6354B33538l8208R86J48209j77088q7699P4307k6682L0194N4095p3123L8365M6262
$$ 233538 195330 196316 344525 167437 79738 154045 127363 157557 211652 138529 176894 223156
6342B23156M7108l1863l50M8693O947O914j43298m1816k7193L1616j9432J61678
$$ 223156 270264 238401 238051 286744 293691 300605 157307 115491 88298 119914 100482 262160
6330B62160j94053N4283M3283n6179L5902Q7674k1719l0208J3494L2653o1506
$$ 262160 68107 122390 165673 109494 145396 233070 211351 181143 194637 227290 165784
6319A65784N3165k3337O7592r5576J6787R1940K1972k1359o4672k40817J68926
$$ 165784 218949 195612 263204 167628 184415 276355 298327 276968 212296 -28521 140405
6308A40405P534l139P8840P6926m7268n4506J89151p6893k37052J15226R8460
$$ 140405 147939 144800 223640 300566 253298 198792 387943 311050 73998 189224 287684
6297B87684l3745L3515K971R2805k0732k21998N0072K4864J7326J1515j45394
$$ 287684 253939 287454 290425 383230 362498 140500 190572 215436 232762 244277 98883
6286I8883J3856Q4248O4359k7331R2459j27318J02566K14086j45249p4923j44279
$$ 98883 112739 196987 261346 234015 326474 199156 301722 515808 370559 295636 151357
6275A51357K5522j6979J10885R4613j1193m5298o7101L3711J2733j50679J42268
$$ 151357 176879 159900 270785 365398 354205 308907 241806 275517 288250 137571 279839
6264B79839R0383p3597K00957j6614o4888r1903q2687n225K9027j13694P1260
$$ 279839 370222 296625 497582 480968 416080 324177 241490 236265 265292 151598 222858
6253B22858K8642P5138J12050m3279l6547k2541j6976J35185j07032K7693J46563
$$ 222858 251500 326638 438688 395409 358862 336321 319345 454530 347498 375191 521754
6242E21754p6909j22578M6751O7996j6558J83513p4208m6334k0173L2784J27902
$$ 521754 444845 322267 369018 437014 420456 603969 529761 483427 463254 496038 623940
6231F23940j8761k22326M1099Q0359j6223j6605m6737R3541R0411j2372O8967
$$ 623940 605179 382853 423952 504311 488088 471483 424746 518287 608698 596326 665293
6220F65293j23138J3677Q7683j20019N6244n133K19242j888p4275O5114j19754
$$ 665293 542155 555832 643515 523496 579740 574607 793849 791961 717686 782800 663046
6209F63046n0275J68187L6567O101J06393J93278N7747p5889j17235j15020k6681
$$ 663046 612771 780958 817525 823626 930019 1123297 1181044 1105155 987920 872900 846219
6198H46219J15307o6432q2560P3978J00472R1149K7869m3268o5712J23759k0690
$$ 846219 961526 895094 812534 886512 986984 1078133 1106002 1062734 997022 1120781 1100091
6187A100091Q6773L1820J0746K6767K30717j1313j08752P6436J09097M5843o8733
$$ 1100091 1186864 1218684 1229430 1256197 1486914 1475601 1366849 1443285 1552382 1598225 1529492
6176A529492m1614o5707M6361J05585o3011o4097j04083p3158J80819L2199j35863
$$ 1529492 1487878 1422171 1468532 1574117 1511106 1447009 1342926 1269768 1450587 1482786 1346923
6165A346923m9877J39564m6698k7747l4418O2505J10473J02115J6173L5216K9642
$$ 1346923 1297046 1436610 1389912 1362165 1327747 1390252 1500725 1602840 1619013 1654229 1683871
6154A683871R718N7110j22674O6286J1530j86966Q2420m4337o7469r9314J28627
$$ 1683871 1693589 1750699 1628025 1694311 1705841 1518875 1601295 1556958 1489489 1390175 1518802
6143A518802j871j93529j6946N2132O4555K16r9253K6042J12000o4063j55034
$$ 1518802 1516931 1323402 1306456 1358588 1423143 1423359 1324106 1350148 1462148 1398085 1243051
6132A243051J04145J19539K444L1924k19539K8742L02767q6162l1116j03074Q4259
$$ 1243051 1347196 1466735 1469179 1501103 1281564 1310306 1613073 1526911 1495795 1392721 1476980
6121A476980j37982J26342j63026J40789l4667j08195J19491M627L7776p63J62832
$$ 1476980 1338998 1465340 1302314 1443103 1408436 1300241 1419732 1424359 1462135 1461372 1624204
6110A624204k7920m5793J7856M3324j82902j73K07435L8358O1795k1417q35j03165
$$ 1624204 1596284 1550491 1568347 1611671 1428769 1428596 1636031 1674389 1736184 1714767 1713932 1610767
6098A610767j5530p047J7992L1528J43957M8570J1514p2607n1604j8123M9761
$$ 1610767 1595237 1588190 1606182 1637710 1781667 1830237 1841751 1769144 1717540 1699417 1749178
6087A749178J53756P5526p3382o0111J38357j5060Q7977k319Q9516J3182J25357
$$ 1749178 1902934 1978460 1905078 1844967 1983324 1968264 2056241 2053922 2143438 2156620 2281977
6076B281977r9042q0651J79665o9825k5946O3427J4778J20519M558p2394R5320
$$ 2281977 2182935 2102284 2281949 2212124 2186178 2249605 2264383 2384902 2389460 2317066 2412386
6065B412386O1374q6192j2979N7388K30610M4777k979M3733L2367O1453J75702
$$ 2412386 2473760 2387568 2374589 2431977 2662587 2707364 2704385 2748118 2780485 2841938 3017640
6054C017640l4051J9914j867M7541J49191J38344j18307J36646r0505J12730L6830
$$ 3017640 2983589 3003503 3001636 3049177 3198368 3336712 3218405 3355051 3264546 3377276 3414106
6043C414106J37452J1607Q049o5614J82538J23779K5700O912K59531J52001j96615
$$ 3414106 3551558 3563165 3571214 3505600 3688138 3811917 3837617 3844529 4104060 4256061 4059446
6032D059446P8626K25075n788J13759N4279o2033K46935M7297j418J05438K76847
$$ 4059446 4138072 4363147 4357359 4471118 4525397 4463364 4710299 4757596 4756178 4861616 5138463
6021E138463L6461J16823J13727l5093K60760K17975j14199P9147L97618L3610
$$ 5138463 5174924 5291747 5405474 5370381 5631141 5849116 5734917 5814064 6211682 6245292
6011F245292K18035J61996J69215J5888K21759J83688K24065K25703J32263J89192
$$ 6245292 6463327 6625323 6794538 6810426 7032185 7215873 7439938 7665641 7797904 7987096
6001G987096L26152M21944J63914K42938M90566K23347K49190M14163M53133L29463
$$ 7987096 8313248 8735192 8899106 9142044 9632610 9855957 10105147 10519310 10972443 11301906
5991A1301906N10825L71208L77267O04976M81616N20576M07045P50863O93528
$$ 11301906 11812731 12183939 12561206 13166182 13647798 14168374 14575419 15326282 16019810
5982A6019810N46759P44284R73665P73603P99484Q72354J188572R48255J173782
$$ 16019810 16566569 17310853 18284518 19058121 19857605 20729959 21918531 22866786 24040568
5973B4040568J172305J255592J339074J498604J757544J766392J699936K047434
$$ 24040568 25212873 26468465 27807539 29306143 31063687 32830079 34530015 36577449
5965C6577449K234365K563964K976428L099906L328444L996135M064082M410120
$$ 36577449 38811814 41375778 44352206 47452112 50780556 54776691 58840773 63250893
5957F3250893M865231M765856M297405L418377K394116J053878J45463o12720
$$ 63250893 68116124 72881980 77179385 80597762 82991878 84045756 84191219 83578499
5949H3578499q98278p66682n83769J72654O47257J412498J939236K828169L581271
$$ 83578499 82680221 81913539 81329770 81502424 82149681 83562179 85501415 88329584 91910855
5940I1910855M482079N291575O235899P445095Q386804R268624J0470141J0942360
$$ 91910855 96392934 101684509 107920408 115365503 123752307 133020931 143491072 154433432
5932A54433432J0770546R498213O807877L238027j014851m714888p253251q936944
$$ 154433432 165203978 174702191 181510068 184748095 183733244 179018356 171765105 162828161
5924A62828161q949245q268031p140607n484945m200496k841904j559133k29578
$$ 162828161 153878916 145610885 138470278 132985333 128784837 125942933 124383800 124154222
5916A24154222R26339K187737L451166M563558N944500P045165P934255Q651201
$$ 124154222 125080561 127268298 130719464 135283022 141227522 148272687 156206942 164858143
5908A64858143Q899327P678662N162057J399255k670335o615578r566970j1143430
$$ 164858143 173757470 181436132 186598189 187997444 185327109 178711531 169144561 158001131
5900A58001131j1543694j0901793r864215q574775p040710n899553n160997l845120
$$ 158001131 146457437 135555644 125691429 117116654 110075944 104176391 99015394 95170274
5892I5170274l169172k600729j940287j147984m51763j71215L99297J027060Q56237
$$ 95170274 92001102 89400373 87460086 86312102 85860339 85689124 86088421 87115481 87971718
5883H7971718P92661K15764j058198k157321l528001m140052m723709m846867
$$ 87971718 88764379 88980143 87921945 85764624 82236623 78096571 73372862 68525995
5875F8525995m690404m503226l763099l468748l167221k800048k573098k359223
$$ 68525995 63835591 59332365 55569266 52100518 48933297 46133249 43560151 41200928
5867D1200928k118836j937781j842254j700861j405823j526911j318735j482046
$$ 41200928 39082092 37144311 35302057 33601196 32195373 30668462 29349727 27867681
5859B7867681j352996r69939r66685q86172p82566q58037o74531o58272n48866
$$ 27867681 26514685 25544746 24578061 23691889 22909323 22051286 21376755 20718483 20169617
5850B0169617p76228o33972m68114o06547o06032n03352n53498m08702m60954
$$ 20169617 19393389 18759417 18291303 17684756 17078724 16575372 16021874 15613172 15152218
5841A5152218m07005n40589n46725n10917l71614m68982m33116j93106m00840
$$ 15152218 14745213 14204624 13657899 13146982 12775368 12306386 11873270 11680164 11279324
5832A1279324l32100j95026k86931j21497k09960l55461j21803m29159k38934
$$ 11279324 10947224 10752198 10465267 10343770 10133810 9778349 9656546 9227387 8988453
5823H988453j43396l07945j51527j46711l02883k74943l5093j48210l75851j61995
$$ 8988453 8845057 8537112 8385585 8238874 7935991 7661048 7625955 7477745 7101894 6939899
5813F939899r5424j09582k92471j26527j62763k11063k18139j24304P2859l41527
$$ 6939899 6844475 6734893 6442422 6315895 6153132 5942069 5723930 5599626 5672485 5330958
5803E330958P1294k8940k95198k1799m2740j57553p015j16860o1842j79772j65901
$$ 5330958 5402252 5373312 5078114 5056315 5013575 4856022 4849007 4732147 4670305 4490533 4324632
5792D324632Q8921j10329n2854j15271n3798j8727K4279k19231k22098K2300J42622
$$ 4324632 4413553 4303224 4250370 4135099 4081301 4062574 4086853 3867622 3645524 3667824 3810446
5781C810446q2370r7039r5971o2393j21573J34563j22367j90843J54713k015o2868
$$ 3810446 3728076 3631037 3535066 3472673 3351100 3485663 3363296 3172453 3327166 3325151 3262283
5770C262283M4527k20015o153J30919j65342m0826m4495J5752J1121O3088k05645
$$ 3262283 3306810 3086795 3080642 3211561 3046219 3005393 2960898 2976650 2987771 3050859 2845214
5759B845214j36263j58490J08998k7429j46977n1825J8942P8130m1785j7135J4412
$$ 2845214 2708951 2550461 2659459 2632030 2485053 2433228 2452170 2530300 2488515 2471380 2485792
5748B485792K2947j48454L3750j46730R1621m6785o4784K5820k3137J36752o5336
$$ 2485792 2508739 2360285 2394035 2247305 2338926 2292141 2227357 2253177 2230040 2366792 2301456
5737B301456o3650k1393J29616n4248k00085n9559J48013M8003r276j28855j01485
$$ 2301456 2237806 2216413 2346029 2291781 2091696 2032137 2180150 2228153 2218877 2090022 1988537
5726A988537q0623K3574K8473P7876j73824J85840p2067N4789J11603j42466j06098
$$ 1988537 1907914 1931488 1959961 2037837 1864013 2049853 1977786 2032575 2144178 2001712 1895614
5715A895614J55667r245O602m1673k4951J45959j16570O440J0231L1412l2749
$$ 1895614 2051281 2042036 2048638 2006965 1982014 2127973 2011403 2017843 2028074 2059486 2026737
5704B026737m5066j6832K12948j26019R1036M2435j92395p7187m838P7445J1319
$$ 2026737 1981671 1964839 2177787 2051768 2142804 2185239 1992844 1915657 1910819 1988264 1999583
5693A999583k5057Q0j11953K65595j56051O3332J09720q9295J82147J23357p549
$$ 1999583 1974526 1974606 1862653 2128248 1972197 2035529 2145249 2055954 2238101 2361458 2353909
5682B353909j30354Q1165Q0252N7663M0483J08035l0031q5162q790k45611P2612
$$ 2353909 2223555 2304720 2384972 2442635 2483118 2591153 2561122 2475960 2467170 2221559 2294171
5671B294171j15065j20007K0021L3768J21472j28790O2458j12638Q942m5068Q1549
$$ 2294171 2179106 2059099 2079120 2112888 2234360 2105570 2168028 2055390 2064332 2019264 2100813
5660B100813P1506R1598k4651J42496J22792k5095R516q3205o415p5921O5554
$$ 2100813 2172319 2263917 2239266 2381762 2504554 2479459 2488975 2405770 2399355 2323434 2388988
5649B388988j36377J35312j83427j40671P0238q5288j09017L5104j1645m4856
$$ 2388988 2252611 2387923 2204496 2063825 2134063 2048775 1939758 1974862 1963217 1918361
5639A918361L07O9835j63750K408Q4357l6923o5636J87039M6813r8156m0178n4758
$$ 1918361 1918668 1988503 1824753 1827161 1911518 1874595 1808959 1995998 2042811 1944655 1904477 1849719
5627A849719M5239m7386m1978o253n8181L0482n2378k6972N6322L5725n9713N8935
$$ 1849719 1894958 1847572 1805594 1799341 1741160 1771642 1719264 1692292 1748614 1784339 1724626 1783561
5615A783561M3375p430K20614j71563j49190J80278j19874k6151o6173J50631
$$ 1783561 1826936 1819506 2040120 1868557 1719367 1899645 1779771 1753620 1687447 1838078
5605A838078q5477L0005l9034j74995J97483N7904j51551L4046J52494j65063
$$ 1838078 1752601 1782606 1743572 1568577 1766060 1823964 1672413 1706459 1858953 1693890
5595A693890J63202M4711m6567K7282O7359J23873r8625o8046l7226J61313L3948
$$ 1693890 1857092 1901803 1855236 1882518 1949877 2073750 1975125 1907079 1869853 2031166 2065114
5584B065114j00566M7783J590M3265J36477j53611l4021J70397M1641L8724J20831
$$ 2065114 1964548 2012331 2013921 2057186 2193663 2040052 2006031 2176428 2218069 2256793 2377624
5573B377624j57990j57605J99622N1562k8686j0572R9833p221M6070p2271J35013
$$ 2377624 2219634 2062029 2261651 2313213 2284527 2273955 2373788 2366567 2412637 2340366 2475379
5562B475379J59517o4463j01922Q1969L3966J33911P0668j02071O3660J54347
$$ 2475379 2634896 2570433 2468511 2550480 2584446 2718357 2789025 2686954 2750614 2904961
5552B904961L6792N8154q6518J80226J64715J59707J24380J18829j1195J5901
$$ 2904961 2941753 2999907 2913389 3093615 3258330 3418037 3542417 3661246 3650051 3665952
5542C665952R4567J10832k054J0544k6077O2618r462O5175Q4536J36315q3918
$$ 3665952 3760519 3871351 3869297 3879841 3853764 3916382 3906920 3972095 4056631 4192946 4109028
5531D109028l1911J57011J16093L1059P8335j4148l446J6817k3J20688R2315P1443
$$ 4109028 4077117 4234128 4350221 4381280 4459615 4445467 4442021 4458838 4458815 4579503 4671818 4743261
5519D743261q1547N4968m5522Q1717K72850n8471J374Q1364Q193j2896P0681P4432
$$ 4743261 4661714 4716682 4671160 4752877 5025727 4967256 4968630 5049994 5058187 5045291 5115972 5190404
5507E190404J79132J25185o8285M6841O4486K84473R906L7406P6145J26282J18220
$$ 5190404 5369536 5494721 5426436 5473277 5537763 5822236 5832142 5869548 5945693 6071975 6190195
5496F190195J59174L4540J85822K14262n9960K93604J96121J26950J29028J46355
$$ 6190195 6349369 6383909 6569731 6783993 6724033 7017637 7213758 7340708 7469736 7616091
5486G616091L49153J76770Q7282M40246K06234L34998L25911K85254L08617M35260
$$ 7616091 7965244 8142014 8229296 8669542 8875776 9210774 9536685 9821939 10130556 10565816
5476A0565816K36856L66164N17589M54290N12191N10845O07752M02825O54259
$$ 10565816 10802672 11168836 11686425 12140715 12652906 13163751 13771503 14174328 14828587
5467A4828587O61103Q30735P68611Q92138P71712Q35837J027953Q32352R87531
$$ 14828587 15489690 16320425 17089036 17981174 18752886 19588723 20616676 21449028 22436559
5458B2436559J085471R57364J077866J314315J197437J360947J395658J305286
$$ 22436559 23522030 24479394 25557260 26871575 28069012 29429959 30825617 32130903
5450C2130903J669939J626688J761277J862675J918433K049752K369394K390528
$$ 32130903 33800842 35427530 37188807 39051482 40969915 43019667 45389061 47779589
5442D7779589K450352K735693K843534L044709L424858L620451L577844M187740
$$ 47779589 50229941 52965634 55809168 58853877 62278735 65899186 69477030 73664770
5434G3664770M386453M844435N389127O373186O972457P800693R100767J0326740
$$ 73664770 78051223 82895658 88284785 94657971 101630428 109431121 118531888 128858628
5426A28858628J1935522J3630393J5678953J7823087K0313649K2543367K4171029
$$ 128858628 140794150 154424543 170103496 187926583 208240232 230783599 254954628
5419B54954628K4917291K2916286J6784799P801923k870787j3145533k1164522
$$ 254954628 279871919 302788205 319573004 327374927 324504140 311358607 290194085
5412B90194085k5585027k6424978k5209410k2372767j9225807j6573407j4104288
$$ 290194085 264609058 238184080 212974670 190601903 171376096 154802689 140698401
5405A40698401j1821474j0362041r016100p576074o951576o215083n833709n166248
$$ 140698401 128876927 118514886 109498786 101922712 94971136 88756053 82922344 77756096
5397G7756096m610748m190830m112336l541031l354372k955659k490730k228291
$$ 77756096 73145348 68954518 64842182 61301151 57946779 54991120 52500390 50272099
5389E0272099k374443j703344j793736j552681j533753j329050j334074j473076
$$ 50272099 47897656 46194312 44400576 42847895 41314142 39985092 38651018 37177942
5381C7177942j297049j303876j337517j489418j206121j166245j225617j102269
$$ 37177942 35880893 34577017 33239500 31750082 30543961 29377716 28152099 27049830
5373B7049830j101913j036561j136450r35881p52409p64057n84662p63586p65966
$$ 27049830 25947917 24911356 23774906 22839025 22086616 21322559 20737897 19974311 19208345
5364A9208345o90279m53387n38017l88682m87689m87763l46388m53950p11935
$$ 19208345 18518066 18064679 17526662 17137980 16650291 16162528 15816140 15362190 14650255
5355A4650255l86496m38563n47897k41033k24336l61213l59551k91889k46950
$$ 14650255 14263759 13825196 13277299 13036266 12811930 12450717 12091166 11799277 11552327
5346A1552327m45269m00680j68783k20278m60209j78664K120j31037k30199k26336
$$ 11552327 11107058 10706378 10537595 10317317 9857108 9678444 9680564 9549527 9319328 9092992
5336I092992k40637l68071p8631j35262k81038j42374l59991j74842j45991k51736
$$ 9092992 8852355 8484284 8405653 8270391 7989353 7846979 7486988 7312146 7166155 6914419
5326F914419k50781k2574k39997j98188k68866p2743j9727n5974j24416j53219
$$ 6914419 6663638 6641064 6401067 6202879 5934013 5861270 5841543 5785569 5661153 5507934
5316E507934j99537j35082n8839j45821q8898k9649r3340j55821p0282m8542j68131
$$ 5507934 5308397 5173315 5114476 4968655 4879757 4850108 4756768 4600947 4530665 4482123 4313992
5305D313992j57342j52664q9644j76379j6361Q007O0120k7486r7989n5522j81444
$$ 4313992 4156650 4003986 3914342 3737963 3721602 3729609 3789729 3762243 3664254 3608732 3427288
5294C427288j4376p3905j39195l8177k9176P1026N4030k53046Q791J11356j6221
$$ 3427288 3412912 3339007 3199812 3161635 3132459 3203485 3257515 3004469 3013260 3124616 3108395
5283C108395M78K0447q3669r8366Q3910q2179k6422R8771Q0594j46139j53351
$$ 3108395 3108873 3129320 3045651 2947285 3031195 2949016 2922594 3021365 3101959 2955820 2802469
5272B802469l1760j77436J17396R9934r8637j14590l6932q9639J90398k2465j53694
$$ 2802469 2770709 2593273 2710669 2810603 2711966 2597376 2560444 2470805 2661203 2638738 2485044
5261B485044J00985m0760p530j8886j03117L2137l7733p9104J8077j03355P7697
$$ 2485044 2586029 2545269 2537739 2518853 2415736 2447873 2410140 2331036 2349113 2245758 2323455
5250B323455J08573k6434K0691l6489j39704j01430j1683K0257J20872j13516
$$ 2323455 2432028 2405594 2426285 2389796 2250092 2148662 2136979 2157236 2278108 2164592
5240B164592j08269R6308j22270J42516j18325N611q9550q4982L0178N6639p9369
$$ 2164592 2056323 2152631 2030361 2172877 2054552 2060163 1970613 1885631 1915809 1972448 1893079
5229A893079q2660p5945N506J67310j55199j16523L4251r097O524j9847l7568
$$ 1893079 1810419 1734474 1739980 1907290 1752091 1635568 1669819 1660722 1667246 1647399 1609831
5218A609831n6404J20337M1030J3663j19460j94171J11048J70260j3042M7106
$$ 1609831 1553427 1673764 1714794 1728457 1608997 1414826 1525874 1696134 1683092 1730198
5208A730198l0776r6043K1202m4100l174J6969q5965k2235k2193p7708K12618
$$ 1730198 1699422 1603379 1624581 1580481 1577307 1594276 1508311 1486076 1463883 1386175 1598793
5197A598793p8444k102P3131N8980n9809n0667j27707N989J0438p4567K17413
$$ 1598793 1520349 1518247 1591378 1650358 1590549 1539882 1412175 1418164 1428602 1354035 1571448
5186A571448j36402J9114j02721K2552J94832K5591m8509k41959l5908J27622
$$ 1571448 1435046 1454160 1351439 1373991 1568823 1594414 1545905 1303946 1268038 1395660
5176A395660L9856r5450M4860O3400Q0613k3462J90589j78924L5245n86q8582
$$ 1395660 1435516 1340066 1384926 1448326 1528939 1505477 1696066 1517142 1552387 1551801 1463219
5165A463219J43361l0851n3681m6839K6150O9152j151Q068l8087K1568p1932L807
$$ 1463219 1606580 1575729 1522048 1475209 1501359 1570511 1569360 1577428 1539341 1560909 1488977 1492784
5153A492784J03998o212p1427P6010m2096L2251n1628J6826N5915m9615m9088
$$ 1492784 1596782 1590570 1519143 1595153 1553057 1585308 1533680 1550506 1606421 1556806 1507718
5142A507718J8078L1615J9039J4298M157J31723o5757j22784Q6676o0035J32326
$$ 1507718 1525796 1557411 1576450 1590748 1594905 1726628 1660871 1538087 1624763 1564728 1697054
5131A697054k428j60316R7604j2723k7171k0849J60785J3797N9830J93004J226
$$ 1697054 1694626 1534310 1631914 1619191 1592020 1571171 1731956 1745753 1805583 1998587 1999813
5120A999813Q2724j54164j29205R1564M0946O2186l0486M3528O5258j81392r6957
$$ 1999813 2082537 1928373 1799168 1890732 1931678 1993864 1963378 2006906 2072164 1890772 1793815
5109A793815J02031J41762J19175l2423J14145O7705j44588J37365k5544K15686
$$ 1793815 1895846 2037608 2156783 2124360 2238505 2306210 2161622 2298987 2273443 2489129
5099B489129j26822n8101Q3989J33990Q9391N159L3150q436P2063j32893J7501
$$ 2489129 2362307 2304206 2388195 2522185 2611576 2616735 2649885 2641449 2713512 2580619 2598120
5088B598120L9028J12441P3553j47749l8350J58702Q8508q0799R5531L4545K9314
$$ 2598120 2637148 2749589 2823142 2675393 2637043 2795745 2884253 2803454 2898985 2933530 2962844
5077B962844m4998n5380Q2722J3609j04022l6274n3760L8944K334j7455Q0911
$$ 2962844 2917846 2862466 2945188 2958797 2854775 2818501 2764741 2803685 2806019 2788564 2869475
5066B869475L6196j6709j19035N1518k4147O3972r5650J08466O9283l6540k01871
$$ 2869475 2905671 2888962 2769927 2821445 2797298 2861270 2765620 2874086 2943369 2906829 2704958
5055B704958J07571M5877l5436l8138N1195J77814j38294j03257K41089P8751
$$ 2704958 2812529 2858406 2822970 2784832 2836027 3013841 2875547 2772290 3013379 3092130
5045C092130r4795P4595j5588J8477J30852J10354j73879P1273K10516r4907O3004
$$ 3092130 2997335 3071930 3056342 3074819 3205671 3316025 3142146 3213419 3423935 3329028 3392032
5034C392032k23167K14871M7789j07174j8549J10207K8172r1578J36351Q512l6743
$$ 3392032 3168865 3383736 3431525 3324351 3305802 3416009 3444181 3352603 3488954 3497466 3460723
5023C460723L1661J209K25012R3264J3169p7931k0980k0949P2025O1011J7228
$$ 3460723 3492384 3493593 3718605 3811869 3825038 3747107 3726127 3705178 3777203 3838214 3855442
5012C855442q800R9562k8893K2395J04463J09024j24797J05527K62579J00689
$$ 3855442 3846642 3946204 3917311 3939706 4044169 4153193 4028396 4133923 4396502 4497191
5002D497191r7618J1101j4827J86744J99341K02593n8762Q7545J87929k03895
$$ 4497191 4399573 4410674 4395847 4582591 4781932 4984525 4925763 5013308 5201237 4997342
4992D997342P2715K61290j9816j2864J32323Q1789N7930Q4867K0778J98408K76186
$$ 4997342 5070057 5331347 5311531 5298667 5430990 5512779 5570709 5655576 5676354 5874762 6150948
4981F150948j02580N1314Q8314K22187O385K59018J20926K04908R1653j39045
$$ 6150948 6048368 6099682 6187996 6410183 6416568 6675586 6796512 7001420 7093073 6954028
4971F954028K14655K70620R9942P6441J06048R0009K04348J93894K56720K46406
$$ 6954028 7168683 7439303 7539245 7615686 7721734 7811743 8016091 8209985 8466705 8713111
4961H713111L8919J58810N3246K61296J6455K64158J50425J32200M3485K27780
$$ 8713111 8752030 8910840 8964086 9225382 9241837 9505995 9656420 9788620 9832105 10059885
4951A0059885K73263K86476K97161R5950K51569K15492L05247J36967K90905M52739
$$ 10059885 10333148 10619624 10916785 11012735 11264304 11479796 11785043 11922010 12212915 12665654
4941A2665654K61704J59404J51331M25709M46308L49443M92957M74930M29419
$$ 12665654 12927358 13086762 13238093 13663802 14110110 14459553 14952510 15427440 15856859
4932A5856859P16210O54958M30455M70056O69066M92881Q85395O33524O42068
$$ 15856859 16573069 17228027 17658482 18128538 18797604 19290485 20175880 20809404 21451472
4923B1451472R65691Q58301P77462P25579J132909R70790J010743J216380J157139
$$ 21451472 22417163 23275464 24052926 24778505 25911414 26882204 27892947 29109327 30266466
4914C0266466J406785J350153J413274J647356J554795J670361J911962K058052
$$ 30266466 31673251 33023404 34436678 36084034 37638829 39309190 41221152 43279204
4906D3279204K126275K201617K304955K502347K643017L010134L027436L258315
$$ 43279204 45405479 47607096 49912051 52414398 55057415 58067549 61094985 64353300
4898F4353300L314233L642555L893534L943307M247844M378946M177644M507903
$$ 64353300 67667533 71310088 75203622 79146929 83394773 87773719 91951363 96459266
4890I6459266M396579M189614M604268M304321M214051M226145M209145M013265
$$ 96459266 100855845 105045459 109649727 113954048 118168099 122394244 126603389 130616654
4882A30616654L935689M073809M013516M115434M283487M385372M627695M716288
$$ 130616654 134552343 138626152 142639668 146755102 151038589 155423961 160051656 164767944
4874A64767944N041740N230906N066187M604757M406138L933891L443425K811089
$$ 164767944 169809684 175040590 180106777 184711534 189117672 193051563 196494988 199306077
4866A99306077K123612J426662O41465l38984p19683j535180k042254k337316
$$ 199306077 201429689 202856351 203497816 203158832 202439149 200903969 198861715 196524399
4858A96524399k610488l091411l300416l261009l384347l246378l583386l842585
$$ 196524399 193913911 190822500 187522084 184261075 180876728 177630350 174046964 170204379
4850A70204379l794625m106853m394645m385474m741893n077023n145438n262110
$$ 170204379 166409754 162302901 157908256 153522782 148780889 143703866 138558428 133296318
4842A33296318n166464n055978m897824m629048m561311m203751l935284l700713
$$ 133296318 128129854 123073876 118176052 113547004 108985693 104781942 100846658 97145945
4834I7145945l153882k842023k737220k496764k243192j796953j492789j297622
$$ 97145945 93992063 91150040 88412820 85916056 83672864 81875911 80383122 79085500
4826G9085500j205425p52204n84775l60186L8619K16496Q6628O42932M34641L80865
$$ 79085500 77880075 77127871 76543096 76182910 76221529 76438025 76524653 77167585 77602226 77983091
4816G7983091Q23050N74100P95765O66727N82519M23718L08964L02968j16430
$$ 77983091 78806141 79380241 80176006 80842733 81425252 81848970 82157934 82460902 82344472
4807H2344472j62894n02447r03533j041840j128386j246477j375654j669548j583490
$$ 82344472 82181578 81679131 80775598 79733758 78605372 77358895 75983241 74313693 72730203
4798G2730203j754241j666610j527888j290143j409468j276792j167228j321348
$$ 72730203 70975962 69309352 67781464 66491321 65081853 63805061 62637833 61316485
4790F1316485q78384m15313l22685k29889m1721J90635L09974N00373R19299P94962
$$ 61316485 60438101 60022788 59700103 59470214 59428493 59619128 59929102 60429475 61348774 62143736
4780F2143736R67923J237181J332261J462873J591922J987403K114164K029031
$$ 62143736 63111659 64348840 65681101 67143974 68735896 70723299 72837463 74866494
4772G4866494K439224K909507K904653L275797L365789L705346M018779M154181
$$ 74866494 77305718 80215225 83119878 86395675 89761464 93466810 97485589 101639770
4764A01639770M509345M532023N032104M973199N232927N178305M818076N110754
$$ 101639770 106149115 110681138 115713242 120686441 125919368 131097673 135915749 141026503
4756A41026503M866518M815921M395383M425212M167149M070421L904189L812238
$$ 141026503 145893021 150708942 155104325 159529537 163696686 167767107 171671296 175483534
4748A75483534L672458L770228L687185L508950L286333L113241K685963K374054
$$ 175483534 179155992 182926220 186613405 190122355 193408688 196521929 199207892 201581946
4740B01581946J742939R45126K79923m95297j099277k239686k665602l136539
$$ 201581946 203324885 204270011 204549934 204054637 202955360 200715674 198050072 194913533
4732A94913533l863548m298073m602617m661461m602251m815388m427634m279141
$$ 194913533 191049985 186751912 182149295 177487834 172885583 168070195 163642561 159363420
4724A59363420m189130l891549l615128l889003l902991l987579m205418m081940
$$ 159363420 155174290 151282741 147667613 143778610 139875619 135888040 131682622 127600682
4716A27600682m269572m508967m484796m652985m592101m683177m704615m277310
$$ 127600682 123331110 118822143 114337347 109684362 105092261 100409084 95704469 91427159
4708I1427159m280584m136038m005006l990786l538534l304786l176642k924518
$$ 91427159 87146575 83010537 79005531 75014745 71476211 68171425 64994783 62070265
4700F2070265k679883k730167k394672k498067k427692j763454j854594j953659
$$ 62070265 59390382 56660215 54265543 51767476 49339784 47576330 45721736 43768077
4692D3768077j669237j397555j550231j478734j188794j324421j190462j097348
$$ 43768077 42098840 40701285 39151054 37672320 36483526 35159105 33968643 32871295
4684C2871295j094499j163174r05060p84573r20613o69110j051792q36608n23077
$$ 32871295 31776796 30613622 29708562 28923989 28003376 27334266 26282474 25445866 24922789
4675B4922789p99912p49641o48297o82380o02341n63670l70014n76556o10727
$$ 24922789 24122877 23373236 22724939 22042559 21440218 20876548 20506534 19929978 19319251
4666A9319251n52640m87128k87038m40744m28043m62211l44893m02888k27162
$$ 19319251 18766611 18279483 17992445 17551701 17123658 16661447 16316554 15913666 15686504
4657A5686504m31856m30418l05949k45554j91810n07065l23177k89251j74924
$$ 15686504 15254648 14824230 14518281 14272727 14080917 13573852 13250675 12961424 12786500
4648A2786500k01367k11324j23083l01871l91757k22578j32277l34108k20167
$$ 12786500 12585133 12373809 12250726 11948855 11557098 11334520 11202243 10868135 10647968
4639A0647968k69795k49713k34817j83562m9222j67092k49438j62232k46876j15653
$$ 10647968 10378173 10128460 9893643 9710081 9660859 9493767 9244329 9082097 8835221 8719568
4629H719568l13440k32779q6430j07687j65484j68789k84213n9458j17538q7944
$$ 8719568 8406128 8173349 8086919 7979232 7813748 7644959 7360746 7301288 7183750 7095806
4619G095806k40102k9158k42694o8001n6932k24032r6437j40839q7270M360j55083
$$ 7095806 6855704 6826546 6583852 6515851 6458919 6234887 6138450 5997611 5910341 5914701 5759618
4608E759618q8560O6477j23419m2086k59907j46685Q4343m0484k6772j39303J02436
$$ 5759618 5671058 5737535 5614116 5572030 5312123 5165438 5249781 5209297 5182525 5043222 5145658
4597E145658k11219N4086q5610o7164J89185l05213K0203m9803l5161n4897j19251
$$ 5145658 4934439 4988525 4902915 4835751 5024936 4719723 4739926 4690123 4654962 4600065 4480814
4586D480814P858J29192m0728j08565q6905M8688j70009n3775M5224Q0661k2726
$$ 4480814 4488672 4617864 4577136 4468571 4381666 4430354 4260345 4206570 4251794 4332455 4309729
4575D309729p1238o9065J4806l8039J22534q3669L9868L8598j86720k9929M0087
$$ 4309729 4238491 4169426 4184232 4146193 4268727 4185058 4224926 4263524 4076804 4046875 4086962
4564D086962j36676N646l5699m6087J54128r5985k20193j7279j2135n1844Q1256
$$ 4086962 3950286 3955932 3920233 3874146 4028274 3932289 3712096 3694817 3682682 3630838 3712094
4553C712094m2112k2979p2669m7390J27131j04871m9698J1068N1381o9356J32217
$$ 3712094 3669982 3647003 3574334 3526944 3654075 3549204 3499506 3510574 3561955 3492599 3624816
4542C624816J72863j70076N0678J14169j13372n9328O1823j359j807J63074j45556
$$ 3624816 3797679 3627603 3678281 3792450 3679078 3619750 3681573 3680214 3678407 3841481 3695925
4531C695925Q6703k7053N7713P1330l1940j10005j7694J40559Q5346R1458m9503
$$ 3695925 3782628 3755575 3813288 3884618 3852678 3742673 3724979 3865538 3950884 4042342 3992839
4520C992839n8085q930q951q551q6310O9424J05246k44908J02019M0203o6387
$$ 3992839 3934754 3925824 3916873 3908322 3822012 3891436 3996682 3751774 3853793 3893996 3827609
4509C827609L1036J6749m1763n6340J88246j32637O8655M251j16244j4685l9265
$$ 3827609 3858645 3875394 3833631 3777291 3965537 3832900 3901555 3905806 3789562 3774877 3735612
4498C735612J7164K11354n4264K4457p2484J65524R3162j38214k2881o9574R9437
$$ 3735612 3752776 3964130 3909866 3934323 3861839 4027363 4120525 3982311 3959430 3889856 3989293
4487C989293J24652k1j64237K2833N5019N0878n1329k5370n1312L9608K0157O8409
$$ 3989293 4113945 4113924 3949687 3972520 4027539 4078417 4027088 4001718 3950406 3990014 4010171 4078580
4475D078580k5235K33695Q0298j56711j23008l1361K25568J24709p8079l6507
$$ 4078580 4053345 4287040 4367338 4210627 4087619 4056258 4281826 4406535 4328456 4291949
4465D291949l764L5817o3973K12512M9973M0111J1501j035M6447l9547j01595
$$ 4291949 4288185 4324002 4260029 4472541 4522514 4562625 4574126 4573091 4619538 4579991 4478396
4454D478396P5902N3486N5658m4528n6017p929J09948J43O4335q5218j7615K9340
$$ 4478396 4554298 4607784 4663442 4618914 4562897 4554968 4664916 4665059 4729394 4644176 4626561 4655901
4442D655901O2041K0032O5671J53880j38257L4359n7397o4665j48839N5074M8139
$$ 4655901 4717942 4737974 4803645 4957525 4819268 4853627 4796230 4731565 4582726 4637800 4685939
4431D685939R4208K09129p1098q1332o0219p3981O1279J67828M4733q5692J10645
$$ 4685939 4780147 4989276 4918178 4836846 4776627 4702646 4763925 4931753 4976486 4890794 5001439
4420E001439p5431J7139l2646K76604K3904r7279j3825o9699p1504J30085N5471
$$ 5001439 4926008 4943147 4910501 5187105 5211009 5113730 5099905 5030206 4958702 5088787 5144258
4409E144258o5850N1428j47139J76128J32316k4939M6946m0311R9139J33011O4520
$$ 5144258 5078408 5129836 4982697 5158825 5291141 5266202 5313148 5272837 5371976 5504987 5569507
4398E569507j3919O629q2239J6258K54794J0057p214l4689P9124m5352K94961
$$ 5569507 5555588 5562217 5479978 5496236 5751030 5761087 5753873 5719184 5798308 5752956 6047917
4387F047917J39391q2216R6489J24847R4451J58289j84611J76698O3672Q3673
$$ 6047917 6187308 6105092 6201581 6326428 6420879 6579168 6394557 6571255 6634927 6718600
4377F718600J36088L3487P8338Q2425l6134J49806J73818J32477L88939P2167
$$ 6718600 6854688 6888175 6966513 7048938 7012804 7162610 7336428 7468905 7857844 7930011
4367G930011k5037Q7671R5826J25337R2672J66519J57961J94326L12994J56086
$$ 7930011 7904974 7992645 8088471 8213808 8306480 8472999 8630960 8825286 9138280 9294366
4357I294366j21813J82896K81618P3629J13242N5445L25843J99924J83064J01698
$$ 9294366 9172553 9355449 9637067 9710696 9823938 9879383 10205226 10405150 10588214 10689912
4347A0689912K17469J84039K25856K13174J58981K05145J93963J88688K99687
$$ 10689912 10907381 11091420 11317276 11530450 11689431 11894576 12088539 12277227 12576914
4338A2576914K22300L63725L77055L61519K39606L21913J82368L58810M09648
$$ 12576914 12799214 13162939 13539994 13901513 14141119 14463032 14645400 15004210 15413858
4329A5413858M52582M22655N20367M49514K93687M58465M80399O65180N89446
$$ 15413858 15866440 16289095 16809462 17258976 17552663 18011128 18491527 19156707 19746153
4320A9746153O00379O08772P26708M68988P05391P94988Q97972P96107R17790
$$ 19746153 20346532 20955304 21682012 22151000 22856391 23651379 24549351 25345458 26263248
4311B6263248Q97177J091863J041828J214072J388611J201308J296191J370622
$$ 26263248 27160425 28252288 29294116 30508188 31896799 33098107 34394298 35764920
4303C5764920J683911J790002J766761J935517J763448K071950K232987K090726
$$ 35764920 37448831 39238833 41005594 42941111 44704559 46776509 49009496 51100222
4295E1100222K346111K282094K334453K369304K463527K763665K731043K612696
$$ 51100222 53446333 55728427 58062880 60432184 62895711 65659376 68390419 71003115
4287G1003115K771490K847954K862349K982719L037171L143246L367073L237234
$$ 71003115 73774605 76622559 79484908 82467627 85504798 88648044 92015117 95252351
4279I5252351L298719L457312L731353L932585M163090M468166N002946N103551
$$ 95252351 98551070 102008382 105739735 109672320 113835410 118303576 123306522 128410073
4271A28410073N178815N617834N869438N975397O310386O703063O843443O866324
$$ 128410073 133588888 139206722 145076160 151051557 157361943 164065006 170908449 177774773
4263A77774773O984372O956425P136770O971204P217427P052320P465326P527703
$$ 177774773 184759145 191715570 198852340 205823544 213040971 220093291 227558617 235086320
4255B35086320P632345Q286687Q609844Q713166Q812745R097363R096471Q638760
$$ 235086320 242718665 251005352 259615196 268328362 277141107 286238470 295334941 303973701
4247C03973701Q349155P597503O687968N937972N210906M377036L691264L058156
$$ 303973701 312322856 319920359 326608327 332546299 337757205 342134241 345825505 348883661
4239C48883661K280671J497846Q17367J69632n41364j367633k143995k985626
$$ 348883661 351164332 352662178 353479545 353649177 353107813 351740180 349596185 346610559
4231C46610559l467974m199398m958537n557513o207874o762994p782455q195262
$$ 346610559 343142585 338943187 333984650 328427137 322219263 315456269 307673814 299478552
4223B99478552q823159r265071r192991r112019q991685q559791q118576p947155
$$ 299478552 290655393 281390322 272197331 263085312 254093627 245533836 237415260 229468105
4215B29468105p598595p131158o898355o881476o701040o528472o532721o307967
$$ 229468105 221869510 214738352 207839997 200958521 194257481 187729009 181196288 174888321
4207A74888321o371794o141165n984829n954023n789732n308087n392331m856385
$$ 174888321 168516527 162375362 156390533 150436510 144646778 139338691 133946360 129089975
4199A29089975m744581m453133m114625l970802l852167l605262l038794l154194
$$ 129089975 124345394 119892261 115777636 111806834 107954667 104349405 101310611 98156417
4191I8156417l030940k769297k933857k638367k674248k743216k561478k615975
$$ 98156417 95125477 92356180 89422323 86783956 84109708 81366492 78805014 76189039
4183G6189039k482266k537067k518514k384067k329594k328265k188571j874873
$$ 76189039 73706773 71169706 68651192 66267125 63937531 61609266 59420695 57545822
4175E7545822j864792j970180j900191j784563j689314j446120j439585j629583
$$ 57545822 55681030 53710850 51810659 50026096 48336782 46890662 45451077 43821494
4167D3821494j197218j420954j357904j107283j092118r68447j046445j158647
$$ 43821494 42624276 41203322 39845418 38738135 37646017 36677570 35631125 34472478
4159C4472478j065311j001177j033856r46158q27238q28010q38703q78046o78691
$$ 34472478 33407167 32405990 31372134 30425976 29598738 28770728 27932025 27053979 26375288
4150B6375288o14952n63154o78315o64568n07995m43228m80642n69287m66692
$$ 26375288 25760336 25197182 24518867 23854299 23346304 22903076 22422434 21853147 21386455
4141B1386455n31828l63743l52828l93812m56808l41023o20541m38162l32944
$$ 21386455 20854627 20490884 20138056 19744244 19287436 18946413 18325872 17887710 17554766
4132A7554766m99848m39834l09449l73802l29270j27506l43705m78152j80124
$$ 17554766 17054918 16615084 16305635 15931833 15602563 15475057 15131352 14653200 14473076
4123A4473076m27711j99099p0248k25756j29858k12316l34488k58924m5816j43648
$$ 14473076 14045365 13846266 13776018 13550262 13420404 13208088 12873600 12614676 12568860 12425212
4113A2425212j93095j51252k34931k71607q5474j24313n0760n2126q4997p2786
$$ 12425212 12232117 12080865 11845934 11574327 11488853 11364540 11313780 11261654 11176657 11103871
4103A1103871n6796n5388n0695k0706q8362q1189j059j38857n1594j36590Q3517
$$ 11103871 11047075 10991687 10940992 10920286 10831924 10750735 10749676 10610819 10559225 10422635 10506152
4092A0506152p0241j07168J4457k5631J4356o8266j18221k4346m6021L1881J12623
$$ 10506152 10435911 10328743 10343200 10317569 10331925 10263659 10145438 10121092 10075071 10106952 10219575
4081A0219575j24924N7708L3104J15451M0724J64351P4238m0771p3159j53601
$$ 10219575 10094651 10152359 10185463 10300914 10341638 10505989 10580227 10539456 10466297 10312696
4071A0312696J51622K99505P312n1139j27677m5388K07441n8972j1114O1196k3810
$$ 10312696 10464318 10763823 10771135 10719996 10592319 10546931 10754372 10695400 10684286 10745482 10721672
4060A0721672K04533J10546j3388L5020J12342J80117J22961J70819k1228J14358
$$ 10721672 10926205 11036751 11023363 11058383 11170725 11350842 11473803 11644622 11623394 11737752
4050A1737752K08127J83443J77050R3965J16950K6298K05668M7251L68797K53852
$$ 11737752 11945879 12129322 12306372 12400337 12517287 12543585 12749253 12796504 13165301 13419153
4040A3419153J45934J79318J49880P4113J72538L69481J36589L26307L29166L34656
$$ 13419153 13565087 13744405 13894285 13968398 14140936 14510417 14647006 14973313 15302479 15637135
4030A5637135L33360L58035L41897K69151M87591M67598M62680N16016L22019
$$ 15637135 15970495 16328530 16670427 16939578 17427169 17894767 18357447 18873463 19195482
4021A9195482O04402M82840Q93511O49450M77693Q23535O94217O56018R21422
$$ 19195482 19799884 20282724 21176235 21825685 22303378 23126913 23821130 24477148 25398570
4012B5398570P91996Q36356Q34684J057288J102919J234892J230761J136879J193954
$$ 25398570 26190566 27026922 27861606 28918894 30021813 31256705 32487466 33624345 34818299
4003C4818299J235897J677260J718185J695779J849251J880013K229880K181937
$$ 34818299 36054196 37731456 39449641 41145420 42994671 44874684 47104564 49286501
3995D9286501K145987K556106K693069L040117L043354L317268L542668L774356
$$ 49286501 51432488 53988594 56681663 59721780 62765134 66082402 69625070 73399426
3987G3399426M290266M836801N294702O011497O531047P583281Q471668R445014
$$ 73399426 77689692 82526493 87821195 93832692 100363739 107947020 116418688 125863702
3979A25863702J0551128J1788458J2738803J3161476J2982029J1772534R368340
$$ 125863702 136414830 148203288 160942091 174103567 187085596 198858130 208226470
3972B08226470N454232J048421k881839n385987o905562p029952o084171m461332
$$ 208226470 213680702 214729123 211847284 206461297 199555735 192525783 186441612 181980280
3964A81980280k736480q24530P93941K904880M400847O419208Q507611J0355213
$$ 181980280 179243800 178419270 179213211 182118091 186518938 192938146 201445757 211800970
3956B11800970J2274470J4887444J7080124J8993598K0728341K1084082J8577100
$$ 211800970 224075440 238962884 256043008 275036606 295764947 316849029 335426129
3949C35426129J3135393N172377l815042j2120571j8424857k1815267k2212296
$$ 335426129 348561522 353733899 349918857 337798286 319373429 297558162 275345866
3942B75345866k0452173j8182162j5376550j2604439j0085053p900647n828737
$$ 275345866 254893693 236711531 221334981 208730542 198645489 190744842 184916105
3935A84916105m134103k575364q70599M34068K048434L244106M416664N845365
$$ 184916105 180782002 178206638 177336039 177770107 179818541 183062647 187479311 193324676
3927A93324676N833446N070369K807880m30183m279532q105242j1131479j2541352
$$ 193324676 199158122 204228491 207036371 206606188 202326656 194221414 183089935 170548583
3919A70548583j3067598j2332584j1376038r865767q811103p746074p025124o197360
$$ 170548583 157480985 145148401 133772363 123906596 115095493 107349419 100324295 94126935
3911I4126935n391687n010190m810658m286847l838751l556000l332377l155272
$$ 94126935 88735248 83725058 78914400 74627553 70788802 67232802 63900425 60745153
3903F0745153k988851k338815k430572k375985j908341j806111j655067j535679
$$ 60745153 57756302 55417487 52986915 50610930 48702589 46896478 45241411 43705732
3895D3705732j459981j445816j346820j227191j173775j166858j087730j096256
$$ 43705732 42245751 40799935 39453115 38225924 37052149 35885291 34797561 33701305
3887C3701305j246664j054479j100752j305967r45513q09818q12054r88399r41347
$$ 33701305 32454641 31400162 30299410 28993443 28047930 27238112 26426058 25437659 24496312
3878B4496312p64838o20259o97062o58452o31748l85274n79011o09058n33363
$$ 24496312 23731474 23111215 22414153 21755701 21123953 20738679 20159668 19550610 19017247
3869A9017247n44818l56609n74303n63640l50381l35562n88242m04946l37170
$$ 19017247 18472429 18115820 17541517 16977877 16627496 16291934 15703692 15298746 14961576
3860A4961576m68781k63720m49635l32780l13226m82856l58066l27477k19986
$$ 14961576 14492795 14229075 13779440 13446660 13133434 12650578 12292512 11965035 11745049
3851A1745049k94164k32456l49306k82121j12459l26440k38032k69234n5045j00002
$$ 11745049 11450885 11218429 10869123 10587002 10474543 10148103 9910071 9640837 9585792 9485790
3841I485790m08251j97194j1334l36099j53954r9846k71727j79888p6945j80095
$$ 9485790 9077539 8880345 8869011 8532912 8378958 8279112 8007385 7827497 7750552 7570457
3831G570457j46045p5676j05952k88539j74356j55952j26335j77889j87273n4533
$$ 7570457 7424412 7348736 7242784 6954245 6779889 6623937 6497602 6319713 6132440 6077907
3821F077907k48420L0628j99435n7637m1584j42345Q769J26483j65048j85852
$$ 6077907 5829487 5860115 5660680 5603043 5561459 5419114 5427883 5554366 5389318 5203466
3811E203466l6537k05623J33027o9745j98353m0521Q5098j52413j24164j74119
$$ 5203466 5166929 4961306 5094333 5024588 4826235 4785714 4870812 4718399 4594235 4420116
3801D420116k2829m432L3216j19314j47399k8693n924r7439J2760r307q5251J18396
$$ 4420116 4397287 4392855 4426071 4306757 4159358 4130665 4124741 4027302 4040062 4030755 3945504 4063900
3789D063900m2962r0260K1076o6412n2559j4179p605j68363k0393L0906o8417
$$ 4063900 4020938 3930678 3951754 3885342 3832783 3818604 3810999 3642636 3622243 3653149 3584732
3778C584732k22128m9853l2344M4340J3741o7031R107R1712j43020j4716L0311
$$ 3584732 3362604 3312751 3280407 3324747 3338488 3271457 3280564 3372276 3229256 3214540 3244851
3767C244851r8356Q6428k1062P3684r12n6416N6581Q1597n7653P0607O5093j5637
$$ 3244851 3146495 3232923 3211861 3285545 3284633 3228217 3284798 3366395 3308742 3379349 3444442 3428805
3755C428805m0293o6854O892O058k57058Q8043j97179l2268l0839J92962l5681
$$ 3428805 3388512 3321658 3328550 3334608 3077550 3165593 2968414 2936146 2905307 3098269 3062588
3744C062588j67484P5248q062O4783J0368K03350Q9331M9943Q9018J0897J00822
$$ 3062588 2895104 2970352 2962290 3027073 3037441 3240791 3330122 3380065 3469083 3479980 3580802
3733C580802R2547O3238l9591R3411l12725p014m1776k43267l31082q8301J45245
$$ 3580802 3673349 3736587 3696996 3790407 3477682 3470668 3428892 3185625 2854543 2766242 2911487
3722B911487k29767o3357j6555J9062r50j09238j40427J1414j7752J8950j0415
$$ 2911487 2681720 2618363 2601808 2620870 2619920 2510682 2370255 2381669 2363917 2382867 2372452
3711B372452j07151O3455J07682p8239p1392p8339R821p3203j9716k02561P7665
$$ 2372452 2265301 2328756 2436438 2358199 2286807 2208468 2218289 2145086 2125370 1922809 2000474
3700B000474j9404j50622j43690j22527K25688p6633k636j96521j53207n8469
$$ 2000474 1981070 1830448 1686758 1564231 1789919 1713286 1710650 1514129 1360922 1302453
3690A302453j43203J13032J13794n7806p149J37157m6680j97894Q2831j98574
$$ 1302453 1159250 1272282 1386076 1328270 1321121 1458278 1411598 1213704 1296535 1097961
3680A097961O0478J59939j5581k59862j05012Q6967N8382J27093j50182j06818
$$ 1097961 1158439 1318378 1302797 1042935 937923 1024890 1083272 1210365 1060183 953365
3670I53365o2426J49486J07697P2620k12482k276j48692r5839J76863J76918O4508
$$ 953365 890939 1040425 1148122 1220742 1008260 1005984 857292 761453 938316 1115234 1179742
3659A179742j42651k16614L0308j3145R5634j11992N555j21340N2918J06913M2540
$$ 1179742 1037091 820477 850785 837640 933274 821282 826837 705497 758415 865328 907868
3648I07868q7205j42537P7194p1513j9076J78410J17243p8360L6118k10130M7070
$$ 907868 820663 678126 755320 683807 664731 843141 960384 882024 918142 708012 755082
3637G55082o9275M7672m0758m0249o561m3649M676r9834M7443j3199J26511L2205
$$ 755082 685807 733479 692721 652472 645911 602262 606938 507104 554547 541348 667859 700064
3625G00064n587m2700P6810n3407r6807K3957K763Q4653J13002j1405j14584q6712
$$ 700064 694477 651777 728587 675180 578373 602330 605093 689746 802748 791343 676759 590047
3613E90047K9274j49748j965n17J24064o1553j4760p2651Q8097L134J24508j82576
$$ 590047 619321 469573 467608 467091 591155 529602 514842 442191 530288 533422 657930 475354
3601D75354M254J69613l3213r144r1849j710m8385j78029M5746J17829r9597j3347
$$ 475354 479608 649221 616008 606864 515015 513305 464920 286891 332637 450466 350869 337522
3589C37522K1708j3248j06677Q4789R3246L5525j36187O168N7803Q2056k32141
$$ 337522 359230 345982 239305 324094 417340 452865 316678 322846 380649 462705 230564
3578B30564M7467Q0051j6908j9687O9024j00917j9905n7390J32644m3377R0572
$$ 230564 278031 358082 341174 321487 390511 289594 269689 212299 344943 301566 392138
3567C92138k15903J03196K8905q7967M7161J39862n9740k3870p5411R5476J6187
$$ 392138 176235 279431 308336 220369 267530 407392 347652 323782 248371 343847 360034
3556C60034j06989O1229M211r4991L4108k8925Q6761o3219J07064O4597k12472
$$ 360034 253045 314274 318485 223494 257602 228677 315438 252219 359283 423880 211408
3545B11408K25808P7153j55679m1730n3668K781J81683m7987k5761n8007N4388
$$ 211408 437216 514369 358690 316960 263292 266073 447756 399769 374008 316001 370389
3534C70389K0689p0340j53403R4769N3184r0181Q5979j6786O9977q9760J7545
$$ 370389 391078 320738 167335 262104 315288 225107 311086 294300 364277 274517 292062
3523B92062j31429j06384M7086J91466K4548M4442o0746O0952j94650k00751J32071
$$ 292062 160633 54249 101335 292801 317349 361791 301045 361997 167347 -33404 98667
3512I8667N8403J49792l1189o9007l235J07816m5616K1777m0132j8143j32523
$$ 98667 157070 306862 275673 206666 203431 311247 265631 287408 247276 229133 96610
3501I6610J27728O888k1749j14549J43153l7232Q3851l2401l5017p2564P4704
$$ 96610 224338 231226 209477 94928 238081 200849 284700 252299 217282 144718 219422
3490B19422l0035l5159J0979l443J0386R0674j59134J2637K26671k8988o8730
$$ 219422 189387 154228 165207 161764 172150 262824 103690 116327 342998 314010 245280
3479B45280j31083q207R8069r6956K0339L7352j32217r6608L6829L4971n4268
$$ 245280 114197 105990 204059 107103 127442 164794 32577 -64031 -27202 7769 -46499
3468d6499k4827R5348J45915J73255q972j88662L0631j8756K1943J04977k5005
$$ -46499 -71326 24022 169937 343192 334220 145558 176189 157433 179376 284353 259348
3457B59348l8778o0020q610J16579K271k40178m590Q4767L1452k14491R0319m3862
$$ 259348 220570 160550 151940 268519 270790 30612 26022 110789 142241 -72250 18069 -25793
3445b5793O9390l0134R3721k4006m8058O7884M8621L8002j68684n5748K33890
$$ -25793 43597 13463 107184 83178 35120 103004 151625 189627 20943 -34805 199085
3434A99085m2267o1213M5194p5603J03590J6525m6630l355k4181j06212p9676
$$ 199085 156818 95605 140799 65196 168786 185311 138681 135326 111145 4933 -74743
3423g4743L0763J40444o6893m238J0473o5103Q4952Q026j84989K24364q1250l7154
$$ -74743 -43980 96464 29571 25333 35806 -29297 55655 63681 -121308 103056 21806 -15348
3411a5348q1809R9296q9232J12209K3044N9353Q6990p1925k4279J9477n3107o2325
$$ -15348 -97157 2139 -87093 25116 48160 107513 194503 122578 98299 117776 64669 2344
3399B344n8571q141n3735J44129O3758L9439k8002M1068j2327N141k1009l9744
$$ 2344 -56227 -64368 -118103 26026 89784 129223 101221 142289 129962 135103 114094 74350
3387G4350Q3601r9838N4587j2907j19886q2947O1682J7067l9427r774o0702J99982
$$ 74350 157951 58113 112700 99793 -20093 -103040 -41358 -24291 -63718 -73492 -134194 65788
3375F5788M8507q3284K4139N4488L7057o252j31989m5751j02150M7117r1910k9307
$$ 65788 114295 31011 55150 109638 146695 140443 8454 -37297 -139447 -92330 -184240 -213547
3363b13547K86679o5125L1317l9004l3361P6807N528j52142K3929J11505p262
$$ -213547 73132 8007 39324 320 -33041 43766 49294 -102848 -78919 32586 25324
3352B5324J4046l8993m2160k2396p3471J73002K7012p7305j5667P1992j43280
$$ 25324 39370 377 -41783 -64179 -137650 35352 62364 -14941 -30608 41384 -101896
3341a01896K4140q5102k9573J24325K7113M2193j3330N3243l6297n3921k0944
$$ -101896 -77756 -162858 -192431 -68106 -40993 1200 -12130 41113 4816 -49105 -70049
3330g0049J7235M2709l8818Q7069k2896j08620M6201j0577m8751Q2122J27400
$$ -70049 -52814 -10105 -48923 38146 15250 -93370 -47169 -57746 -106497 -24375 103025
3319A03025j93714J42996J42742j55967l4277n5199J27261j82021j02057K71073
$$ 103025 -90689 52307 195049 39082 4805 -50394 76867 -105154 -207211 63862
3309F3862l6190j1056l491q1502L3393j635O0673r5168p2258m5350o6946J21742
$$ 63862 27672 16616 13125 -68377 -34984 -36619 24054 -71114 -143372 -188722 -255668 -133926
3297a33926p624j13258K10731Q0188J01874P2964j25769q1356L2571O0300j6829
$$ -133926 -141550 -254808 -44077 36111 137985 210949 85180 3824 36395 96695 79866
3286G9866L9407p7774m7918q7431O903j4410J16999q2681J33565n6743j7702m1650
$$ 79866 119273 41499 -6419 -93850 -86947 -101357 15642 -67039 66526 9783 -7919 -49569
3274d9569J27363J6016j60626Q5634J00589p9165j39883n5918K46645J34617j04932
$$ -49569 77794 93810 -66816 18818 119407 40242 -99641 -155559 91086 225703 120771
3263A20771p0171j21049R2995R096K6063r5081J06526n1826m1323P1587M3725
$$ 120771 50600 -70449 22546 31642 57705 -37376 69150 17324 -23999 47588 91313
3252I1313p854j50189R4968q8057q6167J2608P7565Q5246O4567p6392k3863j5676
$$ 91313 83459 -66730 28238 -59819 -145986 -133378 -55813 29433 94000 17608 -6255 -21931
3240b1931j3481j06117j1518j0637J7258L6966O0934j048K7075Q6506L643P4900
$$ -21931 -35412 -141529 -153047 -163684 -146426 -109460 -48526 -49574 -22499 64007 67650 142550
3228A42550l7285n7807j58218q1254j08035K91841o6053P6286K9500q5768O6588
$$ 142550 105265 47458 -110760 -192014 -300049 -8208 -74261 2025 31525 -54243 12345
3217A2345p7012p0031N6026J61463J8452P2059j10419q6097R0799n4154p3557
$$ 12345 -64667 -134698 -78672 82791 101243 173302 62883 -23214 67585 13431 -60126
3206f0126o8526L8802O75N8635m5002O0505P859K0018k5508n2974l2373J25494
$$ -60126 -128652 -89850 -89175 -30540 -75542 -15037 -7178 12840 -12668 -65642 -98015 27479
3194B7479j03012J12054k7299k4294J22770j10635q422Q1035L3428m3284r774
$$ 27479 -75533 36521 9222 -15072 107698 -2937 -11359 69676 103104 59820 50046
3183E0046j35892n5888K39100r016j72759J07305j1231Q0890r9617n6378J08610
$$ 50046 -85846 -141734 97366 88350 -84409 22896 11665 92555 -7062 -63440 45170
3172D5170n0861M7980j1870R4428m6603M5588O4691o1216n2118Q0281r3892k9575
$$ 45170 -5691 42289 30419 124847 78244 123832 188523 127307 75189 155470 61578 32003
3160C2003O2501J02249m2548k46451N4871O9640l3377N5022M2083k08859J50813
$$ 32003 94504 196753 154205 -92246 -37375 32265 -1112 53910 95993 -112866 37947
3149C7947P3085N1716M4140m3585j0269o3351J67043L238r768j20370J5700J11053
$$ 37947 111032 162748 206888 163303 153034 89683 256726 259964 250196 129826 145526 256579
3137B56579j61741N5999J02576P317k20500K41808k0646O3450Q9003p8564l926
$$ 256579 94838 150837 253413 260730 40230 282038 261392 324842 413845 335281 331355
3126C31355L0162j2766P2662L9737N180L2202Q5166l7167m8970J63326J628l5989
$$ 331355 361517 348751 421413 461150 466330 498532 583698 546531 497561 660887 662515 626526
3114F26526O73J32638k4342R1587Q6993J72589l4735p5916K79930P5559J00621
$$ 626526 627199 759837 735495 827082 914075 1086664 1051929 976013 1255943 1331502 1432123
3103A432123O9619J22872K16301R6830J92266K56330K95963L07075K69940L81874
$$ 1432123 1501742 1624614 1840915 1937745 2130011 2386341 2682304 2989379 3259319 3641193
3093C641193M85912K04097J87774n9149j08170k48077l96011k60364m15776m79169
$$ 3641193 4127105 4331202 4518976 4459827 4351657 4103580 3707569 3447205 3031429 2552260
3083B552260k15003j75338l10514q0772j39239l9915k33136q7140j53291j37120
$$ 2552260 2337257 2161919 1851405 1770633 1631394 1591479 1358343 1271203 1117912 980792
3073I80792N5006l7596k13528J61214q1523j10235j04279p4422j04950P1396M2644
$$ 980792 1035798 998202 784674 945888 864365 754130 649851 575429 470479 541875 584519
3062E84519k5764p1932j41684k4651n7856J32725J22540P6084l35556p3226J32976
$$ 584519 558755 486823 345139 320488 262632 395357 517897 593981 258425 185199 318175
3051C18175r3909M4839J38786j04985j53978J56296N8880j02252r995k89165P9924
$$ 318175 224266 269105 407891 302906 148928 305224 364104 261852 251857 -37308 42616
3040D2616J27429M021R7701l0064j32343Q5807O1952P6452j23567j61388K0607
$$ 42616 170045 174066 271767 241703 109360 195167 257119 333571 210004 48616 69223
3029F9223j1478O7198J516j13928r1519J17991J46968L690j12950Q5543j0879
$$ 69223 57745 124943 126459 12531 -78988 39003 185971 189661 76711 162254 151375
3018A51375m1943M1894k738r6554j3453j6431J28294n5897J302K26772j16826
$$ 151375 109432 151326 148588 52034 38581 22150 150444 94547 95849 322621 205795
3007B05795j87899n633M6820K7235n0831N5234K1822j00777J9643J19180j35179
$$ 205795 17896 12263 59083 86318 35487 90721 112543 11766 31409 150589 15410
2996A5410L9236Q3143j37780R317j618K7418o8474M0783p7103J16664R3325J4031
$$ 15410 54646 137789 9 9326 7708 35126 -33348 7435 -69668 46996 140321 154352
2984A54352j22807q6915j3829o3074J34436j08420r7281J55182p2293l4423O5193
$$ 154352 31545 -55370 -69199 -132273 2163 -106257 -203538 -48356 -120649 -155072 -89879
2973h9879K974q1707J5048J10963l2721k3382k270j37802N7389K08827o7819J2364
$$ -89879 -86905 -168612 -153564 -42601 -75322 -98704 -100974 -238776 -181387 27440 -40379 -28015
2961b8015K5690m2050n1298R802M5749J22562M084r1270j7921j20580R9778M7262
$$ -28015 -2325 -44375 -95673 -85871 -40122 82440 86524 -4746 -22667 -143247 -43469 3793
2949C793m4819J4977j71284P7864K9233j6904k9907r4074P9740M5912J52472o8641
$$ 3793 -41026 -26049 -197333 -119469 -90236 -107140 -137047 -231121 -151381 -105469 47003 -21638
2937b1638j5734m1234Q5380l5038P0017q3525j18938l589J4980L8625J70638l4744
$$ -21638 -37372 -78606 6774 -28264 41753 -41772 -160710 -164299 -149319 -110694 59944 25200
2925B5200j7309m5494k39186J00565R8295k7877R8134k7197j73523J2021M9314
$$ 25200 7891 -37603 -276789 -176224 -77929 -105806 -7672 -34869 -208392 -196371 -147057
2914a47057J61880P995J7267M6782j09194q0369O500M6102o1Q5383M6622j47498
$$ -147057 14823 22818 40085 86867 -22327 -102696 -96196 -50094 -50155 35228 81850 -65648
2902f5648K1145k1080p2755J19590l6153m3536q9032J72701q8146n157Q9271J06343
$$ -65648 -44503 -65583 -138338 -18748 -54901 -98437 -187469 -14768 -102914 -108071 -18800 87543
2890H7543m1230r492j10836P149J80677j43600P551M2353o9110M7589o6796k6151
$$ 87543 46313 36821 -74015 -66866 113811 -29789 -22238 20115 -48995 -1406 -68202 -94353
2878i4353p1146K53311M9614j57654j931k4143J9354K8616p4434p5929J22866
$$ -94353 -165499 87812 137426 -20228 -22159 -46302 -26948 1668 -72766 -148695 -25829
2867b5829P1473k6656j01524J18580j56432O2609j08938O0626M8135k973n6826
$$ -25829 45644 18988 -82536 36044 -120388 -57779 -166717 -106091 -57956 -60929 -117755
2856a17755J03159M6493L6785n5760K0971n2221p082M1171L4893o0000J38725
$$ -117755 -14596 31897 68682 12922 33893 -18328 -25410 15761 50654 -9346 129379
2845A29379j9013n191p4151j1623J09356m2052j38785N0395r0519P4850o3643
$$ 129379 110366 105175 31024 19401 128757 86705 -52080 -1685 -92204 -17354 -80997
2834h0997M3613N4403O8750Q0805k33443j5757l2663J10753q0975k0013p6452
$$ -80997 -37384 17019 85769 166574 -66869 -82626 -115289 -4536 -85511 -105524 -181976
2823a81976O439J21958Q4812j54866J140R7021M7186j34814q8382J24630q1656
$$ -181976 -175537 -53579 31233 -123633 -122493 -25472 21714 -113100 -201482 -76852 -158508
2812a58508O4750p0922j8830l4162J38908J9040j15556J3005k0060O3852j0798
$$ -158508 -93758 -164680 -183510 -217672 -78764 -59724 -175280 -162275 -182335 -118483 -129281
2801a29281Q2915q4706Q8096J2876N1172k1767p2996L0263j49830k77J17781j00242
$$ -129281 -46366 -131072 -42976 -30100 21072 -695 -73691 -43428 -193258 -193535 -75754 -175996
2789a75996J52692n2114r9796M0282r129P5246K6166K4078k13715L55703j1495
$$ -175996 -23304 -75418 -175214 -134932 -144061 -68815 -42649 -18571 -232286 123417 111922
2778A11922j16505P3826m2973j32535J41513j0746l1192j66207J11722k8331o6199
$$ 111922 -4583 69243 26270 -106265 35248 24502 -6690 -172897 -61175 -89506 -155705
2767a55705R438k8224J49368j04776L2728O2297J02273j11482p6684o9378j6580
$$ -155705 -146267 -174491 -25123 -129899 -97171 -34874 67399 -44083 -120767 -190145 -206725
2756b06725O4220R0274J1319l9738p955R9211j15168J53967j4527J665k33515
$$ -206725 -142505 -52231 -40912 -80650 -88605 10606 -104562 49405 34878 36543 -196972
2745a96972K52103J1169k43735j56305n5757K00470L8052J41812r9357r8184J37362
$$ -196972 55131 66300 -177435 -333740 -389497 -189027 -150975 -9163 -108520 -206704 -69342
2734f9342L6162j0910m4535L8122K4446R2902q676j21597l8081j21065N5717O0516
$$ -69342 -33180 -44090 -88625 -50503 -26057 66845 58169 -63428 -101509 -222574 -166857 -106341
2722a06341J0815m3075K0619l9134m012J6149J77520k0766j19301N6782k9162
$$ -106341 -95526 -138601 -117982 -157116 -161128 -144979 32541 11775 -107526 -50744 -79906
2711g9906o954L025J64771j9508M3530n9831o8276n0731M0410L0577O5581j25646
$$ -79906 -86860 -83835 80936 61428 104958 45127 -23149 -73880 -33470 -2893 62688 -62958
2699f2958p7109J50927M3549r9746q1193j9888J42824n5699K7693K0765o2584
$$ -62958 -140067 10860 54409 -45337 -126530 -146418 -3594 -59293 -31600 -10835 -73419
2688g3419M9061J11777o7608m3123j31978j10916J01226J01929Q6997n7198J06054
$$ -73419 -24358 87419 19811 -23312 -155290 -266206 -164980 -63051 23946 -33252 72802
2677G2802O1420j80827J0161K6706j14535n7062M2034R8687L0119q5560M283j00853
$$ 72802 134222 -46605 -36444 -9738 -124273 -181335 -139301 -40614 -10495 -96055 -91772 -192625
2665a92625R1604Q8424j39764J43684J0341j82955L8333j60264J16584K25471
$$ -192625 -101021 -12597 -152361 -8677 1664 -181291 -142958 -303222 -186638 38833
2655C8833R898J11115j28334o7805m7392J59974k6924P1711j54305O8715n6071
$$ 38833 48731 159846 31512 -36293 -83685 76289 49365 121076 -33229 35486 -20585
2644b0585o9356J09745j02965j1803J56174j56025q2252J46170P393k4550p0659
$$ -20585 -89941 19804 -83161 -94964 61210 -94815 -177067 -30897 -23504 -48054 -118713
2633a18713L2583J01143n5624j70276J59816j7736k5084j3703j09103J33939J38501
$$ -118713 -86130 15013 -40611 -210887 -51071 -68807 -93891 -107594 -216697 -82758 55743
2622E5743k46350J399J22930p5996O9407J0926K11838m4748j36492l5405o005
$$ 55743 -190607 -189208 -66278 -142274 -72867 -61941 149897 105149 -31343 -66748 -72753
2611g2753m2659J3399M5877l667L1235J39796j67589j1947Q0603J78659j38198
$$ -72753 -115412 -102013 -56136 -59803 -28568 111228 -56361 -68308 12295 190954 52756
2600E2756j57200r7599N1162N5552Q2127k10157P1077j8707m5102R1114k3065
$$ 52756 -104444 -202043 -150881 -95329 -13202 -223359 -152282 -170989 -216091 -124977 -148042
2589a48042J00974M5976M2395j82428m4763J19052r956n5219k6007J55329O9309
$$ -148042 -47068 -1092 41303 -141125 -185888 -66836 -76792 -132011 -158018 -2689 66620
2578F6620m3888R9873j89799J5606p6549r347R0716q6937n6322J05477j34063
$$ 66620 22732 122605 -67194 -51588 -128137 -137484 -46768 -133705 -190027 -84550 -218613
2567b18613J08542P3132n0933R1425o7809l7696K9201r1439J29377K0904o9814
$$ -218613 -110071 -36939 -87872 3553 -64256 -101952 -72751 -164190 -34813 -13909 -83723
2556h3723N3197Q0156j24388N7855P63L9672R3602o3245j21049n0511O8226O575
$$ -83723 -30526 49630 -74758 -16903 -16140 23532 117134 53889 -67160 -117671 -49445 -42870
2544d2870m5066J6197m5312j17785R1565r1647K14624p2452o948k3560j19300
$$ -42870 -87936 -71739 -117051 -234836 -143271 -234918 -20294 -92746 -99694 -123254 -242554
2533b42554J37232L1442P2395L0710j69253L7646P2746p0955R2521l5824l8339
$$ -242554 -105322 -73880 -1485 29225 -140028 -102382 -29636 -100591 -8070 -43894 -82233
2522h2233L1691P4018p095j23342Q2355m8999l6689j4198P7242L476j10354R0594
$$ -82233 -50542 23476 16381 -106961 -24606 -73605 -110294 -124492 -47250 -43774 -154128 -63534
2510f3534J4043J9756P3141O3803j33094J4531o1725K722L8519j00136Q2663J95512
$$ -63534 -49491 -29735 43406 107209 -25885 -11354 -73079 -70357 -31838 -131974 -49311 146201
2498A46201j15059o5827j23116J20988n7149k00847J71391J16388M9261q4640
$$ 146201 31142 -34685 -157801 -36813 -93962 -294809 -123418 -7030 42231 -42409
2488d2409L3632n929O6233q6335k22688K04408j68941J21681N3927P5325j45855
$$ -42409 -8777 -14706 51527 -34808 -257496 -53088 -222029 -100348 -46421 28904 -116951
2477a16951n3160K21529J90431j93588k04499O0718k06552K2403J50859M8981
$$ -116951 -170111 51418 241849 48261 -156238 -95520 -302072 -279669 -128810 -79829
2467g9829k01883o7490P568K76886J25603j23778n7708R4525M0570K284o6693
$$ -79829 -281712 -349202 -341634 -64748 60855 -62923 -120631 -26106 14464 16748 -49945
2456d9945k0325n8935P6088l9017l8631M3033K4731N9265O5302j02992k96J20783
$$ -49945 -70270 -129205 -53117 -92134 -130765 -87732 -63001 -3736 61566 -41426 -41722 79061
2444G9061j30178N6424n6351R5133K5687p6041k18596J77376m3302J11794J04239
$$ 79061 -51117 5307 -51044 44089 69776 -6265 -224861 -47485 -90787 21007 125246
2433A25246j52393O0761j27774K7367J4301K9607l9903j14561m0405J91068p459
$$ 125246 -27147 33614 -94160 -66793 -52492 -22885 -62788 -177349 -217754 -26686 -34145
2422c4145j43409Q949J4859J46874M5340k9281o1749k01498J72480L4868j2141
$$ -34145 -177554 -168605 -153746 -6872 38468 9187 -52562 -254060 -81580 -46712 -58853
2411e8853L0236r226j7046j9697R6824P9787j03344j76752K6176M9531M1461J04253
$$ -58853 -28617 -37843 -54889 -74586 22238 102025 -1319 -178071 -151895 -102364 -60903 43350
2399D3350P7562j15643n804M4423m8856O0122k3862k2170j33675O4211q8222L857
$$ 43350 120912 5269 -535 43888 -4968 55154 31292 9122 -124553 -60342 -148564 -144707
2387a44707J64387L1142l6005j03134m0503K05472q5609j12583o3239J8628r446
$$ -144707 19680 50822 14817 -88317 -128820 76652 -8957 -121540 -184779 -166151 -175597
2376a75597M0673Q0847j10701R5083J04718J34899j28634m3558R9486j37935r4253
$$ -175597 -134924 -54077 -164778 -69695 35023 169922 41288 -2270 97216 -40719 -134972
2365a34972M8481l6060j41347J98054L8268p6587K8197M8753k29528K5124M2497
$$ -134972 -86491 -122551 -263898 -65844 -27576 -104163 -75966 -27213 -256741 -231617 -189120
2354a89120j7089K02611j42925L8287K6157J45569k9188q8505O8887n3565Q8827
$$ -189120 -206209 -3598 -146523 -108236 -82079 63490 34302 -54203 14684 -38881 49946
2343D9946n4085q7148P3453m9072m6272o3292K8199K80864R061j62899m4223o6159
$$ 49946 -4139 -91287 -17834 -66906 -113178 -176470 -148271 132593 141654 -21245 -65468 -131627
2331a31627l8317P2240M2252l4717r5465Q2316N1543P806K8155N1371j7456p7121
$$ -131627 -169944 -97704 -55452 -90169 -185634 -103318 -51775 -43969 -15814 35557 18101 -59020
2319e9020J5560N3992o7250Q9173J09326O129j13125j57543N2036m399o5834P5161
$$ -59020 -43460 10532 -56718 32455 141781 147910 34785 -122758 -70722 -75121 -140955 -65794
2307f5794R1898r0165o7307j5862m1164j1037P0298j46230M9483R3707J21916
$$ -65794 26104 -64061 -131368 -147230 -188394 -199431 -129133 -275363 -225880 -132173 -10257
2296a0257P0991q6698K940O6073o1566P2332j03727k7034M3039j8269K18463j03997
$$ -10257 60734 -25964 -23024 43049 -18517 53815 -49912 -76946 -33907 -52176 166287 62290
2284F2290j24248N3379p6964m8816J42435K5348k74641N6932k678R6068R2582
$$ 62290 -61958 -8579 -85543 -134359 8076 33424 -241217 -184285 -186963 -90895 1687
2273A687K7523p9823L3552o1508J30464K9574q8974Q4390R1547l4603j74212O6417
$$ 1687 29210 -50613 -17061 -78569 51895 81469 -7505 76885 168432 133829 -40383 26034
2261B6034j44642k04273J33686P1780J10670r1769l8523q0463J73374M2834l1336
$$ 26034 -118608 -322881 -189195 -117415 -6745 -98514 -137037 -217500 -44126 -1292 -32628
2250c2628r7692J25051L1895j13745J19852o8358Q0387o2428J46459O077n9021
$$ -32628 -130320 -5269 26626 -87119 32733 -35625 44762 -17666 128793 134870 75849
2239G5849o9805r150L0236N5069o1942N2015j01523k05179m064Q3814O3960L9053
$$ 75849 6044 -3106 27130 82199 20257 72272 -29251 -234430 -238494 -154680 -90720 -51667
2227e1667R194J19912j56669m8186J50153j27226O794J55962j83562O4161j13858
$$ -51667 -42473 77439 -79230 -127416 22737 -104489 -97695 58267 -125295 -61134 -174992
2216a74992L537J36298R3253j33254O8230K3849j36530j10808J58993N994j03755
$$ -174992 -171455 -35157 58096 -75158 -6928 16921 -119609 -230417 -71424 -65430 -169185
2205a69185J31094P5718k9817j50260J22227M8312l4357j2578j45963p9377l4094
$$ -169185 -38091 37627 7810 -142450 -20223 28089 -6268 -18846 -164809 -244186 -278280
2194b78280J38031M6657J26836l7395q0705N8422q4979O3704n6164p9406N4590
$$ -278280 -140249 -93592 33244 -4151 -84856 -26434 -111413 -47709 -103873 -183279 -128689
2183a28689Q3814o5771M464J10060j3954j85815N0172q9214P3399J15670N1092
$$ -128689 -44875 -110646 -106182 3878 -10076 -195891 -145719 -234933 -161534 -45864 5228
2172E228J4K1781k1556n2454l0012K9525r161O6063k5904M709J17387l0581m8030
$$ 5228 5242 27023 5467 -46987 -76999 -47474 -56635 9428 -16476 -11767 105620 75039 27009
2159B7009j22105o3600m1425P9995o6339l2964K21112j5351p1367R9012r1102
$$ 27009 -95096 -158696 -200121 -120126 -186465 -219429 1683 -13668 -85035 13977 -77125
2148g7125R1313J37436p7762j86605J52090j40082n2457L1715J0296J21354m1129
$$ -77125 14188 151624 73862 -112743 39347 -100735 -153192 -121477 -111181 10173 -30956
2137c0956O5684J04940n6165j66688r5427k4161O7044R5640j32539L5250K5234
$$ -30956 34728 139668 83503 -83185 -178612 -202773 -135729 -40089 -172628 -137378 -112144
2126a12144R4655R6255q6992N2068k24695N0230O6294j02645P410J64743j78971
$$ -112144 -17489 78766 -8226 43842 -180853 -130623 -64329 -166974 -159564 5179 -173792
2115a73792n3089o579J09600n8730M5572J20761r042r3727m6348L7935N7139l2637
$$ -173792 -226881 -233460 -123860 -182590 -137018 -16257 -25299 -119026 -165374 -127439 -70300 -102937
2103a02937J05031O677o2044k0701Q5056J9562j00745J0456N0874m4519j9659
$$ -102937 2094 8771 -53273 -73974 11082 30644 -70101 -59645 -8771 -53290 -72949
2092g2949P0619k0376Q1434l122n9011m5574r785M1276k8585K32564o8651j06811
$$ -72949 -2330 -22706 58728 55606 -3405 -48979 -58764 -17488 -46073 186491 117840 11029
2080A1029M6844k2377n9023J22761k07674J7104O4830K8402k4029r2497J54742
$$ 11029 57873 35496 -23527 99234 -108440 -91336 -26506 1896 -22133 -114630 40112
2069D0112j43589N0658m5403L7156n4221j05906K0228K12277j9855R5346O0816
$$ 40112 -103477 -52819 -98222 -61066 -115287 -221193 -200965 11312 -8543 86803 147619
2058A47619k9828j57123J04372k9067o8937J43739j23282k578O3468K1599j60771
$$ 147619 117791 -39332 65040 35973 -32964 110775 -12507 -15085 48383 69982 -90789
2047i0789N3505Q4359r2947J95311n3107j18416J11328K4818k3886j55648k6279
$$ -90789 -37284 47075 -45872 149439 96332 -22084 89244 114062 90176 -65472 -91751
2036i1751J38250o1548J443n1263m668K1211l6592R8658M6841P808r7803j5019
$$ -91751 46499 -15049 -13606 -64869 -69537 -48326 -84918 13740 60581 68389 -29414 -44433
2024d4433n0865p4390J87014r4378m3438Q5314l365K7840k4375K4017O8835j88718
$$ -44433 -95298 -169688 17326 -77052 -120490 -35176 -38541 -10701 -35076 -11059 57776 -130942
2012a30942N774j3083j1976l2282O916R1845N2265j49895N1556P4616l625Q0610
$$ -130942 -125168 -138251 -150227 -182509 -175593 -83748 -31483 -181378 -129822 -55206 -58831 21779
2000B1779m9280j24325M9665j8343O1077m7792o7510L9448R5257O4723K9242l2079
$$ 21779 -27501 -151826 -102161 -120504 -59427 -107219 -174729 -135281 -40024 24699 53941 21862
1988B1862j6860P2031n6317J7147j90991J81444J06780o9782K3254p0595j05077
$$ 21862 5002 77033 20716 37863 -153128 28316 135096 65314 88568 17973 -87104
1977h7104j30633J18250J66481J203k9742n5577o8208N9930J49021n3952N5149
$$ -87104 -217737 -99487 66994 68197 38455 -17122 -85330 -25400 123621 69669 124818
1966A24818N859j14092o9023J02659K5868L9648o0802m1344J8608M048m0261m5136
$$ 124818 130677 16585 -52438 50221 76089 115737 54935 13591 32199 36247 -4014 -49150
1954d9150O531p2454K40870L269j17787L1485j3381N344n2082q1868K4809J6577
$$ -49150 -42619 -115073 125797 129066 11279 42764 29383 34727 -17355 -99223 -74414 -57837
1942e7837o2788K4376l6389M270K7739J04451j26757L2997n5520k0390J15113
$$ -57837 -120625 -96249 -132638 -128368 -100629 3822 -122935 -89938 -145458 -165848 -50735
1931e0735o9164J6980k25K10676j65938n2465J02524r293k7904O2515k1505K181
$$ -50735 -119899 -102919 -103144 107532 -58406 -110871 -8347 -17640 -45544 16971 -4534 -2353
1919b353J55036j24412j63994L9359l3213P0195J21357j28716j9394L6363J18514
$$ -2353 152683 28271 -135723 -96364 -129577 -59382 61975 -66741 -86135 -49772 68742
1908F8742j49833N693J15653n4981o5854j3036N2228l2925j50000l192P6310P6941
$$ 68742 -81091 -75398 40255 -14726 -80580 -93616 -41388 -74313 -224313 -227505 -151195 -74254
1896g4254M5192Q3359k8537j1349L1469P3011j30657j36222J94115k7928n1762
$$ -74254 -29062 54297 25760 14411 45880 118891 -11766 -147988 46127 18199 -33563
1885c3563O855k1269Q2866l8575Q1449j22909N7538j24168m445J15358J7813j68701
$$ -33563 -26708 -47977 34889 -3686 77763 -45146 12392 -111776 -116221 -863 16950 -151751
1873a51751l2280N9762o8593J57798Q3103r3469k7935J6065R7178M7140j09383
$$ -151751 -184031 -124269 -192862 -35064 48039 -45430 -73365 -57300 39878 87018 -22365
1862b2365L352k3652l3204o5273M7241j33036J10084J43173j43180O005j156m50
$$ -22365 -19013 -42665 -75869 -141142 -93901 -226937 -116853 26320 -116860 -110855 -112011 -112461
1850a12461P7971N1298R930m8515K00035p1451l3835L0226k00054O7431J34180
$$ -112461 -34490 16808 26738 -21777 178258 106807 72972 103198 -96856 -29425 104755
1839A04755j99078p0661l8076Q7844j4391O5848J35325j03782K894m6443p6635
$$ 104755 -94323 -164984 -203060 -115216 -129607 -63759 71566 -32216 -29322 -75765 -152400
1828a52400m7557M1947o9709R1017J23689l6529O7267j11085k34580K22203R7577
$$ -152400 -199957 -158010 -227719 -136702 -13013 -49542 17725 -93360 -327940 -105737 -8160
1817h160n3056P4504l1457L8172j34644R6435L2634j80240l7966O8436o9764J57782
$$ -8160 -61216 13288 -18169 20003 -114641 -18206 14428 -165812 -203778 -135342 -205106 -47324
1805d7324K8808n6239K4237J52018J3123j36199j84314J12565M4753l7800n972
$$ -47324 -18516 -74755 -50518 101500 114623 -21576 -205890 -93325 -48572 -86372 -92344
1794i2344O9508O9536l0159j0272j91981J29320Q7040R2808j55100j23203M3519
$$ -92344 -22836 46700 16541 6269 -185712 -56392 30648 123456 -31644 -154847 -111328
1783a11328J08014J49807j20758k9477K6100r7872p9438M0327J14924N29o9756
$$ -111328 -3314 146493 25735 -3742 22358 -75514 -154952 -114625 299 828 -68928
1772f8928o8768J44471l0149j12921R3243k901J35950J0569k8605l6752j66885
$$ -68928 -137696 6775 -23374 -136295 -43052 -45953 89997 100566 71961 35209 -131676
1761a31676K6575Q1441k4077m1093L4254J9003k5422K17606j09276n2110o0987
$$ -131676 -105101 -23660 -47737 -88830 -54576 -35573 -60995 156611 47335 -4775 -65762
1750f5762n6142M1024J2999k9663N5967k16871K99814L9700j00970N3199m2193
$$ -65762 -121904 -80880 -67881 -97544 -41577 -258448 41366 81066 -19904 33295 -8898
1739h898J42620j19444r1935k298J25206j75777J23521P5134m8845p7025L32808
$$ -8898 133722 14278 -77657 -79955 45251 -130526 -7005 68129 19284 -57741 275067
1728B75067j42839p5039k10686J16782L1950m2126N3647k92p4997k5119L5651
$$ 275067 132228 57189 -153497 -36715 -4765 -46891 6756 6464 -68533 -93652 -58001
1717e8001Q9463Q57q2450j13318j16072L21310j2231k13816J29753Q2924o8984
$$ -58001 31462 32319 -50131 -163449 -279521 41789 29558 -184258 -54505 28419 -40565
1706d0565K5791L4336q7164R7513J10226p0468j58q5847O1185m6336R88L1958
$$ -40565 -14774 19562 -67602 29911 140137 69669 69511 -16336 44849 -1487 -499 31459
1694C1459j3931P103k0070Q9942P8328j00048p1480r5864J17006P3071m1259j00749
$$ 31459 17528 24631 4561 94503 172831 72783 1303 -94561 22445 95516 54257 -46492
1682d6492l2718K2524l1281j02594J51456p3366R1524J9969j69254M4578K2813
$$ -46492 -79210 -56686 -87967 -190561 -39105 -112471 -20947 -978 -170232 -125654 -102841
1671a02841J68693k6461q2902J7179o1786J33351J8575o44p8544n792p1284N9298
$$ -102841 65852 39391 -43511 -26332 -88118 45233 63808 63164 -15380 -21172 -92456 -33158
1659c3158M8580q5188N929L9989m9217j43713J33411J27085M8773k26911l9136
$$ -33158 15422 -69766 -63837 -23848 -73065 -216778 -83367 43718 92491 -134420 -173556
1648a73556J95430l6821m9725N6261N76n669j0416l8999N6876R8520o51r1938
$$ -173556 21874 -14947 -64672 -8411 -7835 -13504 -23920 -62919 -6043 92477 91826 -112
1636a12k6521o5503L1234j19160k7230K61829K9866r3958r2754J00209J7695P2929
$$ -112 -26633 -92136 -60902 -180062 -207292 54537 84403 -9555 -102309 -2100 15595 88524
1624H8524j76736P8560m2284r3154J01105M9318k48992m2605K11983J9333p6180
$$ 88524 -88212 -9652 -51936 -145090 -43985 5333 -243659 -286264 -74281 -54948 -131128
1613a31128J15864J25923r0200p1680J14031r2268K5769p549j46359R2635O3424
$$ -131128 -15264 110659 20459 -51221 62810 -29458 -3689 -11238 -157597 -64962 -1538
1602a538L5561j19627P6488q6345K10107L5741j25500K1606o647j21324J3652
$$ -1538 34023 -85604 -9116 -95461 114646 150387 24887 46493 39846 -81478 -67826
1591f7826M4656k0781q3169J74971O3964o163J17584j15684Q2182o7014q7817
$$ -67826 -23170 -43951 -127120 47851 111815 105652 223236 107552 189734 122720 34903
1580C4903j37315M0029J34956j7893n8973m1958J8692M8621o804j86424j3007
$$ 34903 -102412 -62383 72573 54680 -4293 -46251 -27559 21062 14258 -172166 -185173
1569a85173J60113o9672R7169N360j39626J3618j805O5236l6990P237J27841n6303
$$ -185173 -25060 -94732 2437 7797 -131829 -118211 -120016 -54780 -91770 -84533 43308 -12995
1557a2995k3368N912k1089J16941N3051m7908l3047K5475m0625O3162R3500l78755
$$ -12995 -36363 -30451 -51540 65401 118452 70544 37497 62972 22347 85509 179009 -199746
1545a99746R0741Q0248j08141J11003L4997r9192j30451J42442k0187N6994q4141
$$ -199746 -109005 -28757 -136898 -25895 9102 -90090 -220541 -78099 -98286 -41292 -125433
1534a25433J51841Q4964j11714q5312k8481L3453k62631K34559N9016N3126J38989
$$ -125433 26408 111372 -342 -85654 -114135 -80682 -343313 -108754 -49738 3388 142377
1523A42377q9166j6350l5115j9589M3978k6854j9153Q6705j44516R0905J00614
$$ 142377 53211 36861 1746 -17843 26135 -719 -19872 66833 -77683 13222 113836
1512A13836o1027J7250R0544n4617j1585j853K94R8587j10234r0384n7366j1194
$$ 113836 52809 70059 160603 105986 94401 92548 92842 191429 81195 -9189 -66555 -77749
1500g7749j24726m5113J93403M2952Q6213l4223J01407J9050j77239m9701Q2030
$$ -77749 -202475 -247588 -54185 -11233 74980 40757 142164 161214 -16025 -65726 16304
1489A6304j08705O7054k2264n041J2666q309n6008L4065P5322l5882k6223J5037
$$ 16304 -92401 -25347 -47611 -52652 -39986 -48295 -104303 -70238 5084 -30798 -57021 -41984
1477d1984M5606L8326r2724J93358R8658l19428l2489J9188P0154J45343k04703
$$ -41984 3622 41948 -50776 142582 241240 -78188 -110677 -91489 -21335 124008 -80695
1466h0695m369Q6474J5153j1476J01778n2370r3793J02176L404M3209k05182J02662
$$ -80695 -85064 1410 16563 5087 106865 54495 -39298 62878 66282 109491 -95691 6971
1454F971r0340k5713P2022k6602P6370l3706L012L8648J14087j67725o8376L2924
$$ 6971 -83369 -109082 -37060 -63662 12708 -20998 -17986 20662 134749 -32976 -101352 -68428
1442f8428L7815O2142l2394O0085j53263J29014j09695M0470j0029M1990q054
$$ -68428 -30613 31529 -865 59220 -94043 34971 -74724 -34254 -44283 -2293 -10347
1431a0347q8779j5471l8504J89357O9466j89913K55540j48583j87376O3048L9922
$$ -10347 -99126 -114597 -153101 36256 105722 -84191 171349 22766 -164610 -101562 -61640
1420f1640K1025R9976k7246l3601J7496J2684J93092j49206p7760p542j18350
$$ -61640 -40615 59361 32115 -1486 16010 28694 221786 72580 -5180 -12722 -131072
1409a31072P2477J20628j14538K17284m0960l3118J3185L3541l648k3573m3695
$$ -131072 -58595 62033 -52505 164779 123819 90701 103886 137427 133779 110206 66511
1398F6511R2293r3699j02120j32183j0938M0769L9782j10072P6412o3078Q2197
$$ 66511 158804 65105 -37015 -169198 -180136 -139367 -99585 -209657 -133245 -196323 -114126
1387a14126K3557O189P3723k04470K3906J285R5512O2692J9952m5579J35547j68269
$$ -114126 -90569 -84380 -10657 -215127 -191221 -189936 -94424 -31732 -11780 -57359 78188 -90081
1375i0081J22151o6592O545j1602L8956M3315j9942j59752N7628L4541j7213L5468
$$ -90081 32070 -34522 -27977 -39579 -623 42692 22750 -137002 -79374 -44833 -62046 -26578
1363b6578J8309J70625j13394M0741r9888o4227J70106o0215Q8934k8851j09873
$$ -26578 -8269 162356 48962 89703 -10185 -74412 95694 35479 124413 95562 -14311
1352a4311j39656J88033J7166J71921j68840r5103J18955j73713P4279o4873O7759
$$ -14311 -153967 34066 51232 223153 54313 -40790 78165 -95548 -21269 -86142 -18383
1341a8383K3693m5194J1289k4607J8215L986n7024N0544L0050Q7902K6895n2640
$$ -18383 5310 -39884 -28595 -53202 -34987 -31001 -88025 -37481 -7431 80471 107366 54726
1329E4726n9541N4335j61938n4930J3949J163l0235J39165o2069M0019L8008Q6893
$$ 54726 -4815 49520 -112418 -167348 -153399 -152236 -182471 -43306 -105375 -65356 -27348 59545
1317E9545r6293O4011R0506k7908L2740R2036j12377M0866n9942j45433N7286
$$ 59545 -36748 27263 117769 89861 122601 214637 102260 143126 83184 -62249 -4963
1306d963J795O3740K114o6673P2421P7444P1021r3287M3951j54285l3201J78829
$$ -4963 -3168 60572 62686 -3987 68434 145878 216899 123612 167563 13278 -19923 158906
1294A58906k4921j13110j74018J18520l9581P3973N6357l0390L4725n6961N9792
$$ 158906 133985 20875 -153143 -34623 -74204 -231 56126 25736 60461 3500 63292
1283F3292P2739p9523o7600K05402j20155n5615n3686M664m0601n7994J49220
$$ 63292 136031 56508 -11092 194310 74155 18540 -35146 -30482 -71083 -129077 20143
1272B0143m3310N3322J48488k4367j45241O0047J32936O5136k26067p8498K1424
$$ 20143 -23167 30155 178643 154276 9035 69082 202018 267154 41087 -37411 -15987
1261a5987N1288m604l6425K3781j24474K7354o6332J09094J54459n4448j5672
$$ -15987 35301 30697 -5728 18053 -106421 -79067 -145399 -36305 118154 63706 48034
1250D8034p1254P5433n9984N9395q1709L6315J29759j20757j96812J34705J14090
$$ 48034 -23220 52213 -7771 51624 -30085 6230 135989 15232 -181580 -46875 67215
1239F7215m9058q742O2344P247l7255j1533M7659j09339N6251j52124K12486k3286
$$ 67215 18157 9415 71759 79006 41751 30218 77877 -31462 24789 -127335 85151 61865
1227F1865j43284J4493J31287j29726j14596O9770K2017N3732n1110O1831m9524
$$ 61865 -81419 -66926 64361 -65365 -179961 -110191 -88174 -34442 -85552 -23721 -73245
1216g3245J76522k2897L2710n351k9316o8108J8138K612p8564J66352j48980j07453
$$ -73245 103277 80380 113090 107739 78423 10315 28453 31065 -47499 118853 -30127 -137580
1204a37580Q6746R653o7480M4359M080J9705Q2799r8746N1810J75504j41520j08153
$$ -137580 -50834 -41181 -108661 -64302 -60222 -40517 42282 -56464 -4654 170850 29330 -78823
1192g8823L3549k9500J50846m312L9745K0869k2467r2476J67138j01498j32042
$$ -78823 -45274 -74774 76072 71760 111505 132374 109907 17431 184569 83071 -48971
1181d8971J45606J2144o5998o5799q0246l0341K34280P3515k32955k6057k1888
$$ -48971 96635 108779 42781 -23018 -103264 -133605 100675 174190 -58765 -84822 -106710
1170a06710J8650O9236o553J2271J8366J87674j99390J05294j48186O2430n4218
$$ -106710 -88060 -18824 -25377 -13106 5260 192934 -6456 98838 -49348 13082 -41136
1159d1136j03322Q5175j369K19758q9523J3525K658k06787l5897L2871M514L1788
$$ -41136 -144458 -59283 -60652 159106 69583 83108 85766 -121021 -156918 -124047 -119533 -87745
1147h7745J38217J80739j33155R9710j33659J3257k3416O5370m1125M7504j90929
$$ -87745 50472 231211 98056 197766 64107 77364 53948 119318 78193 125697 -65232
1136f5232r1721K6743O8211J21863r7541O7557M545K7910j5996k20286K14053
$$ -65232 -156953 -130210 -61999 59864 -37677 29880 34425 62335 46339 -173947 40106
1125D0106O2146n3240J87246j97383j10120Q5014J30396l1535n8153p3321M8126
$$ 40106 102252 49012 236258 38875 -71245 13769 144165 112630 54477 -18844 29282
1114B9282J49055j25350q5596J22647j0373j60687J87511j62096J98592k1299
$$ 29282 178337 52987 -32609 90038 79665 -81022 106489 -55607 142985 121686
1104A21686p5339m174n1135J31279j46965j10507m6961K49469l7750K2304M786
$$ 121686 46347 42173 -8962 122317 -24648 -135155 -182116 67353 29603 51907 56693
1093E6693k4823r0980N367J1532m5758J09285n8552K1680Q9483l2762r8136j47869
$$ 56693 31870 -59110 -53743 -42211 -87969 21316 -37236 -15556 73927 41165 -56971 -204840
1081b04840K62257m2630K3540J5113P5829j17275p3415L3471r1059R3055J4247
$$ -204840 57417 14787 38327 53440 129269 11994 -61421 -27950 -119009 -25954 -11707
$$ [...]
##END NTUPLES=NMR SPECTRUM
##END=
