##TITLE=1H_CA-9303
 CDCl3
 8 sc, 
 25.11.2024
##JCAMPDX= 6.0         $$ Bruker NMR JCAMP-DX V2.0
##DATA TYPE= NMR SPECTRUM
##DATA CLASS= NTUPLES
##ORIGIN= UXNMR, Bruker Analytische Messtechnik GmbH
##OWNER= root
$$ XWIN-NMR		Version 3.5
$$ Mon Nov 25 14:36:55 2024 Russian Standard Time (UT+4h)  she@DPX200
##.OBSERVE FREQUENCY= 200.1315
##.OBSERVE NUCLEUS= ^1H
##.ACQUISITION MODE= SIMULTANEOUS
##.ACQUISITION SCHEME= undefined
##.AVERAGES= 8
##.DIGITISER RES= 18
##SPECTROMETER/DATA SYSTEM= spect
##.PULSE SEQUENCE= zg30
##.SOLVENT NAME= CDCl3
##.SHIFT REFERENCE= (INTERNAL, CDCl3, 0, 19.4871)
##AUDIT TRAIL= $$ (NUMBER, WHEN, WHO, WHERE, WHAT)
$$ ##TITLE= Audit trail, XWIN-NMR		Version 3.5
$$ ##JCAMPDX= 5.01
$$ ##ORIGIN= Bruker BioSpin GmbH
$$ ##OWNER= she
$$ F:/spectra/data/she/nmr/H-F/1/pdata/1/auditp.txt
$$ ##AUDIT TRAIL=  $$ (NUMBER, WHEN, WHO, WHERE, WHAT)
(   1,<2024-11-25 14:35:30.89 +0400>,<she>,<DPX200>,
      <created by zg, POWCHK disabled, PULCHK disabled
       configuration hash MD5:
       00 E9 B6 7A A2 85 ED C7 34 08 36 98 17 FE 4E 26
       data hash MD5: 16K
       6C 39 3F 69 F5 7B 58 A9 54 7D 7D 9B 12 2A 6F 42>)
(   2,<2024-11-25 14:35:34.76 +0400>,<she>,<DPX200>,
      <Start of raw data processing
       efp BC_mod = 2 LB = 0.24 FT_mod = 6 PKNL = 1 PHC0 = -26709 PHC1 = 17.58744 SI = 16K 
       data hash MD5: 16K
       2C 5B 8D 0C BA 79 40 85 0C 8D 13 9C B6 08 0C 9F>)
(   3,<2024-11-25 14:35:52.40 +0400>,<she>,<DPX200>,
      <pk PHC0 = 1.270533 PHC1 = -2 
       data hash MD5: 16K
       E5 D7 E5 A3 9C B2 8C CD A3 A0 85 14 A7 FC 94 7D>)
(   4,<2024-11-25 14:35:56.34 +0400>,<she>,<DPX200>,
      <abs ABSG = 5 
       data hash MD5: 16K
       07 E1 80 91 D4 4F 19 5D C6 05 1B FC 23 CF 3E D1>)
$$ ##END=
$$ 
$$ hash MD5
$$ 4C 02 3C CB C5 5A 2D 87 A2 5E B2 D4 2D 35 BC 2E
##$RELAX= 
##$RELAX= 
##$RELAX= 
##$RELAX= 
##$RELAX= 
##$RELAX= 
$$ Bruker specific parameters
$$ --------------------------
##$DU= <F:/spectra>
##$EXPNO= 1
##$NAME= <H-F>
##$PROCNO= 1
##$TYPE= <nmr>
##$USER= <she>
##$AMP= (0..31)
100 100 100 100 100 100 100 100 100 100 100 100 100 100 100 100 100 100 
100 100 100 100 100 100 100 100 100 100 100 100 100 100 
##$AQSEQ= 0
##$AQ_mod= 1
##$AUNM= <au_zg>
##$AUTOPOS= <>
##$BF1= 200.13
##$BF2= 200.13
##$BF3= 200.13
##$BF4= 200.13
##$BF5= 200.13
##$BF6= 200.13
##$BF7= 200.13
##$BF8= 200.13
##$BYTORDA= 1
##$CFDGTYP= 0
##$CFRGTYP= 5
##$CHEMSTR= <none>
##$CNST= (0..31)
1 1 145 1 1 1 1 1 1 1 1 1 1 1 1 1 1 1 1 1 1 1 1 1 1 1 1 1 1 1 1 1 
##$CPDPRG= <>
##$CPDPRG1= <>
##$CPDPRG2= <>
##$CPDPRG3= <>
##$CPDPRG4= <mlev>
##$CPDPRG5= <mlev>
##$CPDPRG6= <mlev>
##$CPDPRG7= <mlev>
##$CPDPRG8= <mlev>
##$CPDPRGB= <>
##$CPDPRGT= <>
##$D= (0..31)
0 1.2 0 0 0 0 0 0 0 0.06 0 0.03 0 0 0 0 0.0002 0 0 0 0 0 0 0 0 0 0 0 0 
0 0 0 
##$DATE= 1732530930
##$DBL= (0..7)
120 120 120 120 120 120 120 120 
##$DBP= (0..7)
150 150 150 150 150 150 150 150 
##$DBP07= 0
##$DBPNAM0= <>
##$DBPNAM1= <>
##$DBPNAM2= <>
##$DBPNAM3= <>
##$DBPNAM4= <>
##$DBPNAM5= <>
$$ [...]
##$SUBNAM3= <"">
##$SUBNAM4= <"">
##$SUBNAM5= <"">
##$SUBNAM6= <"">
##$SUBNAM7= <"">
##$SUBNAM8= <"">
##$SUBNAM9= <"">
##$SW= 24.0689530833862
##$SWIBOX= (0..15)
0 0 2 0 0 0 0 0 0 0 0 0 0 0 0 0 
##$SW_h= 4816.95568400771
##$TD= 16384
##$TD0= 1
##$TE= 0
##$TE2= 300
##$TE3= 300
##$TEG= 300
##$TL= (0..7)
0 120 120 120 120 120 120 120 
##$TP= (0..7)
150 150 150 150 150 150 150 150 
##$TP07= 0
##$TPNAME0= <>
##$TPNAME1= <>
##$TPNAME2= <>
##$TPNAME3= <>
##$TPNAME4= <>
##$TPNAME5= <>
##$TPNAME6= <>
##$TPNAME7= <>
##$TPOAL= (0..7)
0.5 0.5 0.5 0.5 0.5 0.5 0.5 0.5 
##$TPOFFS= (0..7)
0 0 0 0 0 0 0 0 
##$TUNHIN= 0
##$TUNHOUT= 0
##$TUNXOUT= 0
##$USERA1= <user>
##$USERA2= <user>
##$USERA3= <user>
##$USERA4= <user>
##$USERA5= <user>
##$V9= 5
##$VALIST= <valist>
##$VCLIST= <CCCCCCCCCCCCCCC>
##$VD= 0
##$VDLIST= <DDDDDDDDDDDDDDD>
##$VPLIST= <PPPPPPPPPPPPPPP>
##$VTLIST= <TTTTTTTTTTTTTTT>
##$WBST= 1024
##$WBSW= 4
##$XGAIN= (0..3)
0 0 0 0 
##$XL= 0
##$YL= 0
##$YMAX_a= 261633
##$YMIN_a= -145879
##$ZGOPTNS= <>
##$ZL1= 120
##$ZL2= 120
##$ZL3= 120
##$ZL4= 120
##$ABSF1= 19.51503
##$ABSF2= -4.554104
##$ABSG= 5
##$ABSL= 3
##$ALPHA= 0
##$AQORDER= 0
##$ASSFAC= 0
##$ASSFACI= 0
##$ASSFACX= 0
##$ASSWID= 0
##$AUNMP= <proc_1d>
##$AZFE= 0.1
##$AZFW= 0.1
##$BCFW= 0
##$BC_mod= 2
##$BYTORDP= 0
##$COROFFS= 0
##$CY= -3
##$DATMOD= 1
##$DC= 0
##$DFILT= <>
##$DTYPP= 0
##$F1P= 0
##$F2P= 0
##$FCOR= 1
##$FTSIZE= 16384
##$FT_mod= 6
##$GAMMA= 0
##$GB= 0
##$INTBC= 1
##$INTSCL= 2.524811e-10
##$ISEN= 128
##$LB= 0.24
##$LEV0= 0
##$LPBIN= 0
##$MAXI= 10000
##$MC2= 0
##$MEAN= 0
##$ME_mod= 0
##$MI= 1.114404
##$NCOEF= 0
##$NC_proc= -7
##$NLEV= 6
##$NOISF1= 3.799351
##$NOISF2= 2.8
##$NSP= 0
##$NTH_PI= 0
##$NZP= 0
##$OFFSET= 19.48712
##$PC= 1
##$PHC0= -26707.73
##$PHC1= 15.58744
##$PH_mod= 1
##$PKNL= yes
##$PPARMOD= 0
##$PSCAL= 0
##$PSIGN= 0
##$REVERSE= no
##$SF= 200.130008518612
##$SI= 16384
##$SIGF1= 3
##$SIGF2= 2
##$SINO= 5.538805
##$SIOLD= 16384
##$SREGLST= <1H.CDCl3>
##$SSB= 0
##$STSI= 16384
##$STSR= 0
##$SW_p= 4816.95568400771
##$SYMM= 0
##$S_DEV= 0
##$TDeff= 16384
##$TDoff= 0
##$TI= <>
##$TILT= no
##$TM1= 0
##$TM2= 0
##$TOPLEV= 0
##$USERP1= <user>
##$USERP2= <user>
##$USERP3= <user>
##$USERP4= <user>
##$USERP5= <user>
##$WDW= 1
##$XDIM= 16384
##$YMAX_p= 508210592
##$YMIN_p= -761111
$$ End of Bruker specific parameters
$$ ---------------------------------
##NTUPLES= NMR SPECTRUM
##VAR_NAME=  FREQUENCY,     SPECTRUM/REAL,   SPECTRUM/IMAG
##SYMBOL=    X,             R,               I
##VAR_TYPE=  INDEPENDENT,   DEPENDENT,       DEPENDENT
##VAR_FORM=  AFFN,          ASDF,            ASDF
##VAR_DIM=   16384,         16384,           16384
##UNITS=     HZ,            ARBITRARY UNITS, ARBITRARY UNITS
##FACTOR=    0.29402158847633, 1,            1
##FIRST=     3899.95742649744, 0,            0
##LAST=      -916.998257510267, 0,           0
##MIN=       -916.998257510267, -761111,     0
##MAX=       3899.95742649744, 508210592,    0
$$ Real data points
##PAGE= N=1
##DATA TABLE= (X++(R..R)), XYDATA
$$ [...]
11167A82858j31666J4074j55609L5679O280k88371L16727K7761n5504j95307L39895
11156I6817k32467o8830K92864K13552j44155J384m6227K10732k49590j40220
11146f6140q9162l6978L33761J18101k07512k10722K02312j1002R3568n0894k51004
11135a75672K1437L60924J26330j7528m28955K05054j17432j41306K36523K68483
11125C37858l53766j83718J80890p2170k54343Q3782J8153m9054L05044L35989
11115C48665m85897L36825M0453k22876l48045K50212J43902k02633P1711q3852
11105a51535l1669J31021n693K5337K13112q6497k49611m0555K45036m8659P9669
11094G9956k55223N9832P019j20514L35463K53686k82139O1450K091j76497M0136
$$ plain form
11167 182858 51192 65266 -90343 -54664 -48384 -336755 -20028 7733 -47771 -243078 96817
11156 96817 -135650 -204480 88384 301936 157781 159165 112938 323670 74080 -66140
11146 -66140 -155302 -192280 141481 259582 52070 -158652 43660 32658 126226 75332 -175672
11135 -175672 -154235 206689 333019 315491 -113464 91590 -25842 -167148 69375 337858
11125 337858 -15908 -199626 -18736 -90906 -345249 -261467 -243314 -292368 12676 348665
11115 348665 -137232 199593 240046 17170 -330875 -80663 63239 -139394 -67683 -151535
11105 -151535 -183204 -52183 -57876 -32539 180573 94076 -155535 -196090 48946 287 79956
11094 79956 -175267 -115435 -108416 -228930 106533 360219 78080 139530 141621 -34876 5260
11083E260J34498k0158j772k22929P1482O4734j09476K237j73892K48748l4542
11072c5810J61825O1758j51187O1531o7141k36605P2065J64633m1592J8983l00471
11061b92011O12127N2545k60601j31029o0923K29240K9187n5743J46009l82860
11051a14059R3084J83736J91660j34992k67500M01940m5844k31227j71057J84163
11041H9904P9725l13075N2629k8062K79133O3896j75927j29079k8053J53283J47481
11030A91855l18664L8143q1589k50155L03253O4166K93214j05793j40821P5698
11020F9307L59627n1220n92853N2699K73353l05061K12731K53404l91620j10901
11010b30534J08018j08189K58498j45250K78120M1379r3224l1310m8322j82191
$$ plain form
11083 5260 139758 119600 117828 -105101 -33619 31115 -78361 -76124 -250016 -1268 -35810
11072 -35810 126015 187773 36586 98117 30976 -205629 -133564 31069 -10523 8460 -292011
11061 -292011 320116 372661 112060 -18969 -79892 149348 178535 122792 268801 -114059
11051 -114059 -20975 162761 354421 219429 -48071 353869 308025 76798 -94259 89904
11041 89904 169629 -143446 -90817 -118879 160254 224150 48223 -80856 -108909 44374 191855
11030 191855 -126809 -88666 -170255 -420410 -117157 -52991 240223 134430 -6391 69307
11020 69307 428934 377714 -215139 -162440 110913 -194148 18583 271987 -119633 -230534
11010 -230534 -122516 -230705 27793 -117457 160663 202042 108818 77508 29186 -153005
11000a53005Q5268K1897j63986K97492J75735p1274k01822J36299k83236J60029
10990C397j71140K98233j3347p0519j20161j70635K92273K75124j07241j93249
10980B2735m8439J09870j15724j5191k6552k8336K61036k04362O5213k36896M2808
10969a73838N0725m3223o1085J8371O5668K56384n5508O5168l41438J94573O9998
10958D5795k95545Q8505J3705J09993J78907J11092k97473m84142L06911K35181
10948A2929k22863j13799J58020J74451J41701L5152l52413L04303J51064k2384
10938B66161m64648j01827J07974j43238Q9539J8337K88712j88261P9189P6362
10928B8300K28975j04491j27346L6094o9788K98738m23977j22510P1019m6167
$$ plain form
11000 -153005 -67737 -45840 -209826 87666 263401 192127 -9695 126604 -156632 3397
10990 3397 -167743 130490 117143 46624 -73537 -244172 48101 323225 215984 22735
10980 22735 -25704 84166 -31558 -46749 -73301 -101637 159399 -44963 20250 -216646 -173838
10969 -173838 -123113 -166336 -227421 -209050 -143382 113002 57494 122662 -218776 -24203 45795
10958 45795 -249750 -161245 -147540 -37547 141360 252452 -45021 -529163 -222252 12929
10948 12929 -209934 -323733 -165713 8738 150439 185591 -166822 137481 288545 266161
10938 266161 -198487 -300314 -192340 -335578 -246039 -227702 61010 -127251 -48062 28300
10928 28300 257275 152784 25438 61532 -8256 290482 -133495 -256005 -184986 -231153
10918b31153n3223L04226j33325j4978J17791K36227j48952o2953N8454j32305
10908f0191L5562K8800j30912l7439l1807m0241l01247J37956M5764K69233J49548
10897F5026O8783R5966m01709j77215J07871N4082j45357J22271K91650j21240
10887c9872j3302n2155j47274J87534J7395J19264j39713J19399k19199L29990
10877A62067L3147Q6453k23144k72545j63936L03772m6556J21270K96982k34740
10867F2770k56310J08941k7798N8205K949J20562J17412q1799k05971k64134J55009
10856b10164k464J51544j46995J69214R3321j59531K80560K03578j51798l13920
10846h6655j20186k1516k24424K16933j21601M42194j68277p2868L53867k66334
$$ plain form
10918 -231153 -284376 19850 -113475 -128453 -10662 225565 76613 13660 72114 -60191
10908 -60191 -24629 4171 -126741 -164180 -195987 -236228 -537475 -399519 -353755 -84522 65026
10897 65026 133809 229775 -171934 -349149 -241278 -187196 -332553 -210282 81368 -39872
10887 -39872 -53174 -105329 -252603 -65069 -47674 71590 -68123 51276 -167923 162067
10877 162067 195214 281667 58523 -214022 -377958 -74186 -120742 528 297510 62770
10867 62770 -193540 -84599 -112397 -54192 -51243 69319 186731 104932 -101039 -365173 -210164
10856 -210164 -212628 -61084 -208079 -38865 54456 -105075 175485 379063 227265 -86655
10846 -86655 -206841 -228357 -452781 -235848 -357449 84745 -83532 -156400 197467 -68867
10836f8867j37379L46893k32630J57598K64352j52563j01006l02981J59117o0609
10826a28075J82628q490K38823j51487l18446P7353Q3343n4744L23187j19999
10816A24093P654M17226l82365M7455n1919j33444j79512j18520j33273j37501
10806e40106L13902K60002Q816L743l2253j21156j37248K05208K4380Q0092k20690
10795a55310J97167l0726j9297o2032K2132J83178j6136o7557l14881L60530l37990
10784b40922k2751J30774J92098L08163n73655L1665j13101j89712L49009J33546
10774E114K91220k32921l87990Q2221L34873M3074R991o245K47546k1425k96752
10763F8706p6016j9706j80687m1681M29996J7173k748j14493K01477L2942k53292
$$ plain form
10836 -68867 -206246 140647 -91983 65615 329967 177404 76398 -226583 -67466 -128075
10826 -128075 54553 46063 284886 133399 -185047 -107694 -24351 -79095 244092 124093
10816 124093 131747 548973 166608 214063 162144 28700 -150812 -269332 -402605 -540106
10806 -540106 -226204 33798 42614 46357 14104 -107052 -244300 -39092 -14712 65380 -155310
10795 -155310 41857 11131 -8166 -70198 -48066 135112 118976 51419 -263462 97068 -240922
10784 -240922 -263673 -132899 59199 367362 -206293 -174628 -287729 -477441 -128432 5114
10774 5114 296334 63413 -324577 -242356 92517 135591 145582 139337 386883 365458 68706
10763 68706 -7310 -27016 -207703 -249384 180612 197785 195037 80544 282021 314963 61671
10752F1671k6813L66657n6291j46255k35321k6958K74626O2461J6753k24217L31041
10741C97354q4380R440k84492m842k56108K6938N86018J28617j68123l78817Q9036
10730F0641r5487j6925N432l5262j42634J41748p7821j50846J29996j74664J34563
10719b21259M7197J25971J3051J49473m03618L04677R2604r1461k6133j99624
10709b09122k37512K52183L45026k19159J72481k22106Q5787j03792J10731j68016
10699a93499K5517J49806l67979J19931N2967q2406r4123K56095M44374j08081
10689B02602k19192P8840J47232k0997k43654P2757j56174M699n0951j4943M35073
10678B35292k74184J30561J28797n8678k17144J30413J15683r1453j27627K33414
$$ plain form
10752 61671 34858 401515 345224 198969 -36352 -63310 211316 273777 290530 66313 397354
10741 397354 312974 322414 37922 33080 -223028 -196090 389928 518545 350422 -28395 60641
10730 60641 -34846 -51771 -46339 -81601 -224235 -82487 -160308 -311154 -181158 -355822 -221259
10719 -221259 -174062 -48091 -35040 114433 -289185 15492 108096 16635 -9498 -209122
10709 -209122 -446634 -194451 150575 -68584 103897 -118209 -32422 -136214 -25483 -193499
10699 -193499 -167982 -18176 -386155 -266224 -213257 -295663 -389786 -133691 310683 202602
10689 202602 -16590 62250 209482 188485 -55169 17588 -138586 -133887 -184838 -199781 235292
10678 235292 -38892 91669 220466 161788 -55356 75057 190740 99287 -28340 205074
10668B05074n2886N1096k4676o6833j46006J8161J85607r6348o0377J48301j70599
10657i486p8057K1007K55644n8924Q9485K16342k94945j94255J07909J0647j71580
10646a06213m1095M40491j34455M8744n3696j05808K4231j77005J39963r0307
10636e5150K96463j40971r2607J22733m2461K32447L0729n17554J96183J14499
10626A44311q9472j79988J31128k00177K48165j2746j73015J18527m873J3981
10616d159N5445k48655J40062J47345j38426r4487j1182L3768J10924m2817j4501
10605f6683p4698J41451j00862P3363N5460l33323J71729l26675J79876n825O7824
10594b18363J14634R7031k11772K39881K1371l20066J05139p7958K18809l2501
$$ plain form
10668 205074 152188 203284 178608 111775 -34231 -16070 169537 73189 12812 161113 -9486
10657 -9486 -87543 -66536 189108 130184 219669 436011 141066 -53189 54720 65367 -106213
10646 -106213 -147308 293183 158728 207472 153776 47968 72199 -104806 35157 -55150
10636 -55150 241313 100342 7735 130468 88007 320454 351183 -166371 29812 144311
10626 144311 54839 -125149 5979 -194198 53967 41221 -131794 -13267 -18140 -4159
10616 -4159 51286 -197369 -57307 90038 -48388 -142875 -154057 -120289 -9365 -52182 -66683
10605 -66683 -141381 70 -100792 -27429 28031 -305292 -133563 -460238 -280362 -286187 -218363
10594 -218363 -103729 -6698 -218470 21411 42782 -277284 -172145 -250103 -31294 -63795
10584f3795j40871J69955J93681J44002m24092l66703N31906K4324m7567l47826
10574c26986L04453K72472N1296j29969j69080k28997J82674Q3345O731k22591
10564a76652j1202L53073j45927K19082J70965k11686j50819Q9821j35376p7349
10554g6070k28198J10901J1593K95506K00786j24285k79148n9938j01230K50063
10544b0O2275O4507m2937k63941K43612L3697l13919j34465R2682L30737m24160
10533c51932J60332L3396k72632K75478p8706K09706o368m0707k54238K22144
10523a03527r273J23611J13333J51750L42925l92548k80726j99653K88600L6377
10513G0869M8318Q5957k18194N4351K8576j51438P8854J63198r7567n2197k08114
$$ plain form
10584 -63795 -204666 -34711 158970 302972 -121120 -487823 44083 68407 20840 -326986
10574 -326986 -22533 249939 301235 171266 2186 -226811 -44137 39208 45939 -176652
10564 -176652 -187854 165219 19292 238374 409339 197653 46834 136655 1279 -76070
10554 -76070 -304268 -193367 -181774 113732 314518 190233 -88915 -148853 -250083 -20
10544 -20 62255 126762 83825 -180116 63496 97193 -216726 -351191 -258509 72228 -351932
10533 -351932 -191600 -158204 -430836 -155358 -234064 -24358 -30726 -71433 -325671 -103527
10523 -103527 -112800 10811 124144 275894 618819 226271 -54455 -254108 34492 70869
10513 70869 119187 205144 -13050 41301 69877 -81561 -2707 160491 62924 10727 -197387
10502a97387N1740l7940r5888K03784l19820L00958J13237k10259K08787j53739
10492a36527q412M828m6419j14577J10981j53013K15563k31035J22379L37867
10482A01635j45713K62650M0435j64720p6986j292j1720o3666N2227N8572k00807
10471a49385k8706K17931j74339k7640N8376K14902p4028l494K3212L03564p5728
10460B84665m25601q5461k5721L47397l07350k0668J47143Q1579J27246K03070
10450C26299j67821j35965q2747K69244n0980k45574j37137k1545K79685j43702
10440a10243k0210k43615N2046M74658p3442k19751q5121o6981K08886J63383
10430G9610j24969M24227K2536j58795L6847j43307l47423K30898j14446L8484
$$ plain form
10502 -197387 -145647 -183587 -279475 -75691 -395511 -94553 18684 -191575 17212 -136527
10492 -136527 -144939 -140111 -186530 -301107 -190126 -343139 -127576 -358611 -236232 101635
10482 101635 -44078 218572 259007 94287 17301 16009 4289 -59377 -7150 51422 -149385
10471 -149385 -178091 39840 -134499 -162139 -103763 111139 37111 33617 56829 360393 284665
10460 284665 -140936 -226397 -252118 95279 -212071 -232739 -85596 -4017 123229 326299
10450 326299 158478 22513 -60234 209010 158030 -87544 -224681 -246226 33459 -110243
10440 -110243 -130453 -374068 -322022 152636 79194 -140557 -225678 -292659 -83773 79610
10430 79610 -45359 378868 401404 242609 279456 136149 -211274 19624 -94822 -56338
10420e6338N7616J66247k95858R511K06323l6278j63766J14505K3899j49236J04135
10409a9240l3093j81250K71586m2113m6320j47951k9687L99747r4987M0596l2685
10398H4603k8543q3080K05414j3589L3056k32085j28221J24336M8569q0190J28281
10387E8551j00840K61513l69000M2202R9342J24127l98465M27175J76161l16760
10377D006k29870J90265K9252n9868J56640m6258Q6496j25433j01148J7496M668
10366g3754J50875K29330l11315P0371l15955Q8470P8945J72973j4056M4421J70120
10355B90425J339l83805n3293P1308P2020j61114J71058p9384k5113K43524k89613
10344a42648O8534p2251m5743K10749L68630k83256J00584j79160m2966R7467
$$ plain form
10420 -56338 1278 167525 -128333 -118822 87501 51223 -112543 1962 25861 -123375 -19240
10409 -19240 -52333 -233583 38003 -4110 -50430 -198381 -228068 171679 76692 117288 84603
10398 84603 56060 -27020 178394 164805 197861 -34224 -162445 -38109 10460 -69730 58551
10387 58551 -42289 219224 -149776 -107574 -8232 115895 -282570 144605 320766 4006
10377 4006 -225864 -35599 -6347 -66215 90425 44167 130663 5230 -95918 -78422 -73754
10366 -73754 77121 306451 -4864 65507 -250448 -161978 -83033 89940 75884 120305 290425
10355 290425 291764 -92041 -145334 -74026 -2006 -163120 7938 -71446 -96559 146965 -142648
10344 -142648 -74114 -146365 -192108 18641 387271 104015 204599 25439 -17527 79940
10334G9940j862l98781q4639M50461K1224j61274l8490K11940j5267j97109j23472
10323b57329K3256k04779K49316R6891k28798R9872J82494N6994K8243J9330J81068
10312B46558R374O5999j25391l21549J5315n9911M1406Q4427j87277n0869n8404
10301c40322R6582K32972J63485N0549J15952o6763j13026p5633l38853Q0303
10291a94754K13406L1196L7910m5282p894o80R3546k75710M9719K06622l20754
10280b12675J20748r476J24992J15430J6778m45075K58331L00708m20789K4846
10270a26182J68841J44250m8002J59569N164k46688L2912n92537N67710O7211
10260A32248m16533j00j60638n8176L44968K97603l08853K12321k18064K13915
$$ plain form
10334 79940 78078 -320703 -405342 45119 66343 -94931 -133421 78519 63252 -133857 -257329
10323 -257329 -234073 -438852 -189536 -92645 -321443 -221571 -39077 17917 46160 65490 246558
10312 246558 255932 321931 196540 -125009 -109694 -169605 -128199 -43772 -231049 -281918 -340322
10301 -340322 -243740 -10768 152717 203266 319218 252455 139429 63796 -275057 -194754
10291 -194754 18652 49848 87758 42476 34582 33902 127448 -148262 -98543 108079 -212675
10280 -212675 -91927 -101403 23589 139019 155797 -289278 -30947 269761 -151028 -126182
10270 -126182 42659 186909 138907 298476 303640 56952 89864 -502673 65037 132248
10260 132248 -284285 -284385 -445023 -503199 -158231 139372 -169481 42840 -175224 38691
10250C8691K2910J96207o2442k11712J30029k06140M0377k79432L3127J44633
10240a53752j62240J12207K38699q5930O6614M8398j41195j03561j05002Q4989
10230b00773j45725J38786k6366l8172K41869P8470k25964K22942j61655K156
10220a14432j82405l4807L28537K2918k35259J83613p85j46052O4323j57592J83479
10209h8462K38581L9965j97879l17020q075K10410L1671K49438l48565L23131
10199A33195k6513j67237q560j33723J76279k51313K62732J54271K28573j08882
10189B58822J58117l45592k02573l71774J15793K99906P1671j63893p8989K51769
10179f743j68534M4633K23565N2338p3667l94274j2885K21029p3778m6834n3K82355
$$ plain form
10250 38691 61601 257808 195366 -16346 113683 -92457 -52080 -331512 -298385 -153752
10240 -153752 -315992 -203785 34914 -51016 15598 63996 -77199 -180760 -285762 -200773
10230 -200773 -346498 -207712 -234078 -272250 -30381 48089 -177875 45067 -116588 -114432
10220 -114432 -296837 -331644 -3107 19811 -215448 -31835 -32620 -178672 -114349 -271941 -88462
10209 -88462 150119 190084 -7795 -324815 -332890 -122480 -90809 158629 -189936 133195
10199 133195 106682 -60555 -69115 -202838 -26559 -277872 -15140 139131 367704 258822
10189 258822 416939 71347 -131226 -503000 -387207 -87301 -15630 -179523 -258512 -6743
10179 -6743 -175277 -130644 92921 145259 71592 -322682 -335567 -114538 -188316 -235150 -235203 47152
10167D7152m80139J37531J40778M8237j23320O5943J39158n7577J75663J74901
10157B68327l91588K7956l1412K1189p5917p4640J93254j79055J14811n5458J72562
10146i971J29032j5225j44137k34382q6717J39606L21199m16362K417K31002J27031
10135D3493j1532J72263J13831l5978m30729n3454K13733k80466m3801Q2847j09932
10124c39725L06139L50004k84853l43497K08878r77O3911l1089l52337M44446
10114B0900K05654R0538l61459l54902K6429J17092L01736J94510J78168j73255
10104B45411l49025J76682j25986J75545j58251R5457j5437j30164K94056n8298
10094A49990k47094J77051l12617J09865J07428k78915j49633Q2148J59906j03492
$$ plain form
10167 47152 -432987 -295456 -154678 -106441 -229761 -163818 -24660 -82237 93426 268327
10157 268327 -123261 -95305 -126717 -105528 -181445 -256085 -62831 -241886 -127075 -182533 -9971
10146 -9971 119061 103836 -40301 -274683 -361400 -221794 99405 -316957 -314540 -83538 43493
10135 43493 31961 204224 318055 282077 -148652 -202106 11627 -268839 -312640 -229793 -339725
10124 -339725 -33586 316418 31565 -311932 -103054 -104031 -40120 -71209 -423546 20900
10114 20900 226554 317092 -44367 -399269 -372840 -255748 45988 240498 418666 245411
10104 245411 -103614 73068 -52918 122627 -35624 59833 44396 -85768 208288 149990
10094 149990 -97104 79947 -232670 -122805 -15377 -294292 -443925 -361777 -201871 -305363
10084c05363L1452K0171R7200j46145k62218K55770J20277k26435L77988q4552
10074a21855O2219l18128K13958M08502k91563j12880J60893j82904k11925K51873
10064a41810P3557k34907K16237N4001J12990j81423J0480L4124k1967K20039
10054A41321K61593J114l09446j46797j50893J7580o5579L82068j01720Q4516
10044A13757j88595k43625J85239J19490K27234k95031K12613j64986k02536O076
10034b30364J94476Q9595J06189l39024P1125K20607J04577j71736L7558M6808
10024A29811q4171J71851k48035N6157o3294j98028Q6615M2973Q5017L0279l0161
10013b0986M1926k482j9155j92524O3054J06155J43869r8241r1756J8773Q7173
$$ plain form
10084 -305363 -273911 -253740 -156540 -302685 -564903 -309133 -188856 -415291 -37303 -121855
10074 -121855 -59636 -377764 -163806 244696 -46867 -159747 1146 -181758 -393683 -141810
10064 -141810 -68253 -303160 -86923 -32922 80068 -101355 -90875 -56751 -78718 141321
10054 141321 402914 404028 94582 -52215 -203108 -185528 -251107 130961 29241 113757
10044 113757 -74838 -318463 -133224 -13734 213500 -81531 131082 -33904 -236440 -230364
10034 -230364 -35888 53707 159896 -179128 -108003 112604 217181 45445 83003 129811
10024 129811 45640 217491 -30544 25613 -37681 -235709 -149094 -106121 -21104 9175 -20986
10013 -20986 20940 18458 -697 -193221 -130167 -24012 119857 21616 -70140 -51367 35806
10002C5806J81341O2769j27418o3828j73435j966P2295j51573k57377J16316J04774
9991b02296O5595m29203O6548K73387l1346O5000J52372k82917J63199J0163k05389
9980c54887J44922O1773q9290J93833J25490q9921p6044J23883n5896l36483L78957
9969B6337R041l13026K6384J19330K18843k64239J64378K09864R7126k86244k42896
9958b35102P3984J86343k4633j23182P1760K54268p2375k45892J51767k32130
9948a95192Q8122J18010l40330J34636P5487O7725J09630j39915J77977k57357
9938a61207j66367P3758J49820K38601J37121j82132m35545j31842K3210R9259
9928c55324K66740M0624j63563K3429j4602N8310K80727q6219L1989n9462m9130
$$ plain form
10002 35806 217147 279916 152498 88670 -84765 -86731 -14436 -166009 -423386 -307070 -202296
9991 -202296 -136701 -565904 -499356 -225969 -257315 -192315 -39943 -322860 -159661 -149498 -354887
9980 -354887 -209965 -148192 -237482 -43649 81841 -8080 -84124 39759 -16137 -352620 26337
9969 26337 35378 -277648 -251264 -131934 86909 -177330 -12952 196912 294038 7794 -235102
9958 -235102 -161118 25225 592 -122590 -50830 203438 131063 -114829 36938 -195192
9948 -195192 -107070 10940 -329390 -194754 -119267 -51542 58088 -81827 96150 -161207
9938 -161207 -327574 -253816 -103996 134605 271726 89594 -345951 -477793 -454583 -355324
9928 -355324 -88584 -47960 -211523 -188094 -202696 -144386 136341 50122 82111 22649 -26481
9917b6481O687r5262r8981J38899j5720J37701k69860j65414K65120l1806L14857
9906A59740O1390q3220k39463K90573r8649o6715K16289l33494O2766j25756L22185
9895A65646K4346R7924k26761j14498P6292O1299l28991J69430J48834l64410
9885b90889K98505J42985j10952L02888r7138p5101p7942L1878L0701j00024M8087
9874A02998j23679J41432j60997m1315P3260l4054N8044m25903L70123j10001
9864a50092k60945J41492n5426J46205M2997K36023j29678J06966j42062N1332
9854a3188p0095j84357J2028Q8321p4414K61287k37638L851N00382l3327l38657
9843h5807J58826o4456l66548J17808m9361J46003q1059J90233L4172m3891P9976
$$ plain form
9917 -26481 -19794 -115056 -214037 -75138 -90858 46843 -223017 -388431 -123311 -155117 159740
9906 159740 221130 137910 -101553 189020 90371 23656 239945 -93549 -30783 -156539 165646
9895 165646 189992 287916 61155 -53343 22949 84248 -244743 -75313 73521 -290889
9885 -290889 7616 150601 39649 342537 245399 170298 92356 124234 154935 54911 102998
9874 102998 -20681 120751 -40246 -81561 -8301 -42355 15689 -410214 -40091 -150092
9864 -150092 -411037 -269545 -324971 -178766 -135769 100254 -29424 77542 -64520 -13188
9854 -13188 -83283 -267640 -255612 -167291 -241705 19582 -218056 -214205 286177 252850 -85807
9843 -85807 73019 8563 -357985 -240177 -289538 -143535 -224594 -34361 -189 -44080 35896
9832C5896k46572J02325j38285K05232j56074L19707O9294n8068J9024k58150
9822a05671K29407j29673k9588L1655r3747J93707K25074j87673J9586j59464
9812f387k94779J14374j18426K78431Q10j74754R3495R3524k0951j56746P2862
9801a18547K57111o1770k78575O1691K20667o6099j08959N8234m7857N912j00585
9790a78777j98586J90964o9711J42291P0478m8339J88862l00830q1591J52600
9780a32639L27495k63291l08880K64715p2472J10365L0289j0062k7709j01111
9770a83300k16205k4883K44526p2361K02782j09602J93238j74317L04607j19980
9760D4505j63924o9187K42581O983p1402q1131M856j2001J56041J60411j85174
$$ plain form
9832 35896 -210676 -108351 -246636 -41404 -197478 122229 191523 133455 152479 -105671
9822 -105671 123736 -5937 -35525 -3870 -97617 96090 321164 133491 153077 -6387
9812 -6387 -301166 -186792 -305218 -26787 -25977 -200731 -107236 -13712 -34663 -191409 -118547
9801 -118547 138564 76794 -201781 -140090 80577 14478 -94481 -36247 -84104 -78192 -178777
9790 -178777 -377363 -186399 -256110 -113819 -43341 -91680 97182 -203648 -285239 -132639
9780 -132639 194856 -68435 -377315 -112600 -185072 -74707 -44418 -54480 -82189 -183300
9770 -183300 -399505 -424388 -179862 -252223 -49441 -159043 34195 -140122 164485 44505
9760 44505 -119419 -188606 53975 60958 -10444 -91575 -86719 -98720 57321 217732 32558
9749C2558l89724j93577K44626J87824Q0956O7456J3744k34401j88475N06732
9739A27719o2174J82494M918o5747k87723m6209K27540m4774K16722m31988k17811
9728c97033K48476M05921j82900J37707k93209L7589m382M5862O2970J24582m40444
9717b54861P6116n0911J05650J76589j9674J28408L3807k32510O8530l01422L3022
9706b37256J51124O4992M7360k34583L38676p4233l0697J75274K76987j76799
9696C00845k30632k75681J42081J07935k42349K30804k60619J87417J00539J35497
9686A95837M8273m56166K23300K8301o3999J76332R2978K1733j68831p2220K57720
9675B83258J41194l43275j26575J65906l73565P9820k7552K3863k4592o2590K79124
$$ plain form
9749 32558 -357166 -550743 -306117 -118293 -37337 30119 43863 -190538 -379013 127719
9739 127719 65545 248039 252957 187210 -100513 -146722 80818 36044 252766 -179222 -397033
9728 -397033 -148557 257364 74464 212171 -81038 -43449 -47831 -1969 61001 185583 -254861
9717 -254861 -178745 -229656 -124006 52583 32909 161317 195124 -37386 31144 -270278 -237256
9706 -237256 -86132 -21140 26220 -208363 130313 56080 25383 200657 477644 300845
9696 300845 70213 -205468 -63387 44548 -197801 33003 -227616 -40199 60340 195837
9686 195837 244110 -212056 11244 39545 -24454 151878 244856 266589 97758 25538 283258
9675 283258 424452 81177 -45398 120508 -253057 -173237 -200789 -176926 -201518 -264108 15016
9664A5016K50197r6163j83686q3251J46980J07075O9348J4335N374k95094j13192
9653a63061M12529n7329O3093k39204j1111j23501n449O1864L04915j71169j15827
9642d4250J56390n16052J21326L1505R1196J08837j42411m5373J78087j50566
9632b11311j05801K18870p0550J94125k34490J97003J67450j7617M7236k05122
9622b0207N5889k95326p9278K22785J62740j07901J5350O7564l32336P4487J65461
9611g0772k000L5183K12974k68913o2435K01556j9069j10869l09922J21030K07815
9600f5422J06503j66928R3187j13694m3935P7650j39076p71L11733j09151Q3042
9589C3138j58313l36301N59698J69163j69764J05640L33450k50421l48582k20291
$$ plain form
9664 15016 265213 169050 -14636 -97887 49093 156168 225516 239851 245225 -49869 -163061
9653 -163061 249468 192139 255232 16028 4917 -118584 -124033 -62169 242746 71577 -44250
9642 -44250 112140 -403912 -282586 -251081 -159885 -51048 -193459 -238832 -60745 -211311
9632 -211311 -317112 -98242 -168792 25333 -209157 -12154 155296 137679 184915 -20207
9622 -20207 35682 -259644 -338922 -116137 46603 -61298 -45948 21616 -310720 -236233 -70772
9611 -70772 -72772 -37589 175385 -93528 -155963 45593 26524 -84345 -394267 -273237 -65422
9600 -65422 41081 -125847 -32660 -146354 -190289 -112639 -251715 -252486 59247 -49904 33138
9589 33138 -125175 -461476 98222 267385 97621 203261 536711 286290 -62292 -282583
9579b82583R0242J39164m7997M14638q2849j1559O1657k67886j44499N9214K26352
9568A53894K26439k17063p8764J80818l23858j63523J61726j82496J73551O9319
9558D3J18910j8306n3709N0434k4684j20611r9337P0299j94157K32035J6954j04214
9546a26343K16750n2841p8164j13243J39842j71106J57233J14340j02688l6976
9536e3196k50857l4686J01800K07138l55547j0131J70120O3285k23070j21244
9526e06388K31485j59988L53906J07872J4069k799q2325k0983J02630J19286L0108
9515A86873q9618j83106J09778j63533k9552p5647K52164m6329N4746R0700J36395
9504B42871m5394n93967J56704K13993l03293Q7042Q8552L46404K8755p6006O1964
$$ plain form
9579 -282583 -192341 -53177 -101174 313464 230615 219056 280713 12827 -131672 -72458 153894
9568 153894 380333 163270 84506 265324 -58534 -222057 -60331 -242827 -69276 43
9558 43 118953 100647 46938 97372 72688 -47923 -147260 -76961 -271118 -39083 -22129 -126343
9546 -126343 90407 37566 -40598 -153841 -13999 -185105 -27872 86468 -16220 -53196
9536 -53196 -304053 -338739 -236939 -29801 -385348 -395479 -225359 -162074 -385144 -506388
9526 -506388 -274903 -434891 -80985 26887 40956 38157 -44168 -65151 37479 156765 186873
9515 186873 97255 -85851 23927 -139606 -169158 -244805 7359 -38970 15776 106476 242871
9504 242871 197477 -396490 -239786 -25793 -329086 -242044 -153492 192912 221667 145661 207625
9493B07625L41434K4398j6829k36520o0866l5140k45696J41531k40594L4045k86988
9482c73600J57291j21467J04085N56072k38086k67139j4659K42083J67443m4467
9472A67556j44479r1320o7435J72409K55088m04216j57758J47913M60l38489L33808
9461a26463m2214j12255R40j81057J13537O9368J98046n5231l9038J59096m59016
9450d74287K67426P7933J71976o0568j91905K4071q6509n3223K07671o9511L7000
9439a49926K31488P1014k89570j27327J70434m09480L17928K6951O486n391J32310
9428b5083K54066m34778l44391M7741J43006J35838K62474J2919m95069K15408
9418b27869r3101L28496j04784k30956j65760L02823Q243j13522M433j518j19016
$$ plain form
9493 207625 549059 573457 556628 320108 259242 224102 -21594 119937 -120657 -86612 -373600
9482 -373600 -216309 -337776 -233691 322381 84295 -182844 -197503 44580 212023 167556
9472 167556 23077 -68243 -135678 36731 291819 -112397 -270155 -122242 -121782 -460271 -126463
9461 -126463 -168677 -280932 -279992 -461049 -347512 -278144 -80098 -135329 -174367 -15271 -474287
9450 -474287 -206861 -128928 43048 -17520 -209425 -185354 -271863 -325086 -117415 -186926 -149926
9439 -149926 81562 152576 -136994 -264321 -93887 -503367 -185439 -158488 -152002 -157393 -25083
9428 -25083 228983 -205795 -550186 -502445 -359439 -223601 38873 51792 -443277 -227869
9418 -227869 -320970 7526 -97258 -328214 -493974 -191151 -182908 -296430 -291997 -293515 -412531
9407d12531L35625M52125n00412o60k08854J33101L16253O559k88887O2493K91083
9396A85895k08697N388m60890M15021L635J89558J28983j35304M3818k19600R947
9385d2246r5982j29052K42036O4337k42768J47343J81548J29282k04487l47516
9375b97505m3571L67389n6211m1142R2767J57459Q6459j9250j50332N0413k74467
9364a27991j4513M71973l41594n4333l15218K38629r3360J01661K22413L99263
9354D86930j93635k17840R9699j57602M2551l34167l2920K0901M78680j74223
9344A8374L1069n7733O3571m6783k58512O6192J76762o8503J86638k82187j17942
9333b89054j9102J14813L9004n2407J27372P0797j32805j85171J20550k10001
$$ plain form
9407 -412531 -76906 375219 -125193 -125853 -334707 -201606 114647 121206 -167681 -105188 185895
9396 185895 -22802 -17414 -478304 -63283 -59648 129910 258893 123589 167407 -52193 -42246
9385 -42246 -138228 -267280 -25244 39093 -203675 -56332 125216 254498 50011 -297505
9375 -297505 -341076 26313 -29898 -71040 21727 179186 265645 246395 96063 146476 -127991
9364 -127991 -142504 329469 -12125 -66458 -381676 -143047 -236407 -134746 87667 486930
9354 486930 293295 75455 175154 17552 60103 -274064 -306984 -286083 192597 18374
9344 18374 49443 -8290 55281 8498 -250014 -183822 -7060 -75563 111075 -171112 -289054
9333 -289054 -308156 -193343 -154339 -206746 -79374 -8577 -141382 -326553 -206003 -416004
9323d16004J74142M8776M2966q0782L61509j05544L6092J44376k41202K05428
9313A69757l8153J42534k59734O3625O7919k83466L23257q562P672j19148p2764
9302g063O3230L0468l9123J77853k5160m68649J93480R324J0660j2671P9138j73426
9290a61939R9398J38165K14085j94740k31293K0639P0222k41790L4534K58462
9280E743L5270j23243K64941P6190k52467O0193J8351p0873M2418r185L13234
9269C60572j46122O9743m22876J12892k5075o1680J28478M6942K46565k71455
9259C7984q3416n1214P7864J63624n8874l43307J01469L6977L2165j37373J60144
9248f3957L00467k53338Q2066P2868k34646J44447K4931l9780j2438P9170K11494
$$ plain form
9323 -416004 -241862 -193086 -150120 -230902 130607 25063 61155 205531 -35671 169757
9313 169757 131604 274138 14404 78029 145948 -137518 185739 177177 184849 65701 -7063
9302 -7063 56167 86635 47512 225365 200205 -268444 -74964 -65640 -54980 -67651 11487 -161939
9290 -161939 -62541 75624 289709 94969 -136324 -115685 -45463 -287253 -252719 5743
9280 5743 41013 -82230 182711 258901 6434 66627 84978 14105 56523 47338 360572
9269 360572 214450 284193 -138683 -25791 -50866 -112546 15932 62874 309439 37984
9259 37984 -45432 -96646 -18782 144842 85968 -257339 -155870 -118893 -86728 -224101 -63957
9248 -63957 236510 -16828 65238 138106 -96540 47907 72838 33058 20620 99790 311284
9237C11284j52142o6174J70204k49391O9513n7684j2003L1323Q2175P9493l20200
9226a13602k57974L29139L23665m44455J00357k58567j19998J28026M08240k34514
9216a39683J14049R3060q9651R994j35975j26639L6488J39772J38857J08957k6423
9205A22806l8096l79033K13879N9748l37372J5737M05027k54896k08827J55729
9195b45298M15490k57294K4350p7596K28708l0505J18191j94427j12015q8681
9185b19077J92738j03137j46424L37131Q0862n37428J85585J68551J52156l20801
9175b09844j17939L41471L23646j76756Q8122j57037J69389j53001l9236K49421
9165C18236O5939j49651m2449k03210l11175J36787N7767K13775L0576j05444
$$ plain form
9237 311284 159142 92968 263172 13781 83294 25610 13607 44930 127105 206598 -113602
9226 -113602 -371576 -42437 281228 -163227 -62870 -321437 -441435 -313409 94831 -139683
9216 -139683 -25634 67426 -22225 -12231 -148206 -274845 -238357 -98585 40272 149229 122806
9205 122806 84710 -294323 -80444 -20696 -358068 -342331 62696 -192200 -401027 -245298
9195 -245298 170192 -87102 -62752 -140348 88360 57855 176046 -18381 -130396 -219077
9185 -219077 -26339 -129476 -275900 61231 142093 -395335 -209750 -41199 110957 -209844
9175 -209844 -327783 13688 337334 160578 248700 91663 261052 108051 68815 318236
9165 318236 384175 234524 192075 -11135 -322310 -185523 -127756 86019 116595 11151
9155A1151m08761J89855K33322J18661K53820p3077k29630j85253k7463p0929
9145a88304N0926P1168l5618o9559L8178L66836k06283j74919j9082j7062j00405
9134b84124J69454k87r0990L12889j50994J31514J79715j53184l24981l2763K42262
9123a489k26404J31826k15756K96250J71405k11232p3520K2334k25145M08142
9113G6411k25295K31863j9010J42701K9458P868j85795j74112J30651K36899j02945
9102A48694j16316R3206j54492J78906K8907P5510r4290P4822K32527j90197l47019
9091f9742r8129P8739M242K5095L1482j9963K0351j77231o9953J87908N128K28089
9079A46016k2720N983J24k30893L32456k04910M8502J38657o0165k75981K34369
$$ plain form
9155 11151 -397610 -207755 25567 144228 398048 324971 95341 -89912 -117375 -188304
9145 -188304 -137378 -66210 -101828 -171387 -133209 233627 27344 -147575 -166657 -183719 -284124
9134 -284124 -114670 -114957 -205947 106942 -44052 87462 267177 113993 -210988 -243751 -1489
9123 -1489 -227893 -96067 -311823 -15573 155832 -55400 -128920 -106586 -331731 76411
9113 76411 -148884 82979 63969 206670 236128 243996 58201 -115911 14740 251639 148694
9102 148694 32378 125584 -28908 149998 178905 254415 160125 234947 467474 277277 -69742
9091 -69742 -167871 -89132 -84890 -59795 -28313 -48276 -27925 -205156 -275109 -87201 -82073 146016
9079 146016 123296 129279 129403 -101490 230966 26056 74558 213215 153050 -122931 111438
9068A11438p7794k10950j9283K24670j06525J67300J28707m81538M66384K093
9058B04502j85742N2552n0800K259J75652m64699L14377q5030j90071K04892o3284
9047h5392m352q2185J3134J34640k5361J61602o2656J06097k49502k6444K78439
9036A58020N1799K8282j19353k89449K06094m700l9815M1075P4368q1404o0556
9025c5639n0456M1506M28136k04972K07388l13832j36780j13296M3370N3727o3003
9014a43851q3381J59626L96l20052J79553Q9947N0760K81487k89864J81255K7571
9003A33447j72036L31185k44047j73666Q6992j01391K9479j61762k9035J50961
8993a49873q2371j4881L01219N331J75909M8296j32238p3818l10698K69967J14539
$$ plain form
9068 111438 33644 -177306 -196589 28081 -78444 88856 217563 -263975 202409 204502
9058 204502 18760 71312 20512 22771 198423 -266276 48101 -36929 -227000 -22108 -85392
9047 -85392 -89744 -171929 -158795 -24155 -49516 112086 49430 155527 -93975 -120419 158020
9036 158020 209819 238101 118748 -170701 35393 30693 -9122 31953 106321 24917 -35639
9025 -35639 -86095 -44589 383547 178575 385963 72131 -64649 -177945 -134575 -80848 -143851
9014 -143851 -227232 -67606 -67210 -387262 -207709 -117762 -67002 214485 -75379 105876 133447
9003 133447 -38589 292596 48549 -125117 -38125 -139516 -110037 -271799 -300834 -149873
8993 -149873 -232244 -247125 54094 59425 235334 283630 151392 77574 -233124 36843 151382
8982A51382K5427k57420j66146J17841J51677j42013L04402Q6914j48730K24681
8972C48015k77804j42891N1937Q744o5190M5481j88k43241K55028K59107k52595
8961a3597P691J98400K872j90303J05187K37281k08943m54048K56351j19729J07004
8950g1834J54023r4922j007j5366k8553N5122J2014O3680l69955j49454J68471
8939b77781J23768J57742J02971m1249q3433J69514K35796l74851k69283k1457
8929b78263K04472K919l5837J2420r8149J61319k903j23416M4719J32230J30400
8918A49911j96013l7276K34535M0769l00138p1159J38854O1165l01280Q1750J95479
8907c403L0493o8139K69536j25951k36621j44909J99131J27279m6348k44424N0785
$$ plain form
8982 151382 176809 -80611 -246757 -128916 22761 -119252 185150 272064 123334 348015
8972 348015 70211 -72680 -20743 -11999 -77189 -31708 -31896 -275137 -20109 238998 -13597
8961 -13597 -5906 192494 195366 5063 110250 347531 138588 -315460 -59109 -178838 -71834
8950 -71834 82189 -12733 -13740 -29106 -57659 -2537 9477 73157 -296798 -446252 -277781
8939 -277781 -154013 3729 106700 65451 -17982 151532 387328 12477 -256806 -278263
8929 -278263 -73791 -70872 -106709 -94289 -192438 -31119 -34022 -157438 -112719 19511 149911
8918 149911 -46102 -83378 151157 191926 -108212 -179371 -40517 20648 -280632 -198882 -3403
8907 -3403 27090 -41049 228487 102536 -134085 -278994 -79863 47416 1068 -243356 -192571
8896a92571M25620k46334J55219p2012r8780J35373k22727o2026J09519M1630
8886b7089k3143k00239K73379J14217p0163p5247j05254j514J37927l96926j70805
8875e44857K12331J71090l07927J07012J8668n1408J54568P7846J23064L7565
8865b048O1452J41235k42872J10567Q4733J30829j30224j17685j60863J69992
8855D5116J9817J21373O0399k07954k47947R5833J80027o0920r3441p0461J55673
8844b485M5440j19077N4481j6705K08949J79440j58704r8708R546K5482o4173
8833F3486m44336L72432j40518j07903J42700j51057P07277j94578j36739o1037
8823D9727J10721r3520q2880K51249j71192l9024R8255R4262J26308k01180j64413
$$ plain form
8896 -192571 233049 -13285 141934 69922 -28858 106515 -116212 -178238 -68719 -27089
8886 -27089 -50232 -250471 22908 137125 66962 -8285 -113539 -115053 22874 -374052 -544857
8875 -544857 -332526 -161436 -469363 -362351 -343683 -395091 -240523 -162677 -39613 -2048
8865 -2048 59404 200639 -42233 68334 153067 283896 153672 35987 -124876 45116
8855 45116 64933 186306 246705 38751 -209196 -113363 66664 5744 -87697 -158158 -2485
8844 -2485 42955 -76122 -21641 -38346 170603 350043 191339 92631 102177 127659 63486
8833 63486 -380850 -8418 -148936 -256839 -114139 -265196 442081 247503 110764 49727
8823 49727 160448 66928 -15952 235297 64105 25081 123336 217598 343906 142726 -21687
8812b1687J40500j18046m8649j90936J56158J45257j40650O71774k44883o40436
8802b91598K1053J46202K94190l5516q5300J69731n2949Q7564k52780J58226q1818
8791G7005K4237k53383l1879J58171R9505q2469j81188N4210J07248K99493J07233
8780C78183O8846j61258j92991j55048L77117l05935j50418Q1836K22829K50854
8770D14015K0557l75461J0643K10128k75432j87348J88787L17845k86325j15969
8760g8560M3579J51020O4416r2162r9571l4813L7097j92193J55605L63817j30404
8749A87831K3642j21076K60233L66916l44222r4501Q7923n10902j63712J88900
8739a18968J22583p3762N1964J86960j13311l25871K59382M3886K799O2238k88835
$$ plain form
8812 -21687 118813 767 -47882 -238818 -82660 62597 -78053 593721 348838 -291598
8802 -291598 -270545 -124343 169847 134331 49031 218762 165813 253377 597 158823 77005
8791 77005 101242 -152141 -184020 -25849 73656 -8813 -190001 -135791 -28543 270950 378183
8780 378183 447029 285771 92780 -62268 314849 8914 -141504 -59668 163161 414015
8770 414015 434572 59111 69754 279882 4450 -182898 5889 323734 37409 -78560
8760 -78560 -34981 116039 180455 88293 -11278 -46091 -8994 -201187 -45582 318235 187831
8749 187831 211473 90397 350630 717546 373324 278823 366746 -144156 -307868 -118968
8739 -118968 3615 -70147 -18183 168777 55466 -270405 -11023 32863 35662 97900 -190935
8728a90935L99879j95566k0712L8825J26278l6043j00641J25040K2364P7965k84607
8717c8153m7402K14779k23784J54406k8541K00955j84690j41032L73885L5841
8707C16264o9566l15408L99225l27738J29380J03561O6871J01196l26469m7516
8697B9800K7493k27865J11485M3068J03141m7785P9617J68290k13837K08597J33367
8686D15371k66751j75690K72407J68381j88904k99349L17728P3167k15290k10548
8676a09478L69870k09985K36266M346j33257K81013k75756Q897M6095M8936k21257
8665D5690l3742P9068l65580K20614K38431k09220K72479l1660j09212n1678k21740
8654a66550J135K84407L25080N2747l17717J9898K0118L1653R051K5808l01932
$$ plain form
8728 -190935 208944 13378 -7334 31491 157769 121726 21085 146125 168489 246454 -38153
8717 -38153 -85555 129224 -94560 59846 31305 232260 47570 -93462 280423 316264
8707 316264 246698 -68710 330515 2777 132157 235718 302589 403785 77316 29800
8697 29800 57293 -170572 -59087 -16019 87122 39337 118954 287244 73407 282004 415371
8686 415371 148620 -27070 245337 413718 224814 -74535 243193 316360 101070 -109478
8676 -109478 260392 50407 286673 291019 157762 438775 163019 171916 218011 266947 45690
8665 45690 11948 91016 -274564 -53950 184481 -24739 247740 216080 106868 55190 -166550
8654 -166550 -165415 118992 444072 496819 179102 199000 219118 250771 259822 285630 -16302
8643a6302L95559J36056l96460k95560J12047K50463j13825K94358j69790K04762
8633D01308L08848k83997l2720o3142l00030J57915K85911k65590r8321J09921
8623B20103M45872k35166l57507K09157j7910p5152J18075k4511j04319j71032
8613G610R1681J90846j07073l9579j4157K21572q6417k47308K3598L05866j45944
8602B00695L95279k83328j08658M0848K5978R2692k9418J7885l14037K49852o3424
8591B24364Q5560R972J54596j44701r0058n8690k64195N8410J33540M509J74222
8580B87529j28717J43880J45696J08633j85788r1149k66962j90908M31040o6478
8570A86776j8915J60060o4933J17854N2723j1773J09039R5528j73875l82784J87395
$$ plain form
8643 -16302 379257 515313 118853 -176707 -64660 185803 71978 366336 196546 401308
8633 401308 710156 426159 393439 330297 30267 188182 474093 208503 110182 220103
8623 220103 665975 430809 73302 282459 264549 189397 307472 282961 178642 7610
8613 7610 99291 290137 183064 143485 129328 350900 264483 17175 40773 346639 200695
8602 200695 595974 312646 203988 244836 270814 363506 334088 351973 37936 287788 224364
8591 224364 309924 319896 474492 329791 239733 181043 -83152 -24742 108798 113307 287529
8580 287529 158812 302692 448388 557021 371233 280084 13122 -177786 253254 186776
8570 186776 167861 327921 262988 380842 433565 421792 530831 626359 452484 69700 257095
8559B57095l6209J5195Q4266L19366l46092K67740j6747k1567l81788J8429K03596
8548C63284k75046J65647k18279J85521J70245J37611r1984k0965P4835j36774
8538C54095j91697L04244O3956j77229L03926j66474k17166J27292m0061j7553
8528C43333L27175l216k42233l26250k8120L57739j7543R3691Q982J29542j31590
8517E11510l48306L02495k47169M01237j24080m38944L92541j46667J74505m793
8507D72329Q24J41152j85508J32243p3506l0628j09941p5266k3999J30062N5513
8496D33275k63621K80407j32509M3486o2300p3219R5760k43514K12966K14104
8486E04835J17072k50033q8450l78990N65801N55931k64137p5484K12173k02981
$$ plain form
8559 257095 220886 236081 320347 639713 293621 561361 544614 523047 141259 159688 363284
8548 363284 88238 253885 35606 221127 391372 528983 436999 416034 490869 354095
8538 354095 162398 466642 530598 353369 657295 490821 273655 400947 360886 343333
8528 343333 670508 667292 425059 98809 70689 428428 410885 504576 513558 643100 511510
8517 511510 163204 465699 218530 619767 495687 56743 449284 302617 477122 472329
8507 472329 473153 614305 428797 561040 487534 456906 346965 271699 247700 377762 433275
8496 433275 169654 450061 317552 361038 298738 225519 321279 77765 290731 504835
8486 504835 621907 371874 283424 -95566 470235 1026166 762029 686545 898718 695737
8476F95737r0698J03864Q7421M503k96969P2635l8189k14829K87410j73143j13840
8465C23902K07830J00148K4608l35443K67650j44819j96482K20741J76814r150
8455F35799J60288j04639k87869P6626J91831L956j19124p3080p7271l4336n6818
8444C15363k9067O81201r040j05533Q2200k56798M4461q4657J63828J72169j08633
8433H65494j68200j19224K35827j31855J13476N0146J9336j88113R3208K95436
8423A065531K34244k09101N9298K3140K100L6497R0894o593K61697P2936m77438
8412A153205J51466K17125K2232L3677j76282J42817k18528m54308j04215N96187
8402A363376j95294K13626J75674j53983J75899K05874k54146M5578J52831k34501
$$ plain form
8476 695737 605039 708903 796324 800827 503858 576493 538304 323475 610885 437742 323902
8465 323902 531732 631880 656488 321045 588695 443876 247394 468135 644949 635799
8455 635799 796087 691448 403579 480205 672036 675992 556868 483788 406517 372181 315363
8444 315363 286296 967497 958457 852924 935124 678326 722787 638130 801958 974127 865494
8433 865494 697294 578070 813897 682042 795518 845664 865000 676887 770095 1065531
8423 1065531 1299775 1090674 1149972 1173112 1175212 1211709 1302603 1296010 1557707 1630643 1153205
8412 1153205 1304671 1521796 1544028 1577705 1401423 1544240 1325712 871404 767189 1363376
8402 1363376 1168082 1381708 1557382 1403399 1579298 1785172 1531026 1576604 1729435 1494934
8392A494934J48484J02173j26864L24826J30333o3362K85033J81347l60729J72129
8382B288304K30524p5797j13971k6497N3166j55570J43233l88032j8083l73614
8372A563663J20646L60990J23100k07113K09454O9055M5257k18026L02988O5079
8362B435093R3947k5423K44469k22686L05152J69905k74587L515O3448k15692
8352B577141M65512k83621m83411M73233K13908p0561q8107J42802k33775J55445
8342B868566l12909K02818N9832n2685L04745J32357O2069k57836k71319q2976
8332B652662k19415J76987K04811N4504K53564j53789k126k61850p8827K10508
8322B837029q7990o7471k79402J23452K20204l20046P6012j14337q4500L2197
$$ plain form
8392 1494934 1643418 1745591 1618727 1943553 2073886 2010524 2295557 2476904 2116175 2288304
8382 2288304 2518828 2443031 2329060 2302563 2355729 2200159 2343392 1955360 1937277 1563663
8372 1563663 1684309 2045299 2168399 1961286 2170740 2239795 2285052 2067026 2370014 2435093
8362 2435093 2529040 2503617 2748086 2525400 2830552 3000457 2725870 2729385 2792833 2577141
8352 2577141 3042653 2759032 2275621 2748854 2962762 2892201 2804094 2946896 2713121 2868566
8342 2868566 2555657 2758475 2818307 2765622 3070367 3202724 3264793 3006957 2735638 2652662
8332 2652662 2433247 2610234 2815045 2869549 3123113 2969324 2967198 2705348 2626521 2837029
8322 2837029 2749039 2681568 2402166 2525618 2745822 2425776 2501788 2387451 2302951 2335148
8312B335148R2248J66040j44641J20315N1592k35178k14197j5864q7147L17311
8302B385627J28805q8590m2728j30888J65800l7988J6221m4946O819Q2156J02137
8291B542425m6376o2550R2070J3239J92794k28935O8363j14108J17816R9251J74076
8280B848065l0991j29584L16320m9139p6352j15993K36346K46993J58328j09855
8270C294138j24708K71744j57730R356K6589j03334J41881R9705J47767j03331
8260C502077J6588Q2774q4123L32075K94000J32933j88179j15494J28761Q3949
8250D185361L24268n52093J6669L19703o7435K67372K61092k8254j13232K83365
8240D896816K9209M6662K52534J21932J31560n7106N2155K17105k7650K26714
$$ plain form
8312 2335148 2427396 2593436 2448795 2569110 2620702 2385524 2171327 2155463 2068316 2385627
8302 2385627 2514432 2425842 2383114 2252226 2418026 2380038 2396259 2351313 2358132 2440288 2542425
8291 2542425 2496049 2433499 2525569 2538808 2731602 2502667 2571030 2456922 2574738 2673989 2848065
8280 2848065 2817074 2687490 3003810 2954671 2878319 2762326 2998672 3245665 3403993 3294138
8270 3294138 3169430 3441174 3283444 3292800 3319389 3216055 3357936 3457641 3605408 3502077
8260 3502077 3518665 3601439 3517316 3849391 4143391 4276324 4088145 3972651 4101412 4185361
8250 4185361 4509629 3957536 3974205 4293908 4226473 4493845 4754937 4726683 4613451 4896816
8240 4896816 4926025 4972687 5225221 5347153 5478713 5421607 5473762 5690867 5663217 5889931
8230E889931p9270N0379K75806r4298N48986l10885r7521K13664k58249M37132
8220F575675j2614J09900K94391j35537J2933J86486J24683j25485L47466K9728
8210G407626j66481N95985Q531m2601L90265L75924k35722J28961l4561L94965
8200H822892J38316N24427J8449l8211M7707N18693K26833Q09778R70344j636244
8190A0402984K38481M62809J87813M96485L63155J97806O84256M23594L57220
8181A3814603K51094L90358O06957K42331Q40558M20374N85955N95155P28748
8172A8476133P28830P21177Q09558O35424P87367R41461J173076J261815J003231
8163B6538072J399159J593833J829362J677962K211996K026971K228795K446524
$$ plain form
8230 5889931 5810661 5861040 6136846 6042548 6591534 6280649 6183128 6396792 6138543 6575675
8220 6575675 6563061 6672961 6967352 6831815 6844748 7031234 7155917 7030432 7377898 7407626
8210 7407626 7241145 7837130 7845661 7803060 8193325 8569249 8333527 8462488 8427927 8822892
8200 8822892 8961208 9485635 9504084 9465873 9513580 10032273 10259106 11068884 12039228 10402984
8190 10402984 10641465 11104274 11292087 11788572 12151727 12349533 13033789 13457383 13814603
8181 13814603 14065697 14456055 15063012 15305343 16145901 16566275 17152230 17747385 18476133
8172 18476133 19204963 19926140 20735698 21371122 22158489 23099950 24273026 25534841 26538072
8163 26538072 27937231 29531064 31360426 33038388 35250384 37277355 39506150 41952674
8155D1952674K612379K840603K451270K523646K148292K162023K424827K710028
8147F1825742K821974L614493L349376K834757K463138J804205J483327J521005
8139H1718017J663177K655984L238176L482175L955732M258039L826880L609588
8131A08407768L937487M417852N305493O677949P730014Q631586Q604631Q126792
8123A61839572Q065365Q555337R018220R547387J0377538Q502426N650694K511229
8115B24067768n10661j863091j745999L57995K977337N490275P727307J0978336
8107B47479267J3887723J7022323K1288515K4992223K7828101K7562122K4210463
8100D04270737J7213429P842686q61638o156137p590111m406350K254304Q719415
$$ plain form
8155 41952674 44565053 47405656 49856926 52380572 54528864 56690887 59115714 61825742
8147 61825742 64647716 68262209 71611585 74446342 76909480 78713685 80197012 81718017
8139 81718017 83381194 86037178 89275354 92757529 96713261 100971300 104798180 108407768
8131 108407768 112345255 116763107 122068600 128746549 136476563 145108149 153712780 161839572
8123 161839572 169904937 178460274 187478494 197025881 207403419 215905845 221556539 224067768
8115 224067768 223557107 221694016 219948017 220306012 223283349 228773624 236500931 247479267
8107 247479267 261366990 278389313 299677828 324670051 352498152 380060274 404270737
8100 404270737 421484166 429326852 428465214 422309077 414718966 410312616 412566920 421286335
8092D21286335J4205498J6317982J6135049J5060502J2326336Q901991L976899
8085E08210592k355580r178926j6022573k2189205k7056459k8204390k7613826
8078C75589633k5291915k1741804j7397828j3388760j0049685p188200o759569
8071B73771872o613928p410388p329244p591793p163481n761142l751324k189697
8063B25960875p65826r16337k356018m954052q193590r821611j0911814j0664336
8055A77377291j0301035r488264r044033q338972p928055o729789o094795m776141
8047A14676207m137884l848630m183066m351988m213659l808436m159757m196734
8039H1776053l639780l923640l350573l248160l129806k857871k557140k849726
$$ plain form
8092 421286335 435491833 451809815 467944864 483005366 495331702 504233693 508210592
8085 508210592 505855012 496676086 480653513 458464308 431407849 403203459 375589633
8078 375589633 350297718 328555914 311158086 297769326 287719641 280531441 273771872
8071 273771872 267157944 259747556 252418312 244826519 237663038 231901896 228150572 225960875
8063 225960875 225195049 224278712 221922694 216968642 208775052 198953441 188041627 177377291
8055 177377291 167076256 157587992 148543959 140204987 132276932 125547143 119452348 114676207
8047 114676207 110538323 106689693 102506627 98154639 93940980 90132544 85972787 81776053
8039 81776053 78136273 74212633 70862060 67613900 64484094 61626223 59069083 56219357
8031E6219357k508102k092700j834831j927933j718448j503218j636788j391162
8023D1606175j206748j322866j376218j240391j124063j033467j262551j245893
8015C1793978j047614q63601p42904o63121j020785j132606o80198l94286r83424
8006B4265439q25306l26360r68339q78092m67705m48060q04415j76189n47596
7997A8823377k44957n89874o13883n97563m98460l41856l96266m98017q08057
7988A4234444k69772r1892o25729n4523n06907k37900p5864n92736j99007m05014
7978A1175100l70871k66484r0325o04993j84171M4950j81257l4603k89947m10872
7968H786527j58174j79941k18970m80962k29757q0684K08823r2153l46279k45115
$$ plain form
8031 56219357 53711255 51618555 49783724 47855791 46137343 44634125 42997337 41606175
8023 41606175 40399427 39076561 37700343 36459952 35335889 34302422 33039871 31793978
8015 31793978 30746364 29882763 29139859 28476738 27455953 26323347 25643149 25248863 24265439
8006 24265439 23440133 23113773 22145434 21267342 20799637 20351577 19547162 19370973 18823377
7997 18823377 18578420 17988546 17374663 16777100 16278640 15936784 15540518 15042501 14234444
7988 14234444 13964672 13872780 13247051 13192528 12685621 12447721 12371857 11779121 11580114 11175100
7978 11175100 10804229 10537745 10447420 9842427 9658256 9703206 9521949 9487346 9197399 8786527
7968 8786527 8628353 8448412 8229442 7748480 7518723 7438039 7646862 7554709 7208430 6963315
7958F963315j35701j39273l15930M7441J8421l98275j67818m5117j05697L86480
7948F107846j04033m88692L10818J70744l75528k06906l8727l7141k1095j82753
7938E134533j68644Q9879L9484k93151K76020k07759k99881J10574j50520n0945
7928D479590M9411k76201n2281j94365J10802P5507J18611J35921l51529l6522
7918D058944K49146o4062r7640n8476l8057j56962l62540m0933K28770M37934
7908D156124q0765P2989M548J55662l58509Q6570p06207L59304N48827n77888
7898C660655R6298O8988K32284J41924l41687k62806J74442r39O2604j9284j18621
7887C693858J24635N6174l1028J87395j94473J47477J02889L6991l7379J33757
$$ plain form
7958 6963315 6827614 6688341 6372411 6419852 6438273 6039998 5872180 5827063 5721366 6107846
7948 6107846 6003813 5515121 5825939 5996683 5621155 5414249 5375522 5338381 5317286 5134533
7938 5134533 4965889 5055768 5095252 4802101 5078121 4870362 4570481 4681055 4530535 4479590
7928 4479590 4529001 4252800 4200519 4006154 4116956 4192463 4311074 4446995 4095466 4058944
7918 4058944 4308090 4244028 4146388 4087912 4049855 3892893 3530353 3489420 3718190 4156124
7908 4156124 4075359 4148348 4152896 4308558 3950049 4036619 3330412 3689716 4238543 3660655
7898 3660655 3756953 3825941 4058225 4200149 3858462 3595656 3770098 3769159 3831763 3812479 3693858
7887 3693858 3818493 3874667 3843639 4031034 3836561 3984038 4086927 4123918 4086539 4220296
7877D220296K66272l57806q0196J58572r0154J47956l2381L24002k99084j44937
7867D112540L45941J19844p6356K3072r2743k44714K49681k3609J46853k3839
7857D536670P7927O926j22018K94403J3542j78176j43120J08909M08988K34750
7847E238801J55004Q0794J3064k25260J65287J76537l2247J57152N357j01381
7837E633108r2783L59706P2839k14656J14014j0152J51353J17456K34279j8735
7827F346429K01994K87690k6869J60538J88446J62627J64197J94352k10469M8230
7817G517165q9505O2207M10434M59884r4226L39261n0779J21455J1396l8785K51904
7806H900411L75238M971j08306Q11339K60641M6337K01704K90072N6783N08821
$$ plain form
7877 4220296 4486568 4128762 4048566 4207138 4116984 4264940 4232559 4556561 4257477 4112540
7867 4112540 4458481 4578325 4501969 4525041 4432298 4187584 4437265 4413656 4560509 4536670
7857 4536670 4614597 4621523 4499505 4793908 4807450 4629274 4486154 4595063 5004051 5238801
7847 5238801 5393805 5474599 5487663 5262403 5427690 5604227 5571980 5729132 5734489 5633108
7837 5633108 5540325 5900031 5972870 5758214 5872228 5862076 6013429 6130885 6365164 6346429
7827 6346429 6548423 6836113 6809244 6969782 7158228 7320855 7485052 7679404 7468935 7517165
7817 7517165 7427660 7489867 7900301 8360185 8265959 8605220 8554441 8675896 8687292 8648507 8900411
7806 8900411 9275649 9280620 9172314 9983653 10244294 10290631 10492335 10782407 10839190 11348011
7796A1348011K97207J76850L66298j1700O91665L55540J05799L81773K41708O22025
7786A4575176M24861L89040M76926L41392L31139O45234O97934Q76852J079831
7777A9838385O06542M56819Q69680P29442P54462J001346J081160J131613J011882
7768B7481331J340007J160003J424015J297273J447952J475648J634603J857083
7760C9117915J815257K031523K067371K043770J967114K401184J771089K198753
7752E5413976K155610K045507J748030J903223J629287R32467Q15025J180329
7744F7823454J73915J61577J55593o063m22324j46879k64201l87497l92954k03657
7734F6490964n3166K14613J41553J57387R8511N76862M17949N51072K98241L60499
$$ plain form
7796 11348011 11645218 11822068 12188366 12176666 12868331 13223871 13329670 13711443 13953151 14575176
7786 14575176 15000037 15389077 15866003 16207395 16538534 17183768 17881702 18758554 19838385
7777 19838385 20444927 20901746 21771426 22500868 23255330 24256676 25337836 26469449 27481331
7768 27481331 28821338 29981341 31405356 32702629 34150581 35626229 37260832 39117915
7760 39117915 40933172 42964695 45032066 47075836 49042950 51444134 53215223 55413976
7752 55413976 57569586 59615093 61363123 63266346 64895633 65828100 66643125 67823454
7744 67823454 67997369 68158946 68314539 68308476 67886152 67739273 67475072 67087575 66694621 66490964
7734 66490964 66437798 66652411 66793964 66951351 67049862 67626724 68044673 68595745 68893986 69254485
7724F9254485O61999K42260k93470j63105o55943q45490q15054j549219j562748
7715F4273715j561275k095085k116436k012962k527149j824494j998757k062391
7707D8075166k212314j823714j996104j622293j747560j515757j718882j299787
7699C4138755j603771j248514j104313j114507j341740j088212q95711j109389
7691B4632598p12586n80229j089517p52615r94205n73452n75534o65250n85090
7682A8104120q07531o04205m07712j08257n03544o62725j44393m68119m97258
7673A3900376n76736k66313n86804l38613j14317n14930l92571j54250k82222
7664A0673620m40950k80678k46011k92326l85109N6278r4046j97230m80723k46028
$$ plain form
7724 69254485 69916484 70158744 69865274 69702169 69046226 68200736 67385682 65836463 64273715
7715 64273715 62712440 60617355 58500919 56487957 53960808 52136314 50137557 48075166
7707 48075166 45862852 44039138 42043034 40420741 38673181 37157424 35438542 34138755
7699 34138755 32534984 31286470 30182157 29067650 27725910 26637698 25741987 24632598
7691 24632598 23920012 23339783 22250266 21497651 20503446 19929994 19354460 18689210 18104120
7682 18104120 17296589 16692384 16284672 16176415 15672871 15010146 14865753 14397634 13900376
7673 13900376 13323640 13057327 12470523 12131910 12017593 11502663 11110092 10955842 10673620
7664 10673620 10232670 9951992 9705981 9413655 9028546 9084824 8990778 8793548 8312825 8066797
7654H066797r7187l14513k19819j00692K23087j20569m56244l33398k40206l52017
7644F055239k57541l6032o5901n2969p706l85804k36916o8546K41000j32200j62292
7633D890332J2480j13558k72463k33762k62874j591M6085K49365l98497m63122
7623C452395L03721M6396j02895j04732q7733L2531l09883j31787J49182l11900
7613B935295L19719k82310l29565J46870J44710l83491N4894k60458k7232K20486
7603B538918j88540k3143J16523k87978Q6141J07728k18757j08115K39641J98473
7593B460891k04189j45387J76091K03009j54528m14717J64105n2357l86330L21297
7583A967885L17098n25345j13281J96563J6593n5443j7069k2632q0865J55425
$$ plain form
7654 8066797 7969610 7655097 7435278 7334586 7557673 7437104 6980860 6647462 6407256 6055239
7644 6055239 5797698 5761666 5695765 5642796 5635090 5249286 5012370 4943824 5184824 5052624 4890332
7633 4890332 4902812 4789254 4516791 4283029 4020155 4018564 4064649 4314014 3915517 3452395
7623 3452395 3756116 3802512 3699617 3594885 3507152 3539683 3229800 3098013 3247195 2935295
7613 2935295 3255014 2972704 2643139 2790009 2934719 2551228 2606122 2345664 2318432 2538918
7603 2538918 2350378 2327235 2443758 2155780 2241921 2349649 2130892 2022777 2262418 2460891
7593 2460891 2256702 2111315 2287406 2490415 2335887 1921170 2085275 2032918 1646588 1967885
7583 1967885 2284983 1759638 1646357 1842920 1859513 1804070 1787001 1764369 1683504 1838929
7573A838929m427m31589J42013j0888J34555j11824K85292K19954n28535j78590
7563A354890K86698k66565p9222O1362j2469L2106k03414O7563k1732p4450J10108
7552A254875k27063L8131O2651L38700k42436k70186J9701j70025K36110K16105
7542A256563j75785l30425k63026L38701J56955J1418K20978J81908m62382P0295
7532A005200q1647n06348j6438o1491M69915j74933J58027m13441j18537l749
7522B56558K7034K61736J10389l2326N2438k31218K49392p2328j59721Q709Q3733
7511E54396L4695j97349K22019j53507J45150Q1334m7566P5633j19615K52441
7501H47631k18336K82454q2486j85399k10375j21176N7778j84619J17250k29150
$$ plain form
7573 1838929 1834502 1402913 1544926 1534038 1668593 1556769 1842061 2062015 1533480 1354890
7563 1354890 1641588 1375023 1295801 1357163 1344694 1376800 1173386 1240949 1219217 1144767 1254875
7552 1254875 1027812 1065943 1128594 1467294 1224858 954672 974373 804348 1040458 1256563
7542 1256563 1080778 750353 487327 826028 982983 994401 1215379 1397287 934905 1005200
7532 1005200 923553 417205 400767 339276 809191 634258 792285 378844 260307 256558
7522 256558 283592 545328 655717 623391 675829 444611 694003 621675 461954 470663 554396
7511 554396 589091 391742 613761 460254 605404 686738 639172 714805 595190 847631
7501 847631 629295 911749 829263 643864 433489 312313 370091 185472 302722 73572
7491G3572J59938O1401m0602j01226p5755M6368n0725j3479O7640j15790L20212
7480C31554L38929j65374K16620l27858k41241p5409j61820K04010J06636k79399
7470e3352R8821J20694J50352l69911J59701J3152L75968M2863k92573k73312
7460b7597J81876K96191p2082J11649k06710j98586n3673n3950l8928J21676k22845
7449a62979j71255L54281P2652j78692L35248o0698j49829k31304J88130L66001
7439C61555j7719j10945p2323M9216Q6908j5809J38676k58938R5214J26811j50837
7428B31809r8598R4612j83902L9292l9006l04228K09912J2862J86238n2381R1100
7417A87710K10759l10637J87989k11079J1743n7453K10263o1354k14415L16216
$$ plain form
7491 73572 233510 294911 254309 153083 77328 123696 72971 59492 127132 11342 331554
7480 331554 670483 505109 721729 393871 152630 77221 -84599 119411 226047 -53352
7470 -53352 45469 166163 316515 -53396 106305 119457 495425 538288 245715 -27597
7460 -27597 154279 450470 378388 490037 283327 84741 31068 -22882 -61810 59866 -162979
7449 -162979 -334234 20047 92699 -85993 249255 188557 38728 -192576 -4446 361555
7439 361555 343836 232891 160568 209784 296692 280883 419559 160621 255835 382646 231809
7428 231809 133211 227823 43921 83213 44207 -260021 -50109 -37247 148991 96610 187710
7417 187710 398469 87832 275821 64742 76485 19032 229295 167941 -46474 269742
7407B69742j18422l05740k4903J47202j56261K6405J10523J16624j81265J07323
7397h772p0802J64167o8721K24349K4235j48705n2419j29284n701R9134k3103
7386D378J2375K32271j69475K75140m2024k63156Q299m853p6643L29266j19754
7375A85824j1784M2174J03981r3547k09233R8838q8349L37897j70167Q378l0267
7364A73745J95563k5511l02584L4408J4053J84115r0256M6022Q4224R7576k04520
7353B06835K24766o106Q661J03336j29271k6730k82464K78368o4354n1305k4557
7342B37179l2553p1212O9058M51317k76825Q0264J12802r4643j50877J6963j81272
7331A60201j94078L64133M2267j49059K56827K87500k06775k20697J72359O2513
$$ plain form
7407 269742 151320 -154420 -179323 -32121 -188382 -161977 -51454 65170 -116095 -8772
7397 -8772 -79574 84593 15872 240221 264456 115751 63332 -65952 -71653 27481 4378
7386 4378 16753 249024 79549 354689 312665 49509 57808 52955 -23688 305578 185824
7375 185824 174040 216214 320195 226648 17415 116253 27904 365801 195634 204012 173745
7364 173745 369308 343797 41213 75621 89674 273789 183533 229555 313779 411355 206835
7353 206835 431601 425495 434156 537492 408221 381491 99027 377395 313041 261736 237179
7342 237179 204626 133414 202472 653789 376964 457228 570030 475387 324510 341473 160201
7331 160201 -33877 330256 372523 223464 480291 767791 561016 340319 512678 575191
7321E75191k63327K10197J23359p5609k24633J308j04198q8361K89505j4537r5519
7310C33376n3310k73K10915r2499j68270j75240j58560J62355j40346J62240L3752
7299A14140J18770k47397R0331O02j90478N0021O4328j68047J86205k61720J67346
7288g5899L14007j66657J30230Q9419k0656j97607j15916j20922j91058L18244
7278c6815J21074j29758J54132J70770q5468k8121P2760k05240k56221j28476
7268c51363K43872j49226Q2863n2857q4916K15030M1721K29283k98573l13169
7258d37335J53968o0974J9894K06272K59706p7809m6779K11949j65527q6294o215
7247b9144K46429l5325J54449k29990k35428o8951j01023J72374j51723J32359
$$ plain form
7321 575191 311864 522061 645420 569811 345178 346486 242288 153927 443432 428895 333376
7310 333376 280066 279793 490708 398209 229939 54699 -103861 58494 -81852 80388 114140
7299 114140 232910 -14487 75844 76446 -114032 -64011 317 -167730 18475 -243245 -75899
7288 -75899 238108 71451 201681 291100 270444 72837 -43079 -164001 -355059 -36815
7278 -36815 84259 -45499 108633 279403 193935 165814 238574 33334 -222887 -351363
7268 -351363 -107491 -256717 -173854 -226711 -311627 -96597 -54876 174407 -124166 -437335
7258 -437335 -283367 -344341 -324447 -118175 141531 63722 16943 228892 63365 -22929 -29144
7247 -29144 217285 181960 336409 106419 -129009 -197960 -298983 -126609 -278332 -145973
7237a45973N3714J29216j35638k46340j70919K08597Q7702R6264M8800k41896
7227c16473K95898j81244P0614J47231k68094q2410O5673Q716m3428j18354p3589
7216d95460K47434J51300K268l25352L89216p2312N1624M1636O6715Q1326o0495
7205G7900k7190J77027j71072L283N4064r4363j26779k18097M3521L39507L4326
7194I2127l23563J93942o6335r0041m560K79270L6526k51782J14693j15710J71406
7183C5973l12500J41903j39326L00338L0580n18104J2853K19334Q8975R0762j36793
7172a86005n3084m6791N8465p8288n5828J2821P2350k63024J97634L05567J81620
7161A45437k49251o9381j22643P8732O3054K35680N9978o30387k72330J21591
$$ plain form
7237 -145973 -92259 36957 -98681 -345021 -515940 -307343 -219641 -123377 -74577 -316473
7227 -316473 -20575 -201819 -131205 16026 -252068 -334478 -268805 -260089 -303517 -421871 -495460
7216 -495460 -248026 -96726 -94458 -419810 -30594 -102906 -51282 -9646 57069 138395 77900
7205 77900 50710 227737 56665 59948 114012 19649 -107130 -325227 -281706 57801 92127
7194 92127 -231436 -37494 -103829 -193870 -198430 80840 117366 -134416 -19723 -135433 35973
7183 35973 -276527 -134624 -273950 26388 56968 -461136 -448283 -228949 -139974 -49212 -186005
7172 -186005 -239089 -285880 -227415 -305703 -361531 -348710 -276360 -539384 -341750 -36183 145437
7161 145437 -103814 -173195 -295838 -217106 -154052 81628 141606 -488781 -761111 -639520
7151f39520o9875J38172K40244k9543K73963m61488K07452M897J65418K84517
7141A14237k16579J43107J95760k16342K9091l33940J37517j82424J75176K8329
7131a26068p2224J03962j85390q7684P8118n6464J51241k812K1558k92819L4673
7120d33909J53333P9287k90023J51385L31709r0277j5671j37946K45927l27387
7110c33572j73279L55149m2561j347j98644J54590L18116L33349m71067K73931
7100B14665m33575K2769L24879l76699j72048N5335K71160K3010m6446j99398
7090c16348L3271J398j58227J0174L75728k18775o7620q7357R8467J64491j43294
7079c08092j79479l1011K1593M06089P8507j8178n8208j72093r4518O7173J24200
$$ plain form
7151 -639520 -709395 -571223 -330979 -360522 -86559 -548047 -340595 -335698 -170280 114237
7141 114237 -102342 40765 236525 20183 49274 -284666 -147149 -329573 -154397 -126068
7131 -126068 -198292 -94330 -279720 -367404 -289286 -345750 -194509 -197321 -175763 -468582 -433909
7120 -433909 -280576 -201289 -491312 -339927 -8218 -98495 -114166 -252112 -6185 -333572
7110 -333572 -506851 -151702 -194263 -195610 -394254 -239664 78452 411801 -59266 214665
7100 214665 -218910 -196141 128738 -247961 -420009 -364674 -93514 -70504 -116950 -316348
7090 -316348 -283077 -281679 -439906 -429732 -54004 -272779 -340399 -427756 -329289 -164798 -308092
7079 -308092 -487571 -518582 -496989 -90900 -12393 -30571 -88779 -260872 -355390 -288217 -164017
7068a64017j79002j23924L94379K4815p1922l45863k6412K58762K0855J0055J70339
7057c1935M7438k87470K9209j56868R2623j05179K4944M4377K25813l0250J8751
7046a28547k5379n1366k92054M9100J41912k7816K71623n1096q0007J91442P0783
7035F8595l29618M25270J545k83106j35350l5830K29733O9947J17064o1528p3520
7024f798O9480L3381j19915p5837J01645k16572N6583Q619j8744M0108j7995k31497
7012c77542k5859J39279r7972M70773l51869q3374L86512R7815l41669k90474
7002d74380j53328J08137J01570J71774j02038J244J86054k80696k8444m3602
6992e13709j05715J98475J10052J19193K76302k77177j18942k34002K62813n2982
$$ plain form
7068 -164017 -343019 -466943 -72564 -47749 -119671 -465534 -491946 -233184 -212329 -202274 -31935
7057 -31935 15503 -271967 -242758 -399626 -307003 -412182 -387238 -342861 -117048 -147298 -128547
7046 -128547 -153926 -205292 -497346 -448246 -306334 -334150 -62527 -113623 -193630 -2188 68595
7035 68595 -261023 164247 165792 -117314 -252664 -288494 -58761 11186 128250 66722 -6798
7024 -6798 62682 96063 -23852 -99689 1956 -214616 -158033 -149414 -168158 -128050 -146045 -377542
7012 -377542 -403401 -264122 -362094 108679 -243190 -326564 59948 157763 -183906 -474380
7002 -474380 -627708 -519571 -418001 -246227 -348265 -347021 -160967 -441663 -470107 -513709
6992 -513709 -619424 -420949 -310897 -191704 84598 -192579 -311521 -545523 -282710 -335692
6982c35692N31136l19940r3419N8991l0868J10794j49402k6863j9884J71695r683
6971a13135j8191J61450J2905k4705M9736j26965j76467N2045J78508l88988J38139
6960b55668P1056M7870J9016P3612M35124k88821l49188K15397J33251k31360
6950a29711K9437K97670k47346j87644m0565J94687K18158K9866j50167m8956
6940c4571J60189l03303J05449J88788J06822j68381k0647j76656Q5569j09250
6930a65991L17021M2639n78569j48097J45535j58536K12916R9151j73031L7487
6920c69475L3702p1084J23202R8178k15825L4095K41973L1073j18119j35044J45404
6909b01920L19587j87991o7723k37757m1981J64619n1474J33910P7815K3305J33046
$$ plain form
6982 -335692 195444 -124496 -217915 -158924 -189792 -78998 -228400 -255263 -275147 -103452 -113135
6971 -113135 -131326 30124 43029 18324 68060 -58905 -235372 -183327 -4819 -393807 -255668
6960 -255668 -184612 -136742 -117726 -44114 391010 102189 -246999 -31602 101649 -129711
6950 -129711 -100274 197396 -49950 -237594 -278159 -83472 134686 164552 14385 -34571
6940 -34571 125618 -177685 -72236 116552 223374 54993 34346 -142310 -56741 -165991
6930 -165991 151030 193669 -384900 -532997 -387462 -545998 -333082 -233931 -406962 -369475
6920 -369475 -335773 -406857 -283655 -185477 -401302 -367207 -125234 -94161 -212280 -347324 -201920
6909 -201920 117667 -70324 -138047 -375804 -417785 -253166 -304640 -170730 -92915 -69610 63436
6898F3436K1626k39204l4738M35032J2718k12190q5368j67648j22981K37396M3136
6887d8785k15358l1152N24535L2041k61984P0947J74640l49322j44407L06104
6877E7259j46806K20578J0392j39040k07447k22978J13516J66548P5729k22795
6867b95044M16918n2594R1370j18368k82833Q9277k3284J54059k6254J02888j90523
6856a34388j09586K5817K04348Q8076j46885j7502n5679L29556l20725J99911
6846F2943M9249J01260j78555j7009J7390k53J33646j48613j48029M7701J65529
6835H5259m385p3703j03819L07588j11417k13289L48635o639j31169r5517L23853
6824C25397j74758o2517P8584k1461K420k19558L9037k8478J69517k4511p4470
$$ plain form
6898 63436 85062 -154142 -188880 246152 258870 46680 -38688 -206336 -329317 -91921 -48785
6887 -48785 -264143 -295295 229240 261281 -703 70244 244884 -104438 -248845 57259
6877 57259 -89547 131031 141423 2383 -205064 -428042 -314526 -147978 -72249 -295044
6867 -295044 121874 69280 160650 42282 -240551 -151274 -174558 -20499 -46753 56135 -134388
6856 -134388 -243974 -218157 -13809 74267 -72618 -90120 -145799 183757 -136968 62943
6846 62943 112192 213452 34897 17888 35278 35025 168671 20058 -127971 -80270 85259
6835 85259 80874 7171 -96648 210940 99523 -113766 234869 228230 97061 1544 325397
6824 325397 150639 88122 166706 145245 147665 -71893 -32856 -61334 108183 83672 9202
6813I202R6085J29590L70606l35550k02436K8060j9133k1167J92130L3766r8030
6802A83123l0314j46138J94134J49648j30892r3417k2772j63138j13802M82186
6792C08618k4753k0344L77440m59678J30615J28313k70040J88076P5210j41752
6782B91705o9494m074L63926j10176n1847m2953p087k54348O229P8722P7873J23847
6770D02323R1934j50318O314j71210J50251Q8216j98100K07516P9343m1120q2911
6759C82238j48424J49754K34953K9007O6969j33159l2620M1799l96278O1915K11971
6748D68125J51842k25080j87598j41460L75835r956k09525o9867Q2467K12504
6738D47287j5994j52755K62963J00509j48366j66984j69428J11842J27153K9455
$$ plain form
6813 9202 105287 234877 605483 269933 67497 95557 76424 55257 247387 281153 183123
6802 183123 152809 6671 200805 350453 219561 126144 103372 -59766 -173568 308618
6792 308618 283865 263521 640961 181283 311898 440211 170171 358247 433457 291705
6782 291705 222211 218137 582063 471887 420040 377087 370000 115652 121881 200603 278476 402323
6770 402323 494257 343939 350253 179043 329294 417510 219410 426926 506269 465149 382238
6759 382238 233814 383568 618521 647528 714497 581338 548718 590517 194239 256154 468125
6748 468125 619967 394887 207289 65829 441664 431708 222183 152316 234783 447287
6738 447287 431293 278538 541501 642010 493644 326660 157232 269074 396227 425682
6728D25682j5482J0083O0171N9878k33405q6479J07809J80490j9048K38644l40115
6717C88228k13588k74772L01825N70365j03812N0216k37453J22890J69116j70167
6707F02848k18700j39855J40738l940N4596K34431J54458l6360l75101j62569
6697B50546J50487J70933j26035J12111M6316r5510n3941j71164K76015l8771
6687E20987J46312L2046j77755L08331l90494J61732K00250j36417L29924j91182
6677H03734K25457j75345L49458j98695j70818o9723J29026p532K04071J52193
6667A241826m7047N6886r5001o7030j27014L47184M9468k51530P309K22057Q7669
6656A424777j412j69659L26318K96903j71485m11247K06320p7169L79743p1899
$$ plain form
6728 425682 410200 420283 480454 540332 306927 220448 328257 508747 489699 728343 388228
6717 388228 174640 -100132 201693 772058 668246 718462 481009 603899 773015 602848
6707 602848 384148 244293 385031 381091 435687 670118 824576 788216 413115 250546
6697 250546 401033 571966 445931 558042 604358 508848 454907 283743 559758 520987
6687 520987 667299 699345 521590 829921 439427 601159 801409 664992 994916 803734
6677 803734 1029191 853846 1203304 1004609 833791 764068 893094 885562 1089633 1241826
6667 1241826 1194779 1251665 1156664 1089634 962620 1309804 1359272 1107742 1115051 1337108 1424777
6656 1424777 1423365 1253706 1580024 1876927 1705442 1294195 1500515 1423346 1803089 1731190
6646A731190k00594K19257K92746L1983q8220O5024j30599j5221L76287j3919
6636B267934R8926M9683o9508l2609J83690J22574J05709P340J15543m3137J87306
6625B993451L06431k52901O88599Q8830K09043R2742j46409K98386j8076J62508
6615D422604K67974O97277M14162q1957M36430J92504M36430J43555L87054O04868
6605G920901M81653O21054M97740L95980Q92299P22467Q47692J171817J325382
6596A4876985J472880J384867J528573J528139J467504J168557J17562k2980l60126
6587B3161961k6726J02816k95300J62940K23992O34350O05604R07551J481207
6578B6958395J312929K174424J957985K457483L513097L626111M253172M530036
$$ plain form
6646 1731190 1530596 1749853 2042599 2074582 1986362 2051386 1920787 1905566 2281853 2267934
6636 2267934 2366860 2416543 2347035 2314426 2498116 2620690 2726399 2733739 2849282 2806145 2993451
6625 2993451 3299882 3046981 3735580 3824410 4033453 4126195 3979786 4278172 4260096 4422604
6615 4422604 4690578 5387855 5802017 5720060 6156490 6348994 6785424 6928979 7316033 7920901
6605 7920901 8402554 9023608 9521348 9917328 10809627 11532094 12379786 13551603 14876985
6596 14876985 16349865 17734732 19263305 20791444 22258948 23427505 23545067 23522087 23161961
6587 23161961 23135235 23238051 22942751 23105691 23329683 23964033 24569637 25477188 26958395
6578 26958395 28271324 30445748 32403733 34861216 38374313 42000424 46253596 50783632
6570E0783632M726089M418704L953224K276457K03767j455492k438619l239386
6562E9228376l207652k633706k493485j589580j387799o91515N472L08804J040186
6553D8579101J233200K380612K877651L690824M154767N062616O097225O294703
6545H0370699N345490M707602L122521L70319k318143m571205n629008o210580
6537G5187695n709838n364939m456320l418321k795832k133576j464387r08208
6529D8936274l39598L06317N44822J142613J545962K220753K945117L120505L450863
6520F3873628K947415J539932j17480j568848l043704m623581m942342m515709
6512D9549311m394795l949484l109179k327767k167270j779411j234447j158047
$$ plain form
6570 50783632 55509721 59928425 63881649 66158106 66361873 64906381 62467762 59228376
6562 59228376 56020724 53387018 50893533 49303953 47916154 47224639 47230111 47538915 48579101
6553 48579101 49812301 52192913 55070564 58761388 62916155 67978771 74075996 80370699
6545 80370699 85716189 90423791 93546312 93916631 91598488 87027283 81398275 75187695
6537 75187695 69477857 64112918 59656598 56238277 53442445 51308869 49844482 48936274
6529 48936274 48596676 48902993 49447815 50590428 52136390 54357143 57302260 60422765 63873628
6520 63873628 66821043 68360975 68243495 66674647 63630943 59007362 54065020 49549311
6512 49549311 45154516 41205032 38095853 35768086 33600816 31821405 30586958 29428911
6504B9428911j357806q39182k79893o20055k94365j34065P60N04747K99896Q1005
6494B6789953k44276r16684j198364j214948j807516j810107j415101r43545j119982
6485A6119430j163092r04800q44930m60211l00778o79185m86363o81025o08159
6476I990887n94904j52324l53064k76455m47216k37826j65664k67972n29926k75837
6466F689699l1946o05298J99911l13746o1103j01315l61935L3360m5847n31450
6456D870330j49186o9502l77382k94614K75378m42085j1317N848k90597P3581
6446C590454j79904q8051j64747j53058n1589m12656k25780L63663n105o6396
6436B606831j46033K6736o6247k41355l7691K9619q7289L6142O1529k65690J09538
$$ plain form
6504 29428911 28071105 27231923 26952030 26331975 26037610 25903545 25904305 26409052 26708948 26789953
6494 26789953 26545677 25628993 24430629 23215681 21408165 19598058 18182957 17239412 16119430
6485 16119430 14956338 14051538 13206608 12746397 12445619 11766434 11280071 10599046 9990887
6476 9990887 9395983 9243659 8890595 8614140 8166924 7929098 7763434 7495462 6965536 6689699
6466 6689699 6657753 6052455 6252366 5938620 5877517 5776202 5414267 5447627 5401780 4870330
6456 4870330 4721144 4651642 4274260 3979646 4255024 3812939 3801622 3807470 3516873 3590454
6446 3590454 3410550 3322499 3157752 3004694 2953105 2540449 2314669 2678332 2673227 2606831
6436 2606831 2460798 2487534 2421287 2179932 2142241 2171860 2084571 2120713 2182242 1916552 2026090
6425B026090r4389m3787j4063J18137l16777q0812K22181j97392l55310p497Q9808
6414A346189m40658M16321K83980j79472j57384J26176P6492k10455l43411J6232
6404I34010K1632K26635k20264j45405M2295N0222j61555j18418O2691n9986J49728
6393G81585r777l7261O8787m7995m2693M52555q1594l08786k7904k43735o8005
6382D35177K81746j58596N0587P9927j54376r4419J42638k45857k09585J92840
6372C20082J45743J14472O547k18588k50820l4173O1835N5591K55365O200K28021
6361F90275k46901J06794k82103k87589N06816L4876j35874J72457K5222J73498
6351G57471p2231j67159j70300P489J10897q8360m3256k27824L01442P3842K59708
$$ plain form
6425 2026090 1931701 1887914 1873851 1991988 1675211 1594399 1816580 1619188 1263878 1256381 1346189
6414 1346189 905531 1321852 1605832 1426360 1268976 1395152 1471644 1261189 917778 934010
6404 934010 955642 1182277 962013 816608 858903 909125 747570 629152 691843 631857 781585
6393 781585 771808 734547 803334 755339 712646 1165201 1083607 774821 746917 503182 435177
6382 435177 716923 558327 608914 688841 534465 440046 582684 336827 127242 320082
6372 320082 465825 580297 586844 368256 117436 83263 145098 200689 456054 462254 690275
6361 690275 443374 550168 268065 -19524 487292 522168 386294 558751 583973 757471
6351 757471 685240 518081 347781 355270 466167 377807 334551 106727 408169 482011 741719
6340G41719j76129n2587p0119j82506r2778j0359K5666J1279j3914j07369P7568
6329A50471J42837M9601J03530N4178l32607L5079K40288Q741L2764j57959R0593
6318D17516M0357l40043j35779J54635j12312K18841j67167K40098L62696l21167
6308C57675k71345M7984K34803m9063R3489J82028j7873J01346p72m8303K22196
6297H52165l16957j48809K46356k35503k00945J70887p4917j05173L6674J2753
6287B36531r8223K9302J43413L5510K11507L5348J6897j4438o1648J14348j00183
6276E48364L4650q4518j3458p2911o8244j02824Q2785j26027l88294K69515M9313
6265A28351L3081p2432L2260o4948K9349l6448n0180k45633L73251j85185k3334
$$ plain form
6340 741719 565590 513003 442884 260378 167600 157241 182907 194186 180272 72903 150471
6329 150471 293308 342909 446439 500617 168010 203089 443377 452118 484882 326923 417516
6318 417516 457873 117830 -17949 136686 24374 243215 76048 316146 678842 357675
6308 357675 86330 134314 369117 320054 413543 595571 577698 679044 678272 629969 852165
6297 852165 535208 386399 632755 397252 196307 367194 292277 187104 223778 236531
6287 236531 138308 167610 311023 346533 558040 593388 610285 595847 534199 648547 548364
6276 548364 583014 498496 485038 412127 343883 241059 323844 197817 -190477 79038 128351
6265 128351 161432 89000 121260 56312 85661 49213 -967 -246600 126651 -58534 -81868
6254h1868N06555j70427J35126J30318k15934j14794k027j89252j05772K88251
6244A80176J69979n1916k07823n1245N2889r1291K50792q4712l9409M05685o2914
6233D70211p1860n4834k7848m98206k4379K82371R6560j03371l99214N79282J8906
6222B67618k65716O7056J62826J46928l7137K35270J16192k05010l3949l29825
6212A24253R8935m8981P4407J82999j04382j63475j7155n1L19726k05066J46123
6201D07333m0114j7279j0379L39360K6270j74840L2745q5151j21775K63869J44646
6190G64685k02458j74414q6400K3395K38095R2515R091J10800j04210j0936j53465
6179E06698L2261k16522j09864q8062p1657j31782L26484J55460k24102J38724
$$ plain form
6254 -81868 424687 254260 389386 519704 303770 188976 186949 -2303 -108075 180176
6244 180176 350155 298239 90416 39171 92060 769 251561 166849 127440 533125 470211
6233 470211 398351 343517 315669 -182537 -206916 75455 172015 68644 -330570 248712 267618
6222 267618 1902 68958 231784 378712 341575 576845 693037 488027 454078 124253
6212 124253 223188 174207 248614 431613 327231 163756 146601 146550 466276 261210 407333
6201 407333 367219 349940 339561 678921 705191 530351 563096 477945 356170 620039 764685
6190 764685 562227 387813 301413 324808 562903 655418 664509 775309 671099 660163 506698
6179 506698 538959 322437 212573 124511 52854 -78928 247556 403016 178914 317638
6169C17638K20293l09973J53814j63275J02859l95706J58900K60208o4699K27334
6159E07393R9983n20983J36989K3736k25875o3348L7861J58139J76314j65417
6149A64792k33127q0868J37277K95652j43234o2880o1176Q5291O3520J89173l66398
6138a1978j69648L4489q2523J66067K52763j69099j51178Q7603J21429k12139
6128a34214L2744J19047K19802j53764K41965q0280k35892K03925j94217J63720
6118A82836J36928j15900P8063k23520j00442j64989m6967l899J19804K53034
6108A14948J91373k60912n139J49801j18958j18290J41948j30201O113l10M9281
6097A9654j48799O4082P4566k59992J39826J15914O2183q4584r5911J06385K14136
$$ plain form
6169 317638 537931 227958 381772 218497 321356 -74350 84550 344758 280059 507393
6159 507393 607376 86393 223382 247118 21243 -42105 -4244 153895 330209 164792
6149 164792 -68335 -149203 -11926 283726 140492 77612 16436 101727 165247 354420 -11978
6138 -11978 -181626 -147137 -229660 -63593 189170 20071 -131107 -43504 77925 -134214
6128 -134214 -101470 17577 237379 83615 325580 245300 9408 213333 19116 182836
6118 182836 319764 203864 281927 58407 -42035 -207024 -253991 -257890 -138086 114948
6108 114948 306321 45409 40270 190071 71113 -47177 94771 -35430 -29317 -29627 19654
6097 19654 -129145 -65063 9503 -250489 -110663 5251 67434 -17150 -113061 -6676 207460
6086B07460P4706j98267O0259L3515j90221O1467K2837K2029k35306P019K03394
6075F8892o1914j46198K84997J94886r0936l337j79128j48123K98755K0112m8486
6064A89520n6543j5424k01270K44626L7020k31602l9412O3195J75554l51285J5617
6053a70004K22602K1923L02239J03480k03605k34928k19189J04603M5876o652
6043c3655j20847K90895K8365k01718o7080M19754M33601Q004k30876M1886P2300
6032F40629n0970J03541l16987l8394J32726M3706J0783O2886l49603J54189P1833
6021D64339j20291n3869R1327k85125Q9892K00938Q9117l62590J30163K29718
6011D73619j4798q5469j33694K8084J7516q2188M30722j60225k31013K67723J77753
$$ plain form
6086 207460 282166 83899 144158 177673 -12548 48919 71756 93785 -141521 -134502 68892
6075 68892 6978 -139220 145777 340663 249727 246390 67262 -80861 217894 238006 189520
6064 189520 132977 117553 -83717 160909 197929 -33673 -73085 -9890 165664 -185621 -170004
6053 -170004 52598 74521 376760 480240 276635 41707 -177482 -72879 -27003 -33655
6043 -33655 -154502 136393 164758 -36960 -104040 315714 749315 757319 526443 568329 640629
6032 640629 589659 693200 376213 337819 470545 514251 525034 587920 238317 392506 464339
6021 464339 344048 290179 381506 96381 186273 387211 476328 113738 243901 473619
6011 473619 458821 373352 239658 267742 285258 203070 633792 473567 242554 510277 688030
6000F88030p5979k96893p0053Q3851r5200k17257K82727m6734J86599l24831O3984
5989A78244j01851J22514q9009J56645J73290k84378N1973k24062R6611j16116
5979c6139J06357k98173Q7167M59387M2533k90881K0220J4970k294J88488l50819
5968e9184o528J43679K63246k25362k31815L7923P0701O720j66705K39010j68300
5957i6615J4263L08201j43871R1978J88499j7720k38534j25838J28223J32237
5947B40823j06365l05016N9605J17033O8863j54700p9065K88691m2794l5464K08362
5936B59973K55261j02297l18710j52174O6614J92775O1579k83454q1320K26736
5926A24983j07605k0808K55882o5318k9562j04217o9889J66568J16537q2970P286
$$ plain form
6000 688030 612051 315158 245105 328956 233756 16499 299226 252492 439091 114260 178244
5989 178244 76393 198907 109898 266543 439833 155455 207428 -16634 79977 -36139
5979 -36139 70218 -227955 -140788 318599 361132 70251 90471 105441 103147 291635 -59184
5968 -59184 -65712 77967 341213 115851 -115964 -78041 -7340 -620 -167325 71685 -96615
5957 -96615 -82352 225849 81978 173956 362455 344735 106201 -19637 108586 240823
5947 240823 134458 -170558 -110953 6080 74943 -79757 -158822 129869 87075 51611 259973
5936 259973 515234 412937 94227 -57947 8667 201442 263021 -20433 -101753 124983
5926 124983 17378 -3430 252452 187134 157572 53355 -16534 150034 266571 183601 190887
5915A90887j48951r0783J87423k05239K15168j9015j49490K24915r3265n5936
5905E5714j14938P8232Q4223k23679L2421N8871J29304n8817k4109j7459K21816
5894B21579j23418p2149O8485K02396Q2967k75420J42053l1747O8853j30357O1094
5883B14336j51360m1040P2839j59271P3883K31060j45954L7057O2852Q467j75102
5872B7767J93275p0678k36135N1925k5644k761L0423L08899O4215j65617K52012
5861D27681k79073m7728m0723l71270K48309J44447J40521J69472m46825K24799
5851A69610j7603k72828L13210j60231q6146n1428o3241K88494j42959L58934
5841C35812j0031l1196r0103k11307K261K56450k32893j01233k4097K08753p6413
$$ plain form
5915 190887 41936 -48847 138576 -66663 148505 129490 -20000 204915 111650 55714
5905 55714 -59224 19008 103231 -120448 -88027 -29156 100148 41331 17222 -237 221579
5894 221579 98161 26012 94497 296893 379860 104440 246493 214746 283599 153242 214336
5883 214336 62976 21936 94775 -64496 9387 240447 94493 131550 194402 202869 27767
5872 27767 221042 150364 -85771 -33846 -59490 -62251 -31828 277071 341286 175669 427681
5861 427681 148608 100880 60157 -311113 -62804 81643 222164 391636 -55189 169610
5851 169610 152007 -120821 192389 32158 -53988 -105416 -168657 119837 -23122 335812
5841 335812 325781 294585 204482 -6825 -4564 251886 18993 -82240 -106337 102416 26003
5830B6003k56310M06016J8043J64076m20043k8184j17429J72316j46200k9862
5820b11574J52963L99599k10361l78350n1662L36360N4129r595O8730k55742j14950
5809b20453M16851J59008M5115M2152j00231k16217j18694j57633k430K91649
5799A39117O7772j04656n0388j3797j66952P3578j8760J42740O820J56790N2367
5788B84631j18024l53852K34787j79670Q7853N02989q1809l37544O6026Q6055
5778A91442J64241j32662j57595p5873j20907L5877P0770J55033J6298R2216k6689
5767B12151k118J37964J8357O7477j04915l32918J04821n160m28728M50937L46662
5756D64530k74288M2000k46369j66348J33195O13928k99570j46643J29284N19
$$ plain form
5830 26003 -230307 175709 193752 357828 -62215 -90399 -207828 -35512 -181712 -211574
5820 -211574 -58611 340988 130627 -247723 -299385 36975 91104 81509 150239 -105503 -220453
5809 -220453 196398 355406 400521 442673 342442 126225 7531 -150102 -152532 139117
5799 139117 206889 102233 51845 38048 -128904 -55326 -74086 68654 75474 232264 284631
5788 284631 166607 -187245 47542 -132128 -44275 458714 376905 39361 105387 191442
5778 191442 355683 223021 65426 -10447 -131354 -95477 -24707 130326 146624 238840 212151
5767 212151 210033 347997 366354 433831 328916 -4002 100819 95659 -333069 117868 464530
5756 464530 190242 232242 -14127 -180475 -47280 566648 267078 120435 249719 250238
5746B50238p9817J17191j16355m0251o7662K16173J06829l5276j72214k10987
5736c2131K778J32879j18230J52876j71554k09136K06051J52796J2865q262L00432
5725D21364l19928p922K22512r7794j073k23842L45249P2540K8520o8038j48046
5714B23542k31365M44910K40671k10341j06742M8302j00595k03277M23192j09126
5704D19171l63541K45297j52557m5846l7222k8588K49969k58217r2255r6468P0643
5693h9614K19485M4862J67786j38714K2229J03912k03253J82461j87828J02687
5683B24013n4206m79296K23319N15997m1322k0614K847K878j81302J13328M1931
5672C47573M9710k16240K59954N0150n36971k00536K4014K32405K97256k82851
$$ plain form
5746 250238 170421 287612 171257 131006 63344 279517 386346 351070 178856 -32131
5736 -32131 -29353 103526 -14704 138172 -33382 -242518 -36467 116329 129194 120932 421364
5725 421364 101436 93514 316026 218232 217159 -6683 338566 411106 439626 371588 223542
5714 223542 -7823 437087 677758 467417 360675 408977 308382 105105 528297 419171
5704 419171 55630 300927 148370 102524 65302 36714 286683 28466 -63789 -160257 -89614
5693 -89614 129871 174733 342519 203805 226034 329946 126693 309154 121326 224013
5683 224013 169807 -309489 -86170 429827 388505 367891 370738 373616 192314 305642 347573
5672 347573 397283 181043 440997 491147 -45824 -246360 -222346 10059 307315 24464
5662B4464K98187L74812l42824m1373K350k98827P4397O0753K82399J54694k05732
5651C83300L3842J30176n9426k01314o574J76787J0385j65710J98056J71920m49880
5640B21562J27718J27108j2412J30033p3135P6828l00091K67152O9045j18193
5630E15615J25074j84581K16855Q6473K7654j29129J64941J55521k2915n10061
5620D45447P8315R0514K00122M11246l65954r0761n9816R3557K9308j7452k0607
5609G93919k24232K74735Q2444j79353j46042k70606J94312K77193k71866K27080
5599G57584R6043l5168m5995j80868M45199J3430j733q2162L37834P5876m15287
5588I64753N15733l3929L6240j40408O7807R9240M64464P5947K89273J94505K20648
$$ plain form
5662 24464 322651 697463 354639 313266 315616 16789 91186 151939 434338 589032 383300
5651 383300 417142 547318 487892 286578 280004 456791 467176 301466 499522 671442 221562
5640 221562 349280 476388 463976 594009 520874 597702 297611 564763 633808 515615
5630 515615 640689 456108 672963 759436 787090 657961 822902 978423 955508 445447
5620 445447 523762 614276 814398 1225644 859690 768929 709113 802670 831978 814526 793919
5609 793919 569687 844422 926866 747513 601471 330865 525177 802370 530504 757584
5599 757584 853627 818459 772464 591596 1036795 1050225 1048492 966330 1304164 1380040 964753
5588 964753 1480486 1446557 1482797 1342389 1410196 1509436 1973900 2049847 2339120 2533625 2754273
5577B754273M85966K8231M1518k1905m03909k37452r4690m69828j15426j87917
5567A778861j49225L7356J96884j36839o9520k29325o3434K65620k7041j78562
5557A424775j32015j26119K60898J98956j06868k48357p8881j44338J39003p9861
5547A107193q5134L382j25284Q4781N09282k57779o4142j31400N997k0809N0416
5536A076503J67927j7451r7082P0157N073l82745K42742N9869l97179O3489R1878
5525H83181J70605j5055p1723J4052J23379N8536N7799K59943O0702o4236J69207
5514A646390K1633j76616k46989m5140N55025k14250q3488K17119P764j75011
5504A506437L41876K28930m82673K742K94165L047l32332J12399n1591j51995
$$ plain form
5577 2754273 3240239 3268470 3309988 3288083 2884174 2646722 2552032 2082204 1966778 1778861
5567 1778861 1629636 1666992 1863876 1727037 1657517 1428192 1364758 1630378 1603337 1424775
5557 1424775 1292760 1166641 1427539 1626495 1519627 1271270 1192389 1048051 1187054 1107193
5547 1107193 1022059 1025441 900157 984938 1494220 1236441 1172299 1040899 1046896 1026087 1076503
5536 1076503 1244430 1226979 1129897 1200054 1205127 822382 1065124 1124993 727814 791303 883181
5525 883181 1053786 1038731 967008 981060 1104439 1162975 1220774 1480717 1541419 1477183 1646390
5514 1646390 1668023 1491407 1244418 1199278 1754303 1540053 1456565 1673684 1681448 1506437
5504 1506437 1848313 2077243 1594570 1597312 1891477 1894524 1562192 1674591 1623000 1471005
5494A471005M80435J28793k20033J98298k24909J40153J76794m0180q9101M28680
5484B449935j5236K43204j01691L10281j69965j38296J2086k1106j72810K2701
5474B419103K13849l21275p8443J53762K72925L32128j79921l16696M22958L18721
5464C237111j15474k45621k18168J14157K23893k62241K57289j63235M8617o6242
5454B810086k34940J62729N1762k9564j82029L38906J58639J61872j88938j66290
5444B882233L24515J39098K13455J03562K05865k28833K8950j11413j41362L86339
5434C802409Q8046n448K41479J50564L4068K87598J27084L8678N64596K5802K28127
5423E583003M8775L0089j85533L85027P5566J99213L81169K02737J40273L5732
$$ plain form
5494 1471005 1951440 2080233 1860200 2058498 1833589 1973742 2150536 2110356 2021255 2449935
5484 2449935 2434699 2677903 2576212 2886493 2716528 2578232 2590318 2569212 2396402 2419103
5474 2419103 2632952 2311677 2233234 2386996 2659921 2992049 2812128 2495432 2918390 3237111
5464 3237111 3121637 2876016 2657848 2772005 2995898 2733657 2990946 2827711 2876328 2810086
5454 2810086 2575146 2737875 2789637 2760073 2578044 2916950 3075589 3237461 3048523 2882233
5444 2882233 3206748 3345846 3559301 3662863 3868728 3639895 3668845 3557432 3416070 3802409
5434 3802409 3890455 3885007 4126486 4277050 4311118 4598716 4725800 4764478 5329074 5354876 5583003
5423 5583003 5631778 5661867 5476334 5861361 5936927 6136140 6517309 6720046 6860319 6896051
5413F896051k14413L31120J75908Q2512L65609O5433Q6848L07342L39693K83461
5403H719564M49032L61515M52922N41695L85990L76297P82969N34850N37620Q05674
5393A3948128P94769M95712P23628Q41979J104187J477272R13946J341739J299665
5384B2941025J490089J095518J395076J022715R45696J543678J829874J797911
5376C4061582J932819K165422J958134K637400K850557K608813K548418K436653
5368E3199798K940695L832251M308640N156639N210937N332023N517636N741345
5360I1239964O424696P186878Q528197Q950077J0276253J2068292J4980342J7141723
5352A76796422K0186838K4325298L0068398L7539219M7622745N4859097N1477506
$$ plain form
5413 6896051 6681638 7012758 7188666 7271178 7636787 7702220 7789068 8096410 8436103 8719564
5403 8719564 9168596 9530111 9983033 10524728 10910718 11287015 12069984 12604834 13142454 13948128
5393 13948128 14742897 15238609 15962237 16804216 17908403 19385675 20299621 21641360 22941025
5384 22941025 24431114 25526632 26921708 27944423 28890119 30433797 32263671 34061582
5376 34061582 35994401 38159823 40117957 42755357 45605914 48214727 50763145 53199798
5368 53199798 56140493 59972744 64281384 69438023 74648960 79980983 85498619 91239964
5360 91239964 97664660 104851538 113379735 122329812 132606065 144674357 159654699 176796422
5352 176796422 196983260 221308558 251376956 288916175 336538920 391398017 442875523
5345D42875523L6940638J2203533j5667619l9091693n3736596n4867417m6829320
5338B81827049l7047479k9338278k4127483j9406529j5759321j2291661j0731683
5331A33124615r626238q768178p788213o786351o205411o148560n620176n438632
5323G6742856m856848m345966l582246l468066l079688k805530k508197j910267
5315E0186048k075530k351665j826277j614367j226298j076074j051732j082070
5307C7882035j038049j576410q99955j132634j185126p45892j153977r51544n58000
5298B8640448r72325q96418r04619q45543o03448j226624j060833o30734r03093
5289B0596811n84036q25102m51973o44019o53241o71420n41179m09524o09411
$$ plain form
5345 442875523 479816161 492019694 476352075 437260382 383523786 328656369 281827049
5338 281827049 244779570 215441292 191313809 171907280 156147959 143856298 133124615
5331 133124615 123498377 114730199 106941986 100155635 93950224 87801664 82181488 76742856
5323 76742856 71886008 67540042 63957796 60489730 57410042 54604512 52096315 50186048
5315 50186048 48110518 45758853 43932576 42318209 41091911 40015837 38964105 37882035
5307 37882035 36843986 35267576 34367621 33234987 32049861 31303969 30149992 29198448 28640448
5298 28640448 27668123 26771705 25867086 25021543 24418095 23191471 22130638 21499904 20596811
5289 20596811 20012775 19187673 18735700 18091681 17438440 16767020 16225841 15816317 15206906
5280A5206906j06660n24018n83666m73102k47133n69868j84152k79437k71100
5271A1967770o1806o52933m82078m5478j36236l39851n76610j19283j33477j31807
5261I288211l43167k65681O6561l27899R9989k91534j97423k22380j56516P5000
5251G725161j62117m42123j85211j45132j11918k24605k11348j60959J62894Q442
5241F253084k1011j13711j29884l92017L60653K78031m43452K5899m0753L99726
5231F176565k02657n8055P7742j26286l00970j12619l38800j52352k70054j97026
5221D495488j13991j12744k12323o7650k03771l2247P330R4936j48294J32263
5211C838997j3096l12143J32490K57845j70633J00421J14662m07343m3604j74359
$$ plain form
5280 15206906 15100246 14576228 13992562 13519460 13272327 12702459 12518307 12238870 11967770
5271 11967770 11905964 11253031 10770953 10725475 10589239 10249388 9672778 9553495 9420018 9288211
5261 9288211 8945044 8679363 8745924 8418025 8518014 8226480 8029057 7806677 7650161 7725161
5251 7725161 7563044 7120921 6935710 6790578 6678660 6454055 6242707 6081748 6244642 6253084
5241 6253084 6232073 6118362 5988478 5596461 5957114 6235145 5791693 5817592 5776839 6176565
5231 6176565 5973908 5915853 5993595 5867309 5566339 5453720 5114920 4962568 4692514 4495488
5221 4495488 4381497 4268753 4056430 3988780 3785009 3752762 3760092 3855028 3706734 3838997
5211 3838997 3825901 3513758 3646248 3904093 3733460 3833881 3948543 3541200 3497596 3323237
5201C323237R1162j87053j88094K28020k65682q4547N1731l57025L0939M9108
5191B691796L4602j70346N6051L20996m85673k25905L93867j49287J3760j45703
5181B334158l00228J08834j4713J17992k86479K11753J3433k52791O0096j97807
5171A794248p2321R3318J04068O2749J16984l14985M1077L11551j53145J57522
5161B141066M7396k83464r1284K5362N1931M0969n3612p9230Q636m7462j7655
5150A742653O1299L71996K3952l53979K22510P5313P4792p4730j43470j45231
5140A855105j16573l2921P1424j24221k00883m3119L53131P8174k84437R4058
5130A649738M8535k0715j1617Q6943J74823K13524j87062q9250R1753J49014j89946
$$ plain form
5201 3323237 3414399 3227346 3039252 3267272 3001590 2917043 2968774 2611749 2642688 2691796
5191 2691796 2726398 2556052 2612103 2933099 2447426 2221521 2615388 2466101 2479861 2334158
5181 2334158 2033930 2142764 2128051 2246043 1959564 2171317 2184750 1931959 1992055 1794248
5171 1794248 1721927 1815245 1919313 1982062 2099046 1784061 1825138 2136689 1983544 2141066
5161 2141066 2188462 1904998 1813714 1839076 1891007 1931976 1878364 1799134 1807770 1760308 1742653
5150 1742653 1803952 2175948 2199900 1845921 2068431 2143744 2218536 2143806 2000336 1855105
5140 1855105 1738532 1705611 1777035 1652814 1451931 1408812 1761943 1840117 1555680 1649738
5130 1649738 1698273 1677558 1665941 1752884 1927707 2141231 1954169 1864919 1956672 2105686 1915740
5119A915740J31530J73831K06004L6357K3865K69534J77256N18297J81481J54544
5109C788439n0839l53041k42443l31354k66524L4561k37697N0473l08692o4714
5099B018169n5988j32412J46778q7250m34125q5483J18914j04052N5788j44726
$$ plain form
5119 1915740 2047270 2221101 2427105 2463462 2487327 2756861 2934117 3452414 3633895 3788439
5109 3788439 3737600 3384559 3142116 2810762 2544238 2578799 2341102 2391575 2082883 2018169
5099 2018169 1962181 1829769 1976547 1889297 1455172 1369689 1488603 1384551 1440339 1295613
$$ [...]
##END NTUPLES=NMR SPECTRUM
##END=
