##TITLE=1H_CA-93-74-1
 200.13MHz,CDCl3,
 8 sc
 
 27.8.2025
##JCAMPDX= 6.0         $$ Bruker NMR JCAMP-DX V2.0
##DATA TYPE= NMR SPECTRUM
##DATA CLASS= NTUPLES
##ORIGIN= UXNMR, Bruker Analytische Messtechnik GmbH
##OWNER= pz
$$ XWIN-NMR		Version 3.5
$$ Wed Aug 27 14:38:29 2025 Russian Standard Time (UT+4h)  she@DPX200
##.OBSERVE FREQUENCY= 200.1313
##.OBSERVE NUCLEUS= ^1H
##.ACQUISITION MODE= SIMULTANEOUS
##.ACQUISITION SCHEME= undefined
##.AVERAGES= 8
##.DIGITISER RES= 18
##SPECTROMETER/DATA SYSTEM= spect
##.PULSE SEQUENCE= zg30
##.SOLVENT NAME= CDCl3
##.SHIFT REFERENCE= (INTERNAL, CDCl3, 0, 15.5298)
##AUDIT TRAIL= $$ (NUMBER, WHEN, WHO, WHERE, WHAT)
$$ ##TITLE= Audit trail, XWIN-NMR		Version 3.5
$$ ##JCAMPDX= 5.01
$$ ##ORIGIN= Bruker BioSpin GmbH
$$ ##OWNER= she
$$ F:/spectra/data/she/nmr/H-C/1/pdata/1/auditp.txt
$$ ##AUDIT TRAIL=  $$ (NUMBER, WHEN, WHO, WHERE, WHAT)
(   1,<2025-08-27 14:36:58.90 +0400>,<she>,<DPX200>,
      <created by zg, POWCHK disabled, PULCHK disabled
       configuration hash MD5:
       00 E9 B6 7A A2 85 ED C7 34 08 36 98 17 FE 4E 26
       data hash MD5: 16K
       5B 25 36 32 1E 79 3E CA 78 FA FF 81 AD BB EF 97>)
(   2,<2025-08-27 14:37:01.46 +0400>,<she>,<DPX200>,
      <Start of raw data processing
       efp BC_mod = 2 LB = 0.25 FT_mod = 6 PKNL = 1 PHC0 = -1719.315 PHC1 = 9.792278 SI = 16K 
       data hash MD5: 16K
       66 3B 07 6A E9 48 D9 67 B9 A0 58 5F 80 1C F4 E0>)
(   3,<2025-08-27 14:37:17.67 +0400>,<she>,<DPX200>,
      <pk PHC0 = 1.830619 PHC1 = 0 
       data hash MD5: 16K
       EC 44 4A C3 F7 29 9E AD 69 C7 CA C6 05 FB 4E 14>)
(   4,<2025-08-27 14:37:21.46 +0400>,<she>,<DPX200>,
      <abs ABSG = 5 
       data hash MD5: 16K
       B8 95 D7 A3 77 6E 1B 5D 6C 97 7D F9 CB 07 EA AA>)
$$ ##END=
$$ 
$$ hash MD5
$$ 49 3B 09 3C D9 8B F6 BE CE 31 51 BC 0A 06 1C 3F
##$RELAX= 
##$RELAX= 
##$RELAX= 
##$RELAX= 
##$RELAX= 
##$RELAX= 
$$ Bruker specific parameters
$$ --------------------------
##$DU= <F:/spectra>
##$EXPNO= 1
##$NAME= <H-C>
##$PROCNO= 1
##$TYPE= <nmr>
##$USER= <she>
##$AMP= (0..31)
100 100 100 100 100 100 100 100 100 100 100 100 100 100 100 100 100 100 
100 100 100 100 100 100 100 100 100 100 100 100 100 100 
##$AQSEQ= 0
##$AQ_mod= 1
##$AUNM= <au_zg>
##$AUTOPOS= <>
##$BF1= 200.13
##$BF2= 200.13
##$BF3= 200.13
##$BF4= 200.13
##$BF5= 200.13
##$BF6= 200.13
##$BF7= 200.13
##$BF8= 200.13
##$BYTORDA= 1
##$CFDGTYP= 0
##$CFRGTYP= 5
##$CHEMSTR= <none>
##$CNST= (0..31)
1 1 145 1 1 1 1 1 1 1 1 1 1 1 1 1 1 1 1 1 1 1 1 1 1 1 1 1 1 1 1 1 
##$CPDPRG= <>
##$CPDPRG1= <>
##$CPDPRG2= <>
##$CPDPRG3= <>
##$CPDPRG4= <mlev>
##$CPDPRG5= <mlev>
##$CPDPRG6= <mlev>
##$CPDPRG7= <mlev>
##$CPDPRG8= <mlev>
##$CPDPRGB= <>
##$CPDPRGT= <>
##$D= (0..31)
0 0.7 0 0 0 0 0 0 0 0 0 0.03 0 0 0 0 0 0 0 0 0 0 0 0 0 0 0 0 0 0 0 0 
##$DATE= 1756291018
##$DBL= (0..7)
120 120 120 120 120 120 120 120 
##$DBP= (0..7)
150 150 150 150 150 150 150 150 
##$DBP07= 0
##$DBPNAM0= <>
##$DBPNAM1= <>
##$DBPNAM2= <>
##$DBPNAM3= <>
##$DBPNAM4= <>
##$DBPNAM5= <>
$$ [...]
##$SUBNAM3= <"">
##$SUBNAM4= <"">
##$SUBNAM5= <"">
##$SUBNAM6= <"">
##$SUBNAM7= <"">
##$SUBNAM8= <"">
##$SUBNAM9= <"">
##$SW= 18.0517328524113
##$SWIBOX= (0..15)
0 0 2 0 0 0 0 0 0 0 0 0 0 0 0 0 
##$SW_h= 3612.71676300578
##$TD= 16384
##$TD0= 1
##$TE= 0
##$TE2= 300
##$TE3= 300
##$TEG= 300
##$TL= (0..7)
0 120 120 120 120 120 120 120 
##$TP= (0..7)
150 150 150 150 150 150 150 150 
##$TP07= 0
##$TPNAME0= <>
##$TPNAME1= <>
##$TPNAME2= <>
##$TPNAME3= <>
##$TPNAME4= <>
##$TPNAME5= <>
##$TPNAME6= <>
##$TPNAME7= <>
##$TPOAL= (0..7)
0.5 0.5 0.5 0.5 0.5 0.5 0.5 0.5 
##$TPOFFS= (0..7)
0 0 0 0 0 0 0 0 
##$TUNHIN= 0
##$TUNHOUT= 0
##$TUNXOUT= 0
##$USERA1= <user>
##$USERA2= <user>
##$USERA3= <user>
##$USERA4= <user>
##$USERA5= <user>
##$V9= 5
##$VALIST= <valist>
##$VCLIST= <CCCCCCCCCCCCCCC>
##$VD= 0
##$VDLIST= <DDDDDDDDDDDDDDD>
##$VPLIST= <PPPPPPPPPPPPPPP>
##$VTLIST= <TTTTTTTTTTTTTTT>
##$WBST= 1024
##$WBSW= 4
##$XGAIN= (0..3)
0 0 0 0 
##$XL= 0
##$YL= 0
##$YMAX_a= 191675
##$YMIN_a= -175954
##$ZGOPTNS= <>
##$ZL1= 120
##$ZL2= 120
##$ZL3= 120
##$ZL4= 120
##$ABSF1= 15.48355
##$ABSF2= -2.568299
##$ABSG= 5
##$ABSL= 3
##$ALPHA= 0
##$AQORDER= 0
##$ASSFAC= 0
##$ASSFACI= 0
##$ASSFACX= 0
##$ASSWID= 0
##$AUNMP= <proc_1d>
##$AZFE= 0.1
##$AZFW= 0.1
##$BCFW= 0
##$BC_mod= 2
##$BYTORDP= 0
##$COROFFS= 0
##$CY= -3
##$DATMOD= 1
##$DC= 0
##$DFILT= <>
##$DTYPP= 0
##$F1P= 0
##$F2P= 0
##$FCOR= 1
##$FTSIZE= 16384
##$FT_mod= 6
##$GAMMA= 0
##$GB= 0
##$INTBC= 1
##$INTSCL= 3.241238e-09
##$ISEN= 128
##$LB= 0.25
##$LEV0= 0
##$LPBIN= 0
##$MAXI= 10000
##$MC2= 0
##$MEAN= 0
##$ME_mod= 0
##$MI= 1.114404
##$NCOEF= 0
##$NC_proc= -8
##$NLEV= 6
##$NOISF1= 3.799351
##$NOISF2= 2.8
##$NSP= 0
##$NTH_PI= 0
##$NZP= 0
##$OFFSET= 15.52984
##$PC= 1
##$PHC0= -1717.484
##$PHC1= 9.792278
##$PH_mod= 1
##$PKNL= yes
##$PPARMOD= 0
##$PSCAL= 0
##$PSIGN= 0
##$REVERSE= no
##$SF= 200.129998371491
##$SI= 16384
##$SIGF1= 3
##$SIGF2= 2
##$SINO= 0.751879
##$SIOLD= 32768
##$SREGLST= <19F.Aceton>
##$SSB= 0
##$STSI= 16384
##$STSR= 0
##$SW_p= 3612.71676300578
##$SYMM= 0
##$S_DEV= 0
##$TDeff= 16384
##$TDoff= 0
##$TI= <>
##$TILT= no
##$TM1= 0
##$TM2= 0
##$TOPLEV= 0
##$USERP1= <user>
##$USERP2= <user>
##$USERP3= <user>
##$USERP4= <user>
##$USERP5= <user>
##$WDW= 1
##$XDIM= 16384
##$YMAX_p= 471637202
##$YMIN_p= -517292
$$ End of Bruker specific parameters
$$ ---------------------------------
##NTUPLES= NMR SPECTRUM
##VAR_NAME=  FREQUENCY,     SPECTRUM/REAL,   SPECTRUM/IMAG
##SYMBOL=    X,             R,               I
##VAR_TYPE=  INDEPENDENT,   DEPENDENT,       DEPENDENT
##VAR_FORM=  AFFN,          ASDF,            ASDF
##VAR_DIM=   16384,         16384,           16384
##UNITS=     HZ,            ARBITRARY UNITS, ARBITRARY UNITS
##FACTOR=    0.220516191357247, 1,           1
##FIRST=     3107.9869478426, 0,             0
##LAST=      -504.729815163178, 0,           0
##MIN=       -504.729815163178, -517292,     0
##MAX=       3107.9869478426, 471637202,     0
$$ Real data points
##PAGE= N=1
##DATA TABLE= (X++(R..R)), XYDATA
$$ [...]
$$ plain form
8267 1159843 1260623 1237675 1171133 1267103 1249050 1283083 1202994 1279939 1257206 1293871 1417844
8256 1417844 1640121 1461630 1359140 1513867 1529513 1347586 1197047 1183099 1223958 1229601
8246 1229601 1157798 1207115 1339903 1282937 1243364 1229830 1047020 1047325 1120823 1144528 1041101
8235 1041101 1005289 1047316 1070350 1177670 1255988 1209748 1094586 1030044 936473 999910 1158728
8224 1158728 1205618 1260586 1007401 948068 961413 933598 823568 833777 895448 995244 989388
8213 989388 1061912 826440 848757 1020485 1087953 1063743 1036225 1099409 1150110 1079768 949040
8202 949040 1006758 1049370 985681 904344 846171 873980 987356 1125284 951844 1480842 1515968
8191 1515968 697219 709617 711903 756834 781575 771653 653351 639092 719036 753145 780973
$$ packed form
8267A159843J00780k2948o6542R5970j8053L4033q0089P6945k2733L6665J23973
8256A417844K22277j78491j02490J54727J5646j81927j50539j3948M0859N643
8246A229601p1803M9317J32788n6966l9573j3534j82810L05P3498K3705j03427
8235A041101l5812M2027K3034J07320P8318m6240j15162o4542r3571O3437J58818
8224A158728M6890N4968k53185n9333J3345k7815j10030J0209O1671R9796n856
8213I89388P2524k35472K2317J71728O7468k4210k7518O3184N0701p0342j30728
8202I49040N7718M2612o3689q1337n8173K7809J13376J37928j73440N28998L5126
8191A515968q18749J2398K286M4931K4741r922j18302j4259P9944L4109K7828
$$ plain form
8180 780973 809126 816043 666780 608035 737419 683289 737684 709933 724280 670552 724812
8169 724812 704190 695917 719505 741296 780466 803319 787392 758271 570631 557458 580604 718441
8157 718441 740401 711094 766123 724397 753914 861216 821892 595324 571823 560691 618397
8146 618397 669540 651030 551023 629025 512866 663235 823535 689406 632562 590630 535095
8135 535095 473152 352605 434058 513502 652906 598311 578367 517355 443961 469721 588124
8124 588124 602997 494753 433639 433934 520847 512011 389802 430201 429791 449069 382613 451176
8112 451176 377148 327823 367335 443688 530422 435062 447865 365526 348955 401217 363420 332564
8100 332564 386848 497511 435463 403002 548555 471771 368327 444576 506215 539426 601007
$$ packed form
8180G80973K8153O917j49263n8745J29384n4130N4395k7751J4347n3728N4260
8169G24812k0622q273K3588K1791L9170K2853j5927k9121j87640j3173K3146J37837
8157G18441K1960k9307N5029m1726K9517J07302l9324k26568k3501j1132N7706
8146F18397N1143j8510j00007P8002j16159J50369J60300j34129n6844m1932n5535
8135E35095o1943j20547Q1453P9444J39404n4595j9944o1012p3394K5760J18403
8124E88124J4873j08244o1114K95Q6913q836j22209M0399m10J9278o6456O8563
8112D51176p4028m9325L9512P6353Q6734r5360J2803q2339j6571N2262l7797l0856
8100C32564N4284J10663o2048l2461J45553p6784j03444P6249O1639L3211O1581
$$ plain form
8089 601007 541825 509760 502273 370656 451429 351874 363517 510467 399629 551277 435565
8078 435565 520591 533843 560012 487466 524937 314562 246917 162165 227857 283712 339023
8067 339023 262695 216521 265453 139043 312408 355544 222144 300709 258509 329137 476786
8056 476786 307555 264935 79279 186794 238662 283712 394602 398452 251887 213436 282764
8045 282764 269541 324319 411837 428256 311582 170559 212057 224491 420323 329710 214867
8034 214867 273427 198249 134438 233163 364755 252152 220324 150668 152886 195322 164924
8023 164924 130305 312198 214226 92856 154990 323157 247600 203056 160977 182677 199403
8012 199403 175291 219397 201622 65606 111654 90341 208959 291751 230933 279398 236684
$$ packed form
8089F01007n9182l2065p487j31617Q0773r9555J1643J46950j10838J51648j15712
8078D35565Q5026J3252K6169p2546L7471k10375o7645q4752O5692N5855N5311
8067C39023p6328m6174M8932j26410J73365M3136j33400P8565m2200P0628J47649
8056D76786j69231m2620j85656J07515N1868M5050J10890L850j46565l8451O9328
8045B82764j3223N4778Q7518J6419j16674j41023M1498J2434J95832r0613j14843
8034B14867N8560p5178o3811R8725J31592j12603l1828o9656K218M2436l0398
8023A64924l4619J81893r7972j21370O2134J68167p5557m4544m2079K1700J6726
8012A99403k4112M4106j7775j36016M6048k1313J18618Q2792o0818M8465m2714
$$ plain form
8001 236684 226230 124533 28942 153165 11898 118009 240200 234195 360770 218083
7991 218083 270952 343612 317608 123018 139739 181680 204236 225157 199445 286933 305935
7980 305935 277636 329636 205350 99692 54088 218240 179450 91462 -29363 21960 -6943
7969 -6943 30297 118049 154352 75298 206298 216081 123441 184034 115246 -58056 106350 151306
7957 151306 189871 122534 228964 208221 178934 197244 151328 278275 269607 180768 133216
7946 133216 173226 122025 180933 241190 107648 52694 -21123 -56925 71412 -30675 31547
7935 31547 76235 116034 137972 117541 83502 57474 -70402 45784 -41047 86534 307486
7924 307486 281225 160448 136551 132506 102479 150153 107041 193996 267916 270358 342149 342728
$$ packed form
8001B36684j0454j01697r5591J24223j41267J06111J22191o005J26575j42687
7991B18083N2869P2660k6004j94590J6721M1941K2556K0921k5712Q7488J9002
7980C05935k8299N2000j24286j05658m5604J64152l8790q7988j20825N1323k8903
7969f943L7240Q7752L6303p9054J31000R783r2640O0593o8788j73302J64406M4956
7957A51306L8565o7337J06430k0743k9287J8310m5916J26947q668q8839m7552
7946A33216M0010n1201N8908O0257j33542n4954p3817l5802J28337j02087O2222
7935C1547M4688L9799K1938k0431l4039k6028j27876J16186q6831J27581K20952
7924C07486k6261j20777k3897m045l0027M7674m3112Q6955P3920K442P1791N79
$$ plain form
7912 342728 279869 169633 110965 219522 304669 259285 236603 305484 298293 157803 162864
7901 162864 151874 86334 136379 128577 106783 122427 58245 48389 186563 307491 228929 109115
7889 109115 254293 246045 95315 176764 298611 172256 178421 285386 368521 227262 153173
7878 153173 247014 213201 144748 82691 240458 253300 282147 253597 128617 132450 81924
7867 81924 157403 139396 74825 11685 197601 279492 186590 161696 208054 279489 285993 108591
7855 108591 11095 -82221 -35589 37246 -64664 26985 -38176 -115511 86703 66153 -38018
7844 -38018 12034 108427 208186 131207 107702 65749 105809 171639 236967 16726 -41837 -58953
7832 -58953 -53621 -60833 -69348 -105249 -151375 -185229 76855 5184 3339 -9907 43377 31864
$$ packed form
7912C42728o2859j10236n8668J08557Q5147m5384k2682O8881p191j40490N061
7901A62864j0990o5540N0045p802k1794J5644o4182r856J38174J20928p8562j19814
7889A09115J45178q248j50730Q1449J21847j26355O165J06965Q3135j41259p4089
7878A53173R3841l3813o8453o2057J57767J2842K8847k8550j24980L833n0526
7867H1924P5479j8007o4571o3140J85916Q1891r2902k4894M6358P1435O504j77402
7855A08591r7496r3316M6632P2835j01910R1649o5161p7335K02214k0550j04171
7844c8018N0052R6393R9759p6979k3505m1953M0060O5830O5328k20241n8563j7116
7832e8953N332p212q515l5901m6126l3854K62084p1671j845j3246N3284j1513
$$ plain form
7820 31864 27897 34252 108796 82788 196002 224725 115838 115247 221381 191217 190161 -65458
7808 -65458 -6972 71404 87831 -28621 59928 -155841 -57539 -517292 -377057 726216 333102
7797 333102 450839 253361 128821 -19139 194236 311779 241238 72484 191832 68894
7787 68894 196240 202146 237829 227720 189730 109675 191694 292875 220064 86633 78332 101402
7775 101402 183270 189423 70955 110886 270526 159629 62820 114563 26130 84733 172251
7764 172251 87596 86181 43144 139152 289799 320214 199798 108613 84182 172546 146168
7753 146168 -34686 -66065 60587 201632 174675 112926 107482 158625 176463 189577 217620
7742 217620 271740 246434 315182 177680 238886 129772 144359 151980 91706 1284 74987
$$ packed form
7820C1864l967O355P4544k6008J13214K8723j08887n91J06134l0164j056k55619
7808f5458N8486P8376J6427j16452Q8549k15769R8302m59753J40235J103273l93114
7797C33102J17737j97478j24540j47960K13375J17543p0541j68754J19348j22938
7787F8894J27346N906L5683j0109l7990q0055Q2019J01181p2811j33431q301K3070
7775A01402Q1868O153j18468L9931J59640j10897r6809N1743q8433N8603Q7518
7764A72251q4655j415m3037R6008J50647L0415j20416r1185k4431Q8364k6378
7753A46168j80854l1379J26652J41045k6957o1749n444N1143J7838J3114K8043
7742B17620N4120k5306O8748j37502O1206j09114J4587P621o0274r0422P3703
$$ plain form
7731 74987 207494 333631 287944 208214 206299 236578 188256 173652 103439 47269 71161 123807
7719 123807 77914 71197 191249 199474 120097 54000 45761 155482 121385 36938 65546 119585
7707 119585 19215 20433 61051 -128146 107328 136137 153155 177128 167403 257529 282375
7696 282375 228525 179051 205180 90299 104203 177199 196170 115758 294794 365040 389048
7685 389048 368912 353753 355363 374622 384822 235710 265378 230918 247300 171376 273548
7674 273548 194854 115534 104348 146413 109645 101953 251800 289896 264000 362030 441946 336219
7662 336219 267243 209807 270054 312512 178616 93809 92665 203395 312537 278334 362353
7651 362353 180599 119383 205922 163920 166659 187992 144343 -59293 -23519 158746 137852
$$ packed form
7731G4987J32507J26137m5687p9730j915L0279m8322j4604p0213n6170K3892N2646
7719A23807m5893o717J20052Q225p9377o6097q239J09721l4097q4447K8608N4039
7707A19585j00370J218M0618j89197K35474K8809J7018K3973r725R0126K4846
7696B82375n3850m9474K6129j14881J3904P2996J8971q0412J79036P0246K4008
7685C89048k0136j5159J610J9259J0200j49112K9668l4460J6382p5924J02172
7674B73548p8694p9320j1186M2065l6768p692J49847L8096k5896R8030P9916j05727
7662C36219o8976n7436O0247M2458j33896q4807j144J10730J09142l4203Q4019
7651C62353j81754o1216Q6539m2002K739K1333m3649k03636L5774J82265k0894
$$ plain form
7640 137852 179345 182120 255056 407010 347432 217844 238774 251742 188121 241790 298834
7629 298834 319355 352587 238446 173449 175151 219211 121438 165022 201823 228010 89709
7618 89709 86823 169432 68207 156056 68586 123317 114817 -1345 74871 210938 132581 -5625
7606 -5625 20360 21006 43197 164881 221916 312474 279810 293221 172500 125618 226948 147568
7594 147568 13158 -6990 35180 56328 90658 98409 177107 333577 241024 104347 196563
7583 196563 247885 92395 72577 180631 318127 257325 188414 182863 154565 242519 157307
7572 157307 125458 144089 148747 41178 -40827 31227 -14921 -9549 -19871 24679 68438 13687
7560 13687 87214 33176 72756 -2473 127241 39098 141468 185342 266872 168065 90060
$$ packed form
7640A37852M1493K775P2936J51954n9578j29588K0930J2968o3621N3669N7044
7629B98834K0521L3232j14141o4997J702M4060r7773M3584L6801K6187j38301
7618H9709k886Q2609j01225Q7849q7470N4731q500j16162P6216J36067p8357j38206
7606e625K5985O46K2191J21684N7035R0558l2664J3411j20721m6882J01330p9380
7594A47568j34410k0148M2170K1148L4330P751P8698J56470r2553j36677R2216
7583A96563N1322j55490j9818J08054J37496o0802o8911n551k8298Q7954q5212
7572A57307l1849J8631M658j07569q2005P2054m6148N372j0322M4550M3759n4751
7560A3687P3527n4038L9580p5229J29714q8143J02370M3874Q1530r8807p8005
$$ plain form
7549 90060 120831 35051 170060 222062 266477 155440 180719 175774 95455 241773 298202
7538 298202 256939 328653 443790 350380 274646 425950 206243 301104 391202 580736 738261
7527 738261 808993 797356 895194 936620 916491 950386 763919 718909 765366 738831 630254
7516 630254 585843 497675 409941 299014 454072 455767 407694 567168 442586 233749 245981
7505 245981 213249 209155 207617 162222 260610 258617 275472 154711 124035 132802 206837 209080
7493 209080 256425 294360 111408 46764 6350 125583 179180 44801 76531 101706 38931
7482 38931 134053 271971 208245 347990 433106 334835 241402 261800 220038 397777 431126
7471 431126 245061 184618 234940 197890 21523 65034 114035 103341 191414 35284 73333
$$ packed form
7549I0060L0771q5780J35009N2002M4415j11037K5279m945q0319J46318N6429
7538B98202m1263P1714J15137r3410p5734J51304k19707R4861R0098J89534J57525
7527G38261P0732j1637R7838M1426k0129L3895j86467m5010M6457k6535j08577
7516F30254m4411q8168q7734j10927J55058J695m8073J59474j24582k08837J2232
7505B45981l2732m094j538m5395R8388j993J6855j20761l0676Q767P4035K243
7493B09080M7345L7935j82952o4644m0414J19233N3597j34379L1730K5175o2775
7482C8931R5122J37918o3726J39745Q5116r8271r3433K0398m1762J77739L3349
7471D31126j86065o0443N0322l7050j76367M3511M9001j0694Q8073j56130L8049
$$ plain form
7460 73333 149355 128345 140393 194824 306550 152175 225954 297154 252859 121562 254317
7449 254317 280497 214490 135687 117231 169468 111526 236456 331119 293425 272405 147352
7438 147352 186199 256169 221395 192821 251705 336378 325800 213288 148849 281147 344300
7427 344300 316833 218500 266619 268939 163078 224624 221556 252470 263236 154713 169872 179555
7415 179555 291748 301749 225257 241261 267077 351979 314732 269606 213953 184813 190078 317583
7403 317583 221873 101047 220081 232140 211195 189220 176041 244368 287971 353091 354053 261342
7391 261342 206772 239664 76666 121526 80813 104830 313547 186281 50797 62020 128932
7380 128932 190403 213845 243670 226203 224995 111463 324301 371435 312008 299557 242663
$$ packed form
7460G3333P6022k1010J2048N4431J11726j54375P3779P1200m4295j31297J32755
7449B54317K6180o6007p8803j8456N2237n7942J24930R4663l7694k1020j25053
7438A47352L8847O9970l4774k8574N8884Q4673j0578j12512o4439J32298O3153
7427C44300k7467r8333M8119K320j05861O1546l068L0914J0766j08523J5159R683
7415A79555J12193J0001p6492J6004K5816Q4902l7247m5126n5653k9140N265J27505
7403C17583r5710j20826J19034J2059k0945k1975j3179O8327M3603O5120R62r2711
7391B61342n4570L2892j62998M4860m0713K4017K08717j27266j35484J1223O6912
7380A28932O1471K3442K9825j7467j208j13532K12838M7134n9427j2451n6894
$$ plain form
7369 242663 278724 297756 473106 430345 262646 241388 254643 357545 312111 298449 310428
7358 310428 277832 401460 355967 298797 366707 352255 300230 234019 183591 232865 227527 233789
7346 233789 232869 282064 299595 328931 277258 348630 325141 324039 367914 398586 406847 366807
7334 366807 382669 501957 346198 300826 296944 384010 357524 232972 307489 348869 421913
7323 421913 481270 380718 403163 560894 461386 446773 380483 432955 400436 420164 463492
7312 463492 422956 396572 351957 474756 436398 419715 500901 541747 453991 550731 495622
7301 495622 507809 529318 432586 552832 560984 579017 693782 622609 590734 596732 615668 541660
7289 541660 379330 462032 495218 631905 626251 483499 447598 542117 588903 733572 775076
$$ packed form
7369B42663L6061J9032J75350m2761j67699k1258J3255J02902m5434j3662J1979
7358C10428l2596J23628m5493n7170O7910j4452n2025o6211n0428M9274n338O262
7346B33789r20M9195J7531K9336n1673P1372k3489j102M3875L0672Q261m0040
7334C66807J5862J19288j55759m5372l882Q7066k6486j24552P4517M1380P3044
7323D21913N9357j00552K2445J57731r9508j4613o6290N2472l2519J9728M3328
7312D63492m0536k6384m4615J22799l8358j6683Q1186M0846q7756R6740n5109
7301D95622J2187K1509r6732J20246Q152J8033J14765p1173l1875N998J8936p4008
7289E41660j62330Q2702L3186J36687n654j42752l5901R4519M6786J44669M1504
$$ plain form
7278 775076 729821 723314 687462 656694 659808 665306 630653 689473 746027 889691 973713 888167
7266 888167 796892 962965 858679 814267 747132 753255 866732 927145 807042 796703 865227
7255 865227 799712 860250 733502 689025 812305 888902 921571 846459 842728 985179 943764
7244 943764 746585 783196 830098 817633 887558 899473 1038519 1017956 903992 807018 790288
7233 790288 769553 814768 923559 1000218 888663 756461 914354 949378 889457 961546 887142
7222 887142 881836 922878 969470 1017535 1029802 1035904 1038191 1111237 1095235 1052126 1061215 1105638
7210 1105638 1117704 1162472 1263058 1365682 1462657 1333773 1400578 1505650 1380339 1438666
7200 1438666 1448754 1468294 1526166 1679872 1702832 1719417 1795221 1731215 1718211 1688904 1779458
$$ packed form
7278G75076m5255o507l5852l0768L114N498l4653N8820N6554J43664Q4022q5546
7266H88167r1275J66073j04286m4412o7135O123J13477O0413j20103j0339O8524
7255H65227o5515O0538j26748m4477J23280P6597L2669p5112l731J42451m1415
7244I43764j97179L6611M6902j2465O9925J1915J39046k0563j13964r6974j6730
7233G90288k0735M5215J08791P6659j11555j32202J57893L5024n9921P2089p4404
7222H87142n306M1042M6592M8065J2267O102K287P3046j6002m3109R089M4423
7210A105638J2066M4768J00586J02624R6975j28884O6805J05072j25311N8327
7200A438666J0088J9540N7872J53706K2960J6585P5804o4006j3004k9307R0554
$$ plain form
7189 1779458 1823460 1796699 1798971 1956587 2065463 2055531 2177196 2201106 2261704 2355750 2378250
7178 2378250 2536738 2540280 2657447 2744054 2762539 2852201 3088226 3195627 3175098 3238764 3418767
7167 3418767 3710647 3766589 3920521 4274801 4344974 4488937 4816971 5207215 5552072 5736557
7157 5736557 6083572 6459978 6697927 6954265 7297124 7650219 8186233 8711137 9207492 9839246
7147 9839246 10581231 11530891 12367812 13360192 14492729 15898913 17477834 19380163 21594027
7138 21594027 23915023 26564298 29643995 32780551 36468506 40863240 46053214 52594915
7130 52594915 61399073 73047970 87438375 102434617 117720019 132370789 144824812
7123 144824812 150706139 151738972 143809012 124904025 107414976 93285881 82132152
$$ packed form
7189A779458M4002k6761K272J57616J08876r932J21665K3910O0598R4046K2500
7178B378250J58488L542J17167Q6607J8485Q9662K36025J07401k0529O3666J80003
7167C418767K91880N5942J53932L54280P0173J43963L28034L90244L44857J84485
7157E736557L47015L76406K37949K56338L42859L53095N36014N24904M96355O31754
7147I839246P41985R49660Q36921R92380J132537J406184J578921J902329K213864
7138B1594027K320996K649275L079697L136556L687955M394734N189974O541701
7130E2594915Q804158J1648897J4390405J4996242J5285402J4650770J2454023
7123A44824812N881327J032833p929960j8904987j7489049j4129095j1153729
$$ plain form
7116 82132152 73612823 66731482 60300095 54868400 50076392 45921112 41620122 37830937
7108 37830937 34853800 32258396 29875181 27798925 25845012 24031850 22334007 20764304
7100 20764304 19387248 18185682 17050014 16105384 15273883 14407797 13873551 13213823 12631393
7091 12631393 12148012 11555140 10984845 10595564 10234085 9768214 9298199 9058303 8774430
7082 8774430 8476285 8127047 7859265 7604864 7318309 7120910 6812143 6499116 6271797 5947213
7072 5947213 5551433 5489148 5333656 5195594 4985745 4794509 4683229 4708905 4644578 4455682
7062 4455682 4380721 4154031 4072592 4034438 4242451 4021640 3731179 3653345 3659922 3431949 3289699
7051 3289699 3377566 3217756 3104158 3125455 2947172 2817178 2896374 2882942 2836351 2812334 2681025
$$ packed form
7116H2132152q519329o881341o431387n431695m792008m155280m300990l789185
7108C7830937k977137k595404k383215k076256j953913j813162j697843j569703
7100B0764304j377056j201566j135668r44630q31501q66086n34246o59728n82430
7091A2631393m83381n92872n70295l89281l61479m65871m70015k39896k83873
7082H774430k98145l49238k67782k54401k86555j97399l08767l13027k27319l24584
7072E947213l95780o2285j55492j38062k09849j91236j11280K5676o4327j88896
7062D455682p4961k26690q1439l8154K08013k20811k90461p7834O577k27973j42250
7051C289699Q7867j59810j13598K1297j78283j29994P9196j3432m6591k4017j31309
$$ plain form
7040 2681025 2617681 2511140 2466646 2525762 2514763 2465469 2325394 2173483 2264012 2279594 2065213
7029 2065213 2162592 2188972 2124803 2202506 2103438 2139800 2168969 2216006 2183471 2079024 2021946
7018 2021946 1952764 1918494 1780466 1933680 1826757 1799722 1992607 1945915 1882548 1880967 1834601
7007 1834601 1860187 1802174 1703493 1815344 1927569 1919569 1886370 1917424 1945920 1800309 1855404
6996 1855404 1929188 1667714 1522146 1569611 1707891 1628836 1622749 1623628 1663685 1633767 1689886
6985 1689886 1673853 1629267 1542523 1574336 1638404 1582630 1640526 1660116 1515143 1377266 1341789
6974 1341789 1413378 1348929 1264942 1404482 1249600 1109573 1135132 1122390 1224406 1173377 1131147
6963 1131147 1023953 1184100 1055742 1050392 1187258 1002374 950812 1022877 960772 1091368
$$ packed form
7040B681025o3344j06541m4494N9116j0999m9294j40075j51911R0529J5582k14381
7029B065213R7379K6380o4169P7703r9068L6362K9169M7037l2535j04447n7078
7018B021946o9182l4270j38028J53214j06923k7035J92885m6692o3367j581m6366
7007A834601K5586n8013r8681J11851J12225q000l3199L1054K8496j45611N5095
6996A855404P3784k61474j45568M7465J38280p9055o087Q79M0057k9918N6119
6985A689886j6033m4586q6744L1813O4068n5774N7896J9590j44973j37877l5477
6974A341789P1589o4449q3987J39540j54882j40027K5559j2742J02016n1029m2230
6963A131147j07194J60147j28358n350J36866j84884n1562P2065o2105J30596
$$ plain form
6953 1091368 1090190 1090618 1087893 1022753 1140510 1152120 1074774 891182 843582 816615 825233 740861
6941 740861 816344 930692 985187 1023481 994441 942522 815883 793520 795113 926638 957353
6930 957353 900173 993682 1073275 1125856 1007524 1020415 1030186 1156171 1187500 1102714 1016274
6919 1016274 981939 998786 1139369 1018574 875596 909796 952490 903790 953974 812468 877215
6908 877215 854794 740044 725857 756289 725553 624583 655254 657484 745444 785993 658026
6897 658026 698364 821723 656932 626231 706979 676208 765099 656201 719133 830429 885433
6886 885433 841973 789042 714199 696833 696712 707003 852712 653428 677954 646002 655556 718655
6874 718655 704756 637621 535343 546084 586504 661601 664323 658978 653966 676617 575014 540177
$$ packed form
6953A091368j178M28k725o5140J17757J1610p7346j83592m7600k6967Q618q4372
6941G40861P5483J14348N4495L8294k9040n1919j26639k2363J593J31525L0715
6930I57353n7180R3509P9593N2581j18332J2891R771J25985L1329q4786q6440
6919A016274l4335J6847J40583j20795j42978L4200M2694m8700N0184j41506O4747
6908H77215k2421j14750j4187L0432l0736j00970L0671K230Q7960M0549j27967
6897F58026M0338J23359j64791l0701Q0748l0771Q8891j08898O2932J11296N5004
6886H85433m3460n2931p4843j7366j21J0291J45709j99284K4526l1952R554O3099
6874G18655j3899o7135j02278J0741M0420P5097K722n345n012K2651j01603l4837
$$ plain form
6862 540177 612665 600770 671583 746341 661266 699677 754598 721902 605223 644603 682528
6851 682528 651721 664185 730722 833364 610694 562839 576427 645217 661923 647202 532419
6840 532419 562788 689626 599271 494088 566763 696390 699281 713837 637217 604702 631592
6829 631592 694375 705712 700104 626490 503434 441688 609245 724372 672356 751185 803317
6818 803317 733516 722919 732473 622230 645505 661905 680632 603002 665189 627502 551415 593963
6806 593963 713513 552193 508174 747596 736333 786847 835938 783979 983554 1000971 917211
6795 917211 909937 779994 817980 871501 912818 1165010 1130116 1131984 1114180 1056134 1038549 955049
6783 955049 860288 1011758 956685 830259 786238 795949 878317 822760 734395 801458 817626
$$ packed form
6862E40177P2488j1895P0813P4758q5075L8411N4921l2696j16679L9380L7925
6851F82528l0807J2464O6537J02642k22670m7855J3588O8790J6706j4721j14783
6840E32419L0369J26838r0355j05183P2675J29627K891J4556p6620l2515K6890
6829F31592O2783J1337n608p3614j23056o1746J67557J15127n2016P8829N2132
6818H03317o9801j0597R554j10243K3275J6400J8727p7630O2187l7687p6087M2548
6806E93963J19550j61320m4019K39422j1263N0514M9091n1959J99575J7417q3760
6795I17211p274j29943L7986N3521M1317K52192l4894J868j7804n8046j7585q3500
6783I55049r4761J51470n5073j26426m4021R711Q2368n5557q8365O7063J6168
$$ plain form
6772 817626 707216 850580 698942 516685 572440 620316 465418 444627 502884 472192 498950
6761 498950 553153 675248 722125 740807 619474 614587 865508 811871 762092 804871 885252
6750 885252 932818 916737 817099 870645 842933 855288 830313 819726 715757 693873 721268
6739 721268 729949 785444 873372 775989 841392 845694 824934 1029002 1044698 913016 926828 922489
6727 922489 861297 911118 996498 1118629 1211658 1416545 1519978 1637430 1616158 1723053 1779775
6716 1779775 1843645 1865924 1692433 1499221 1477258 1370133 1198324 1177480 1054118 981745
6706 981745 985066 899965 921321 1106888 1206625 1095617 1045602 1097023 1141591 1194105 1135765
6695 1135765 1213740 1228010 1185353 1025096 1082026 1125770 1135258 1327826 1214769 1244326 1247007
$$ packed form
6772H17626j10410J43364j51638j82257N5755M7876j54898k0791N8257l0692K6758
6761D98950N4203J22095M6877J8682j21333m887K50921n3637m9779M2779Q0381
6750H85252M7566j6081r9638N3546k7712J2355k4975j0587j03969k1884K7395
6739G21268Q681N5495Q7928r7383O5403M302k0760K04068J5696j31682J3812m339
6727I22489o1192M9821Q5380J22131R3029K04887J03433J17452k1272J06895N6722
6716A779775O3870K2279j73491j93212k1963j07125j71809k0844j23362p2373
6706I81745L321q5101K1356J85567R9737j11008n0015N1421M4568N2514n8340
6695A135765P7975J4270m2657j60257N6930M3744R488J92568j13057K9557K681
$$ plain form
6684 1247007 1238450 1208623 1128451 1149573 1197741 1153078 1092267 1076466 995411 1089797 1201536
6673 1201536 1244100 1078897 1112351 1156399 1120403 1163128 1174536 1211213 1196481 1217591 1277706
6662 1277706 1221299 1182321 1195085 1268211 1280834 1138486 1228129 1204786 1059829 1066194 1005210
6651 1005210 1011875 954853 886023 894654 907879 1065726 917636 844347 861777 792339 762904
6640 762904 690604 761878 807694 712474 797980 793316 884456 868262 926284 989905 781196 878795
6628 878795 875442 711128 731549 715084 581721 630866 593297 579442 597112 629552 555073
6617 555073 678147 703083 507315 445204 455663 539173 572145 491999 571897 598478 597045
6606 597045 488641 574201 618755 503108 591553 497712 557460 657672 571737 437608 465144
$$ packed form
6684A247007q557k9827q0172K1122M8168m4663o0811j5801q1055R4386J11739
6673A201536M2564j65203L3454M4048l5996M2725J1408L6677j4732K1110O0115
6662A277706n6407l8978J2764P3126J2623j42348Q9643k3343j44957O365o0984
6651A005210O665n7022o8830Q631J3225J57847j48090p3289J7430o9438k9435
6640G62904p2300P1274M5816r5220Q5506m664R1140j6194N8022O3621k08709R7599
6628H78795l353j64314K0421j6465j33363M9145l7569j3855J7670L2440p4479
6617E55073J23074K4936j95768o2111J0459Q3510L2972q0146P9898K6581j433
6606E97045j08404Q5560M4554j15647Q8445r3841N9748J00212q5935j34129K7536
$$ plain form
6595 465144 458098 595721 527511 540050 559221 444341 386857 425344 414737 374466 293373
6584 293373 439199 501302 426993 487117 448668 491389 516789 510663 677306 773735 639608
6573 639608 523262 564062 493238 355260 436785 413106 309352 450024 524922 568416 532211
6562 532211 378044 484577 688175 713070 598688 610341 450867 422994 421403 527970 591297
6551 591297 619157 725451 744862 685460 554322 632596 668365 708458 657077 659244 753326
6540 753326 733824 655713 610780 703904 636216 622157 707657 760811 788094 775927 956613
6529 956613 1036205 1043084 1178536 1342398 1361259 1372400 1533842 1563001 1467316 1402304 1285271
6518 1285271 1209590 1295150 1194407 972255 993651 1203342 1106304 1070941 1014689 954605 1063454
$$ packed form
6595D65144p046J37623o8210J2539J9171j14880n7484L8487j0607m0271q1093
6584B93373J45826O2103p4309O0124l8449M2721K5400o126J66643R6429j34127
6573F39608j16346M0800p0824j37978Q1525k3679j03754J40672P4898M3494l6205
6562E32211j54167J06533K03598K4895j14382J1653j59474k7873j591J06567O3327
6551E91297K7860J06294J9411n9402j31138P8274L5769M0093n1381K167R4082
6540G53326j9502p8111m4933R3124o7688j4059Q5500N3154K7283j2167J80686
6529I56613P9592O879J35452J63862J8861J1141J61442K9159r5685o5012j17033
6518A285271p5681Q5560j00743k22152K1396K09691r7038l5363n6252o0084J08849
$$ plain form
6507 1063454 967135 904066 914600 806245 787381 981629 907174 888365 843231 830481 1042069
6496 1042069 1133978 1134151 1228406 1300678 1378692 1484154 1454255 1596051 1716815 1855692 1900619
6485 1900619 1916942 1991610 1932994 1949941 1861855 1664708 1636973 1667287 1465923 1383281 1378790
6474 1378790 1403171 1306161 1213418 1219007 1165218 1089430 1117610 1197181 975795 877810 920718
6463 920718 924572 873266 843610 847094 934870 965559 890240 882324 902291 1028715 1127237 1238225
6451 1238225 1214211 1144516 1259866 1280083 1390364 1434199 1403571 1485271 1523064 1349225 1244587
6440 1244587 1120534 995173 980134 963719 890257 915596 851272 834653 896066 1016058 971999
6429 971999 781848 799002 814949 715021 702500 768271 847733 825298 832089 866674 849051 824086
$$ packed form
6507A063454r6319o3069J0534j08355j8864J94248p4455j8809m5134j2750K11588
6496A042069R1909J73R4255P2272P8014J05462k9899J41796J20764J38877M4927
6485A900619J6323P4668n8616J6947q8086j97147k7735L0314k01364q2642m491
6474A378790K4381r7010r2743N589n3789p5788K8180P9571k21386r7985M2908
6463I20718L854n1306k9656L484Q7776L0689p5319p916J9967J26424R8522J10988
6451A238225k4014o9695J15350K0217J10281M3835l0628Q1700L7793j73839j04638
6440A244587j24053j25361j5039j6415p3462K5339o4324j6619O1413J19992m4059
6429I71999j90151J7154J5947r9928j2521O5771P9462k2435O791L4585j7623k4965
$$ plain form
6417 824086 809113 745491 775055 636476 528459 599075 585764 657723 651336 542095 597933
6406 597933 714462 666031 610539 664921 607934 632434 693734 673678 741337 683488 770294
6395 770294 678423 714046 580928 504832 497381 572686 534246 532385 668771 614747 637988 687139
6383 687139 674661 635505 540152 514479 426619 559184 756863 786209 738586 696353 799882
6372 799882 737380 721382 709223 688199 694062 773149 746773 675799 786294 719432 752428 782722
6360 782722 763363 764652 844526 879019 903901 806545 794401 767029 876410 863174 930147 951392
6348 951392 831680 857229 903495 942036 816804 831595 1002769 915536 820609 893679 958288
6337 958288 820011 874921 1028377 970235 1031077 910860 906445 886284 887318 893982 974272 908402
$$ packed form
6417H24086j4973o3622K9564j38579j08017P0616j3311P1959o387j09241N5838
6406E97933J16529m8431n5492N4382n6987K4500O1300k0056O7659n7849Q6806
6395G70294r1871L5623j33118p6096p451P5305l8440j861J36386n4024K3241M9151
6383F87139j2478l9156r5353k5673q7860J32565J97679K9346m7623m2233J03529
6372G99882o2502j5998j2159k1024N863P9087k6376p0974J10495o6862L2996L0294
6360G82722j9359J289P9874L4493K4882r7356j2144k7372J09381j3236O6973K1245
6348I51392j19712K5549M6266L8541j25232J4791J71174q7233r4927P3070O4609
6337I58288j38277N4910J53456n8142O0842j20217m415k0161J034O664Q0290o5870
$$ plain form
6325 908402 1052494 1196336 1177852 1095517 1113232 1055651 957700 1094341 1150099 1161911 1289253
6314 1289253 1221597 1059956 996513 1050371 1068658 1051553 831144 815333 915996 823127 887070
6303 887070 878318 969643 1103155 1073785 1061117 889617 902136 1035183 1219725 1108536 1044222
6292 1044222 998654 1149076 1190247 1196105 1183608 1079049 1081408 1054547 1071023 1167108 1276737
6281 1276737 1121285 1068145 1086004 1155731 1262636 1293889 1259956 1181210 1074044 1153776 1265273
6270 1265273 1164476 1198906 1317341 1244762 1291567 1298001 1325933 1378954 1250164 1132399 1176859
6259 1176859 1153818 1228639 1265680 1277566 1237627 1265652 1368685 1350381 1363996 1389677 1324548
6248 1324548 1321799 1147507 1122634 1139657 1049348 1096975 1248414 1073385 1193546 1332345 1193471
$$ packed form
6325I08402J44092J43842j8484q2335J7715n7581r7951J36641N5758J1812J27342
6314A289253o7656j61641o3443N3858J8287j7105k20409j5811J00663r2869O3943
6303H87070q752R1325J33512k9370j2668j71500J2519J33047J84542j11189o4314
6292A044222m5568J50422M1171N858j2497j04559K359k6861J6476R6085J09629
6281A276737j55452n3140J7859O9727J06905L1253l3933p8746j07166P9732J11497
6270A265273j00797L4430J18435p2579M6805O434K7932N3021j28790j17765M4460
6259A176859k3041P4821L7041J1886l9939K8025J03033j8304J3615K5681o5129
6248A324548k749j74292k4873J7023r0309M7627J51439j75029J20161J38799j38874
$$ plain form
6237 1193471 1209189 1166090 1138984 1329724 1365228 1337484 1388291 1383970 1365411 1228260 1283639
6226 1283639 1321017 1581334 1613496 1485453 1600520 1612131 1574104 1591796 1562312 1635776 1697242
6215 1697242 1562594 1494419 1481084 1497388 1501861 1528116 1576868 1694289 1685886 1725903 1850318
6204 1850318 1737956 1695950 1746946 1664899 1695146 1915413 1853252 1779636 1887083 1815249 1718349
6193 1718349 1735324 1857098 1927025 1848349 1959774 1934061 2029033 2131556 2155962 2163894 1982510
6182 1982510 2027954 2139136 2206528 2334349 2559868 2574014 2634982 2881017 3042691 3074789
6172 3074789 3153588 3073095 2974410 2862237 2747148 2679918 2591438 2503046 2537940 2618349 2521702
6161 2521702 2354762 2198455 2365782 2526803 2521190 2454193 2382545 2315541 2390931 2489440 2579816
$$ packed form
6237A193471J5718m3099k7106J90740L5504k7744N0807m321j8559j37151N5379
6226A283639L7378K60317L2162j28043J15067J1611l8027J7692k9484P3464O1466
6215A697242j34648o8175j3335J6304M473K6255M8752J17421q403M0017J24415
6204A850318j12362m2006N0996q2047L0247K20267o2161p3616J07447p1834r6900
6193A718349J6975J21774O9927p8676J11425k5713R4972J02523K4406P932j81384
6182A982510M5444J11182O7392J27821K25519J4146O0968K46035J61674L2098
6172C074789P8799q0493r8685j12173j15089o7230q8480q8392L4894Q0409r6647
6161B521702j66940j56307J67327J61021n613o6997p1648o7004P5390R8509R0376
$$ plain form
6150 2579816 2624992 2707277 2870028 3132859 3345128 3470932 3652471 3736162 3683935 3828879
6140 3828879 3812608 3867462 3823528 3729779 3672643 3527563 3534070 3348660 3382640 3250449 3221947
6129 3221947 3133942 3000758 2903106 2898165 2817343 2843423 2946227 2801023 2809586 2933892 2956006
6118 2956006 2909573 3030107 2911468 2828725 2830134 2785092 2927884 3075572 3303888 3408452
6108 3408452 3396245 3554052 3754561 3815373 3755200 3623505 3607213 3421563 3293539 3233457
6098 3233457 3083964 2955617 2837951 2768029 2673625 2656533 2488758 2392411 2317785 2296827 2273663
6087 2273663 2239182 2120291 2113170 2197818 2265183 2368007 2399377 2436346 2380432 2377840 2528203
6076 2528203 2568178 2570864 2507486 2417171 2437101 2498493 2395227 2270513 2257613 2224529 2220807
$$ packed form
6150B579816M5176Q2285J62751K62831K12269J25804J81539Q3691n2227J44944
6140C828879j6271N4854m3934r3749n7136j45080O507j85410L3980j32191k8502
6129C221947q8005j33184r7652m941q0822K6080J02804j45204Q563J24306K2114
6118B956006m6433J20534j18639q2743J409m5042J42792J47688K28316J04564
6108C408452j2207J57807K00509O0812o0173j31695j6292j85650j28024o0082
6098C233457j49493j28347j17666o9922r4404j7092j67775r6347p4626k0958k3164
6087B273663l4481j18891p121Q4648O7365J02824L1370L6969n5914k592J50363
6076B528203L9975K686o3378r0315J9930O1392j03266j24714j2900l3084l722
$$ plain form
6065 2220807 2234450 2237235 2191489 2042684 1964373 1841929 1812426 1838265 1816801 1792842 1775803
6054 1775803 1732248 1866289 1889413 1950432 1940108 1786733 1728282 1917435 1875083 1844336 1879285
6043 1879285 1964279 2059500 1959902 1828418 1889656 1969305 1955750 1924102 1778707 1790224 1864788
6032 1864788 1891235 1882528 1856872 1813894 1926787 1841971 1835118 1821587 1789272 1686115 1742827
6021 1742827 1776874 1894739 1725214 1778247 1883916 1875608 1956705 1948701 1951943 2012334 1987239
6010 1987239 1934466 1985653 1933662 1971502 1986246 2128152 2232270 2194406 2020675 1957860 2154045
5999 2154045 2150646 2167490 2133530 2095000 1986216 2145320 2168907 2187150 2134960 2236113 2256434
5988 2256434 2279236 2286676 2183720 2272857 2344188 2558442 2663863 2546185 2433668 2427409 2473768
$$ packed form
6065B220807J3643K785m5746j48805p8311j22444k9503K5839k1464k3959j7039
6054A775803m3555J34041K3124O1019j0324j53375n8451J89153m2352l0747L4949
6043A879285Q4994R5221r9598j31484O1238P9649j3555l1648j45395J1517P4564
6032A864788K6447q707k5656m2978J12893q4816o853j3531l2315j03157N6712
6021A742827L4047J17865j69525N3033J05669q308Q1097q004L242O0391k5095
6010A987239n2773N1187n1991L7840J4744J41906J04118l7864j73731o2815J96185
5999B154045l399J6844l3960l8530j08784J59104K3587J8243n2190J01153K0321
5988B256434K2802P440j02956Q9137P1331K14254J05421j17678j12517o259M6359
$$ plain form
5977 2473768 2578055 2466407 2535180 2513775 2402245 2180155 2320649 2504777 2569630 2474416
5967 2474416 2416111 2485550 2362831 2200263 2222248 2314967 2367005 2406816 2425317 2394303 2345512
5956 2345512 2288875 2280623 2311520 2452742 2451557 2340555 2324771 2359550 2349428 2301258 2275661
5945 2275661 2297812 2461659 2472729 2429441 2359422 2340091 2336706 2342803 2349167 2353753 2334087 2331873
5933 2331873 2385747 2437431 2544798 2589960 2398162 2392337 2500030 2385628 2365509 2402872 2487966
5922 2487966 2462383 2528960 2458147 2314093 2165832 2206994 2220096 2322642 2445812 2432525 2353272
5911 2353272 2408102 2358434 2243503 2433946 2491174 2494732 2675014 2546936 2501490 2539340 2582816
5900 2582816 2548579 2569278 2446266 2460888 2520139 2446774 2449019 2381211 2465805 2440583 2440324 2441436
$$ packed form
5977B473768J04287j11648O8773k1405j11530k22090J40494J84128O4853r5214
5967B474416n8305O9439j22719j62568K1985R2719N2038L9811J8501l1014m8791
5956B345512n6637q252L0897J41222j185j11002j5784L4779j0122m8170k5597
5945B275661K2151J63847J1070m3288p0019j9331l385O097O364M586j9666k214
5933B331873N3874N1684J07367M5162j91798n825J07693j14402k0119L7363Q5094
5922B487966k5583O6577p0813j44054j48261M1162J3102J02546J23170j3287p9253
5911B353272N4830m9668j14931J90443N7228L558J80282j28078m5446L7850M3476
5900B582816l4237K0699j23012J4622N9251p3365K245o7808Q4594k5222k59J112
$$ plain form
5888 2441436 2518983 2470517 2548740 2554918 2550649 2646933 2638348 2608805 2701988 2654431 2706476 2631725
5876 2631725 2665316 2674094 2646732 2600053 2679710 2691229 2647139 2579571 2576883 2583588 2656097 2730804
5864 2730804 2729108 2737989 2760932 2679532 2709905 2844312 2902816 2960974 2987003 2979120 2955674 2920163
5852 2920163 2918631 2998675 3072982 3181820 3284593 3352612 3362349 3356014 3397414 3476692 3498983 3466269
5840 3466269 3757695 3800334 3705908 3834799 3963670 3965694 4041806 4103758 4049876 4187904 4255352
5829 4255352 4301084 4395315 4439721 4397024 4499033 4544349 4709341 4801630 4863285 4992570 5174462
5818 5174462 5386567 5537177 5696121 5882431 6193911 6564425 6813724 7124256 7419159 7606511
5808 7606511 7998067 8307101 8388521 8563892 8559522 8601819 8551702 8521739 8452142 8430844 8450296
$$ packed form
5888B441436P7547m8466P8223O178m269R6284q585k9543R3183m7557N2045p4751
5876B631725L3591Q778k7362m6679P9657J1519m4090o7568k688O705P2509P4707
5864B730804j696Q881K2943q1400L0373J34407N8504N8158K6029p883k3446l5511
5852B920163j532Q0044P4307J08838J02773O8019R737o335M1400P9278K2291l2714
5840C466269K91426M2639r4426J28891J28871K024P6112O1952n3882J38028O7448
5829D255352M5732R4231M4406m2697J02009M5316J64992R2289O1655J29285J81892
5818E174462K12105J50610J58944J86310L11480L70514K49299L10532K94903J87352
5808G606511L91556L09034Q1420J75371m370M2297n0117k9963o9597k1298J9452
$$ plain form
5797 8450296 8503117 8612035 8643723 8884541 9194548 9525886 9997961 10564596 11171868 11879032
5787 11879032 12545176 13227677 13890615 14411795 14969851 15274280 15615973 15666789 15505705 15352433
5777 15352433 15097869 14700344 14405854 14134280 13813420 13622871 13624620 13650568 13714937 13834333
5767 13834333 14080421 14488612 14999786 15731412 16299631 16793466 17441046 18091248 18639411
5758 18639411 18817964 18936240 18838295 18617566 18312229 17718936 17119699 16521982 15968033 15508073
5748 15508073 15063181 14670303 14386772 14248824 14199763 14154031 14333759 14597699 14952058 15356635
5738 15356635 15787886 16231788 16611857 17007828 17215662 17420650 17338067 17153427 16900799 16421297
5728 16421297 15893780 15190104 14634210 14021587 13699886 13332532 13138520 13143942 13163760 13140853
$$ packed form
5797H450296N2821J08918L1688K40818L10007L31338M72075N66635O07272P07164
5787A1879032O66144O82501O62938N21180N58056L04429L41693N0816j61084j53272
5777A5352433k54564l97525k94490k71574l20860j90549J749K5948O4369J19396
5767A3834333K46088M08191N11174P31626N68219M93835O47580O50202N48163
5758A8639411J78553J18276r7945k20729l05337n93293n99237n97717n53949m59960
5748A5508073m44892l92878k83531j37948m9061m5732J79728K63940L54359M04577
5738A5356635M31251M43902L80069L95971K07834K04988q2583j84640k52628m79502
5728A6421297n27517p03676n55894o12623l21701l67354j94012N422J9818k2907
$$ plain form
5718 13140853 13182524 13315532 13583953 13838942 14439516 14948774 15450703 15988291 16472069 16691730
5708 16691730 16707912 16500992 15915911 15193350 14669564 14112828 13580047 13227692 12982526 12694822
5698 12694822 12389894 11998288 11566618 11496775 11365321 11158734 11143275 11255816 11443594 11591293
5688 11591293 11601311 11657406 11768197 11854025 11839514 12028250 12315502 12485601 12706169 13070677
5678 13070677 13490446 13863387 14536754 15026039 15588642 16448656 17519565 18542842 19711102
5669 19711102 20961111 22317262 23996619 26011377 28541931 31463040 34785040 38128315
5661 38128315 41738974 45219393 48236898 50800901 52554497 53020303 52966354 53339768 54085914
5652 54085914 54886547 55685456 55820029 55086843 52985179 49886525 47021550 44926373 43523804
$$ packed form
5718A3140853M1671J33008K68421K54989O00574N09258N01929N37588M83778K19661
5708A6691730J6182k06920n85081p22561n23786n56736n32781l52355k45166k87704
5698A2694822l04928l91606m31670o9843j31454k06587j5459J12541J87778J47699
5688A1591293J0018N6095J10791Q5828j4511J88736K87252J70099K20568L64508
5678A3070677M19769L72941O73367M89285N62603Q60014J070909J023277J168260
5669A9711102J250009J356151J679357K014758K530554K921109L322000L343275
5661C8128315L610659L480419L017505K564003J753596M65806n3949L73414P46146
5652E4085914Q00633P98909J34573p33186k101664l098654k864975k095177j402569
$$ plain form
5643 43523804 43015775 43324916 44055466 44938028 45723631 46481924 46978952 46711372 45958558
5634 45958558 44176411 42198796 40736682 39954263 39932420 40232013 40658928 41123444 41187964
5625 41187964 40704931 39671656 37557944 34997255 32425306 30367766 28790670 27414364
5617 27414364 26332209 25181635 24372600 23751504 23080933 22483482 22111651 21688770 21588374
5608 21588374 21428016 21321874 21340125 21521102 21661874 21876579 22264977 22347780 22293415 22286904
5598 22286904 22300857 21999132 21837734 21702210 21527700 21445747 21620143 21920772 22387932 22955016
5588 22955016 23632084 24329672 25314965 26444873 27662295 29091400 30599716 31973390 33115901
5579 33115901 34292447 35385648 36215479 36886541 37650552 38256634 38875736 39520785 40232802
$$ packed form
5643D3523804n08029L09141P30550Q82562P85603P58293M97028k67580p52814
5634D5958558j782147j977615j462114p82419k1843K99593M26915M64516O4520
5625D1187964m83033j033275k113712k560689k571949k057540j577096j376306
5617B7414364j082155j150574q09035o21096o70571n97451l71831m22881j00396
5608B1588374j60358j06142J8251J80977J40772K14705L88398Q2803n4365o511
5598B2286904J3953l01725j61398j35524j74510q1953J74396L00629M67160N67084
5588B2955016O77068O97588R85293J129908J217422J429105J508316J373674J142511
5579C3115901J176546J093201Q29831O71062P64011O06082O19102O45049P12017
$$ plain form
5570 40232802 41344194 42172552 42844691 43313020 43859712 44799783 45882519 47400656 49513744
5561 49513744 51798413 54260824 56695362 58857112 60616296 62001087 63025468 63453230
5553 63453230 63568446 63600501 63520707 63343777 62929170 62419331 61855503 61474644 60980155 60361110
5543 60361110 59566059 59013958 58969954 59388821 60322698 61898762 63859863 65908553 68103925
5534 68103925 70261058 72127471 73635644 74591065 74641023 73952864 72646642 70596239 68197994
5525 68197994 65831265 63306516 60625398 58286995 56130325 54285118 52783452 51552089
5517 51552089 50807195 50295043 50147289 50258022 50485193 50724921 51145602 51597046 52307567
5508 52307567 52892232 53430959 53749954 53846805 53672231 53287851 52340082 50929960 49351627
$$ packed form
5570D0232802J111392Q28358O72139M68329N46692R40071J082736J518137K113088
5561D9513744K284669K462411K434538K161750J759184J384791J024381M27762
5553F3453230J15216L2055p9794j76930m14607n09839n63828l80859m94489o19045
5543F0361110p95051n52101m4004M18867R33877J576064J961101K048690K195372
5534F8103925K157133J866413J508173R55421M9958o88159j306222k050403k398245
5525F8197994k366729k524749k681118k338403k156670j845207j501666j231363
5517E1552089p44894n12152j47754J10733K27171K39728M20681M51444P10521
5508E2307567N84665N38727L18995R6851j74574l84380r47769j410122j578333
$$ plain form
5499 49351627 47400578 45276561 43226794 41109619 39142263 37603662 36239124 35108409
5491 35108409 34045891 33401424 32983369 32574471 32319832 32227439 32352896 32469947 32463257 32346882
5481 32346882 32085433 31556436 30920376 30088355 29056494 28130972 27254891 26331316 25589594
5472 25589594 24952228 24401853 24094677 23674212 23333540 22998175 22712661 22265739 21922389
5463 21922389 21710872 21347854 21033886 20882326 20680476 20549458 20573674 20731316 20782773 20810004
5453 20810004 20768634 20962854 21153687 21286482 21443825 21775041 22116312 22346306 22932846 23556978
5443 23556978 24078141 24718061 25519576 26455140 27250169 28032752 28810773 29575447 30363009
5434 30363009 31028232 31567387 32059908 32628840 33222310 33813994 34211772 34728905 35343706
$$ packed form
5499D9351627j951049k124017k049767k117175j967356j538601j364538j130715
5491C5108409j062518o44467m18055m08898k54639r2393J25457J17051o690j16375
5481C2346882k61449n28997o36060q32021j031861r25522q76081r23575p41722
5472B5589594o37366n50375l07176m20465l40672l35365k85514m46922l43350
5463B1922389k11517l63018l13968j51560k01850j31018K4216J57642N1457K7231
5453B0810004m1370J94220J90833J32795J57343L31216L41271K29994N86540O24132
5443B3556978N21163O39920Q01515R35564P95029P82583P78021P64674P87562
5434C0363009O65223N39155M92521N68932N93470N91684L97778N17133O14801
$$ plain form
5425 35343706 36265418 37170998 38205910 39525131 40772468 42283236 43954813 45820661
5417 45820661 48053361 50278472 52742594 55386340 58609829 62244307 66247748 70759790
5409 70759790 76010299 82082580 88682746 96071907 104167832 112952027 122866806 134185812
5401 134185812 147409973 163159644 182189958 206273976 236579445 272732577 313141175
5394 313141175 354417539 394209110 429051863 453767300 463655470 456089351 430266436
5387 430266436 394618468 361274016 334691261 314265881 298495444 285889814 275168406
5380 275168406 266726493 261111395 258128545 258227833 262141524 269881038 281191831 295259796
5372 295259796 311156159 328470348 346184118 362382702 374034859 378911400 374946891
$$ packed form
5425C5343706R21712R05580J034912J319221J247337J510768J671577J865848
5417D5820661K232700K225111K464122K643746L223489L634478M003441M512042
5409G0759790N250509O072281O600166P389161Q095925Q784195R914779J1319006
5401A34185812J3224161J5749671J9030314K4084018L0305469L6153132M0408598
5394C13141175M1276364L9791571L4842753K4715437R888170p566119k5822915
5387D30266436l5647968l3344452k6582755k0425380j5770437j2605630j0721408
5380B75168406q441913n615098k982850R9288L913691P739514J1310793J4067965
5372B95259796J5896363J7314189J7713770J6198584J1652157M876541l964509
$$ plain form
5365 374946891 362309835 344415074 322868455 300214843 279242213 259462408 240726297
5358 240726297 223875606 207935197 193614954 181585603 171410133 162826549 155396897
5351 155396897 148720659 142271994 136013575 129255430 121709874 114324190 107561196 101512714
5343 101512714 96231849 91671654 87395256 83730376 80203884 77024770 73975772 71218234
5335 71218234 68961393 66906582 65090287 63575955 62271605 61137805 60102742 59135760
5327 59135760 58202746 57342776 56545297 55724945 54963750 54358803 54057931 53932134 53753638
5318 53753638 53754443 53807778 54088074 54417323 54875298 55703156 56640566 57814663 59257403 61240868
5308 61240868 63769851 66909351 70765120 74985469 79606328 84959015 90611904 95942002
$$ packed form
5365C74946891j2637056j7894761k1546619k2653612k0972630j9779805j8736111
5358B40726297j6850691j5940409j4320243j2029351j0175470q583584p429652
5351A55396897o676238o448665o258419o758145p545556p385684o762994o048482
5343A01512714n280865m560195m276398l664880l526492l179114l048998k757538
5335G1218234k256841k054811j816295j514332j304350j133800j035063r66982
5327E9135760r33014q59970p97479q20352p61195o04947l00872j25797j78496
5318E3753638Q05N3335K80296L29249M57975Q27858R37410J174097J442740J983465
5308F1240868K528983L139500L855769M220349M620859N352687N652889N330098
$$ plain form
5300 95942002 100664114 104229337 106376600 107974431 108895744 108877947 107774362 105484422 103437801
5291 103437801 102423794 102315013 103227257 105049495 107533192 110878435 114978260 120013739
5283 120013739 126118749 133865279 143958593 156009992 169756882 184948678 201460918
5276 201460918 218513783 234476948 248588911 258436073 263740665 266840683 268151081 265862120
5268 265862120 260193073 252780850 246586299 244339381 245994222 251322915 259838682 270556786
5260 270556786 282008006 294071885 304526967 312403277 320176151 328609895 336140803 345666900
5252 345666900 357810578 371597114 388828290 408728949 430105975 449186460 463763790
5245 463763790 471637202 466635905 455757509 447413788 440028136 431392801 418214007 398232809
$$ packed form
5300I5942002M722112L565223K147263J597831R21313j7797j103585k289940k046621
5291A03437801j014007j08781R12244J822238K483697L345243M099825N035479
5283A20013739O105010P746530J0093314J2051399J3746890J5191796J6512240
5276B01460918J7052865J5963165J4111963R847162N304592L100018J310398k288961
5268B65862120n669047p412223o194551k246918J654841N328693Q515767J0718104
5260B70556786J1451220J2063879J0455082P876310P772874Q433744P530908R526097
5252C45666900J2143678J3786536J7231176J9900659K1377026J9080485J4577330
5245D63763790P873412n001297j0878396q343721p385652q635335j3178794j9981198
$$ plain form
5237 398232809 372191402 346366221 325801107 310017669 298193714 289867471 283546916
5230 283546916 277856800 271193389 262890451 253675429 243756255 235868164 230695939 227520935
5222 227520935 225754936 224013366 221621128 217313558 210365400 203108091 196856970 190931915
5214 190931915 184631364 177316584 168315463 158628596 150797640 144703345 139980265 136561530
5206 136561530 133820061 131461789 128692018 124834970 119463616 111837270 103898678 96905323
5198 96905323 90993362 85838492 81362646 77285124 73775702 70389937 67294493 64441417
5190 64441417 61714823 59383873 57301987 55430593 53603273 52158324 50579431 49317893
5182 49317893 47883498 46598068 45603236 44671355 43695459 42894756 42099587 41227816 40590729
$$ packed form
5237C98232809k6041407k5825181k0565114j5783438j1823955q326243o320555
5230B83546916n690116o663411q302938r215022r919174p888091n172225l175004
5222B27520935j765999j741570k392238m307570o948158p257309o251121n925055
5214A90931915o300551p314780r001121r686867p830956o094295m723080l418735
5206A36561530k741469k358272k769771l857048n371354p626346p938592o993355
5198I6905323n911961n154870m475846m077522l509422l385765l095444k853076
5190F4441417k726594k330950k081886j871394j827320j444949j578893j261538
5182D9317893j434395j285430r94832r31881r75896q00703p95169q71771o37087
$$ plain form
5173 40590729 39998652 39483757 39099469 38677882 38357529 38032184 37636809 37559610 37537718 37341681
5163 37341681 37342703 37184711 37213353 37507081 37684966 37945301 38221566 38570317 39018754 39737657
5153 39737657 40425623 41386284 42569392 44019982 45541807 47514098 49879465 52257528
5145 52257528 55205913 58625250 62434522 66954449 72516290 79425626 87785676 97786082
5137 97786082 109721663 123093711 137009731 150027502 161382648 168872756 171660532
5130 171660532 170412112 163968386 152527497 138512809 125377269 114633620 106103630
5123 106103630 99237864 93419475 88358858 84323718 80700425 77561426 75091399 73204984
5115 73204984 71888119 71099271 70746481 70735045 71206730 72330254 74165529 76798776 80310336
$$ packed form
5173D0590729n92077n14895l84288m21587l20353l25345l95375p7199k1892j96037
5163C7341681J022j57992K8642K93728J77885K60335K76265L48751M48437P18903
5153C9737657O87966R60661J183108J450590J521825J972291K365367K378063
5145E2257528K948385L419337L809272M519927N561841O909336Q360050J0000406
5137I7786082J1935581J3372048J3916020J3017771J1355146P490108K787776
5130A71660532j248420o443726j1440889j4014688j3135540j0743649q529990
5123A06103630o865766n818389n060617m035140l623293l138999k470027j886415
5115G3204984j316865p88848l52790j1436M71685J123524J835275K633247L511560
$$ plain form
5106 80310336 84459200 89112534 94170476 99511172 104987461 110792978 117187848 124243727
5098 124243727 133872641 146753682 162044739 178388010 194955890 210506717 222490541
5091 222490541 228910102 228621391 219207764 205340196 194095116 186329524 181901647 180803527
5083 180803527 182452706 186921773 193739952 201583201 209361091 216299846 220707680 220601650
5075 220601650 214992774 201087031 183105953 166648529 153149389 142505711 133937336
5068 133937336 126514248 119690515 113685793 107838335 101342989 95178520 90110025 85824878
5060 85824878 82304667 79431951 76749014 74501719 72651897 71211032 70110377 69328410
5052 69328410 68965132 69070748 69421486 70278018 71433092 72952439 75143656 77809312 81367016
$$ packed form
5106H0310336M148864M653334N057942N340696N476289N805517O394870P055879
5098A24243727R628914J2881041J5291057J6343271J6567880J5550827J1983824
5091B22490541O419561k88711r413627j3867568j1245080p765592m427877j098120
5083A80803527J649179M469067O818179P843249P777890O938755M407834j06030
5075B20601650n608876j3905743j7981078j6457424j3499140j0643678q568375
5068A33937336p423088o823733o004722n847458o495346o164469n068495m285147
5060H5824878l520211k872716k682937k247295j849822j440865j100655p81967
5052F9328410l63278J05616L50738Q56532J155074J519347K191217K665656L557704
$$ plain form
5043 81367016 86258320 92134506 98759609 105780519 113082509 120272697 126892039 132579597
5035 132579597 136937206 141307987 146700006 153086748 160603548 169402214 178467736 186634338
5027 186634338 193342750 195826241 195090769 194935490 194359712 193247008 190217109 185853430
5019 185853430 182550757 182196948 185105170 190709185 198476826 208406926 220355221 233710502
5011 233710502 246114977 256262929 265060488 273137527 279398096 282318438 280547518 271658127
5003 271658127 260878391 251864089 244478709 237653284 229966429 222748997 216222334 210325665
4995 210325665 206673885 205125557 204517854 205343258 206567886 206177932 204575378 202862815
4987 202862815 199392962 194016937 187289457 179456330 168358436 155386449 144039559 134210270
$$ packed form
5043H1367016M891304N876186O625103P020910P301990P190188O619342N687558
5035A32579597M357609M370781N392019O386742P516800Q798666R065522Q166602
5027A86634338O708412K483491p35472j55279n75778j112704l029899m363679
5019A85853430l302673l53809K908222N604015P767641R930100J1948295J3355281
5011B33710502J2404475J0147952Q797559Q077039O260569K920342j770920q889391
5003B71658127j0779736r014302p385380o825425p686855p217432o526663n896669
4995B10325665l651780j548328o07703Q25404J224628l89954j602554j712563
4987B02862815l469853n376025o727480p833127j1097894j2971987j1346890r829289
$$ plain form
4979 134210270 126206473 119127749 112893403 107058246 101729065 97000700 92399931 87896737
4971 87896737 83786576 79889358 76358114 72892371 69680816 66876896 64460528 62463760
4963 62463760 60554885 58906908 57695993 56758895 55957923 55496573 55190726 55025187 54923589
4954 54923589 54992598 55013289 54974793 54826060 54776144 54764464 54515031 54338295 53830150 53286944
4944 53286944 52528518 51792722 51172496 50465649 49922635 49504329 49203178 49090213 48903499
4935 48903499 48613508 48226380 47873956 47316761 46631925 46068784 45474569 45005336 44833530
4926 44833530 45049188 45433028 46003230 46850068 47650096 48428759 49474898 50326694 50835861
4917 50835861 51402441 51677981 51596205 51513004 51035605 50499387 50001710 49789721 49845668 50252779
$$ packed form
4979A34210270q003797p078724o234346n835157n329181m728365m600769m503194
4971H7896737m110161l897218l531244l465743l211555k803920k416368j996768
4963F2463760j908875j647977j210915r37098q00972m61350l05847j65539j01598
4954E4923589O9009K0691l8496j48733m9916j1680k49433j76736n08145n43206
4944E3286944p58426p35796o20226p06847n43014m18306l01151j12965j86714
4935D8903499k89991l87128l52424n57195o84836n63141n94215m69233j71806
4926D4833530K15658L83840N70202Q46838Q00028P78663J046139Q51796N09167
4917E0835861N66580K75540q1776q3201m77399n36218m97677k11989N5947M07111
$$ plain form
4907 50252779 50733153 51786445 52896523 54143586 56128089 58382012 61051395 63913447
4899 63913447 67277045 71231481 75455982 79706901 83745412 87189116 89994697 91628547
4891 91628547 91820013 90837199 88911204 86103347 83020975 79989802 77098411 74524274
4883 74524274 72240672 70334179 68847070 67681450 66583651 66160662 66118206 66354250 66956347
4874 66956347 68216691 69681307 71624747 73934241 76437358 78981564 81386237 83482645
4866 83482645 84831025 85175913 84287403 82163453 79143523 75525724 71314845 67189419
4858 67189419 63463682 59745902 56326785 53264108 50463202 47978213 45521642 43311580
4850 43311580 41248033 39427456 37685255 35863792 34443499 33007357 31548474 30067196
$$ packed form
4907E0252779M80374J053292J110078J247063J984503K253923K669383K862052
4899F3913447L363598L954436M224501M250919M038511L443704K805581J633850
4891I1628547J91466r82814j925995k807857l082372l031173k891391k574137
4883G4524274k283602j906493j487109j165620j097799m22989m2456K36044O02097
4874F6956347J260344J464616J943440K309494K503117K544206K404673K096408
4866H3482645J348380L44888q88510k123950l019930l617799m210879m125426
4858F7189419l725737l717780l419117l062677k800906k484989k456571k210062
4850D3311580k063547j820577j742201j821463j420293j436142j458883j481278
$$ plain form
4842 30067196 28702148 27585057 26520365 25600833 24744675 23935395 23234490 22566431 22001044
4833 22001044 21482478 21130543 20681911 20218947 19831795 19443954 19106360 18714762 18216148
4824 18216148 17695919 17380143 16953277 16731395 16373437 16014169 15452954 15186009 14968822
4815 14968822 14587033 14297526 13994522 13738092 13453664 13192205 13254112 13000564 12662249 12450516
4805 12450516 12226085 12043511 11805096 11743437 11632215 11377346 11369061 11290519 11182383 11116792
4795 11116792 11222885 11146764 10828689 10889931 11125259 11130379 11118980 11190170 11196895 11140839 11161699
4784 11161699 11273468 11532821 11501991 11597293 11780304 12051740 12301317 12444397 12701124 12825067
4774 12825067 13101619 13436137 13805682 14254746 14809018 15541612 16208659 16755308 17155721
$$ packed form
4842C0067196j365048j117091j064692r19532q56158q09280p00905o68059n65387
4833B2001044n18566l51935m48632m62964l87152l87841l37594l91598m98614
4824A8216148n20229l15776m26866k21882l57958l59268n61215k66945k17187
4815A4968822l81789k89507l03004k56430k84428k61459O1907k53548l38315k11733
4805A2450516k24431j82574k38415o1659j11222k54869q285p8542j08136o5591
4795A1116792J06093p6121l18075O1242K35328N120j1399P1190O725n6056K0860
4784A1161699J11769K59353l0830R5302J83011K71436K49577J43080K56727J23943
4774A2825067K76552L34518L69545M49064N54272P32594O67047N46649M00413
$$ plain form
4765 17155721 17263295 17232100 17170805 17085525 17155390 17475642 17889853 18303344 18640198 19146754
4755 19146754 19586244 19945580 20002437 19926615 19929870 20164095 20574206 20895485 21314035 21674406
4745 21674406 21952531 22175262 22199357 22231317 22213209 22393538 22722288 23311570 23789496 24313145
4735 24313145 24898471 25694343 26251888 26711242 26964358 27274986 27783133 28285572 29057156
4726 29057156 29972452 31095443 32420847 33974480 35833662 37883250 40368375 43234797
4718 43234797 46531902 50228220 54363680 58938331 64195308 70265380 77514986 86169636
4710 86169636 97023558 110651848 126916735 144971673 163475838 181893434 198493702
4703 198493702 211764193 219948208 222129236 219399845 215829373 216614360 221557132 229088080
$$ packed form
4765A7155721J07574l1195o1295q5280O9865L20252M14211M13491L36854N06556
4755A9146754M39490L59336N6857p5822L255K34225M10111L21279M18550L60371
4745B1674406K78125K22731K4095L1960j8108J80329L28750N89282M77926N23649
4735B4313145N85326P95872N57545M59354K53116L10628N08147N02439P71584
4726B9057156R15296J122991J325404J553633J859182K049588K485125K866422
4718D3234797L297105L696318M135460M574651N256977O070072P249606Q654650
4710H6169636J0853922J3628290J6264887J8054938J8504165J8417596J6600268
4703A98493702J3270491Q184015K181028k729391l570472P84987M942772P530948
$$ plain form
4695 229088080 237988106 246345380 250989109 251136594 245384284 231520834 217900084 209795354
4687 209795354 206856076 208549917 213442526 219832093 226993448 233436827 238004740 238882529
4679 238882529 235753213 230808435 226278125 223150269 221922235 222388573 223123114 222445604
4671 222445604 218440414 209265923 194118463 175171529 156859359 141474955 128876436
4664 128876436 118331218 109013895 100895019 93681078 87120640 80999441 75501227 70558702
4656 70558702 66135684 62159834 58792641 55499788 52466462 49585476 46925302 44691832
4648 44691832 42479862 40514714 38648793 36810159 35367833 33976634 32782039 31619787
4640 31619787 30577517 29528126 28493339 27623416 26586934 25627589 24851270 23938228 23232100
$$ packed form
4695B29088080Q900026Q357274M643729J47485n752310j3863450j3620750q104730
4687B09795354k939278J693841M892609O389567P161355O443379M567913Q77789
4679B38882529l129316m944778m530310l127856j228034M66338P34541o77510
4671B22445604m005190r174491j5147460j8946934j8312170j5384404j2598519
4664A28876436j0545218r317323q118876p213941o560438o121199n498214m942525
4656G0558702m423018l975850l367193l292853l033326k880986k660174k233470
4648D4691832k211970j965148j865921j838634j442326j391199j194595j162252
4640C1619787j042270j049391j034787q69923j036482r59345p76319r13042p06128
$$ plain form
4631 23232100 22526220 21814798 21213642 20678446 20205198 19655026 19067339 18490802 18046414
4622 18046414 17716101 17107299 16533985 16199676 15824967 15240631 14913619 14605678 14256592
4613 14256592 13911374 13571246 13417078 13339259 13210229 13047720 12907224 12658240 12399105 12149416
4603 12149416 12069285 12009980 11763575 11426752 11372451 11000482 10805893 10648911 10460320 10207828
4593 10207828 9935916 9853085 9704918 9486351 9535994 9272271 9076897 9000928 8887712 8778200
4583 8778200 8543531 8402617 8278041 8071990 7813268 7670820 7380925 7163231 7177232 7086747
4573 7086747 6968435 6946115 6826041 6549773 6384159 6324184 6257717 6082920 6066433 6061330 5930801
4562 5930801 5780824 5784267 5655497 5569710 5475441 5289042 5352160 5152851 4977884 4990141 4819738
$$ packed form
4631B3232100p05880p11422o01156n35196m73248n50172n87687n76537m44388
4622A8046414l30313o08802n73314l34309l74709n84336l27012l07941l49086
4613A4256592l45218l40128j54168p7819j29030j62509j40496k48984k59135k49689
4603A2149416q0131n9305k46405l36823n4301l71969j94589j56982j88591k52492
4593A0207828k71912q2831j48167k18567M9643k63723j95374p5969j13216j09512
4583H778200k34669j40914j24576k06051k58722j42448k89895k17694J4001r0485
4573G086747j18312k2320j20074k76268j65614n9975o6467j74797j6487n103j30529
4562E930801j49977L443j28770q5787r4269j86399O3118j99309j74967J2257j70403
$$ plain form
4551 4819738 4754165 4914565 4886359 4676675 4492898 4534834 4443692 4421713 4285333 4259692 4254635
4540 4254635 4050195 3917479 3958632 3944899 3895661 3875230 3740347 3888594 3758266 3627375
4530 3627375 3545179 3512554 3562435 3582955 3446464 3408680 3332882 3147321 3136332 3008348 3013415
4519 3013415 3039192 3010985 3033851 2982366 2936629 2991033 2871513 2740591 2847728 3025134 2787372
4508 2787372 2769700 2675980 2564992 2658145 2656715 2556209 2622041 2607685 2605001 2719483 2722262
4497 2722262 2902925 2935255 2941082 2825956 2797892 2820099 2992089 3141632 2911790 2660288
4487 2660288 2566391 2596463 2369203 2341079 2383193 2263390 2190507 2239065 2185592 2250904 2146992
4476 2146992 2074161 2033082 2023548 2068466 1962232 1937233 1988045 1792899 1771677 1861826 1819197
$$ packed form
4551D819738o5573J60400k8206k09684j83777M1936r1142k1979j36380k5641n057
4540D254635k04440j32716M1153j3733m9238k0431j34883J48247j30328j30891
4530C627375q2196l2625M9881K0520j36491l7784p5798j85561j0989j27984N067
4519C013415K5777k8207K2866n1485m5737N4404j19520j30922J07137J77406k37762
4508B787372j7672r3720j10988R3153j430j00506O5832j4356k684J14482K779
4497B722262J80663L2330N827j15126k8064K2207J71990J49543k29842k51502
4487B660288r3897L0072k27260k8124M2114j19803p2883M8558n3473O5312j03912
4476B146992p2831m1079r534M4918j06234k4999N0812j95146k1222R0149m2629
$$ plain form
4465 1819197 1886089 1905175 1816040 1806067 1856031 1827723 1826004 1792446 1697783 1598942 1537212 1539825
4453 1539825 1573794 1591451 1561074 1527493 1479660 1427603 1345458 1305539 1276710 1299384 1436179
4442 1436179 1551062 1425352 1420016 1417461 1285713 1358774 1307270 1239610 1347172 1338247 1284535
4431 1284535 1361202 1259704 1329934 1382659 1366247 1270040 1243875 1269210 1323387 1321920 1258409
4420 1258409 1143145 1092548 1048800 1083021 1079132 1134979 1039789 999196 1018895 1152877 1072353
4409 1072353 990375 980753 1082446 1154417 1089882 934969 1071998 1089731 1020969 1050189 1025347
4398 1025347 1018434 940295 931155 906234 896388 964050 1016975 1029593 1036673 1034249 1005635 1048646
4386 1048646 998669 973770 990616 1095304 1026799 846680 876674 804407 822509 814650 856527
$$ packed form
4465A819197O6892J9086q9135r973M9964k8308j719l3558r4663r8841o1730K613
4453A539825L3969J7657l0377l3581m7833n2057q2145l9919k8829K2674J36795
4442A436179J14883j25710n336k555j31748P3061n1504o7660J07562q925n3712
4431A284535P6667j01498P0230N2725j6412r6207k6165K5335N4177j467o3511
4420A258409j15264n0597m3748L4221l889N5847r5190m0593J9699J33982q0524
4409A072353q1978r622J01693P1971o4535j54913J37029J7733o8762K9220k4842
4398A025347o913p8139r140k4921r846O7662N2925J2618P080k424k8614M3011
4386A048646m9977k4899J6846J04688o8505j80119K9994p2267J8102p859M1877
$$ plain form
4375 856527 809885 937687 1003885 1040141 993534 1024951 982644 1005677 994460 1022300 1028531 1110714
4363 1110714 1052613 953187 841843 836239 1119172 1135353 1097980 955399 910972 1015732 1132868
4352 1132868 1111125 1238393 1412265 1338439 1402310 1459818 1476259 1567498 1654498 1587439 1413506
4341 1413506 1384101 1275963 1282814 1104450 1100221 1174022 958196 989921 920646 865064 948447
4330 948447 998349 877836 1024331 1075441 1092432 936675 921186 897433 1033068 1140387 1156677
4319 1156677 1022829 1060387 1143828 988536 1171604 1256940 1233264 1253321 1343218 1420394 1466033
4308 1466033 1633822 1608686 1590414 1782392 1910555 1893023 1811365 1942168 2041462 2036543 1992022
4297 1992022 1925284 1996538 2065520 2098402 2194245 2225388 2060831 1993706 1953084 1814787 1791240
$$ packed form
4375H56527m6642J27802O6198L6256m6607L1417m2307K3033j1217K7840O231Q2183
4363A110714n8101r9426j11344n604K82933J6181l7373j42581m4427J04760J17136
4352A132868k1743J27268J73872p3826O3871N7508J6441R1239Q7000o7059j73933
4341A413506k9405j08138O851j78364m229P3801k15826L1725o9275n5582Q3383
4330I48447M9902j20513J46495N1110J6991j55757j5489k3753J35635J07319J6290
4319A156677j33848L7558Q3441j55292J83068Q5336k3676K0057Q9897P7176M5639
4308A466033J67789k5136j8272J91978J28163j7532q1658J30803R9294m919m4521
4297A992022o6738P1254O8982L2882R5843L1143j64557o7125m0622j38297k3547
$$ plain form
4286 1791240 1735330 1802787 1939258 1979213 1869475 1930590 1991140 1939828 1865530 1772658 1832745
4275 1832745 1837329 1806549 1821043 1846074 1809691 1707657 1688233 1534658 1421342 1436018 1342529
4264 1342529 1224162 1307271 1118321 1162621 1131841 1170587 1148821 1099489 1097017 951057 745518
4253 745518 772723 911197 1000663 1008511 1001339 1070001 883445 882846 1027563 1103754 1206545 1111350
4241 1111350 1134179 1172066 1217691 1312393 1122482 1183168 1233540 1265865 1364619 1375995 1305802
4230 1305802 1313069 1264794 1211338 1220426 1107196 1023722 917888 867436 1005814 1028916 953824
4219 953824 897176 969135 1089352 993137 1035564 1042521 956017 803928 860340 1070967 1204923
4208 1204923 1128111 1028168 999552 1005783 1138638 1036499 987055 983155 1022310 1065688 1144509
$$ packed form
4286A791240n5910O7457J36471L9955j09738O1115O0550n1312p4298r2872O0087
4275A832745M584l0780J4494K5031l6383j02034j9424j53575j13316J4676r3489
4264A342529j18367Q3109j88950M4300l0780L8746k1766m9332k472j45960k05539
4253G45518K7205J38474Q9466P848p172O8662j86556n99J44717P6191J02791r5195
4241A111350K2829L7887M5625R4702j89911O0686N0372L2325R8754J1376p0193
4230A305802P267m8275n3456R088j13230q3474j05834n0452J38378K3102p5092
4219I53824n6648P1959J20217r6215M2427O957q6504j52089N6412K10627J33956
4208A204923p6812r9943k8616O231J32855j02139m9444l900L9155M3378P8821
$$ plain form
4197 1144509 1122854 988545 1082149 1075689 1047851 1213539 1265779 1277980 1308942 1456206 1400534
4186 1400534 1409068 1359114 1277857 1348513 1378683 1263581 1251962 1308695 1418851 1553260 1624772
4175 1624772 1795634 1838722 1847726 1853316 2002676 1863643 1721311 1797149 1671579 1702978 1593761
4164 1593761 1549365 1589594 1517853 1503627 1543197 1486789 1464177 1383685 1394355 1409538 1480768
4153 1480768 1533749 1566529 1535695 1468832 1594222 1509941 1719469 1710575 1625242 1641157 1723592
4142 1723592 1655232 1699763 1667575 1767230 1843417 1829320 1861184 1917629 2137546 2073487 2246546
4131 2246546 2406582 2455870 2612149 2882063 2892074 2739280 2888430 3074295 3182279 3263036
4121 3263036 3329442 3592584 3803468 3672886 3794740 4174309 4343150 4559211 4820031 5105846
$$ packed form
4197A144509k1655j34309R3604o460k7838J65688N2240J2201L0962J47264n5672
4186A400534Q534m9954q1257P0656L0170j15102j1619N6733J10156J34409P1512
4175A624772J70862M3088R004N590J49360j39033j42332P5838j25570L1399j09217
4164A593761m4396M0229p1741j4226L9570n6408k2612q0492J0670J5183P1230
4153A480768N2981L2780l0834o6863J25390q4281K09528q894q5333J5915Q2435
4142A723592o8360M4531l2188R9655P6187j4097L1864N6445K19917o4059J73059
4131B246546J60036M9288J56279K69914J0011j52794J49150J85865J07984Q0757
4121C263036O6406K63142K10884j30582J21854L79569J68841K16061K60820K85815
$$ plain form
4111 5105846 5511398 5769088 6155990 6636557 6949971 7395617 7888136 8492885 9111793 9883677
4101 9883677 10607429 11481353 12425309 13448125 14596450 15780411 17176935 18773825 20296963
4092 20296963 22169891 24084390 26015883 28021832 29866736 31462138 32792891 33857990
4084 33857990 34171865 34095622 33481740 32416690 30984136 29310714 27681518 26026039 24381042
4075 24381042 22884796 21359107 19927470 18712106 17546933 16399041 15430112 14464459
4067 14464459 13467057 12694826 11865140 11154398 10724446 10131891 9482365 8953780 8436640
4058 8436640 7952293 7553824 7277158 6892754 6434284 6251055 6039403 5724699 5485606 5348090
4048 5348090 5112040 4833357 4628441 4525570 4401522 4147741 4042305 3864666 3639492 3445589
$$ packed form
4111E105846M05552K57690L86902M80567L13414M45646M92519O04749O18908P71884
4101I883677P23752Q73924R43956J022816J148325J183961J396524J596890J523138
4092B0296963J872928J914499J931493K005949J844904J595402J330753J065099
4084C3857990L13875p6243o13882j065050j432554j673422j629196j655479j644997
4075B4381042j496246j525689j431637j215364j165173j147892r68929r65653
4067A4464459r97402p72231q29686p10742m29952n92555o49526n28585n17140
4058H436640m84347l98469k76666l84404m58470j83229k11652l14704k39093j37516
4048E348090k36050k78683k04916j02871j24048k53781j05436j77639k25174j93903
$$ plain form
4038 3445589 3300425 3380725 3395527 3224760 2942265 2882872 2852127 2749465 2671393 2534677
4028 2534677 2422600 2446745 2308408 2306980 2226281 2099815 2114194 2000223 1905647 1873340 1917061
4017 1917061 1828857 1856944 1823339 1772771 1825170 1648053 1552198 1563583 1474596 1515079 1474026
4006 1474026 1496841 1459587 1448520 1490290 1413453 1354666 1291069 1279210 1328325 1338875 1321414
3995 1321414 1248238 1261799 1017117 774005 1012197 1072740 1055438 1039022 1021304 1073859 1160579
3984 1160579 962349 1029751 861788 933772 1118584 953285 942622 913241 992609 1128188
3974 1128188 1075363 925431 1015424 1040136 976890 904622 898928 688538 818272 792977 738227
3963 738227 886652 878373 923395 818623 752530 695523 765399 821942 770594 792624 773245
$$ packed form
4038C445589j45164Q0300J4802j70767k82495n9393l0745j02662p8072j36716
4028B534677j12077K4145j38337j428q0699j26466J4379j13971r4576l2307M3721
4017A917061q8204K8087l3605n0568N2399j77117r5855J1385q8987M0483m1053
4006A474026K2815l7254j1067M1770p6837n8787o3597j1859M9115J0550j7461
3995A321414p3176J3561k44682k43112K38192O0543j7302j6416j7718N2555Q6720
3984A160579j98230O7402j67963P1984J84812j65299j0663k9381P9368J35579
3974A128188n2825j49932Q9993K4712o3246p2268n694k10390J29734k5295n4750
3963G38227J48425q279M5022j04772o6093n7007O9876N6543n1348K2030j9379
$$ plain form
3952 773245 769289 726079 668939 542586 547661 798463 758674 763402 790771 787424 708603 700855
3940 700855 565952 477439 424984 469308 539353 468714 583735 640357 623940 622884 610949
3929 610949 540486 569505 344083 426615 551752 595383 612356 681198 673943 542097 608287
3918 608287 644324 556159 432225 396606 477256 616239 580138 447380 523902 500335 498005
3907 498005 462012 587712 633864 595865 602318 566019 671687 585630 580940 480453 566222
3896 566222 647100 707030 700803 564523 580673 607169 599730 460382 515497 620445 664731
3885 664731 641572 747210 626979 552243 614843 558011 704330 768705 669938 746814 681555
3874 681555 744946 665365 474459 596974 719899 696936 571532 549780 705981 722729 695426
$$ packed form
3952G73245l956m3210n7140j26353N075K50802l9789M728K7369l347p8821p748
3940G00855j34903q8513n2455M4324P0045p0639J15021N6622j6417j056j1935
3929F10949p0463K9019k25422Q2532J25137M3631J6973O8842p255j31846O6190
3918F08287L6037q8165j23934l5619Q0650J38983l6101j32758P6522k3567k330
3907D98005l5993J25700M6152l7999O453l6299J05668q6057m690j00487Q5769
3896E66222Q0878N9930o227j36280J6150K6496p439j39348N5115J04948M4286
3885F64731k3159J05638j20231p4736O2600n6832J46319O4375r8767P6876o5259
3874F81555O3391p9581j90906J22515J22925k2963j25404k1752J56201J6748k7303
$$ plain form
3863 695426 660191 565935 620195 625736 741660 765447 955453 968135 861347 821483 812696
3852 812696 787570 867226 869398 746293 662758 679148 734147 649696 711055 661834 639773 840298
3840 840298 840214 840316 885961 707019 678986 655514 650586 760715 830830 807823 819946 772498
3828 772498 800294 902690 784976 844597 1020819 991798 961791 861381 911403 1024295 788771
3817 788771 848416 896870 820474 826142 907348 836728 939443 916368 862831 792338 869286 898821
3805 898821 747893 742998 813531 793043 694448 787147 898402 925234 877538 851726 858250 904762
3793 904762 952005 840628 789723 946717 871959 804884 919695 1101505 1249403 1204995 1040856
3782 1040856 992118 974432 898979 897834 949515 916428 967783 958930 913433 1033838 1027099 1015193
$$ packed form
3863F95426l5235r4256N4260N541J15924K3787J90006J2682j06788l9864q787
3852H12696k5126P9656K172j23105q3535J6390N4999q4451O1359m9221k2061K00525
3840H40298q4J02M5645j78942k8033k3472m928J10129P0115k3007J2123m7448
3828G72498K7796J02396j17714N9621J76222k9021l0007j00410N0022J12892k35524
3817G88771N9645M8454p6396N668Q1206p0620J02715k3075n3537p0493P6948K9535
3805H98821j50928m895P0533k0488r8595R2699J11255K6832m7696k5812O524M6512
3793I04762M7243j11377n0905J56994p4758o7075J14811J81810J47898m4408j64139
3782A040856m8738j7686p5453j145N1681l3087N1355q853m5497J20405o739j1906
$$ plain form
3770 1015193 961005 877597 857199 842525 905741 855496 772890 775683 874527 925134 856171 810611
3758 810611 853080 843406 856529 856727 768857 729585 793403 829995 863587 837193 767687 902696
3746 902696 1007882 885716 810412 743151 695768 646969 748953 747445 751608 749578 762220 855938
3734 855938 903503 877186 896156 868958 660366 880553 880938 853445 921206 737273 740684 760937
3722 760937 746193 786000 771991 811361 856365 861816 872994 708195 624852 824912 778542
3711 778542 680434 699498 750301 820885 869454 834860 842737 895061 834967 626501 577489 704764
3699 704764 659111 799547 780340 801968 917604 904651 948254 761298 715415 690603 666387
3688 666387 814907 907140 868424 787920 789727 841829 880691 653383 636574 729136 711865
$$ packed form
3770A015193n4188q3408k0398j4674O3216n0245q2606K793R8844N0607o8963m5560
3758H10611M2469r674J3123J98q7870l9272O3818L6592L3592k6394o9506J35009
3746I02696J05186j22166p5304o7261m7383m8799J01984j508M163k030J2642R3718
3734H55938M7565k6317J8970k7198k08592K20187L85k7493O7761j83933L411K0253
3722G60937j4744L9807j4009L9370M5004N451J1178j64799q3343K00060m6370
3711G78542r8108J9064N0803P0584M8569l4594P877N2324o0094k08466m9012J27275
3699G04764m5653J40436j9207K1628J15636j2953M3603j86956m5883k4812k4216
3688F66387J48520R2233l8716q0504J807N2102L8862k27308j6809R2562j7271
$$ plain form
3677 711865 624882 646392 736769 774207 742755 770989 685539 565044 607578 732724 678847
3666 678847 744136 689148 864639 892328 746068 636194 706856 897630 938014 921410 979403
3655 979403 1073332 990224 1015660 1037210 962377 886579 979328 1095219 1146579 1103010 1060218
3644 1060218 920493 1006147 1112652 935712 829249 979122 1144882 1148724 989913 1046844
3634 1046844 1051616 1011447 979359 1104818 1113852 1041679 1080436 1166987 1203849 1303059 1335041 1236322
3622 1236322 1331051 1397140 1327880 1352897 1461384 1410608 1387998 1409966 1348150 1477342 1600467
3611 1600467 1534100 1573709 1589736 1482753 1525788 1474483 1567321 1649154 1694032 1721878 1804407
3600 1804407 1897061 1738950 1669213 1730727 1868270 1897907 1854547 1827694 1821648 1825782 1908210
$$ packed form
3677G11865q6983K1510R0377L7438l1452K8234q5450j20495M2534J25146n3877
3666F78847O5289n4988J75491K7689j46260j09874P0662J90774M0384j6604N7993
3655I79403R3929q3108K5436K1550p4833p5798R2749J15891N1360m3569m2792
3644A060218j39725Q5654J06505j76940j06463J49873J65760L842j58811N6931
3634A046844M772m0169l2088J25459R034p2173L8757Q6551L6862R9210L1982r8719
3622A236322R4729O6089o9260K5017J08487n0776k2610K1968o1816J29192J23125
3611A600467o6367L9609J6027j06983M3035n1305R2838Q1833M4878K7846Q2529
3600A804407R2654j58111o9737O1514J37543K9637m3360k6853o046M134Q2428
$$ plain form
3589 1908210 2086428 1977456 1989086 2034813 1938925 2000668 2088536 2193380 2273146 2380140 2535603
3578 2535603 2522910 2557553 2575802 2612512 2632675 2669979 2754822 2834444 2823155 2894278 2938489
3567 2938489 3005299 2918953 2771092 2760315 2705436 2713249 2799343 2710615 2719190 2842350 2941342
3556 2941342 2966743 2757298 2753603 2793145 2736091 2818659 2972457 3061486 3134343 3129885 3138226 3147314
3544 3147314 3222786 3356369 3419430 3404305 3327775 3343320 3402522 3405087 3688085 3773284 3745621
3533 3745621 3674026 3795612 3925036 4026762 3929996 4042931 4308845 4536797 4641419 4572567
3523 4572567 4562630 4712778 4751387 4694445 4666737 4634142 4691552 4660611 4550446 4487318 4613172
3512 4613172 4692445 4718340 4684010 4648510 4708136 4617338 4503007 4626680 4794216 4665456 4685139
$$ packed form
3589A908210J78218j08972J1630M5727r5888O1743Q7868J04844P9766J06994J55463
3578B535603j2693L4643J8249L6710K0163L7304Q4843P9622j1289P1123M4211
3567B938489O6810q6346j47861j0777n4879P813Q6094q8728Q575J23160R8992
3556B941342K5401k09445l695L9542n7054Q2568J53798Q9029P2857m458Q341R088
3544C147314P5472J33583O3061j5125p6530J5545N9202K565K82998Q5199k7663
3533C745621p1595J21586J29424J01726r6766J12935K65914K27952J04622o8852
3523D572567r937J50148L8609n6942k7708l2595N7410l0941j10165o3128J25854
3512D613172P9273K5895l4330l5500N9626r0798j14331J23673J67536j28760J9683
$$ plain form
3501 4685139 4923676 5032429 5150949 5320727 5548671 5814825 6017111 6238034 6503103 6586172
3491 6586172 6747901 6740445 6752731 6719031 6680651 6662613 6619642 6559917 6502013 6489505 6644448
3480 6644448 6792242 6723662 6646828 6519309 6536428 6376974 6179238 5997618 6037897 6084030
3470 6084030 6127168 6002067 6139492 6338548 6562825 6721349 6841516 6979287 7092490 7153919
3460 7153919 7375509 7687655 7794184 7817979 7890702 7889838 7979324 8223232 8518670 8818622 8875199
3449 8875199 9360555 9603088 9933861 10237743 10550269 10827404 11239729 11742693 12228882 12823542
3439 12823542 13378752 13989466 14657043 15402123 16146564 16901994 17637790 18410047 19164169
3430 19164169 19824463 20529978 21339153 21978911 22198324 22438808 22522789 22085438 21386371 20556806
$$ packed form
3501D685139K38537J08753J18520J69778K27944K66154K02286K20923K65069Q3069
3491F586172J61729p456J2286l3700l8380j8038m2971n9725n7904j2508J54943
3480F644448J47794o8580p6834j27519J7119j59454j97736j81620M0279M6133
3470F084030M3138j25101J37425J99056K24277J58524J20167J37771J13203O1429
3460G153919K21590L12146J06529K3795P2723q64Q9486K43908K95438K99952N6577
3449H875199M85356K42533L30773L03882L12526K77135M12325N02964M86189N94660
3439A2823542N55210O10714O67577P45080P44441P55430P35796P72257P54122
3430A9164169O60294P05515Q09175O39758K19413K40484Q3981m37351o99067q29565
$$ plain form
3420 20556806 19711230 18902846 18061659 17451108 16816736 16211818 15807542 15554990 15111369
3411 15111369 14832860 14607631 14384686 14411029 14542627 14557861 14510016 14395662 14323118 14258549
3401 14258549 14185032 13884887 13367760 13085179 12798615 12753036 12647110 12659701 12657073 12538368
3391 12538368 12289314 11667143 11124242 10686387 10182601 9869674 9640089 9329455 9035787
3382 9035787 8773228 8523532 8266494 8155693 8185415 8085860 8085026 8186836 8239219 8201610 8274351
3371 8274351 8328078 8277398 7999495 7770100 7570134 7416937 7239685 7107398 7160240 7051220
3361 7051220 6848958 6697229 6634233 6342227 6148888 5902083 5644081 5440884 5395267 5195616
3351 5195616 5090682 4934162 4659371 4521583 4414216 4346099 4317288 4274429 4183873 4160142
$$ packed form
3420B0556806q45576q08384q41187o10551o34372o04918m04276k52552m43621
3411A5111369k78509k25229k22945K6343J31598J5234m7845j14354p2544o4569
3401A4258549p3517l00145n17127k82581k86564m5579j05926J2591k628j18705
3391A2538368k49054o22171n42901m37855n03786l12927k29585l10634k93668
3382I035787k62559k49696k57038j10801K9722r9555q34J01810N2383l7609P2741
3371H274351N3727n0680k77903k29395j99966j53197j77252j32287N2842j09020
3361G051220k02262j51729o2996k92006j93339k46805k58002k03197m5617j99651
3351E195616j04934j56520k74791j37788j07367o8117k8811m2859r0556k3731
$$ plain form
3341 4160142 4110420 4087265 4015633 4163816 4080758 4016977 4025566 3846755 3723965 3590357 3558757
3330 3558757 3616264 3536464 3372705 3299758 3315392 3310773 3160078 2993954 2981484 3072635 3118873
3319 3118873 3151892 3088559 3077424 3087668 3012702 2986522 3131021 3038047 2965685 3033496 3062261
3308 3062261 3251405 3374471 3430667 3383270 3455677 3430769 3423320 3296320 3182260 2985366 2928748
3297 2928748 2779395 2882326 2788246 2582148 2520202 2444187 2408279 2316986 2431396 2486369 2373349
3286 2373349 2346905 2363655 2287406 2295493 2331471 2260130 2225913 2224096 2290568 2270153 2193722 2275773
3274 2275773 2276789 2411134 2494761 2426781 2366071 2351571 2306390 2250094 2206736 2106451 1962882
3263 1962882 2056072 2020362 1977495 2024893 1878332 1831921 1915335 1742824 1749801 1607554 1511278
$$ packed form
3341D160142m9722k3155p1632J48183q3058o3781Q589j78811j22790j33608l1600
3330C558757N7507p9800j63759p2947J5634m619j50695j66124j2470R1151M6238
3319C118873L3019o3333j1135J0244p4966k6180J44499r2974p2362O7811K8765
3308C062261J89144J23066N6196m7397P2407k4908p449j27000j14060j96894n6618
3297B928748j49353J02931r4080k06098o1946p6015l5908r1293J14410N4973j13020
3286B373349k6444J6750p6249Q087L5978p1341l4217j817O6472k0415p6431Q2051
3274B275773J016J34345Q3627o7980o0710j4500m5181n6296m3358j00285j43569
3263A962882R3190l5710m2867M7398j46561m6411Q3414j72511O977j42247r6276
$$ plain form
3252 1511278 1642925 1695776 1625212 1612331 1547968 1608538 1568620 1477554 1360680 1435809 1377738
3241 1377738 1265209 1329487 1286464 1395881 1362733 1353723 1295972 1290430 1161401 1181952 1209032
3230 1209032 1058977 1152305 1289491 1257650 1237948 1102174 1201523 1197890 1274924 1229408 1121239
3219 1121239 1253990 1266476 1225810 1273489 1271642 1317411 1202394 1196170 1140316 1054883 1029124
3208 1029124 995901 1041610 1108376 1240514 1188306 1200416 1116110 1178209 1130497 1126569 1139438
3197 1139438 1126467 1220670 1303679 1269845 1351176 1278941 1336300 1319551 1208172 1246499 1279648
3186 1279648 1256144 1318606 1402543 1344205 1277117 1213178 1259023 1319575 1466675 1377712 1318350
3175 1318350 1313332 1331735 1378625 1505465 1654428 1480960 1462534 1392523 1323979 1451394 1482825
$$ packed form
3252A511278J31647N2851p0564j2881o4363O0570l9918r1066j16874P5129n8071
3241A377738j12529O4278m3023J09417l3148r010n7751n542j29029K0551K7080
3230A209032j50055R3328J37186l1841j9702j35774R9349l633P7034m5516j08169
3219A121239J32751J2486m0666M7679j847M5769j15017o224n5854q5433k5759
3208A029124l3223M5709O6766J32138n2208J2110q4306O2099m7712l928J2869
3197A139438j2971R4203Q3009l3834Q1331p2235N7359j6749j11379L8327L3149
3186A279648k3504O2462Q3937n8338o7088o3939M5845O0552J47100q8963n9362
3175A318350n018J8403M6890J26840J48963j73468j8426p0011o8544J27415L1431
$$ plain form
3164 1482825 1527247 1530352 1488940 1601050 1621479 1406277 1595046 1576876 1558997 1611701 1532753
3153 1532753 1698421 1609648 1775117 1922536 1988478 2006782 1936809 2018652 2003029 2060440 2106714
3142 2106714 2200808 2164691 2139430 2139751 2053259 2152694 2068247 2018756 2000712 2158692 2121709 2026489
3130 2026489 2049476 2258060 2239700 2188738 2271358 2302315 2467127 2450268 2329651 2400777 2552684
3119 2552684 2637198 2670796 2667666 2735568 2839278 2823791 2841887 2994764 2880353 2923671 3067701
3108 3067701 3165706 3255205 3188398 3076019 3208255 3395903 3449260 3348348 3188398 3270991
3098 3270991 3398713 3454955 3557597 3717903 3881627 3810285 3966402 4042048 4192399 4347266
3088 4347266 4335387 4223277 4224755 4249760 4289350 4249821 4057667 3929991 3911779 3910285 3858128
$$ packed form
3164A482825M4422L105m1412J12110K0429k15202J88769j8170j7879N2704p8948
3153A532753J65668q8773J65469J47419O5942J8304o9973Q1843j5623N7411M6274
3142B106714R4094l6117k5261L21q6492R9435q4447m9491j8044J57980l6983r5220
3130B026489K2987K08584j8360n0962Q2620L0957J64812j6859j20617P1126J51907
3119B552684Q4514L3598l130O7902J03710j5487J8096J52877j14411M3318J44030
3108C067701R8005Q9499o6807j12379J32236J87648N3357j00912j59950Q2593
3098C270991J27722N6242J02642J60306J63724p1342J56117P5646J50351J54867
3088D347266j1879j12110J478K5005L9590l9529j92154j27676j8212j494n2157
$$ plain form
3077 3858128 3789006 3917184 3945138 3993247 3943454 3879488 3961930 4040473 4053180 4166920 4197589
3066 4197589 4133395 4206397 4333944 4274525 4288245 4400008 4301163 4383179 4485313 4549806 4402963
3055 4402963 4222424 4155274 3997610 3906399 3847585 3749532 3715314 3743244 3620190 3280155 3375843
3044 3375843 3520552 3386156 3453453 3441083 3301587 3248663 3172512 3138155 3097114 3195728 3011187
3033 3011187 3024065 2951348 2768031 2714530 2649786 2648361 2537187 2317857 2308062 2229679 2142002
3022 2142002 2024450 1929942 1910238 1831702 1855590 1752152 1855223 1848750 1668929 1649941 1674071
3011 1674071 1636237 1552471 1415229 1309282 1421724 1467128 1422062 1343498 1236788 1186243 1120791
3000 1120791 1190783 1106989 1109495 1055361 999641 1082654 1090583 1001104 976888 1084052 968549
$$ packed form
3077C858128o9122J28178K7954M8109m9793o3966Q2442P8543J2707J13740L0669
3066D197589o4194P3002J27547n9419J3720J11763r8845Q2016J02134O4493j46843
3055D402963j80539o7150j57664r1211n8814r8053l4218K7930j23054l40035R5688
3044C375843J44709j34396O7297j2370j39496n2924p6151l4357m1041R8614j84541
3033C011187J2878p2717j83317n3501o4744j425j11174k19330r795p8383q7677
3022B142002j17552r4508j9704p8536K3888j03438J03071o473j79821j8988K4130
3011A674071l7834q3766j37242j05947J12442M5404m5066p8564j06710n0545o5452
3000A120791O9992q3794K506n4134n5720Q3013P929q9479k4216J07164j15503
$$ plain form
2989 968549 874348 935912 889235 842968 875122 810176 834782 894276 892129 826111 752553 675355
2977 675355 595214 467298 591736 895044 876547 753944 755879 820142 732078 573109 643063
2966 643063 573515 572837 596241 604082 716924 565398 459344 405733 440542 457094 488750 503405
2954 503405 478539 618932 491091 386381 385211 500629 466546 485782 599018 557044 491700
2943 491700 564803 516527 523459 469560 357967 374169 335556 269715 343007 375511 433343 447666
2931 447666 357232 318861 374520 478524 350631 280381 315198 253714 356263 392223 198208
2920 198208 120206 143528 172808 179825 230807 213390 416945 295520 105769 132868 272785
2909 272785 248115 239493 303503 236050 137486 190056 137760 81931 156026 301855 151532
$$ packed form
2989I68549r4201O1564m6677m6267L2154o4946K4606N9494k147o6018p3558p7198
2977F75355q0141j27916J24438L03308j8497j22603J935O4263q8064j58969O9954
2966F43063o9548o78K3404P841J12842j51526j06054n3611L4809J6552L1656J4655
2954E03405k4866J40393j27841j04710j170J15418l4083J9236J13236m1974o5344
2943D91700P3103m8276O932n3899j11593J6202l8613o5841P3292L2504N7832J4323
2931D47666r0434l8371N5659J04004j27893p0250L4817o1484J02549L5960j94015
2920A98208p8002K3322K9280P017N0982j7417K03555j21425j89751K7099J39917
2909B72785k4670q622O4010o7453r8564N2570n2296n5829P4095J45829j50323
$$ plain form
2898 151532 170480 255053 288424 334212 464610 475875 321967 347420 188618 142784 121241
2887 121241 154006 207521 172603 114165 216925 188065 12053 20404 118812 168401 97277
2876 97277 161968 250402 257935 319632 345017 304067 303683 150758 56008 96262 125919 99838
2864 99838 123487 117275 106098 -2080 66390 141560 147266 187217 169386 106056 -2768 78580
2852 78580 66599 365 144231 124256 170548 301626 293762 226373 101722 65945 134073
2841 134073 99655 46614 218018 303111 282805 245889 58613 43874 122134 77909 202944
2830 202944 119254 199082 114769 188614 208109 288731 363094 292216 280836 280898 302397 217161
2818 217161 142459 229284 205151 154652 196012 160866 126302 141550 109581 307972 383208
$$ packed form
2898A51532J8948Q4573L3371M5788J30398J1265j53908K5453j58802m5834k1543
2887A21241L2765N3515l4918n8438J02760k8860j76012Q351R8408M9589p1124
2876I7277O4691Q8434P533O1697K5385m0950l84j52925r4750M0254K9657k6081
2864I9838K3649o212j1177j08178O8470P5170N706L9951j7831o3330j08824Q1348
2852G8580j1981o6234J43866j9975M6292J31078p864o7389j24651l5777O8128
2841A34073l4418n3041J71404Q5093k0306l6916j87276j4739P8260m4225J25035
2830B02944q3690P9828q4313P3845J9495Q0622P4363p0878j1380O2K1499q5236
2818B17161p4702Q6825k4133n0499M1360l5146l4564J5248l1969J98391P5236
$$ plain form
2807 383208 411051 389920 309242 291108 322161 117823 164863 204402 173208 121170 223980
2796 223980 273043 348136 531629 435966 447360 399027 410907 291982 370856 232655 193352
2785 193352 111560 149530 166651 208816 310212 346327 160865 241918 352317 322805 401791
2774 401791 422859 288542 413090 531864 511798 393478 368792 334686 329720 321763 338548
2763 338548 343760 296809 341400 288521 398641 331438 367958 413527 458079 483628 463421 163060
2751 163060 178589 263033 286346 260312 206550 234216 251414 214798 256212 275551 204915 177336
2739 177336 167322 188814 175167 120732 30583 151709 301782 314056 240251 330153 247030
2728 247030 45945 56823 138320 214047 151026 263338 261665 94429 140133 44876 119408
$$ packed form
2807C83208K7843k1131q0678j8134L1053k04338M7040L9539l1194n2038J02810
2796B23980M9063P5093J83493r5663J1394m8333J1880j18925P8874j38201l9303
2785A93352q1792L7970J7121M2165J01396L6115j85462Q1053J10399k9512P8986
2774D01791K1068j34317J24548J18774k0066j18320k4686l4106m966p957J6785
2763C38548N212m6951M4591n2879J10120o7203L6520M5569M4552K5549k0207l00361
2751A63060J5529Q4444K3313k6034n3762K7666J7198l6616M1414J9339p0636k7579
2739A77336j0014K1492j3647n4435r0149J21126J50073J2274p3805Q9902q3123
2728B47030k01085J0878Q1497P5727o3021J12312j673j67236M5704r5257P4532
$$ plain form
2717 119408 164190 63754 62241 87078 31527 -17715 58867 38122 -9040 12252 2693 39182
2705 39182 167929 94921 106542 36780 -60106 -24400 31488 -15772 69048 111716 66732 62354
2693 62354 -67780 -36162 -5425 58344 -71136 23669 14205 114519 65004 132499 190171
2682 190171 159125 55576 -53594 2955 -88654 42943 102844 152846 86962 37630 -31908
2671 -31908 -74241 -164851 -106121 -34119 15143 172025 26471 -1612 -17628 24893 37938
2660 37938 107620 144152 73005 97347 100491 84789 4627 95318 109852 116659 119342 80738
2648 80738 90001 70122 -20705 -65763 33563 39309 26135 129281 88732 25977 -223875 -134789
2636 -134789 10764 46387 27310 -61674 -140449 -137362 -90792 -100596 13324 51812 59323 6638
$$ packed form
2717A19408M4782j00436j513K4837n5551m9242P6582k0745m7162K1292r559L6489
2705C9182J28747p3008J1621o9762r6886L5706N5888m7260Q4820M2668m4984m378
2693F2354j30134L1618L0737O3769j29480R4805r464J00314m9515O7495N7672
2682A90171l1046j03549j09170N6549r1609J31597N9901N0002o5884m9332o9538
2671c1908m2333r0610N8730P2002M9262J56882j45554k8083j6016M2521J3045
2660C7938O9682L6532p1147K4342L144j5702q0162R0691J4534O807K683l8604
2648H0738R263j9879r0827m5058R9326N746j3174J03146m0549o2755k49852Q9086
2636a34789J45553L5623j9077q8984p8775L087M6570r804J13920L8488P511n2685
$$ plain form
2624 6638 17062 9942 -101438 -205638 -267976 -171301 -37172 -50010 -83303 22247 112479
2613 112479 -70234 -49290 -199326 -196727 -55466 -77746 -99320 -60781 27493 -132374 -151051
2602 -151051 -2656 61431 52315 -12870 232127 324642 -82362 -87404 -9045 11509 -24099
2591 -24099 27688 -9412 65176 80191 -20754 -110307 -77756 -58713 -36542 -61919 -62765 -34609
2579 -34609 -2635 -145988 -336818 -116652 -220642 -226698 -137464 9226 -40325 -36599 -43337
2568 -43337 -6569 -67556 -122821 -85230 -90897 -7716 -62215 -110978 -33867 -94679 56755 80082
2556 80082 36211 41422 -85634 66069 27727 23147 -30388 -136549 -206808 -203952 -135432 24183
2544 24183 29155 2758 -36150 -132378 -91159 76770 -100667 -98764 -38734 -17503 -219567 -215560
$$ packed form
2624F638J0424p120j11380j04200o2338R6675J34129j2838l3293J05550R0232
2613A12479j82713K0944j50036K599J41261k2280k1574L8539Q8274j59867j8677
2602a51051J48395O4087r116o5185K44997R2515m07004n042P8359K0554l5608
2591b4099N1787l7100P4588J5015j00945q9553L2551J9043K2171k5377q46K8156
2579c4609L1974j43353j90830K20166j03990o056Q9234J46690m9551L726o738
2568d3337L6768o0987n5265L7591n667Q3181n4499m8763P7111o0812J51434K3327
2556H0082m3871N211j27056J51703l8342m580n3535j06161p0259K856O8520J59615
2544B4183M972k6397l8908r6228M1219J67929j77437J903O0030K1231k02064M007
$$ plain form
2532 -215560 3618 34491 64476 15767 -88454 29155 40035 77213 -6800 -166608 -25696
2521 -25696 -152714 -159419 -163527 -27982 -87898 -48452 -30529 -95967 -104093 17343 14996 203
2509 203 -122045 -88273 -93115 -188324 -174472 -68174 -88618 -110311 -11505 -124186 -156366 -43928
2497 -43928 -110161 -254982 -121884 -17347 -110117 -110945 -33446 2881 -57334 22594 -114076
2486 -114076 -141248 -104084 -118094 -109536 -136738 -22130 -28647 -109756 -276848 -130474 -144408
2475 -144408 -233503 -70334 7860 26145 -65353 18914 13921 -22665 -97643 -188863 -168118 -86958
2463 -86958 -42728 -34126 -21515 -43908 -39498 -108665 -50689 -6007 1747 -92535 -68496 -117989
2451 -117989 -187339 -68123 10800 -204159 -71850 -26574 -88520 -149252 -236636 -212819 19690
$$ packed form
2532b15560K19178L0873K9985m8709j04221J17609J0880L7178q4013j59808J40912
2521b5696j27018o705m108J35545n9916L9446J7923o5438q126J21436k347j4793
2509B03j22248L3772m842r5209J3852J06298k0444k1693R8806j12681l2180J12438
2497d3928o6233j44821J33098J04537r2770q28P7499L6327o0215P9928j36670
2486a14076k7172L7164j4010Q558k7202J14608o517q1109j67092J46374j3934
2475a44408q9095J63169P8194J8285r1498Q4267m993l6586p4978r1220K0745Q1160
2463h6958M4230Q602J2611k2393M410o9167N7976M4682P754r4282K4039m9493
2451a17989o9350J19216P8923k14959J32309M5276o1946o0732q7384K3817K32509
$$ plain form
2440 19690 -19319 -91940 -91291 -3182 -107871 -7086 78366 43696 191086 86667 -90071
2429 -90071 77790 58289 -179763 -37756 -31575 -28416 -5492 -68219 -137801 -129393 -193531 -110557
2417 -110557 -132574 -44979 -69176 62052 -58623 -154553 -117231 -113545 -130921 -53821 -28391
2406 -28391 -86399 -46543 7135 17820 9385 207420 138363 -59231 46094 -81274 -216381
2395 -216381 -21953 -147451 -92466 -18560 -193511 -61112 22644 16874 97732 48994 32467
2384 32467 17380 104133 57470 121635 -13240 -4082 6749 -10173 36104 -98895 -150027 -20007
2372 -20007 36413 -74239 52514 11989 2014 50540 106703 102737 84615 169484 166902 96444
2360 96444 92944 18168 -18288 -29036 -18324 -65060 15201 231072 186407 86732 96347 111260
$$ packed form
2440A9690l9009p2621O49Q8109j04689J00785Q5452l4670J47390j04419j76738
2429i0071J67861j9501k38052J42007O181L159K2924o2727o9582Q408o4138Q2974
2417a10557k2017Q7595k4197J31228j20675r5930L7322L686j7376P7100K5430
2406b8391n8008L9856N3678J0685q435J98035o9057j97594J05325j27368j35107
2395b16381J94428j25498N4985P3906j74951J32399Q3756n770Q0858m8738j6527
2384C2467j5087Q6753m6663O4165j34875R158J0831j6922M6277j34999n1132J30020
2372b0007N6420j10652J26753m0525r975M8526N6163l966j8122Q4869k582p0458
2360I6444l500p4776l6456j0748J0712m6736Q0261K15871m4665r9675R615J4913
$$ plain form
2348 111260 134036 153394 34096 -31643 -23901 8037 213702 105088 -74116 659 45778
2337 45778 65304 150482 252347 241084 225413 156542 201483 210162 229780 125744 91662 177281
2325 177281 311999 338923 360311 313995 374158 491780 353528 404485 658609 715595 651664
2314 651664 737783 826657 995035 1095750 1285978 1398821 1481829 1628007 1812183 1965344
2304 1965344 2104270 2265146 2425027 2715252 3101746 3447441 4062916 4670391 5463024 6420233
2294 6420233 7371450 8385729 9284801 9855172 10070001 9963743 9136131 7860777 6899330
2285 6899330 6052461 5512279 5100627 4520481 4159080 3788699 3294231 2822032 2613847 2571194
$$ packed form
2348A11260K2776J9358j19298o5739P742L1938K05665j08614j79204P4775M5119
2337D5778J9526Q5178J01865j1263j5671o8871M4941Q679J9618j04036l4082Q5619
2325A77281J34718K6924K1388m6316O0163J17622j38252N0957K54124N6986o3931
2314F51664Q6119Q8874J68378J00715J90228J12843Q3008J46178J84176J53161
2304A965344J38926J60876J59881K90225L86494L45695O15475O07475P92633R57209
2294F420233R51217J014279Q99072N70371K14829j06258q27612j275354r61447
2285F899330q46869n40182m11652n80146l61401l70381m94468m72199k08185m2653
$$ [...]
##END NTUPLES=NMR SPECTRUM
##END=
