##TITLE=1H_CA-9299-1
 DMSO-d6
 8 sc, 
 29.10.2024
##JCAMPDX= 6.0         $$ Bruker NMR JCAMP-DX V2.0
##DATA TYPE= NMR SPECTRUM
##DATA CLASS= NTUPLES
##ORIGIN= UXNMR, Bruker Analytische Messtechnik GmbH
##OWNER= root
$$ XWIN-NMR		Version 3.5
$$ Tue Oct 29 14:45:54 2024 Russian Standard Time (UT+4h)  she@DPX200
##.OBSERVE FREQUENCY= 200.1318
##.OBSERVE NUCLEUS= ^1H
##.ACQUISITION MODE= SIMULTANEOUS
##.ACQUISITION SCHEME= undefined
##.AVERAGES= 8
##.DIGITISER RES= 18
##SPECTROMETER/DATA SYSTEM= spect
##.PULSE SEQUENCE= zg30
##.SOLVENT NAME= DMSO
##.SHIFT REFERENCE= (INTERNAL, DMSO, 0, 20.965)
##AUDIT TRAIL= $$ (NUMBER, WHEN, WHO, WHERE, WHAT)
$$ ##TITLE= Audit trail, XWIN-NMR		Version 3.5
$$ ##JCAMPDX= 5.01
$$ ##ORIGIN= Bruker BioSpin GmbH
$$ ##OWNER= she
$$ F:/spectra/data/she/nmr/H-F/1/pdata/1/auditp.txt
$$ ##AUDIT TRAIL=  $$ (NUMBER, WHEN, WHO, WHERE, WHAT)
(   1,<2024-10-29 14:44:45.04 +0400>,<she>,<DPX200>,
      <created by zg, POWCHK disabled, PULCHK disabled
       configuration hash MD5:
       00 E9 B6 7A A2 85 ED C7 34 08 36 98 17 FE 4E 26
       data hash MD5: 16K
       16 0A DD E2 07 5D 1B 5F 3B EA 92 93 86 BA 90 32>)
(   2,<2024-10-29 14:44:48.32 +0400>,<she>,<DPX200>,
      <Start of raw data processing
       efp BC_mod = 2 LB = 0.24 FT_mod = 6 PKNL = 1 PHC0 = -26505.54 PHC1 = 9.98743 SI = 16K 
       data hash MD5: 16K
       16 7F 2D 2A 88 60 AB C6 CF D6 F1 57 33 59 4A E5>)
(   3,<2024-10-29 14:45:06.54 +0400>,<she>,<DPX200>,
      <pk PHC0 = 156.446 PHC1 = -1.2 
       data hash MD5: 16K
       26 EE 78 13 1E 6E 0C 6D F8 97 EB 17 15 6E 9E 8E>)
(   4,<2024-10-29 14:45:09.82 +0400>,<she>,<DPX200>,
      <abs ABSG = 5 
       data hash MD5: 16K
       7D 56 3F 65 8A E8 40 F0 93 9A E3 70 52 29 7C A1>)
$$ ##END=
$$ 
$$ hash MD5
$$ E1 96 74 48 09 F5 3E 3D 07 C2 4D 78 96 87 C5 D0
##$RELAX= 
##$RELAX= 
##$RELAX= 
##$RELAX= 
##$RELAX= 
##$RELAX= 
$$ Bruker specific parameters
$$ --------------------------
##$DU= <F:/spectra>
##$EXPNO= 1
##$NAME= <H-F>
##$PROCNO= 1
##$TYPE= <nmr>
##$USER= <she>
##$AMP= (0..31)
100 100 100 100 100 100 100 100 100 100 100 100 100 100 100 100 100 100 
100 100 100 100 100 100 100 100 100 100 100 100 100 100 
##$AQSEQ= 0
##$AQ_mod= 1
##$AUNM= <au_zg>
##$AUTOPOS= <>
##$BF1= 200.13
##$BF2= 200.13
##$BF3= 200.13
##$BF4= 200.13
##$BF5= 200.13
##$BF6= 200.13
##$BF7= 200.13
##$BF8= 200.13
##$BYTORDA= 1
##$CFDGTYP= 0
##$CFRGTYP= 5
##$CHEMSTR= <none>
##$CNST= (0..31)
1 1 145 1 1 1 1 1 1 1 1 1 1 1 1 1 1 1 1 1 1 1 1 1 1 1 1 1 1 1 1 1 
##$CPDPRG= <>
##$CPDPRG1= <>
##$CPDPRG2= <>
##$CPDPRG3= <>
##$CPDPRG4= <mlev>
##$CPDPRG5= <mlev>
##$CPDPRG6= <mlev>
##$CPDPRG7= <mlev>
##$CPDPRG8= <mlev>
##$CPDPRGB= <>
##$CPDPRGT= <>
##$D= (0..31)
0 1.2 0 0 0 0 0 0 0 0.06 0 0.03 0 0 0 0 0.0002 0 0 0 0 0 0 0 0 0 0 0 0 
0 0 0 
##$DATE= 1730198684
##$DBL= (0..7)
120 120 120 120 120 120 120 120 
##$DBP= (0..7)
150 150 150 150 150 150 150 150 
##$DBP07= 0
##$DBPNAM0= <>
##$DBPNAM1= <>
##$DBPNAM2= <>
##$DBPNAM3= <>
##$DBPNAM4= <>
##$DBPNAM5= <>
$$ [...]
##$SUBNAM3= <"">
##$SUBNAM4= <"">
##$SUBNAM5= <"">
##$SUBNAM6= <"">
##$SUBNAM7= <"">
##$SUBNAM8= <"">
##$SUBNAM9= <"">
##$SW= 24.0689170037331
##$SWIBOX= (0..15)
0 0 2 0 0 0 0 0 0 0 0 0 0 0 0 0 
##$SW_h= 4816.95568400771
##$TD= 16384
##$TD0= 1
##$TE= 0
##$TE2= 300
##$TE3= 300
##$TEG= 300
##$TL= (0..7)
0 120 120 120 120 120 120 120 
##$TP= (0..7)
150 150 150 150 150 150 150 150 
##$TP07= 0
##$TPNAME0= <>
##$TPNAME1= <>
##$TPNAME2= <>
##$TPNAME3= <>
##$TPNAME4= <>
##$TPNAME5= <>
##$TPNAME6= <>
##$TPNAME7= <>
##$TPOAL= (0..7)
0.5 0.5 0.5 0.5 0.5 0.5 0.5 0.5 
##$TPOFFS= (0..7)
0 0 0 0 0 0 0 0 
##$TUNHIN= 0
##$TUNHOUT= 0
##$TUNXOUT= 0
##$USERA1= <user>
##$USERA2= <user>
##$USERA3= <user>
##$USERA4= <user>
##$USERA5= <user>
##$V9= 5
##$VALIST= <valist>
##$VCLIST= <CCCCCCCCCCCCCCC>
##$VD= 0
##$VDLIST= <DDDDDDDDDDDDDDD>
##$VPLIST= <PPPPPPPPPPPPPPP>
##$VTLIST= <TTTTTTTTTTTTTTT>
##$WBST= 1024
##$WBSW= 4
##$XGAIN= (0..3)
0 0 0 0 
##$XL= 0
##$YL= 0
##$YMAX_a= 577281
##$YMIN_a= -316760
##$ZGOPTNS= <>
##$ZL1= 120
##$ZL2= 120
##$ZL3= 120
##$ZL4= 120
##$ABSF1= 21.02083
##$ABSF2= -3.048304
##$ABSG= 5
##$ABSL= 3
##$ALPHA= 0
##$AQORDER= 0
##$ASSFAC= 0
##$ASSFACI= 0
##$ASSFACX= 0
##$ASSWID= 0
##$AUNMP= <proc_1d>
##$AZFE= 0.1
##$AZFW= 0.1
##$BCFW= 0
##$BC_mod= 2
##$BYTORDP= 0
##$COROFFS= 0
##$CY= -3
##$DATMOD= 1
##$DC= 0
##$DFILT= <>
##$DTYPP= 0
##$F1P= 0
##$F2P= 0
##$FCOR= 1
##$FTSIZE= 16384
##$FT_mod= 6
##$GAMMA= 0
##$GB= 0
##$INTBC= 1
##$INTSCL= 3.70164e-10
##$ISEN= 128
##$LB= 0.24
##$LEV0= 0
##$LPBIN= 0
##$MAXI= 10000
##$MC2= 0
##$MEAN= 0
##$ME_mod= 0
##$MI= 1.114404
##$NCOEF= 0
##$NC_proc= -6
##$NLEV= 6
##$NOISF1= 3.799351
##$NOISF2= 2.8
##$NSP= 0
##$NTH_PI= 0
##$NZP= 0
##$OFFSET= 20.965
##$PC= 1
##$PHC0= -26349.09
##$PHC1= 8.78743
##$PH_mod= 1
##$PKNL= yes
##$PPARMOD= 0
##$PSCAL= 0
##$PSIGN= 0
##$REVERSE= no
##$SF= 200.130012752169
##$SI= 16384
##$SIGF1= 3
##$SIGF2= 2
##$SINO= 5.538805
##$SIOLD= 16384
##$SREGLST= <1H.CDCl3>
##$SSB= 0
##$STSI= 16384
##$STSR= 0
##$SW_p= 4816.95568400771
##$SYMM= 0
##$S_DEV= 0
##$TDeff= 16384
##$TDoff= 0
##$TI= <>
##$TILT= no
##$TM1= 0
##$TM2= 0
##$TOPLEV= 0
##$USERP1= <user>
##$USERP2= <user>
##$USERP3= <user>
##$USERP4= <user>
##$USERP5= <user>
##$WDW= 1
##$XDIM= 16384
##$YMAX_p= 316677757
##$YMIN_p= -538041
$$ End of Bruker specific parameters
$$ ---------------------------------
##NTUPLES= NMR SPECTRUM
##VAR_NAME=  FREQUENCY,     SPECTRUM/REAL,   SPECTRUM/IMAG
##SYMBOL=    X,             R,               I
##VAR_TYPE=  INDEPENDENT,   DEPENDENT,       DEPENDENT
##VAR_FORM=  AFFN,          ASDF,            ASDF
##VAR_DIM=   16384,         16384,           16384
##UNITS=     HZ,            ARBITRARY UNITS, ARBITRARY UNITS
##FACTOR=    0.29402158847633, 1,            1
##FIRST=     4195.72574788664, 0,            0
##LAST=      -621.229936121071, 0,           0
##MIN=       -621.229936121071, -538041,     0
##MAX=       4195.72574788664, 316677757,    0
$$ Real data points
##PAGE= N=1
##DATA TABLE= (X++(R..R)), XYDATA
$$ [...]
12739 28750 3629 -17778 49225 33698 1774 -59117 99943 -191858 -167827 -6610 52299
12728 52299 -36842 -59568 8475 51970 59369 23586 -27976 83730 90360 107258 132340 68359
12716 68359 -3386 -41918 28587 62190 121340 224878 175816 76139 117190 26977 20272 -7154
12704 -7154 10461 36106 17474 -96137 -86591 31410 129882 97324 -2068 67746 90059 -1195
12692 -1195 94068 77585 69542 24226 18627 -122489 -49120 33011 13496 -17954 -76086 -77862
12680 -77862 -46601 -101254 -91875 -90024 -73017 -39830 -53997 38759 91635 -80505 -192347 7711
12668 7711 70700 29769 -140101 -353241 -136255 -138343 -87342 -10992 14457 67204 -62013
12657 -62013 -150565 -85123 -15429 -82467 -27319 24351 -8175 73064 46077 41657 -3264 -71585
12645 -71585 29769 -83665 -116024 5266 -15656 38871 4751 55448 212355 52842 -54386
12634 -54386 -44235 87632 -42032 41373 72406 -69300 54884 74968 163530 36000 -111911
12623 -111911 -26914 33275 -95088 -169159 -143211 -66251 -61789 -21148 -75515 44661 38847
12612 38847 -16336 -83121 17937 60235 62260 18232 -176226 -47436 48273 161784 78062
12601 78062 192501 191963 195 -108907 47479 68203 157427 -70358 -90392 -31112 56635
12590 56635 226526 16847 88110 82284 -93523 -71245 47152 -92327 -57168 -108339 -143864
12579 -143864 -87432 65534 39398 -61444 -59087 29390 6978 -49274 -97908 10269 -38801
12568 -38801 20372 -23279 -163019 2095 36865 -53146 59401 184793 10192 -78329 -106587
12557 -106587 -71813 15319 172333 50073 44487 -27225 -20682 36217 99458 146509 -104205
12546 -104205 -71696 -7526 -35326 -7763 3353 32720 -19616 119826 18531 688 40917
12535 40917 34055 -111725 -3454 68780 -10306 -38130 77013 98589 136686 127351 5537
12524 5537 42262 -72564 9551 -70570 -99424 32969 35408 54134 -15607 -36520 36785 -153300
12512 -153300 -49899 132873 117806 -16045 -39344 11562 -25778 30363 67752 84876 158486
12501 158486 -18859 -126956 -101031 8994 -46358 -118313 -252278 -218615 73212 96894
12491 96894 116552 65127 -18105 -37506 -67633 -159845 -41730 -133318 -33996 -39028 -19213 -4631
12479 -4631 42845 -6711 4182 124925 -13981 -148846 20579 68966 27507 166228 3940
12468 3940 -23115 -74665 -157730 -58337 -109179 -70801 -153001 -174838 -77305 -18677 12860 -55837
12456 -55837 -87349 -3930 -28443 -79168 113702 -73116 363 -87154 -2688 101633 -50402
12445 -50402 62438 179483 -2483 -155050 -52152 6758 -41701 29721 -8084 -161195
12435 -161195 -219166 -194302 -145972 -114273 -74614 25513 14341 74770 26523 -7921 -73361
12424 -73361 -50730 95614 142039 -128948 -159410 -220053 -129651 98557 92413 -88247 90974
12413 90974 56567 -24281 18325 -1202 -77963 23365 51472 22526 114912 18420 86222
12402 86222 51700 168496 59210 15002 -61704 3338 -198372 -160763 -93728 -58942 47139
12391 47139 53521 -20207 -5590 -80916 -175709 -173076 -87901 -111104 -118486 51795 191719 135259
12379 135259 73440 92702 7080 -76862 -981 75478 -27611 -132615 -180259 -32741 9024
12368 9024 1940 159688 113429 116447 4085 44227 54161 -33869 -100604 -117424 11651 -119733
12356 -119733 -218183 -194202 -109351 3337 188025 5032 -69743 41366 113776 30509 -14869
12345 -14869 100302 -23456 -125022 -200629 57370 30441 -135138 -135268 -4225 -13117 -125950
12334 -125950 -97204 -40639 33287 -59967 -111108 -54524 7022 -39649 -145029 -67563 4940
12323 4940 20311 37109 152804 118428 -44511 -21803 -52781 -173567 -128644 56730 -32526
12312 -32526 6369 -26853 16757 1253 59312 -113958 -164992 -191167 -113901 22531 -95725
12301 -95725 -66706 -78052 -135602 -106605 64817 65997 133221 -67740 -112884 -8389 25458
12290 25458 -59198 22302 64006 53423 110771 48689 85148 153706 78258 80194 -38308 -180169
12278 -180169 -126871 -15182 171868 88208 -7105 134615 9698 49961 139363 1048
12268 1048 -2568 9782 -86460 -137344 37916 -22163 31390 -127710 -21175 31017 2531
12257 2531 -901 121269 -54897 -13601 -57994 -119095 -86397 119671 156547 -46702 -56798
12246 -56798 -60022 -77864 -97213 -67932 -203915 -143757 -80628 -10905 -119856 -20117 -14903 36400
12234 36400 27293 12562 -130829 -69981 29059 1157 -145612 -4433 -55554 -89063 -3137
12223 -3137 28598 104792 70919 21976 78658 -3752 44312 -40277 -86144 -28490 -165449 -72635
12211 -72635 -125085 -3239 75610 20816 -64586 -116075 -147644 -21754 108808 22559 70101
12200 70101 42273 118603 39475 -35586 46330 -199142 -152677 9299 27300 -164861 -58081
12189 -58081 -50597 -1385 -1691 37387 -123345 32680 5779 -143688 58891 170350 167103
12178 167103 159080 72651 8272 69835 65516 188583 -42193 -58046 75270 -9715 61031
12167 61031 -84891 -30339 -70878 -149036 -30172 -23908 -46651 -58172 -33149 -146586 15014
12156 15014 30696 -95906 42543 -71424 -149408 42736 -96959 -53958 -206636 -116412
12146 -116412 -135748 -106441 -74630 -95574 -55966 -28517 46104 19013 -114345 -123388 -86631
12135 -86631 57377 -8751 -29723 581 -55794 -103196 -115358 -30266 -70109 72241 -32975
12124 -32975 -63522 -1501 -307254 -43206 -107458 -87387 21684 50341 118155 40611 102996
12113 102996 75740 86748 1579 91802 53213 101352 -19641 -94761 -89452 -120893 -18752
12102 -18752 -10038 -8858 43326 -6934 -158034 -224837 -148756 -91072 126231 193082 33428
12091 33428 96775 135374 -25939 -89396 -39229 42302 -171471 -123146 -50478 7146 -28383
12080 -28383 -78537 -305 7051 45209 120967 -19243 -87028 -194843 -80063 56701 -155934
12069 -155934 -4163 20724 15138 137989 63526 165595 49940 36680 -177120 -51522
12059 -51522 -68973 -151922 -98111 -95804 -93502 -76813 -46705 -33085 16898 86249 23614 -54886
12047 -54886 98642 22606 93139 64509 -55182 -50467 -23255 -71578 13649 -31730 8253
12036 8253 16901 -36198 -207132 -100371 -44461 74497 -51545 -43827 174121 24193 148116
12025 148116 100165 109757 51241 64799 -4307 -66437 -6502 -81313 -33339 -86047 -47138 -9800
12013 -9800 -22954 -84319 1663 -24934 22899 -53941 -215202 -129836 11091 6009 76405 -7150
12001 -7150 19516 10577 38261 -51990 -147386 -243029 -150699 -17206 -73899 140858 -20570
11990 -20570 -51503 -39119 -21709 6785 6674 -16062 -124853 2891 58499 -11872 28909 -59466
11978 -59466 -230946 -24663 120109 91623 -27204 -139021 -162895 -132484 -5536 -79615
11968 -79615 -81204 -40980 -163894 -56252 -37519 -5832 124929 256852 85127 -92709 -76778
11957 -76778 -108657 -191309 -180638 -6388 -67711 7026 55050 6450 -51688 28757 92530
11946 92530 -63250 40276 123427 -52328 -182669 -59587 -5493 -95662 -152707 2980
11936 2980 37716 66146 48110 -41545 -28618 -45109 23551 -74 84251 14998 4755 -84784
11924 -84784 10749 -54883 -138141 -58696 -291022 -272756 -14685 -74597 -71312 -35626 75905
11913 75905 101508 -104962 -11993 20278 -80897 29982 45153 96248 61132 -75173 80969
11902 80969 -81873 -219531 -199193 -144129 -63248 -40186 72308 -22242 37760 -77766 -133047
11891 -133047 10707 -34401 -40623 713 -77515 -97284 -62608 45485 15836 -19466 51970
11880 51970 50073 -92006 -93464 -195137 -110658 -135916 6712 153641 34382 14410 -4216
11869 -4216 -248302 -306420 -50652 7342 -20569 -101718 -28153 -154192 -60420 -77118 41124
11858 41124 192691 27492 -162931 -79735 -71349 -106772 -99797 -88694 244300 74454 23035
11847 23035 -14475 29718 -78462 -95500 35306 -24679 38075 -63827 -67434 -94798 33699
11836 33699 5417 120041 24859 51670 15715 -82974 -55717 -95121 -99154 -133552 -82700 -25642
11824 -25642 -118763 -61036 -74675 -136756 -44370 45658 110129 -14897 6001 39336 66739
11813 66739 105636 -55776 -5526 -29042 -44743 96550 -117202 -190737 3759 30409 1793
11802 1793 -35324 -96841 -63880 -52206 -124148 -107363 -3462 7246 -4595 44812 -17659 -32331
11790 -32331 -78120 -120105 -92241 -111111 -59452 -23980 -25648 39773 -51568 -57682 -83060 -132068
11778 -132068 25705 42042 75207 -116207 -213095 -129243 32985 5984 -174827 -133724 -84650
11767 -84650 -111740 -8844 105207 10340 -73044 -18809 49102 52338 -30833 -10380 49860
11756 49860 -55149 12150 -185205 -118476 -78536 -72226 -6412 150296 -5926 8358 57734
11745 57734 -66685 -116508 -60158 -58304 -129527 -32600 -20057 24903 35457 -8399 -15875 36389
11733 36389 -96338 -211603 -118108 -49365 -183408 -63468 -49379 -146079 -59241 -65856 -35764
11722 -35764 70031 -25215 -49903 15424 50238 70311 31913 -94088 42353 -13512 -180576
11711 -180576 -46734 115058 -34400 -100896 -74319 -57968 -41962 42221 -64537 -174952
11701 -174952 -171572 -46661 -79468 -93383 -6761 -122163 -142629 -138440 -318252 -273081 -260472
11690 -260472 -140282 -31616 56115 -18376 -80202 -60711 42899 99401 3730 -15654 -16195
11679 -16195 -17850 7194 21827 -116722 -44588 0 -77164 -85979 -65058 -99112 3418 50516
11667 50516 3550 -83718 -34085 -18738 -78554 -76548 7683 18287 140804 152688 18934
11656 18934 -21159 -40619 -127075 -124961 -26341 100935 150455 -673 -121672 -207244 -92772
11645 -92772 47064 24284 101811 -92039 -131540 -69551 -36512 -11 -130894 -66693 35648
11634 35648 83966 -53337 -21524 57850 -24243 59240 -55941 -105272 83569 -100185 48873
11623 48873 41354 -50222 -92734 -102909 -149124 -251923 -39778 45334 -42807 -5058 -105662
11612 -105662 3588 129600 -3851 334 -69780 -214095 -127399 -176308 -196110 -144771 3319
11601 3319 74591 -113242 28804 -85931 -13506 30167 -191695 -155611 39200 -95960 -62638
11590 -62638 -92539 4098 -226424 -140727 34019 -88476 -77795 145223 -21327 -182515
11580 -182515 60048 3718 -14379 59598 133727 107003 -25691 -53009 39243 -61890 -158227
11569 -158227 -194341 -213166 -68747 36668 87014 -37749 -197286 -150884 11020 -32061
11559 -32061 -15664 3413 -41810 -100226 -107094 -16676 32693 -29591 -218469 -34603 3086
11548 3086 30163 73990 146833 -6670 -5965 -20506 -60601 -22649 -77526 -78338 -115005 -154572
11536 -154572 -15048 -22770 29264 28073 -28091 23893 -10004 -84157 -125239 -261579 -240474
11525 -240474 -73545 8220 153982 160941 120611 88814 -44012 -73906 234 21145 -10868
11514 -10868 -130253 -126880 -89587 -62719 -48773 -87650 -149506 -187327 -53628 -127913 -200721
11503 -200721 71815 74420 139621 131400 -60095 -152239 -227714 -202486 -210902 -198283 -72372
11492 -72372 -1409 -102742 -153296 25898 -125591 -60732 1182 -194180 -106540 112279 63482
11481 63482 -33199 47701 7316 -31100 -30819 -11316 -131998 -106239 -52951 -97370 -5353 141686
11469 141686 20769 -22303 -75273 -133059 10753 -810 -13084 -32335 -105169 -204653 -168435
11458 -168435 -362558 -344030 -243924 -293454 -208751 -138208 -202788 -77299 -20382 -72096 -63095
11447 -63095 -103208 -116378 -81470 -63627 -111156 -41736 -82800 -191161 -60244 -122087 56029
11436 56029 158566 -44639 -1037 126844 108075 -34019 -106061 -71002 -206191 -227381 -191004
11425 -191004 28835 99152 -14372 -16628 -76148 -7802 -122252 -134721 -125454 2030 -157127
11414 -157127 -128945 -39515 27612 -227860 4455 -117408 79723 47132 -37760 24617 -109270
11403 -109270 -114936 46200 43555 -132839 80139 6187 53796 -129705 -147116 -47935 -138097
11392 -138097 -94585 -161504 -156752 -83700 41710 -104563 -120281 -20861 -95378 -177475 -159190
11381 -159190 -91128 -201764 11831 103959 -101541 -144606 13887 -405 69127 101622 25296
11370 25296 -36701 31821 20643 -63359 -89917 -31302 -156346 -174213 -78048 -133454 33335
11359 33335 -32471 -99464 -45190 -46756 65163 18673 155168 32879 -122911 -52897 -32700
11348 -32700 -70275 -143825 -142263 52476 -40183 -131227 -154391 -93141 53230 31918 -109544
11337 -109544 -160721 -136123 -36125 609 -45549 87070 132686 -84413 -3813 58178 21363
11326 21363 -64526 -68917 -114378 -110781 -96836 -134686 -69679 -187877 -107369 -36851 -79794 -96608
11314 -96608 13264 -29453 -83860 77455 35389 -64342 -127179 -70053 -117325 -166250 -187322
11303 -187322 -93265 -97982 -89530 -35948 17753 74403 24962 20025 67260 26109 -56171 -106061
11291 -106061 -49219 -14209 -110451 -222782 -158801 -19382 30542 24709 -46536 -130759 -152261
11280 -152261 -144660 63770 34407 -38830 2738 165703 77228 -27508 1338 -52668 -52497
11269 -52497 16607 -105170 -83226 -56619 5732 -13032 -107829 -114852 -30778 -63306 -1457 691
11257 691 -39716 51259 -80010 -76032 -10798 50774 -55789 -84760 -224928 -78288 -57362
11246 -57362 -73718 -187477 34355 -142596 -156606 -223176 -84065 -93330 -170062 -231163 -113070
11235 -113070 -200925 -30387 -133727 -161679 -97753 -55001 -3295 -77580 -68615 4158 -84851
11224 -84851 -73610 48346 -20079 -121075 -19313 -50500 -20517 86946 46340 25273 -71538
11213 -71538 -141918 943 -8962 -206723 -79605 -238239 -105169 -170688 -136688 -27955 -178774
11202 -178774 -170657 27304 -101071 -78211 -12781 -201341 -157719 9079 -164671 -149437 -207948
11191 -207948 -157566 -101685 -135109 35902 50580 -187611 -232372 49185 37687 -30061 54966
11180 54966 -11551 -16431 -44524 98505 -66887 -98922 35018 21690 46693 26561 -124225
11169 -124225 -53935 23769 100569 113258 -77887 -198693 -40637 -89714 -9656 -118652 -145350
11158 -145350 -67995 -160503 -65033 -41891 -103778 -122203 -35429 68532 -41384 -120406 -77092
11147 -77092 -71981 -124130 -60201 -130503 -46050 -45235 -117701 -65220 239 -145001 -329447 -115833
11135 -115833 -100243 -13712 -84664 32963 -3669 -189459 -42761 129974 -12998 -42465
11125 -42465 -122886 -297635 -185065 -185013 -141709 -158802 -190325 -44999 -41238 -177792 -116416 -90192
11113 -90192 -33379 22237 47651 140999 16562 119337 129028 69644 75041 -60304 55677
11102 55677 153360 8673 -31654 -94174 9736 -15952 -98061 -41824 -39002 -54221 -34691
11091 -34691 -101737 -82920 -18470 -72837 61521 92362 96551 -4341 -74975 75515 -36691
11080 -36691 -84337 -17711 -993 -62451 -34909 -133831 -5908 -14329 -235624 -56905 190402
11069 190402 60094 46447 -1197 -79741 -114184 -130547 -8019 100592 25276 -24449 -97271
11058 -97271 -15011 -126928 -161240 -53540 -99588 -101073 -77001 80664 -19367 -76088 -135872
11047 -135872 -6195 -16700 -120278 -127309 -171105 -205757 -150403 -181605 -119647 -82227 -121596
11036 -121596 -48396 -156084 -179136 -123435 -72514 -42716 -77958 -59947 42633 -67793 -102791
11025 -102791 55476 69159 106859 -37354 60905 -66754 26535 -44495 37407 -225535 -380658
11014 -380658 -81680 -98541 130494 86526 -31990 -93796 -194583 -86991 -167863 -190347
11004 -190347 -129433 -40865 -58270 -87725 -10376 8902 -19188 -167044 -110929 -144287 -199502
10993 -199502 -55102 -23173 -152389 -208423 -130374 69715 -41677 -33794 -61775 -19259 42076
10982 42076 -94308 -9798 -51406 -115563 -93852 -134785 -29792 1044 -124352 -123885 -66871
10971 -66871 -23723 -95581 25365 130403 14119 -118329 -87742 112860 153819 19355
10961 19355 -182771 -101137 -50108 -175449 -205075 -245001 -198038 -65312 -47236 6291 -105331
10950 -105331 -22894 -73278 -133651 29667 -71095 -161620 -108720 -185125 -126924 -184772 -51025
10939 -51025 -9796 -53658 -51376 -44104 31747 18400 -115698 17320 -40193 -114539 24391
10928 24391 -97138 -63150 -121827 -291398 52023 63456 68611 138641 -19536 -57336 -104405
10917 -104405 -157020 -111752 -40670 -89093 -23318 -97451 8448 -119298 -147713 -81519 -87207
10906 -87207 -2973 -3352 14234 -99347 18757 -49205 -134036 8725 -20290 -102801 -142480
10895 -142480 -126337 22913 -25554 -81357 1147 -224408 -119717 -38765 -57266 -122260 -24131
10884 -24131 -57728 -65689 -100876 -140159 -202959 -284251 -136189 50013 -20504 -54393 -115508
10873 -115508 -66586 50208 -37142 -31841 -25841 97246 116758 -130512 -175535 -38990 49241
10862 49241 -10149 -112401 -29253 2810 -90318 -167106 -7414 -14816 -66659 -33288 -129234
10851 -129234 -75787 -196668 -139759 -72472 -230738 -140947 89176 -92029 -140912 -130514 -27059
10840 -27059 42621 -7489 -128040 -103328 -96952 -75715 -155376 -61224 -122505 -209055 -186773 -154860
10828 -154860 -46353 -171251 -82618 -140648 -209789 -111348 70445 -18017 -85495 -81646 -48357
10817 -48357 -77156 36409 53625 119195 153402 101710 -36831 -20858 -147266 -70061 -133514
10806 -133514 -38247 -23058 33751 20642 -121571 -108550 -8975 -15583 66932 83871 -2390
10795 -2390 50642 50513 17914 -71487 80331 40355 77123 -120325 -16711 -31386 -95179 73192
10783 73192 -26097 122629 108045 -64045 -98111 -94368 -198562 -117484 -24366 -164941 71676
10772 71676 -12388 -95732 -80919 -75482 -61873 65246 29319 34208 -11751 9096 31114 -73533
10760 -73533 32725 65341 59387 -174596 -106002 -10733 -41908 -2771 -159506 -87979 -50719
10749 -50719 -63025 -70788 20689 49785 -83890 -52795 -85778 -93900 -61943 -32909 -21644 -61225
10737 -61225 -62646 22612 -2702 -261187 -216221 -12262 -83035 -141221 62912 80259 43572
10726 43572 2066 -75688 -109976 -52192 -140087 -175617 -126874 -23926 199794 -29593 -158101
10715 -158101 -180231 4162 19800 -53345 -89547 18790 -35223 -126050 -29856 26313 -81387
10704 -81387 14862 -50522 -224779 -193937 -100767 26637 100101 -96194 37137 58718 114003
10693 114003 -38623 25942 -34607 -59762 -68312 -199971 -369528 -137189 -27633 75803
10683 75803 -4287 -80808 -105905 -104239 57271 -90568 16679 -39961 -193637 -91081 112488
10672 112488 21299 -833 -161952 -43978 -8940 139144 28388 92703 -52561 96334
10662 96334 2406 11860 178786 78857 -23360 -51319 34517 -50303 -159291 -27523 81070
10651 81070 56319 680 -129224 11638 44636 81020 86915 -66344 -153588 -179359 -26541
10640 -26541 -111928 -177360 -184873 -135081 -164528 2738 -202145 -314615 -107529 -85645 -99784
10629 -99784 3032 -85780 -11018 -16587 33144 36827 54407 17305 -34588 -51984 -249927 -316558
10617 -316558 -161638 -56941 -107447 -111715 -220840 -150866 -180042 -200872 -99812 -61804 -60089
10606 -60089 75075 114583 95800 41467 -17522 -76362 -111971 -153099 -88187 -15415 18332
10595 18332 -81612 81421 -39412 -46955 -135214 -257503 -44320 81072 80198 36330 -69317
10584 -69317 -81558 12918 -10023 -108808 -131183 -75320 -214849 -122910 -40246 -101262 -17039
10573 -17039 -25895 39309 33008 -34852 -41845 57629 -115671 -76885 -42327 -33958 -123413 -1023
10561 -1023 29022 57763 68219 32668 5936 -153926 -47873 -80562 -190047 -136244 -144750
10550 -144750 -113648 -28696 -26994 -90893 -171692 -48505 94257 32922 19642 194924 -35504
10539 -35504 -96041 -176224 -64691 32492 -96854 -172993 -144997 -46165 -34239 -42052 -24449
10528 -24449 -149373 -112005 81564 -8415 42095 -76491 -87639 -146282 -214665 -33065 -7721
10517 -7721 -93184 -163510 -6987 -7270 -114962 -79563 -8830 -82 49499 109939 13792 -7182
10505 -7182 -26123 13984 69214 85900 19531 -143312 -160327 -148634 -151462 -241719 -100696 39913
10493 39913 39157 -54670 -44049 -81720 -72440 -4473 92830 67053 -101742 -175554 -106901 -141753
10481 -141753 -141541 -198374 -120700 -62966 -24817 -112510 -148520 -29569 -51305 65753 -150953
10470 -150953 11401 -1271 -4021 -112160 -59593 -70365 -47152 -47403 -36273 -6535 -168178
10459 -168178 -152278 -35918 -106877 -57656 12186 -46816 -114398 53389 -33399 -172222 -99210
10448 -99210 -102008 25382 -160758 -119328 -98322 10267 -14274 -32486 -139598 -68942 57538
10437 57538 3937 6699 34436 108963 72732 186736 159457 -40519 -8517 24364 -29925
10426 -29925 -49458 3920 -31921 -65559 -37280 -22754 -5017 84543 -152350 -89422 -159516
10415 -159516 -187456 -81247 7165 15271 -79472 -101945 -27614 68819 23836 16843 32906 81273
10403 81273 -10497 44471 -11203 -91598 12988 120506 152628 60502 10945 53545 -34402
10392 -34402 -115837 -148610 -181125 -103416 -118983 -23610 89781 66024 -4928 69691 115149
10381 115149 47633 26821 -46818 64608 114650 -1502 -52639 -135645 -198216 -95747 -16404
10370 -16404 -46767 -4935 -49348 -125976 22471 92437 125649 -172836 -195511 30835 84308
10359 84308 113901 78898 25109 72549 27699 -4416 93269 172310 17394 126641 -68415
10348 -68415 -57563 -83586 -136079 129230 138634 144348 85332 -33147 -89579 -48199 -86521 -3955
10336 -3955 60028 52051 167665 115951 -7079 -34404 -100112 -93499 5624 48349 -34052 -37714
10324 -37714 -68759 24272 21049 -715 135221 156327 59593 -92243 -150064 -18293 -40582
10313 -40582 78731 -4570 -93366 -41740 84176 34891 -8616 53109 -158016 -174325 -5816
10302 -5816 -24097 37877 -57892 -73073 -35110 -68202 -117785 -320170 -148336 -155098 1335
10291 1335 43707 13940 5721 -147594 -50273 -83999 71752 124284 -27824 29702 -47245
10280 -47245 12942 83388 -94845 -163723 79148 137663 63737 9494 15772 43080 -66820
10269 -66820 -158520 -55332 33249 -66072 5289 52567 110216 30768 -24353 -58018 -42876
10258 -42876 86176 12713 -120819 -111403 -55880 -21265 -17029 -55299 -86711 -102929 -155254 -66791
10246 -66791 10260 -73153 24951 -94844 -9717 5230 -24902 136451 92265 202669 223713
10235 223713 231455 -7863 58757 46113 157052 74245 -70811 -60187 44474 32306 -9397
10224 -9397 -94348 -184987 -30848 -69297 -193040 -89667 -154557 -134164 -22528 29712 179664
10213 179664 74018 16050 -108806 14899 29484 164806 36429 -15388 18049 30844
10203 30844 -42903 -12471 -53432 143351 188666 34319 88838 -59026 -97641 26761 76340
10192 76340 -28194 45667 2396 3655 -114663 -142743 -9388 70471 126876 123684 72115
10181 72115 14991 -2465 -8693 67576 32658 -12505 85398 55325 -68839 -132591 -87911 -210752
10169 -210752 -131228 -5756 -50507 -134047 -191663 -76154 20892 -27399 58163 61331 -19756
10158 -19756 -93127 -86850 53151 24825 -105112 -40356 110359 -86771 -38472 -33665 87965
10147 87965 74189 35664 -18427 -76529 5385 128443 98357 110657 90743 83887 -35498
10136 -35498 79156 63409 145209 117932 148982 169147 226825 297247 162023 69018 79272
10125 79272 64197 85864 74161 5546 137292 102660 94973 107344 338528 314809 87132
10114 87132 98639 128884 43275 110059 32813 -5286 93143 77554 96105 105130 123566 70547
10102 70547 217716 205095 39310 -7503 81944 113680 21613 16370 -11287 61733 113303
10091 113303 80337 -40656 3202 59132 115459 176054 290907 157983 39845 79069 75858
10080 75858 -32983 -14245 47196 105388 16801 -28127 -247968 -102123 78857 -43141 13589
10069 13589 157868 120897 57005 960 -9248 53735 29037 -17590 158568 126968 160094
10058 160094 16791 62432 48630 13727 22549 32514 164663 302238 204572 257747 212216
10047 212216 121427 329792 253085 153305 272848 148937 212532 181139 181539 143589 195924
10036 195924 222553 185335 -16792 -8382 18389 47334 191654 117011 61322 103477 146287
10025 146287 164402 176953 92137 100023 86190 257504 167017 129420 154121 150110 174944 199682
10013 199682 162710 180037 227209 307821 235302 186753 160842 188828 227821 267717 225932
10002 225932 257716 300646 10694 34735 217520 143227 266650 134562 191913 226361 198142
9991 198142 192504 342264 224097 226114 304810 312768 139457 43413 154111 291590 133647
9980 133647 198557 225595 278209 248338 249261 282420 354030 362349 274833 154722 147914 71138
9968 71138 207957 316062 283143 338222 344117 339605 430028 372320 171274 53205 379706
9957 379706 294614 156288 310196 131104 167157 219409 339154 330061 291534 368976 407373
9946 407373 428800 374264 466163 415393 471333 449030 396639 452892 410359 380966 380254 327694
9934 327694 300031 374597 308983 425458 392280 403150 396871 306681 352987 434056 500422 440634
9922 440634 449860 475827 355567 387491 442142 422220 418586 510084 576372 663420 609496 536197
9910 536197 532602 526888 339311 260672 426350 521498 491385 508818 471773 362038 378396
9899 378396 471512 358153 474682 413887 563405 664619 539240 514806 486147 450612 521253
9888 521253 551928 642235 508303 600969 629426 628653 704460 604952 630961 569814 516495 645054
9876 645054 614705 659968 696559 729145 623604 626396 709005 819319 710081 721582 658688
9865 658688 817271 918043 929545 679169 678381 723679 867055 945721 824505 885768 898411
9854 898411 1130644 961844 819431 875475 873635 1000001 942033 1000640 1048858 952091 1038212
9843 1038212 954338 1111102 1099322 1133150 1239803 1029781 1093808 1278180 1200176 1282667 1168119
9832 1168119 1376008 1345825 1409395 1325315 1402167 1431120 1453954 1711637 1649539 1779868 1767877
9821 1767877 1714483 1753778 1779389 1968766 1884116 1861972 1818958 1785934 1745532 1804343 1849336
9810 1849336 1848440 1871402 1968633 1904794 2070069 2044345 1860391 2010089 1946319 1836560 1959601
9799 1959601 2125678 2048681 2113058 2197942 2222523 2130926 2221816 2050342 2121303 2156825 2113590
9788 2113590 2258163 2292458 2365592 2331194 2429261 2369150 2468375 2618269 2687888 2781233 2795136
9777 2795136 2798071 2864446 2839801 2710098 2814462 2801039 2899884 3010063 3122544 3082577 3170773
9766 3170773 3223449 3324396 3282354 3486262 3503228 3540939 3599641 3682949 3734993 3628878 3781856
9755 3781856 3890527 4030246 4089258 4002445 4152585 4308973 4393002 4530525 4479173 4708682
9745 4708682 4750718 4839413 4847349 5129802 5077617 5227788 5317947 5375855 5563105 5707375 5914234
9734 5914234 6072648 6171038 6328691 6463355 6671461 6908683 7059340 7184008 7438390 7615717
9724 7615717 7727967 7881625 8147042 8250446 8581643 8929711 9293921 9434193 9715704 10229829
9714 10229829 10472734 10715722 11034491 11349911 11780950 12265447 12516033 13019644 13397079
9705 13397079 13919844 14439678 14934711 15437038 16102400 16828645 17500502 18136752 18925659
9696 18925659 19837891 20485992 21280986 21994139 23104584 24034377 25029284 25962705 26978095
9687 26978095 28062458 29364411 30525320 31908345 33278190 34614807 36384585 38048288
9679 38048288 39851642 41546624 43463338 45424376 47573641 49832209 52475112 54875048
9671 54875048 57788743 60766402 63788930 67139931 70730559 74434151 78626713 82892000
9663 82892000 87282240 91919583 96497573 101231323 106050258 110759108 115431915 119491197
9655 119491197 122835533 125561562 127399946 128254017 128029695 126825991 124392277 121201088
9647 121201088 117301088 112828244 108117585 103126068 98021857 92979105 88365709 83633669
9639 83633669 78955615 74538219 70452370 66728883 63154099 59819489 56671475 53704339
9631 53704339 51011707 48490875 46327321 44073903 41850349 39903110 38190183 36656299
9623 36656299 34892287 33271672 31943943 30661459 29478555 28403629 27224400 26051230
9615 26051230 25182906 24379197 23532693 22676835 21898644 21232963 20484552 19760561 19144909
9606 19144909 18546127 17902231 17269810 16688061 16218245 15705532 15228750 14745896 14219582
9597 14219582 13943925 13525709 13114388 12724957 12367614 12113252 11828887 11398472 11048529
9588 11048529 10892100 10426588 10273903 10000992 9565845 9440038 9261099 8926690 8659204
9579 8659204 8536591 8224554 8083277 7762767 7772213 7506336 7228610 7195008 6902963 6782476
9569 6782476 6822407 6743382 6501150 6384162 6217735 6013438 5879030 5844971 5686656 5509024
9559 5509024 5313141 5239673 5249111 5150613 4921536 4838249 4913506 4892903 4801865 4600152 4377496
9548 4377496 4236140 4182511 4230247 4097256 3917377 3911252 3935693 3765354 3674555 3662521 3700382
9537 3700382 3488019 3531358 3458616 3299231 3180970 3153975 3030138 3019932 2945436 2881047 2823020
9526 2823020 2717758 2738978 2714217 2526222 2525031 2447866 2543688 2505142 2482665 2353643 2260549
9515 2260549 2342537 2218853 2294302 2290926 2138450 2170727 2235479 2244746 2176263 2104264 1999862
9504 1999862 1894446 2017997 2054340 1982612 2114142 1928528 1921699 1994888 1894871 1872853 1784411
9493 1784411 1792507 1836027 1919842 1978987 2023689 1968912 1974746 1974984 2058447 1966084 1895123 1892557
9481 1892557 1763314 1648740 1735953 1596893 1391437 1465325 1468910 1298631 1494163 1436550
9471 1436550 1386221 1293235 1091915 1221416 1318646 1231723 1236144 1228993 1364444 1221230 1078019
9460 1078019 1182680 1218932 1237208 1239284 1131591 1097127 1122046 1067407 956121 871518 935316
9449 935316 1065008 980424 1090509 1122784 1124905 1192296 1038511 997787 1054488 1045434 943181
9438 943181 872375 823785 966229 869421 818525 900250 879275 795500 765299 845972 753042
9427 753042 834495 787348 662812 800003 743873 567406 589101 515604 637222 617529 532207
9416 532207 637777 713967 702141 755011 706918 735470 741597 650785 573609 451636 577267
9405 577267 514258 508735 459048 323344 347626 552707 576569 504998 407036 370234 392470
9394 392470 425144 431811 413146 377205 386785 414550 511964 508044 528687 460904 542133 558998
9382 558998 455419 381251 513160 436926 550348 420466 315420 302181 189030 322285
9372 322285 290147 215949 353058 423618 458845 515222 307051 168501 269253 278512 383959
9361 383959 215164 273891 237459 304448 388788 288114 328230 326265 468078 301857 430519
9350 430519 266547 277711 256323 372279 322947 252128 209779 224828 255571 313195 296412
9339 296412 309860 364689 332525 290993 315488 307395 433845 284511 234453 214219 228256
9328 228256 231008 210029 159186 315021 400459 275918 224412 204949 264001 276670 178317
9317 178317 86253 190822 251637 351133 195508 114154 138227 226110 285937 266291 200657
9306 200657 140246 281366 278810 288631 200521 194219 361333 295723 254905 185006 221613 249417
9294 249417 179338 209895 119526 215037 162489 272345 324824 231365 377501 331293 254680
9283 254680 266614 191773 113470 40962 -93068 97363 108470 157780 81116 48385 38219
9272 38219 95586 113948 100193 192164 156766 81668 287830 387531 228145 312342 201558
9261 201558 191531 272862 87501 151376 109748 170458 257538 120192 105196 187633 202218
9250 202218 17947 59831 -52338 -148821 22343 10776 93113 167581 175600 84242 88595
9239 88595 147044 57026 -93819 -6627 -68675 -32967 17327 32218 133499 122047 95436
9228 95436 218895 194167 264901 259943 164405 -27003 36719 47440 75478 53764 -12412 158798
9216 158798 207626 196604 83379 49233 221383 164552 199887 117228 145534 210201 68427
9205 68427 -14678 66527 87963 97429 147336 64823 127565 149459 168650 113241 21679 14646
9193 14646 280292 149058 78997 107894 125362 84921 15084 -100907 55875 121811 157247
9182 157247 80429 143727 189687 74950 171344 196844 101133 -167795 -198312 128382 130319
9171 130319 125087 225075 174849 162496 82037 87769 47659 195534 187227 164866 128261 172539
9159 172539 108468 91535 141081 166408 276667 266066 193580 121477 196052 102075 86437
9148 86437 101285 -7080 -135323 -12375 117106 178810 335697 129149 -84101 89902
9138 89902 65262 120380 72316 203673 121942 66810 130158 9420 61518 -86643 -87358 2103
9126 2103 190185 208359 48496 -778 42851 51919 45410 40023 65503 231183 76686 -7381
9114 -7381 69448 101711 79859 124814 101550 -32530 24907 46901 220825 327709 62295
9103 62295 39522 68654 4760 183045 176125 12698 2667 -55108 36148 68229 -11289 163598
9091 163598 253397 48889 95568 94479 48154 -30432 -41979 21193 393 -89224 -61406 72621
9079 72621 -15239 -61310 15990 -21154 8880 11407 -23474 -80107 6169 111306 89036 120918
9067 120918 85413 52738 63289 117101 124780 46957 -59379 -26375 48981 -19712 60462 -18529
9055 -18529 75145 -10757 -19939 -34222 -151334 -7221 126977 74324 225517 148230 40160
9044 40160 -65368 -73308 -60337 30901 26054 -45817 76996 -27170 -146475 -51131 56065
9033 56065 -8933 105749 -58786 -3221 -106503 10099 -20161 -86961 -104383 -31891 -9134
9022 -9134 -33634 -16814 33592 85595 52654 48582 115651 -32343 -30929 -154311 -114227 -66475
9010 -66475 65162 -131735 -196673 25379 -165745 -124401 77206 33169 40475 -47846 8652
8999 8652 -80539 -50816 -43217 -58481 -71174 -6351 -97534 -92074 -34243 -90070 -56687 -123542
8987 -123542 -187164 -113996 -66244 36908 111636 -40537 -71143 -105890 24500 191235 17063
8976 17063 -144188 -31106 -83739 -57819 -193735 -25018 245126 -1873 -38482 24628 -56856
8965 -56856 -23948 -104465 14877 155502 -33565 -103834 -30107 -27954 -46320 58841 55397
8954 55397 30089 -40810 -85412 -163546 -225262 -25722 19561 151345 120331 -2643 68142
8943 68142 35133 87918 17014 -65893 29233 -84989 -77047 -49120 -40778 -14771 19718 -109938
8931 -109938 -37055 56826 -17415 -27952 87372 86824 17180 25205 89485 -100749 107348 177949
8919 177949 164613 132437 47883 41 -44709 -104391 -25378 -20926 -53627 14996 121116 93993
8907 93993 -4205 -131837 59316 236910 -39469 -5989 23665 4736 -24523 -38344 6607
8896 6607 65034 14087 -65942 -46369 6821 1654 32573 219850 87696 -79405 39636
8885 39636 81196 43530 76522 66658 97702 98571 99592 4315 -11524 -60148 113357 148011
8873 148011 150945 225640 171562 31912 13326 -14442 -14344 -52461 -131972 -23305 15874 -15349
8861 -15349 -18303 181435 51252 11828 -39955 -99632 24438 54361 -92980 -47917 29813
8850 29813 4010 48483 -54705 -12163 -28466 -16424 4642 -178718 25546 59554 115603
8839 115603 74326 -68041 -16274 33433 39904 25977 -85744 83302 186170 33894 10712
8828 10712 15605 27627 18873 67527 -1078 29834 53281 -8034 -22848 27505 99120 -89186
8816 -89186 -299 10831 -5399 52416 29015 -166061 -136299 -200351 -232826 -118953 -93290
8805 -93290 -177437 -98653 -116938 -109470 -125970 -87660 -6474 -195563 -183349 -4313 -126564
8794 -126564 -188061 -48570 37841 24056 61065 -4303 -75608 -2137 85986 -60017 -61759
8783 -61759 2423 27016 189999 14422 38849 -48595 -14772 106095 167349 43848 375
8772 375 70886 218292 100065 24140 -18716 62223 143137 89729 -81191 -99811 -43411 2904
8760 2904 124760 -19607 58868 94160 -7194 -113048 -1253 -113763 19910 87938 -29355
8749 -29355 111121 234354 243361 187348 162095 131823 96904 18425 -35910 -75605 31723
8738 31723 -36613 -129577 -79902 27458 8185 -20734 110141 31091 -360 -232376 -268615
8727 -268615 40681 -19573 -155239 -152078 -67724 6786 -134220 -97080 22401 -26453 29424
8716 29424 -82390 -81095 -22381 57108 11882 94431 88504 -12165 93705 15041 -52541 18246
8704 18246 4400 72115 5680 87602 96775 94394 61281 37003 -22406 -48474 102941 121103
8692 121103 127525 164876 124258 -708 54351 126170 55301 65693 12814 -195789 -96019
8681 -96019 -93268 -123293 -118397 -35034 -22888 8291 169216 20415 -58701 46326 79228 29035
8669 29035 66135 -4804 68181 85661 86704 -47955 -46947 -22628 -23718 9408 49303 806
8657 806 -49573 -14537 -98766 -84437 1152 59942 4431 20799 -8350 -62250 -132541 85972
8645 85972 -104526 -1141 -24095 -50897 -41987 -39995 22079 -2441 -552 33278 14053 -22282
8633 -22282 -170895 -97629 -14065 33682 196305 167442 231559 99714 -99639 -41331 116481
8622 116481 -22413 72817 16722 159801 147336 68586 94867 87675 -85039 -79668 50395
8611 50395 -2655 88432 78821 -101225 -42045 -119275 -93053 -34831 -91993 -150330 -149032 11988
8599 11988 -89402 -28492 34736 183206 187785 126168 -69651 -25346 43043 144482 83132
8588 83132 -39414 -24148 -32429 -79137 -74786 -8528 -1287 24644 36066 73101 88822 51801
8576 51801 105280 182485 112174 151169 82189 73133 -49885 -161834 -83595 -63583 -20871 67373
8564 67373 -46338 -73667 -9868 -14384 45770 83543 71173 -73054 -153689 -174547 -67972
8553 -67972 -29355 -11361 -39399 -51878 65974 -2668 75814 241570 192551 27922 117836
8542 117836 -123002 -51518 247993 87692 137202 -12486 19160 235699 150055 73859 94842
8531 94842 68977 73443 47344 -33586 -57751 8750 -13960 -23318 49004 -22017 47912 125825
8519 125825 101892 55961 86241 63937 9364 21801 71740 28449 -153882 -31276 54318
8508 54318 12107 -40198 -19207 171644 146350 161526 69093 51722 11391 -2620 -13828 -54913
8496 -54913 -67569 41081 146168 69635 -45496 7645 46936 18828 156053 11060 -36507
8485 -36507 193635 165148 99069 21630 -30901 122226 81613 157343 168604 -4044 4729
8474 4729 62104 22035 -41224 -110941 977 155499 188273 24580 88942 7334 68474
8463 68474 41917 117254 43984 -74000 -90760 -60715 5814 1570 81313 10572 1664 14164
8451 14164 19188 119757 158773 147107 167091 142913 191754 83733 26506 -7169 12933 65414
8439 65414 30483 -42555 8148 -84770 -2611 -28900 50614 99480 141061 182840 202544 39150
8427 39150 45113 95704 157440 -22582 -56158 94060 115481 85581 273587 58722 23208
8416 23208 137054 -9740 52259 -16876 61359 102289 12341 100604 84855 -25024 1848
8405 1848 -159324 -48838 86159 246792 160698 161164 66595 1693 25431 -1493 34984 77513
8393 77513 125649 102787 22323 171402 175564 -39999 -47653 110750 149890 51883 115475 135472
8381 135472 144854 132221 -5868 47601 19653 -2516 -138691 15234 154749 33353 56673
8370 56673 -4303 48450 192319 142102 33602 -18898 116397 99703 32149 17377 108853
8359 108853 -55968 5597 -69313 -73073 76302 114965 47981 11280 76318 154810 35320
8348 35320 36937 121392 23016 140193 54403 68531 -49861 58226 48128 40435 166587
8337 166587 97692 126880 9538 19191 94038 90569 10843 50328 -3509 33686 38557 -84192
8325 -84192 -14517 32413 80484 -58647 129739 3611 83460 85720 78060 36326 46503 8232
8313 8232 94345 128821 234553 254682 191666 97649 134899 145860 -27054 148193 233529
8302 233529 162930 -64698 101044 233014 103284 -134589 67424 114071 162882 166701 22963
8291 22963 139009 220408 107726 28858 99433 164226 174583 198691 64976 148262 172428
8280 172428 65016 -51769 -32012 131576 115403 126459 213319 255150 167428 201478 195586
8269 195586 18624 85908 165055 64109 165019 6343 67679 101416 173530 43211 239425
8258 239425 216993 108504 193982 211603 257699 210732 172923 212195 310868 204558 245788
8247 245788 106749 -26183 70789 179509 231258 310664 339666 194898 149477 167691 106309
8236 106309 68539 69222 31151 19070 264544 350523 247474 227067 290870 238673 270114 297780
8224 297780 270522 236671 238582 293872 199754 120516 123416 233773 216997 18015 45231 4640
8212 4640 114186 216556 184814 123004 147635 194947 227870 289541 315188 277227 283375 356697
8200 356697 182903 231236 227243 249769 404363 441561 345523 563372 394479 -61449 133712
8189 133712 120114 112476 89456 64993 178154 126746 -39316 110992 177931 198493 140790
8178 140790 72992 -47213 192461 257438 112595 155958 214496 344587 93632 -12982
8168 -12982 132774 181906 236899 233315 166501 230349 21656 185670 183191 200268 220244 240376
8156 240376 266229 314870 338375 135053 230319 236748 196389 282628 246692 192212 319715
8145 319715 108980 128415 245833 95325 131003 89432 196469 130661 294014 430742
8135 430742 177471 195897 327113 277550 316635 314873 154785 143087 197593 224151 207577
8124 207577 120511 358053 376666 261025 191165 291611 313124 215278 240058 149087 253624
8113 253624 343324 300808 220980 293086 227455 275922 248804 273179 314798 368870 292774 226842
8101 226842 369071 439795 480978 389236 345357 405334 336920 504248 467753 442792 337159
8090 337159 313884 339754 454383 413914 313022 303293 276695 231235 276659 228216 345228
8079 345228 235677 338347 274581 327854 379617 327127 359542 381162 278738 304899 414213
8068 414213 388866 419125 386625 388601 382630 293084 266275 315689 240698 294169 201794 363194
8056 363194 385655 259626 252459 353756 300343 360515 387488 511317 349120 465515 357235
8045 357235 329962 407620 417122 516514 552084 416142 492581 533887 559117 536852 547402 506884
8033 506884 501647 397178 403488 554970 654855 657953 551602 441842 521129 683704 592970
8022 592970 567216 705236 645408 548273 697144 574442 626743 585355 740909 578772 565308
8011 565308 766880 586217 676255 504552 522307 631955 616273 702931 648110 563501 590617
8000 590617 519623 618990 613634 684299 540007 392988 545009 599560 454031 501093 555162
7989 555162 590488 695031 579019 561841 635379 619243 609245 587823 627980 630702 509620
7978 509620 494725 447319 444306 495681 510483 475004 583193 654344 536446 445697 457902
7967 457902 563469 715118 724386 811639 775294 794383 682575 806704 701213 495565 462340
7956 462340 592905 577269 555918 514603 523460 661086 524082 420431 522105 576579 827146
7945 827146 729000 531978 659787 907988 928437 817050 851662 692880 679546 658393 715839
7934 715839 787035 841031 940603 986215 846954 1062772 988431 974451 952431 841775 717189
7923 717189 904791 950320 1052144 942187 939336 958969 992664 955267 787412 838587 857336
7912 857336 833264 840867 913654 899203 798933 847096 930755 915313 859994 947531 914664 900280
7900 900280 754491 620209 912237 813200 991025 992123 1021982 1030712 1006760 1018006 1060189
7889 1060189 1047121 1163742 1090006 1218185 1181245 1313143 1188073 1189723 1279975 1276898 1200580
7878 1200580 1341392 1452492 1370056 1349475 1591341 1527429 1588436 1766053 1735022 1698664 1864995
7867 1864995 1948186 1919782 1956647 2119015 2243240 2234173 2320947 2459605 2444537 2649559 2890485
7856 2890485 2969591 2946383 3106197 3258532 3438640 3485093 3378570 3607825 3550419 3661061
7846 3661061 3740525 3924553 3837315 4089920 4331414 4402668 4717640 4859400 5118249 5404699
7836 5404699 5860290 6276815 6845643 7199546 7384365 7552666 7633615 7749904 7740699 7388398
7826 7388398 6820354 6419381 5919600 5563838 5195757 4941225 4421311 4544418 4250955 3942919
7816 3942919 3754498 3672308 3394966 3265702 3138048 2944939 2785737 2746469 2732866 2653883
7806 2653883 2658892 2618381 2600510 2437374 2317244 2176417 2169963 2286119 2297116 2331066 2383687
7795 2383687 2298117 2062959 2166367 2171852 2009915 1900137 1917270 2081751 2075075 2187990 2037454
7784 2037454 2026599 2038920 2026304 2040934 2075850 2027673 2011831 2090185 2102696 2157083 2407045
7773 2407045 2305928 2165195 2033848 1987753 1996044 2155194 2244442 2266788 2280973 2153416 2118237
7762 2118237 2320917 2495414 2434100 2484710 2600769 2565852 2355235 2383226 2449759 2359592 2332982
7751 2332982 2503171 2523926 2620490 2556301 2576915 2633023 2617663 2638750 2793220 2642695 2789671
7740 2789671 2825581 2854539 2943114 2994969 3063364 2961526 3067203 3122982 3149921 3223832 3334354
7729 3334354 3324533 3395020 3288663 3347963 3393802 3204114 3252806 3304438 3489348 3547994 3526111
7718 3526111 3734214 3778475 3663511 3804680 3871946 3861723 3968185 4038236 3980302 4072414 4213501
7707 4213501 4246152 4422603 4541428 4456984 4518014 4608316 4787608 4833650 4729032 4827013 4901459
7696 4901459 5101573 5146001 5212420 5205351 5166212 5270011 5571981 5678511 5563780 5756565
7686 5756565 5852405 5784204 5724887 5916836 5915161 6031824 6278307 6259118 6261564 6578297 6602228
7675 6602228 6730419 6852198 6900840 7160163 7135351 7351919 7640238 7709148 7641690 7742234
7665 7742234 8003528 8216221 8291835 8565852 8688803 8924828 9244620 9465405 9505714 9733085
7655 9733085 9895940 10178104 10481695 10924191 11006147 11294364 11637419 11924889 12205033 12661419
7645 12661419 13031243 13325545 13664870 14091405 14503094 14980061 15566463 16138651 16822814
7636 16822814 17645380 18244870 19075219 20018231 20994373 21957851 23145099 24200448 24916817
7627 24916817 25677141 26505900 27260143 28006697 28738042 29375894 30339145 31516848 32699360
7618 32699360 33810541 35106418 36692982 38319774 39866218 41602382 43533473 45555104
7610 45555104 47693077 50118636 52369240 54895356 57799347 60978085 64356577 67829150
7602 67829150 71832849 75989910 80953204 86090164 91823209 98382760 105373880 113282177
7594 113282177 122364613 132633544 144295517 157361810 171401031 185693870 199467801
7587 199467801 211803166 221307955 227684960 230240394 228941009 224058497 216383135 206718731
7579 206718731 196218284 185831385 176478852 168316886 161769254 156984031 153840705 151995764
7571 151995764 151751896 152965401 155488229 159697564 165354110 172942801 182425404 193421860
7563 193421860 205268693 216948998 227522023 235750213 240831405 241963105 239050098 231846904
7555 231846904 221391354 208321251 193441685 178086463 163334720 149204075 136431529
7548 136431529 125114830 115165820 106682858 98951578 92208582 86551107 81249972 76671483
7540 76671483 72423162 68474635 64883139 61787811 58685026 55740377 53211246 50876221
7532 50876221 48974727 47033765 44999564 43342285 41710109 40139686 38622162 37462410
7524 37462410 36080446 34978163 33901764 33003338 31856993 30963891 30161820 29317761 28329839
7515 28329839 27352310 26491167 25397299 24471266 23686495 22992397 22164785 21532897 20839696
7506 20839696 20349040 19617001 18886773 18369689 18003133 17388417 16808288 16362438 16127434
7497 16127434 15716620 15217981 15011217 14729302 14387777 13963687 13857533 13608104 13252188
7488 13252188 13128101 12786523 12571099 12295257 12154589 11901511 11765786 11381847 11285097 11074057
7478 11074057 10975915 10847048 10704213 10490291 10185343 9997711 9680120 9576313 9646448 9428422
7468 9428422 9280623 9026736 8941276 8851519 8650398 8588784 8491084 8403891 8328262 8243996 8164733
7457 8164733 7976065 8048245 8013216 7955223 7936633 7862896 7859966 7733267 7728238 7507119 7267459
7446 7267459 7143850 6967136 6932314 6703357 6640571 6580706 6469239 6443141 6429774 6270864
7436 6270864 6233226 6196478 6077077 6020208 5914645 5980147 5972472 5903819 5822447 5960741 5967869
7425 5967869 5919994 5956562 5979253 5990905 5822634 5836194 5966880 5990448 5826754 5776929 6020215
7414 6020215 6052743 6087884 6311240 6479520 6473260 6480385 6532051 6545850 6623488 6591657 6500645
7403 6500645 6458527 6404407 6452436 6294747 6403942 6319647 6178096 6281376 6291839 6321713 6334526
7392 6334526 6402875 6371190 6516055 6500756 6469407 6789963 6930947 7035331 6985790 6993141 7169257
7381 7169257 7129315 7220098 7032935 7040625 7073511 6995935 6864627 6800408 6716186 6641238 6696659
7370 6696659 6682849 6636781 6401149 6587574 6620237 6496415 6357083 6336625 6430065 6364553 6393231
7359 6393231 6368353 6298443 6338593 6342889 6296373 6284874 6321604 6302832 6171941 6120505 6197118
7348 6197118 6167786 6260206 6223575 6200232 6133819 6121226 6312407 6376423 6328992 6403953 6492447
7337 6492447 6511144 6591335 6513763 6608842 6658659 6563603 6590820 6851346 6800129 6925873 7075802
7326 7075802 7186422 7363696 7390449 7568440 7751580 7817091 7992126 8345221 8405517 8392969
7316 8392969 8515390 8561902 8758593 8784368 8658766 8676383 8794938 8834902 8667012 8720975
7306 8720975 8720052 8917082 9172429 9075468 9116358 9351434 9470534 9802641 9737328 9914394 10137736
7295 10137736 10393351 10599070 10681258 10817207 11130483 11519105 11729513 11860583 12025028 12162975
7285 12162975 12198800 12357586 12615982 12651739 12638865 12887188 13022646 13116783 13262546 13597778
7275 13597778 13858041 14093426 14486029 14738150 15021385 15376796 15717354 15858935 16235905
7266 16235905 16705375 17046920 17469404 17823951 18091637 18720774 19414959 19932240 20554819
7257 20554819 21131774 21659034 22340280 22899063 23553107 24326509 25054026 25818171 26473010
7248 26473010 27389012 28403163 29288265 30287913 31374144 32443644 33831647 35107123 36355925
7239 36355925 37679412 39221767 41056937 42698891 44370001 46359443 48263118 50337618
7231 50337618 52449659 54762627 57334293 59879341 62577185 65658001 69084334 72819135
7223 72819135 76845129 81253535 86165142 91436803 97335166 104131113 111804701 120194976
7215 120194976 130237479 141132712 152443583 163861826 174302504 183452508 190208820
7208 190208820 193903617 194645833 192637205 188079575 181970945 175389482 169204221 163579364
7200 163579364 159286419 156308888 154505673 154312803 155491489 158184647 161926225 167009445
7192 167009445 173584721 181742240 191542677 203453549 217545917 234004537 252186436
7185 252186436 270615462 287492464 301712454 312004189 316677757 315211486 307962355
7178 307962355 295841675 279397446 260458893 240986309 222340496 205123510 189895917
7171 189895917 176384516 164948878 155001641 146550550 139525442 133760963 128876432 124486456
7163 124486456 120980858 118091728 115560636 113652053 112201636 111499353 111095379 111141311 111547421
7154 111547421 112298468 113679338 115442310 117489311 120111025 123439800 127660357 132948193
7146 132948193 139147363 146502199 155015710 164620303 174430527 183035333 189247055 193576385
7138 193576385 196044957 196247300 193188020 187579788 181076550 174243620 168118734 162906821
7130 162906821 158812832 156052918 154667327 154636146 155890246 158534363 162760882 168196508
7122 168196508 175335278 184253186 194980971 207079157 219798435 230876835 238762915
7115 238762915 244474475 247843018 247231367 241735886 232801341 222027651 209805181 196788892
7107 196788892 183747325 171394904 160569587 151139845 143115418 136220091 130820151 126607484
7099 126607484 123235476 120914506 119507045 119103629 119593953 121003092 123621561 126922141
7091 126922141 130999745 134704559 136789496 137137813 136299399 134054693 129772904 123575406
7083 123575406 115984612 108016499 100270080 93242739 86749215 80971138 75960086 71627810
7075 71627810 67642778 64107541 61072109 58328535 55860165 53651053 51630528 49625380
7067 49625380 47667884 46117266 44664335 43335910 41971050 40656687 39342797 38416625
7059 38416625 37434384 36381175 35573601 34742582 34048389 33396541 32819767 32333157 31836430
7050 31836430 31574444 31265404 30848630 30523388 30050749 29894697 29493813 29297412 29229513 29035462
7040 29035462 28808755 28645769 28692169 28736947 28910073 29012545 28955044 29113032 29356928 29587882
7030 29587882 29724519 30224233 30582605 31037207 31597204 31977143 32508598 33284219 33909757
7021 33909757 34653036 35458414 36357553 37377432 38450070 39443499 40623054 41817649 43078031
7012 43078031 44470119 45995480 47877010 49704079 51651459 53801072 55922781 58519680
7004 58519680 61245214 64202511 67407134 71229609 75199326 79808410 84745381 90102915
6996 90102915 96533826 103678526 111946597 121387569 131928843 143161728 153808417 162387487
6988 162387487 168552947 172834988 174783214 173582470 169111903 163068538 156540758 150266773
6980 150266773 144875139 140622256 137713025 135836098 135512136 136360647 138291381 141461130
6972 141461130 146170909 152134160 159648953 168893549 180044195 192486432 205361165 217377465
6964 217377465 227729994 235729825 239668271 239103848 234672898 226565055 215254719 201719683
6956 201719683 187692156 174160577 162042774 151066395 141802070 133832141 127539306
6949 127539306 122936669 119080383 116380050 114743711 114096828 114697021 116173315 118896743
6941 118896743 122367899 125991800 128923602 129948094 129538531 127752916 124116557 118155728
6933 118155728 110712196 102889446 95219944 87595263 80913412 74790948 69126117 64242294
6925 64242294 60111232 56478633 53082693 50123327 47461460 44957332 42736541 40715848
6917 40715848 38781990 37144733 35542193 34052429 32625741 31336986 30178773 29087614
6909 29087614 28059642 27099517 26233614 25562986 24493682 23790324 22941568 22355406 21627730
6900 21627730 20845400 20085165 19541690 18787185 18217306 17669852 16897723 16527092 16048348
6891 16048348 15663398 15216793 14851736 14336863 13939512 13602958 13278745 12863774 12503858
6882 12503858 12139781 11878710 11557969 11326397 11190160 11090765 10788517 10542468 10341047 10317884
6872 10317884 10179350 9771974 9488515 9385340 9214465 9116626 8925689 8661962 8589405 8229900
6862 8229900 8083293 7896359 7836180 7685492 7544824 7244996 7161677 7026908 6863609 6634145
6852 6634145 6552384 6587532 6478182 6527716 6305873 6396108 6413846 6347000 6248350 6260175 6025989
6841 6025989 5995243 5964618 5689520 5558459 5498889 5342643 5178237 4906400 4937882 4976947
6831 4976947 4765407 4573956 4325839 4318019 4243813 4227737 4013791 4113834 4165304 3959815
6821 3959815 3974499 3969671 3988638 3857348 3812312 3678250 3745040 3697863 3750654 3687520 3600254
6810 3600254 3456567 3102040 3201502 3159043 2916030 2832267 2840786 2949553 2862981 2720780 2802082
6799 2802082 2867249 2737867 2765675 2791540 2720518 2688805 2803192 2707061 2719185 2530696 2414303
6788 2414303 2408343 2217073 2063148 2165180 2096185 2181676 2138997 2137472 2191817 2258282 2176743
6777 2176743 1950544 2010122 2080422 1994260 1947482 2025058 1913442 1879146 1857596 1944877 2022935
6766 2022935 1880976 1785810 1862943 1804871 1840123 1953363 1726773 1700651 1777406 1720807 1768992
6755 1768992 1488708 1566747 1677660 1478833 1504820 1501669 1557572 1600953 1592738 1485013 1478420
6744 1478420 1670928 1548138 1484291 1409167 1469974 1406498 1469046 1433210 1476135 1352463 1401687
6733 1401687 1378592 1416737 1521041 1583400 1420190 1340657 1326894 1224693 1472600 1477932 1660885
6722 1660885 1638948 1701437 1752466 1779679 1743967 1782768 1621677 1637480 1706307 1707513 1703569 1590168
6710 1590168 1583822 1413855 1626983 1607327 1553426 1678283 1486888 1666908 1734199 1535749
6700 1535749 1591172 1708022 1764812 1819267 1924679 2003202 2043973 2007964 1943244 1969929 2095574
6689 2095574 1977729 1920410 2064588 1917369 1791045 1673958 1516976 1354929 1350193 1227583
6679 1227583 1202052 1413999 1085853 1182279 1252730 1166528 1190054 1395497 1159617 1234428 1178564
6668 1178564 1252026 1235522 1215542 1130934 1180984 1238360 1096342 1073223 1193400 1203141 1150440
6657 1150440 955278 976126 859233 658839 786545 661334 739786 543189 674822 644671
6647 644671 695538 704292 711820 672810 589363 579019 444749 368612 357672 342102 426812 575639
6635 575639 694786 427648 487199 553581 456771 528145 449497 366826 438130 411572 357611
6624 357611 332726 318435 324311 497121 461788 331288 234444 318610 392133 388699 239257
6613 239257 290981 331293 345391 287611 319820 420144 384926 362189 252685 260544 352876
6602 352876 237452 367258 228507 265327 289230 99485 224386 162374 145493 60360 188484
6591 188484 195029 267500 366462 204778 201705 256155 234191 183999 203414 164383 -63822 -39753
6579 -39753 80150 79284 92112 154289 139254 58847 146550 124802 117144 190609 149630 311161
6567 311161 187307 -12317 -57599 22018 108004 66192 176795 188926 142425 25759 17239
6556 17239 91137 206990 124847 134192 124689 62471 177259 148475 106068 7302 36278 79642
6544 79642 -14598 -35211 98429 -98204 -53293 -78168 -55997 -114694 96593 43425 -27832
6533 -27832 9800 -25392 10360 162730 39057 -90743 -62720 76255 -35026 -39363 25747
6522 25747 -106257 -55726 46337 -82455 -4492 31269 -105589 -61370 -221177 -146369 -80472
6511 -80472 17476 67913 -156090 28929 76724 -126957 15343 -65001 31428 105883 158704
6500 158704 6469 -96729 28088 -70526 -37934 -114145 25794 48483 -63397 -87201 -76870
6489 -76870 -137275 -179290 -176152 -118178 -54088 -157741 -85059 -98585 -31504 -189919 30587
6478 30587 -85489 -113424 -31806 34157 7826 -44150 17664 -19194 -124439 -58479 -85103
6467 -85103 -59201 -18354 -3364 -74615 -105577 -79708 -5424 -72803 -134317 -128543 -256399 -133187
6455 -133187 -48944 -40472 -188376 -270132 -24683 -42475 -21076 60610 -38483 -105406 -275393
6444 -275393 -248767 -162257 -57443 -118119 -146400 13571 -88384 -51596 -163869 -40905 -141761
6433 -141761 -123643 -162350 -171505 48774 -22754 -69833 -183302 -308733 -69743 -55041 -70057
6422 -70057 -21722 -94399 46748 -37074 -93193 -130546 -22318 -74094 -114048 -178931 -89911
6411 -89911 20376 87 -117539 -207176 -59868 -54819 -199661 -23450 23047 -226064 -267652
6400 -267652 -205768 6912 -124577 -79164 -110313 -260596 -188543 -105390 -134906 -73479 -233600
6389 -233600 -332512 -227507 -340595 -202605 -276229 -317690 -229367 -293692 -209531 -15735 3213
6378 3213 -109246 -231860 -71172 -180031 -171263 -147015 17979 4367 -58079 -82300 -64272
6367 -64272 -188712 -119890 -194065 -184036 -211936 -191607 -207937 -240607 -143548 -117737 -237445
6356 -237445 -166493 -184415 -263542 -216378 -50773 -94892 -228655 -175114 -98044 -84671 -123220
6345 -123220 -162271 -199635 -220524 -167507 -82939 -244178 -197347 -15295 -262409 -276361 -327786
6334 -327786 -260089 -201140 -195521 -164479 -204330 -340353 -357026 -188896 -222588 -235643 -263775
6323 -263775 -166486 -271871 -175267 -166669 -94280 -46014 -139663 -126285 -146713 -301365 -379995
6312 -379995 -136692 -174891 -65170 -117770 -334443 -379295 -253434 -90922 -421627 -260553
6302 -260553 -200203 -115070 -237054 -139105 -188209 -317956 -148211 -243424 -169083 -126381 -153130
6291 -153130 -230234 -201759 27246 -154154 -231413 -252630 -293929 -256785 -367860 -255965 -237083
6280 -237083 -183773 -319486 -379263 -334103 -244864 -142727 -288991 -325405 -303577 -143499 -43839
6269 -43839 -126859 -199852 -160901 -271144 -165559 -208143 -201538 -213895 22662 -117723 -162862
6258 -162862 -44897 -190025 -275166 -159347 -214376 -244711 -298379 -238673 -248967 -295264 -169160
6247 -169160 -194323 -59224 -81406 -181084 -156217 -195563 -288768 -120620 -12807 -159263 -306930
6236 -306930 -275567 -421998 -357464 -322255 -229521 -175990 -135546 -149689 -208547 -180566 -97094
6225 -97094 -73931 -160733 -220038 -252709 -209027 -277641 -222462 -105264 -154142 -289446 -248343
6214 -248343 -273750 -116395 -119645 -178974 -226625 -244563 -376332 -248681 -61253 -296958 -177432
6203 -177432 -186412 -335954 -374958 -303842 -335491 -186630 -199013 -266877 -180604 -81237 -111852
6192 -111852 -222028 -235974 -257980 -186429 -75654 -148888 -176371 60299 -34626 -94638 -129182
6181 -129182 -130427 -182982 -157788 -114717 -142591 -158371 -188307 -130716 -234216 -329091 -356124 -200188
6169 -200188 -264070 -256398 -217523 -186548 -278552 -246215 -217387 -256457 -134867 -109133 -265966
6158 -265966 -248491 -190902 -194568 -172774 -361469 -377039 -307531 -159895 -101505 -177115 -97442
6147 -97442 -108056 -348297 -425499 -282547 -265594 -299779 -153248 -72815 -174032 -173319 -250847
6136 -250847 -135057 -182579 -79461 -122498 -193756 -52295 -171752 -205640 -156845 -235924 -212577
6125 -212577 -225911 -206547 -272010 -164870 -116972 -118860 -173174 -215988 -53421 -104994 -85212
6114 -85212 -258660 -253470 -146265 -123374 -166083 -234420 -232534 -231343 -296729 -105769 -24219 -80427
6102 -80427 -262566 -181630 -190568 -230341 -254040 -285042 -301714 -368102 -103259 -150747 -210931 -227126
6090 -227126 -376874 -324409 -356074 -146924 -105095 -140725 -66013 -207940 -265761 -192561 -199416
6079 -199416 -268326 -226848 -345794 -369305 -373437 -273641 -231128 -178258 -185420 -240274 -163727 -91919
6067 -91919 -124433 -102431 -340235 -277491 -278085 -260426 -356027 -271812 -316849 -463393 -320460 -217845
6055 -217845 -222130 -258075 -381543 -270406 -303151 -348498 -386581 -483916 -399181 -433778 -238630
6044 -238630 -141397 -150377 -211881 -125315 -106604 -85174 -277819 -328171 -276902 -139061 -113436
6033 -113436 -125331 -110459 -146889 -20209 -64959 -309133 -258551 -182682 -315219 -407181 -291478
6022 -291478 -321757 -353054 -254529 -195693 -162245 -175299 -256776 -177646 -265554 -332111 -355690 -289683
6010 -289683 -125358 -179238 -187567 -311463 -118784 -133109 -166882 -126191 -206350 -139355 -286256
5999 -286256 -335279 -342142 -221956 -222790 -375603 -321585 -161789 -149700 -263496 -157516 -157883 -174450
5987 -174450 -221498 -358640 -134313 -245703 -230309 -212642 -225225 -134817 -160795 -134110 -298424
5976 -298424 -382139 -260083 -257346 -225713 -195359 -111337 -153094 -196324 -275018 -276836 -118505 -33228
5964 -33228 21628 -134239 -196154 -168115 -255585 -101938 16506 -197675 -189734 -236743 -283728
5953 -283728 -461603 -538041 -365409 -294155 -242533 -280873 -239058 -203464 -191086 -128374 -197348
5942 -197348 -322193 -262717 -113618 -67435 -246907 -263169 -245457 -244541 -152479 -289156 -376246
5931 -376246 -299951 -264658 -186003 -369155 -178744 -194896 -175693 -190551 -382346 -135256 -160342
5920 -160342 -227754 -131823 -155222 -326070 -316632 -183431 -341018 -267860 -231798 -320156 -118770
5909 -118770 -325018 -336726 -252375 -236649 -186168 -265398 -330439 -356501 -234219 -202969 -214891
5898 -214891 -260113 -182535 -145390 -67793 -163515 -113723 -81542 -160330 -95767 -101232 -94413 -210029
5886 -210029 -304932 -347307 -343622 -423990 -272846 -177248 -280382 -364016 -271392 -266261 -289641 -161051
5874 -161051 -224081 -171653 -174760 -402932 -154373 -178229 -206425 -139856 -207195 -391296 -457161
5863 -457161 -361122 -259579 -326815 -346946 -263916 -122694 -226798 -339225 -405346 -451739 -273934
5852 -273934 -182131 -224133 -255516 -235227 -87536 -61217 -55654 -128755 -153751 -238389 -137542
5841 -137542 -24442 -167669 -148384 -261313 -334673 -322372 -242806 -203803 -202037 -106209 -63832
5830 -63832 -19482 -59575 -82252 -219045 -211435 -288541 -113617 -297166 -339484 -290713 -298660 -337504
5818 -337504 -415694 -251693 -122210 -191403 -221631 -76031 -171409 -167555 -101113 -187515 -209917
5807 -209917 -233046 -290261 -83081 -152960 -163206 -104652 -79331 -159287 -313371 -100239 -224435
5796 -224435 -324734 -264293 -241423 -284432 -238790 -96933 -96005 -157273 -233991 -83238 -196261
5785 -196261 -166535 -39971 -83676 -379108 -315361 -282191 -358670 -359092 -342118 -290915 1449
5774 1449 -132594 -191255 -151404 -227381 -189178 -156494 -16007 25852 -28113 -220079 -151575
5763 -151575 -70283 -170877 -192126 -141766 -263101 -200883 -59381 -21967 117237 -121047 -168249
5752 -168249 -282922 -263817 -228835 -255777 -240908 -247701 -217354 -74742 73283 -66702 -221398
5741 -221398 -136075 -185399 -90020 -193251 -218964 -181778 -300949 -274826 -136982 -149143 -247705
5730 -247705 -273954 -251483 -223885 -65279 -82386 32421 22131 -22929 -174803 -138772 -254742
5719 -254742 -390802 -321465 -223840 -173381 -136859 -194893 -377863 -129751 -79168 -81258 -276120
5708 -276120 -347663 -225943 -225760 -362543 -125667 -76924 -85108 -239111 -214958 15469 43861
5697 43861 -145821 -46963 14862 92103 11674 -60272 -111035 -150150 -185302 -217376 -264471 -252188
5685 -252188 -182440 -217049 -133917 -62039 18760 -105256 -146335 -32009 -161455 -178223 -161887
5674 -161887 -246944 -27049 -160388 -195576 -214178 -223053 -270386 -269386 -259067 -167354 -48721
5663 -48721 -71128 -6596 -139786 -189117 -183562 -76665 -82108 -140467 -130679 -79481 -112798 -94073
5651 -94073 -15728 85241 -114520 -204698 -148567 -129456 -50622 -82921 42528 -27043 -54935
5640 -54935 -158510 -274303 -224787 -202437 -47117 -39721 -34079 -222005 -405095 -250870 -154280
5629 -154280 -111967 -201656 -221065 -164202 -105247 -126897 -32080 -223466 -240691 -109494 -210645
5618 -210645 -20289 -129775 -105387 -54395 -107187 -86634 -127832 -154474 -156900 -99045 -125916
5607 -125916 -186003 -201750 -124649 -73806 -183206 -227464 -289199 -129316 -94663 -41606 -167971
5596 -167971 -190197 -71929 -100358 -186966 -102749 -165500 -121386 -105378 -168479 -59720 -95664
5585 -95664 -58240 -104051 -181575 -8910 -134494 -81493 -86135 -120590 -73379 -71252 -104327 -56346
5573 -56346 -99609 -63876 -26346 -161587 -280158 -227633 -233125 -67421 -174394 -219133 -115815
5562 -115815 2227 69357 -154464 -237578 -275931 -190523 -325621 -146215 -207971 -97017 -186582
5551 -186582 -43003 -97914 -179374 -84858 -41316 -54803 18901 -74814 -131606 -115596 -225650
5540 -225650 -240315 -54679 -109036 -140370 -102262 -212114 -141185 -167833 -191556 -87492 -100167
5529 -100167 -207296 -198813 -299648 -269786 -214606 -91586 -208280 -269498 -138623 -159850 -86361
5518 -86361 -197644 -273999 -212971 -247769 -199763 -161088 -154556 -23440 50862 15170 -201461
5507 -201461 -42991 -48433 15134 -187554 -221137 -210448 -311010 -74442 -30976 -161492 -248652
5496 -248652 -227173 -44833 -14625 -125383 -141762 -26845 -71119 -9189 47956 -198029 -262937
5485 -262937 -41164 -107282 -210153 -209208 -60750 -51002 -265433 -203679 -220902 -168338 -119046
5474 -119046 -14983 12773 38241 -62372 -298615 -461942 -282826 -177190 -193328 -64582
5464 -64582 -173993 -392871 -246330 -169862 -8797 -26464 -137482 -130228 -153641 -164581 -65343
5453 -65343 -5605 135939 -35852 -127265 -91393 -169717 -155174 -112067 -92956 -23752 -17169 -53377
5441 -53377 -111306 -160600 -190577 -120706 -36414 -80681 -214867 -307288 -232627 -116142 -169888
5430 -169888 -100507 -212620 -161094 -37641 99178 -65067 -228894 -263468 -109448 -215870
5420 -215870 -107714 11375 -160697 27850 -132143 -176403 -153794 -173770 -221685 -268560 -214356
5409 -214356 -198773 -90870 -123109 -219231 -249271 -184147 -37557 -98325 79081 -89214 -115317
5398 -115317 -366148 -166233 -128033 -186957 -201103 -64503 -41007 39191 103333 123502 18345
5387 18345 -134424 22018 -125764 -5168 89134 37816 -248735 -205871 -103428 -29930 -8298
5376 -8298 -268267 -254158 -237024 -262283 -101781 -128295 -131751 -34951 -86118 -36881 -81352 -250674
5364 -250674 -249860 -179504 -153604 -25253 -32190 -11329 55740 37890 -65870 -89457 -79573 -148103
5352 -148103 -131991 -130733 -122742 -48528 -46178 6039 -5260 20266 188091 28703 -84374 -133560
5340 -133560 -83039 -114312 -16111 -12007 18485 -40863 -44112 -87273 -266554 -73651 18240 -20078
5328 -20078 -3001 -10254 -20173 -144448 -128236 -91802 -5397 -28077 -65720 -44949 -11982 45931
5316 45931 114731 13200 1210 167407 82909 128642 15381 50847 160595 -29067 -12053
5305 -12053 -142676 -65543 25911 -26239 20932 25207 -45161 -46866 7371 -75715 20205 29331
5293 29331 -50582 80014 54471 -2436 -53514 -231202 -101333 -53310 16975 -99296 -183375
5282 -183375 -46341 -29542 -99512 -82368 -132826 -61015 -17576 -98267 -68844 -64858 -22821 92204
5270 92204 131171 8373 -5201 -146771 -174279 -61606 -30508 -169295 -267642 32151 174424
5259 174424 62826 -166995 -173364 -271347 -103155 -54396 15587 -3014 -195659 -181934 34364
5248 34364 -47049 24779 45358 2948 -123539 -93999 40563 -85387 -94953 -150653 -41161
5237 -41161 -58031 14479 56384 67947 130309 133305 4830 93877 20210 31020 -2309 67495
5225 67495 -56358 -49424 -131469 37882 -27109 -116442 -100027 -5732 -39699 648 143069
5214 143069 165569 115179 258428 251839 182037 217122 39127 144027 218930 148286 109143
5203 109143 71504 117854 113672 223966 269359 188559 124392 229725 259878 103530 99727
5192 99727 120688 179003 115334 195260 198475 219476 150310 275683 206768 75839 238355
5181 238355 345870 173360 61714 244394 310955 77711 106720 190691 187660 208505 249814
5170 249814 286655 179679 110507 272387 230771 3477 3203 80158 135569 257798 249715
5159 249715 182024 193945 182428 93979 155139 159475 264519 244515 258091 308526 307942 264664
5147 264664 287934 330885 377505 360498 321358 167087 302577 214371 192038 274429 236717
5136 236717 322024 244554 153703 287063 235554 211543 233889 265663 270244 126098 263739
5125 263739 142045 304310 435464 252832 317950 384387 457147 479861 444090 400814 419677
5114 419677 440280 227434 196590 173963 201179 404748 501902 466829 512926 511247 524653
5103 524653 737403 720949 736362 780475 626391 664365 798818 807655 912673 695206 651143
5092 651143 661063 709199 819805 796421 752073 793874 736193 644518 677804 678169 682932 666941
5080 666941 673428 723418 838373 940705 771856 679427 661219 716612 729660 551678 572791
5069 572791 746718 944688 854889 600070 573751 711352 786987 742581 721946 734877 677974
5058 677974 679941 760842 730268 544211 461855 556165 691725 617290 738475 443097 604281
5047 604281 742042 852253 784085 782130 823846 845660 811277 880572 806930 875477 864621
5036 864621 852448 762483 805588 720672 820224 976619 912898 901995 941293 914887 931483
5025 931483 971959 962244 1069468 1168433 1133047 1039790 888126 966597 1218189 1181731 1185857
5014 1185857 1164109 1377737 1342981 1303733 1241962 1407259 1435817 1360958 1557128 1692647 1562875
5003 1562875 1592145 1677059 1596437 1687467 1850415 1773436 1829417 2073503 2008885 2050173 2139994
4992 2139994 2294255 2275953 2302463 2491156 2571995 2591560 2549010 2764168 2992598 3082599 3162591
4981 3162591 3265058 3428904 3551195 3790695 4014083 4199837 4270223 4330578 4547105 4749762
4971 4749762 4927733 5323994 5756672 6041839 6247427 6543757 7047480 7454235 7947990 8547535
4961 8547535 9174226 9778512 10558269 11379530 12281616 13200109 13827079 14318733 14334845 14312271
4951 14312271 14036828 13755160 13531526 13230998 13296610 13374011 13754929 14031982 14366345 14906569
4941 14906569 15599866 16302722 17244295 18254930 19487478 20871807 22768394 24813931 27162823
4932 27162823 29220523 31059433 31706904 31339305 30262396 28726009 27078652 25582163
4924 25582163 23949442 22594300 21429624 20455949 19831536 19456255 19486825 19485173 19640812
4915 19640812 20027167 20601626 21434777 22537547 23929037 25552965 27425851 29457777 31165046
4906 31165046 31834608 31257206 29857759 28085400 25995769 23999536 22092421 20126129
4898 20126129 18512078 17240044 16094650 15287379 14633489 14101891 13639139 13314021 13017395
4889 13017395 12762129 12936933 12984050 13190706 13593158 14157997 14449403 14520418 14185547 13627892
4879 13627892 12850479 12002945 11023898 10335360 9559049 8793002 8214941 7686836 7275639
4870 7275639 6778624 6318292 6105159 5734692 5342140 5167819 4918085 4701250 4516990 4374684
4860 4374684 4113427 3961013 3763548 3742133 3598304 3422836 3544657 3223994 3112883 3037338
4850 3037338 2988480 3007683 2702557 2783138 2810885 2668731 2622420 2558343 2542422 2495652 2443919
4839 2443919 2339719 2162330 2186211 1995852 2124552 2224261 2179267 2325388 2240319 2238047 2093384
4828 2093384 2019909 2075533 2068150 1999569 1909647 1837308 1856978 1813886 1807490 1777825 1690686 1834886
4816 1834886 1924105 1718185 1698592 1619590 1673868 1727874 1778585 1594027 1515043 1691143 1812011
4805 1812011 1737931 1622902 1637242 1720979 1629459 1755536 1758532 1825653 1731021 1781911 1896435
4794 1896435 1866380 1649666 1563148 1742803 1721411 1704503 1849763 1887492 1762508 1895993
4784 1895993 2083736 2112160 2010409 1920093 2102949 2069236 2100859 2208860 2314281 2140502
4774 2140502 2233932 2320549 2349194 2361762 2317222 2571977 2559554 2453688 2638977 2652621 2633060
4763 2633060 2771608 2844650 2862649 2923360 3084167 3231910 3354956 3353467 3366126 3454585 3577343
4752 3577343 3575288 3823920 3858504 4021293 4085297 4169551 4254273 4287613 4714864 4801518 5011255
4741 5011255 5346703 5579051 5765092 5953425 6274006 6462429 6746855 7001071 7475036 7724319
4731 7724319 7989824 8445573 8766479 9151309 9598582 10046569 10687735 11197873 11721428 12240921
4721 12240921 12742161 13088713 13453650 13804629 14170784 14811700 15451970 15918255 16542573
4712 16542573 17121815 18035396 19062806 20113584 21168172 22402025 23828845 25395606
4704 25395606 27087760 29079011 31386172 33864444 36953122 40682685 44849660 49961282
4696 49961282 55917468 62129704 67662644 70617568 70114463 66882265 62243339 56872620
4688 56872620 51415633 46058803 41271750 37065638 33257863 30144065 27486623 25259082
4680 25259082 23271247 21938087 20482058 19063692 18028992 16924289 15925895 15187217
4672 15187217 14415823 13465489 12776917 12116466 11582728 11260356 10887292 10404778 9923483
4663 9923483 9658475 9284705 8921133 8535953 8134882 7961397 7571667 7303396 7175731 6975757
4653 6975757 6869001 6786566 6710781 6274626 6106745 6025003 6017499 5932122 5849180 5609536 5542575
4642 5542575 5377618 5324844 5342065 5392302 5203444 5255227 5352277 5250017 4890055 4733362
4632 4733362 4782261 4804159 4703987 4558115 4537543 4297466 4170183 4090587 4077245 4010072 3834292
4621 3834292 3900366 3846447 3710039 3613318 3542388 3807087 3687174 3695887 3665777 3667126 3545354
4610 3545354 3662329 3499043 3539833 3715092 3598393 3504768 3518181 3492504 3476530 3409547 3556528
4599 3556528 3583088 3545067 3656336 3623094 3617537 3710567 3753820 3604909 3587660 3607219 3559280
4588 3559280 3679368 3577943 3779983 3837096 4031896 4120756 4073791 3958552 4250752 4127861
4578 4127861 4133045 4382095 4469495 4632795 4634603 4696895 4768846 4855864 4980268 5015526 5258926
4567 5258926 5323016 5376717 5591601 5790482 5798433 5998293 6256182 6329858 6508446 6635348
4557 6635348 6830937 7105825 7403481 7598716 7788682 7994711 8278527 8654413 8933939 9382310
4547 9382310 9772146 10169903 10671235 11066878 11326990 11837777 12476098 12723780 13180374 13920880
4537 13920880 14561517 15068267 15694205 16465442 17174015 17907621 18696888 19515293 20492941
4528 20492941 21481342 22408653 23458195 24528874 25674268 26906322 28299087 29621203
4520 29621203 30995371 32597714 34291453 35986894 37929281 40065554 42385756 44890327
4512 44890327 47431335 50527025 53943332 57759787 61996318 66771804 71681180 77298260
4504 77298260 83809180 91052188 98947394 108012760 117665077 127584866 136899877 143983926
4496 143983926 147528009 146808955 142162797 134818763 125700776 115874955 106042273 96681780
4488 96681780 87852098 79870083 72905192 66731261 61374885 56521800 52265897 48567841
4480 48567841 45320201 42221542 39447842 37064493 34795300 32786886 30865651 29083270
4472 29083270 27387273 26024167 24608853 23446818 22366345 21171524 20334388 19413821
4464 19413821 18542171 17838307 16970115 16335435 15812275 15267242 14614331 14021040 13478187
4455 13478187 12883753 12445518 11965549 11576589 11109362 10901247 10497905 10139582 9861854
4446 9861854 9433106 9131892 8798911 8591970 8327788 8105696 7788149 7552372 7360601 7031360
4436 7031360 6780416 6702958 6381566 6190963 5997143 5890546 5637294 5518619 5444497 5051011
4426 5051011 4940182 4880384 4710930 4576730 4514075 4466941 4316810 4118242 3961707 3760474
4416 3760474 3850138 3957693 3642290 3814394 3703598 3473379 3462237 3437732 3344392 3203125
4406 3203125 3116572 3084154 3135072 3139962 2914917 2800825 2821528 2746148 2528221 2598802 2755468
4395 2755468 2506219 2504423 2424309 2375450 2125493 2161608 2143129 1942145 1978722 2121059 1899126
4384 1899126 1851054 1868835 1814656 1802248 1689284 1784561 1852385 1811523 1844462 1635994 1454467
4373 1454467 1556726 1561151 1515929 1561660 1527528 1375236 1323046 1305751 1241734 1301479 1259940
4362 1259940 1436461 1347329 1176087 1083907 1160105 1183252 1126702 1034256 1043538 1121909 1024501
4351 1024501 1188543 1247622 1171309 1028399 1082085 1221937 1060203 775363 927571 1000083
4341 1000083 1063762 855249 766712 949952 933098 905846 859520 983784 847161 887035 754958
4330 754958 749572 742892 669331 624053 696238 665375 614966 612208 747169 736406 765542 595083
4318 595083 452356 524623 592648 727570 739267 711226 440334 339911 502473 441133 441813
4307 441813 478631 484620 408060 523705 498287 366979 450290 462706 478239 334147 291765
4296 291765 381855 481427 375142 384286 503803 585963 383208 325505 333241 298323 428273
4285 428273 357281 259908 364415 417752 425413 278442 448547 385957 254064 397158 316884
4274 316884 264413 191901 273365 253153 223381 154100 250321 182993 68078 263022 469849
4263 469849 345027 239366 198599 318055 397889 151734 237524 268339 284078 139643 139954
4252 139954 273353 197355 200960 63884 5529 201157 211477 135797 187970 236206 211815
4241 211815 253664 280443 55644 10474 190420 180944 38634 52901 206624 14641 68892
4230 68892 110767 47510 96827 48027 147199 106381 80882 171045 121856 84219 17217 1116
4218 1116 136507 67126 -19918 174905 98885 108462 -16732 -106631 -62615 -60064 48878 81068
4206 81068 -162055 91210 85535 204577 130810 -15181 42550 117961 13388 -11271 70874
4195 70874 259053 182214 17922 -618 -92196 7770 31405 101296 112710 138650 212334
4184 212334 84619 168773 63668 14276 22591 -40387 47278 -139941 -64201 -2886 113719
4173 113719 -27153 64849 82749 83361 -13107 167343 79674 279584 140261 105263 158539
4162 158539 -57058 108918 97300 -55096 41792 28793 87865 133780 114779 207526 215574
4151 215574 208242 124103 125388 50084 -48122 55353 32084 -6547 56592 113070 137315 99563
4139 99563 219745 295884 275681 299243 292144 74312 35758 -62857 173853 160832 248017
4128 248017 151830 162735 105565 176597 19285 -15308 27188 85294 196541 157890 40890
4117 40890 207523 330387 99509 219484 68071 -132111 -5807 59338 59756 -11525 -52641
4106 -52641 -39989 -25478 148034 97252 117967 -51065 -40444 -23024 -53958 -98266 1910
4095 1910 -7898 -124756 -63720 -41110 133517 191776 44166 -3345 14622 201147 163586
4084 163586 257199 199452 30908 -182446 -113963 -31540 -55016 45202 35370 45835 32176
4073 32176 -26372 37386 -75779 15300 33164 -19422 -95192 -9052 92187 28132 34742 96463
4061 96463 122969 151306 27103 -149483 72219 70101 -29956 128790 -50029 38009 62441
4050 62441 22004 45508 94919 166851 43725 174406 125838 -6190 144062 141514 176147
4039 176147 88016 140960 151136 109189 176490 150892 258018 280690 14345 118002 260018
4028 260018 116131 77392 217247 231304 71153 172014 113415 237693 215018 216532 148338
4017 148338 200202 6763 145748 332558 206708 167711 168916 202648 239432 163489 190522
4006 190522 171845 280524 230438 -26837 144752 101512 67520 100465 133870 102091 51874
3995 51874 82426 81860 29236 22768 199002 143469 301459 177852 182599 147971 153831 128623
3983 128623 197773 -39990 169497 254236 172363 57275 -44260 128719 274329 406633
3973 406633 403357 314588 203192 249658 234142 239731 334579 248153 182505 119897 162819 376134
3961 376134 384642 288408 386643 476761 254281 171640 369823 445450 241315 339051 356195
3950 356195 352279 282301 478642 397669 291472 289239 504303 577050 524213 560942 635617
3939 635617 584661 484219 429249 357107 396637 567005 524057 464309 351432 268521 467258
3928 467258 557797 470428 628430 562699 421195 478772 578202 507385 571468 481353 419355
3917 419355 520745 482289 517767 480537 402276 420937 644521 663383 559035 467501 491522
3906 491522 584637 514909 608437 732925 536641 470572 597846 485175 694722 631952 487327
3895 487327 714079 758449 659183 586222 680760 674430 743186 740471 851232 892437 750868
3884 750868 759125 988558 909804 648641 636775 534877 809710 862740 1112955 972909 857346
3873 857346 811570 855066 1026690 964329 1131279 1146846 1067180 958079 1040880 968465 1075388
3862 1075388 1109616 1009642 1205176 1238840 1093448 1313463 1226026 1227003 1317091 1458646 1445497
3851 1445497 1494005 1536333 1611954 1689629 1787145 1853947 2059659 2024326 2146547 2168421 2316810
3840 2316810 2431273 2512218 2604590 2719934 2985188 2946657 3121221 3160702 3310594 3564875
3830 3564875 3709335 3899572 4094561 4234174 4451094 4650932 4698272 5178383 5512914 5792416
3820 5792416 6029145 6344829 6509226 6852052 7194241 7452427 7907076 8456867 8977807 9313344
3810 9313344 9844140 10613610 11330215 11920085 12908965 13866879 14781676 16128271 17609553
3801 17609553 18866406 20089773 21576030 22906847 24214832 25661457 27074273 28120509
3793 28120509 29140027 29991523 30634772 31532452 32082912 32376921 32237495 31823176 31048798
3784 31048798 30508022 29813799 28890559 27840437 26580562 25403349 24051074 22561270 21213607
3775 21213607 19774101 18454721 17067280 15756070 14336210 13373055 12417413 11504855 10577535
3766 10577535 9711421 9052122 8401550 7812947 7316186 6879339 6519092 6096382 5816340
3757 5816340 5452774 5331231 5106270 4633872 4362475 4193295 3897848 3885818 3759671 3645508
3747 3645508 3502754 3348951 3260579 3214682 3079911 2941515 2845665 2713105 2500871 2386911
3737 2386911 2280449 2290963 2095148 2119154 2054956 1919099 1941393 1884680 1726530 1607613
3727 1607613 1696610 1622136 1535545 1479465 1574712 1585044 1584643 1401529 1292353 1297826 1351371 1359493
3715 1359493 1412644 1238792 1235023 970300 973992 948297 1012562 900830 1034521 925487 840064
3704 840064 672364 828859 871239 792614 811695 857160 684497 654089 630088 772207 740396
3693 740396 702889 596972 527556 477228 564078 487774 515172 564235 526721 552859 352147
3682 352147 391769 298428 411991 415321 450832 372544 424929 338095 353563 300257 259954 215138
3670 215138 283441 204565 306394 329650 332003 352833 299891 305453 132258 278209 425089
3659 425089 289182 284168 130468 66612 128623 232882 250093 146776 224999 256928 103085
3648 103085 116124 93542 15420 122022 116484 92128 236133 227783 158133 107767 41401 195128
3636 195128 183746 136244 139449 182617 152929 28985 108710 150295 73177 81009 91619 126701
3624 126701 92212 -22506 -36912 -66219 165835 190943 126226 133714 10574 -27844 -3280
3613 -3280 -60235 49349 64832 121517 121771 103100 186265 127787 -113722 80077 231217 149447
3601 149447 173978 -13919 62592 98017 -64145 132498 88747 55734 154238 19372 46059
3590 46059 125176 32573 84325 39340 77246 72453 46605 138710 -53632 -33161 -56840 98820
3578 98820 49340 -30226 -15097 30201 28446 47904 14424 -42572 163172 174203 49786 62048
3566 62048 118326 147629 206965 94412 36699 260327 173736 317128 207760 311954 256015
3555 256015 351604 301810 236249 178140 148514 109328 253034 248357 245350 167635 39878 189425
3543 189425 192079 300603 278188 278554 262419 170616 84962 146603 116388 54261 -58745 120002
3531 120002 -8628 -38042 29008 122778 79823 107540 150503 270261 70327 106514 -126902
3520 -126902 -69365 76780 -63420 -159769 160019 125672 -23219 -26004 -131542 -85719 -29217
3509 -29217 110160 -25162 27493 26695 -118428 -49506 90406 21391 -34009 -35221 -37939 -56948
3497 -56948 -51595 -76604 -94001 22164 109699 19589 -50260 44597 101838 2880 -120755 -44692
3485 -44692 -34875 -6980 64462 -3888 101483 -189482 -222089 -30177 100955 32618 36127
3474 36127 108239 100194 60631 -100322 -106813 -90514 -48792 32554 -5815 48069 17128 14833
3462 14833 22199 70467 144402 111458 87866 175023 85140 133227 153273 110208 130417 128612
3450 128612 -14204 6984 53978 -95708 -25938 -127789 -130698 -23475 23174 65456 81823
3439 81823 120141 22582 22831 18784 -55464 705 -96884 -73968 -89676 103141 10151 -19727
3427 -19727 -59138 10964 47060 74601 -84361 -14193 98077 67320 107875 38310 30367 -68692
3415 -68692 -162 68485 18577 -55561 -88994 -167236 -70090 -24747 -78283 -116484 -67295 -72293
3403 -72293 -49235 -19510 -48216 -135131 -85712 51215 -29958 -182833 -135434 -24715 -25535 -115033
3391 -115033 -17556 39112 94671 49297 43098 34413 8842 -56404 -85297 -27330 -8313 -136044
3379 -136044 -106219 -17888 62251 16528 -68083 -82080 -14201 -2526 -42009 -59417 51471
3368 51471 24416 -175827 18487 84714 -67406 -48128 -28287 -100183 27013 11468 115637
3357 115637 117556 64453 33750 87395 77909 -71043 -157078 -152806 -131169 -99428 88429 172656
3345 172656 -17624 49456 93000 -102979 -27241 -111528 -51278 19014 -36504 -13005 -89120
3334 -89120 -41096 31869 31316 19745 -33820 101583 -9746 -140503 71584 136931 83343
3323 83343 116127 30775 148326 166885 152034 245037 133907 44984 55503 62161 -112892
3312 -112892 127821 187937 97173 140744 203205 171639 5938 20112 79570 103875 304393
3301 304393 142269 -72022 150413 71295 52995 35311 178068 150702 104572 31979 53134
3290 53134 41661 158674 27778 -24712 35109 54703 124379 187308 69207 129569 190095
3279 190095 -45278 93002 148884 21198 202330 -40806 -79620 -16894 105641 296680
3269 296680 156053 -1536 -79005 129382 114609 142333 67781 136721 25713 201137 41868
3258 41868 119352 197231 192918 190022 126537 273505 159692 44794 132695 149858 203223 128021
3246 128021 166147 242719 190502 259817 205083 164461 118361 -31913 81324 23394 111433
3235 111433 63690 118445 178414 264244 290143 118939 81459 234364 188323 89808 111028
3224 111028 22859 4473 -8113 66696 118404 64113 156957 150094 188019 276739 238026 128832
3212 128832 57942 144712 295805 214705 297731 297220 281004 362723 424538 427885 412803 428421
3200 428421 406974 481839 324319 230168 231914 218784 145042 193691 103327 100844 139908 324410
3188 324410 128985 41877 216110 335589 383788 340582 330480 376373 335574 352934 392654
3177 392654 374575 109015 292023 316496 404857 284940 284626 316589 464304 503864 526117
3166 526117 550184 553743 478713 407625 560214 358943 390196 381741 459551 422446 257503
3155 257503 307001 545581 434062 490323 583071 473791 598625 521314 551729 638300 457685
3144 457685 548426 446434 447008 406229 382960 323408 430435 528604 432984 528377 424116
3133 424116 504990 521059 455781 441876 469186 633529 485567 467999 533971 532842 546275
3122 546275 507989 427930 391310 326503 441083 475733 482040 571655 429108 417398 507326
3111 507326 531896 528166 564598 583596 460835 355961 500138 489550 534228 417557 456068
3100 456068 527283 510115 597498 662820 537521 562624 561798 419689 414052 424952 514206 631682
3088 631682 714270 570090 535326 617312 625961 800148 864173 704305 812454 863834 708251
3077 708251 625817 726194 780242 781766 780313 816014 807098 793454 666999 831001 970257
3066 970257 903903 810015 897832 879674 1069204 1141499 1056470 1092875 1138657 1113568 1050281
3055 1050281 920599 1043251 986679 1028147 1089068 1047643 1274178 1348835 1290334 1269505 1261531
3044 1261531 1207139 1160023 1080664 1257165 1381949 1503261 1353622 1456992 1448832 1490351 1453297
3033 1453297 1368651 1377867 1430770 1503868 1545511 1417258 1600538 1603164 1615081 1734490 1877239
3022 1877239 1911134 2056242 1985945 2034035 2070276 1975961 2048402 2149375 2325936 2286512 2317817
3011 2317817 2502942 2736086 2759154 2698917 2744086 2717867 2818203 3005228 3144342 3187472
3001 3187472 3269751 3625768 3709563 3901561 3902710 4105771 4354805 4467537 4622706 4719948
2991 4719948 4966873 5076049 5276944 5465045 5629244 5899385 6082200 6357336 6531712 6906848
2981 6906848 7291418 7567070 7866315 8349564 8766547 9232372 9554250 10095546 10697722 11203970
2971 11203970 11836280 12492300 13195165 14032582 14841766 15803800 16925923 18150709 19501910
2962 19501910 20870479 22761240 24543818 26895287 29483958 32153448 34646929 36511727
2954 36511727 37091245 36432612 35284355 34063677 32760025 31342316 30181411 29347234 28935544
2945 28935544 28853933 28995010 29190854 29834319 30787181 32008400 33491778 35513409 37644019
2936 37644019 40145626 43647701 47670771 52068922 56672677 59764728 60274649 58406393
2928 58406393 55421713 51579145 47548470 43729259 40084232 36803572 34223998 32138886
2920 32138886 30201930 28830798 27955504 27307071 26837913 26722470 26573422 26800623 27450543
2911 27450543 28381891 29966495 31302041 32831999 34115035 34316658 33295471 31504513
2903 31504513 29271784 26973618 24611314 22502478 20555612 18893709 17385089 16011090
2895 16011090 14881964 13910540 12958371 12376573 11740165 10949614 10356544 9726513 9259934
2886 9259934 8821016 8563476 8102876 7923004 7633480 7248808 6957501 6616776 6618344 6499709
2876 6499709 6325503 6204193 5860478 5745786 5935139 5994524 5925972 5869511 5847683 5864279
2866 5864279 5728549 5399725 5143915 4950711 4688449 4619253 4484300 4315668 3988268 3978667
2856 3978667 3989431 3783819 3732597 3595842 3524375 3498090 3536729 3656095 3840569 3731717
2846 3731717 3615743 3600000 3520402 3410953 3214557 3067834 2728337 2553740 2423710 2414383
2836 2414383 2239382 2268869 2042894 2081066 1946399 1877474 1813578 1735162 1529912 1491079 1465782
2825 1465782 1342493 1274120 1380555 1283824 1311353 1328420 1213445 1127753 1073199 1094940 1085456
2814 1085456 961395 1039653 1016380 915685 864419 933788 882644 728400 650866 764209 544201
2803 544201 477989 606032 617950 561802 734124 615790 533491 577733 426847 517846 400331
2792 400331 428365 519953 532985 539443 470363 493436 482832 400920 437029 368833 474802 631463
2780 631463 535859 435615 524918 465843 519724 334001 348879 276410 466663 489995 422451
2769 422451 397514 477089 399588 352772 326066 262416 273432 354205 295380 382230 307782 290220
2757 290220 350577 491008 437997 357858 289819 332871 281085 252839 240213 104561 342767
2746 342767 356276 344961 373828 167548 222325 260916 469469 465992 293395 197786 231654
2735 231654 157402 247703 227251 227497 283694 255253 212810 386861 332979 405587 412313 325850
2723 325850 354578 334129 381714 444304 348966 309818 240974 281896 449284 491979 501288 521958
2711 521958 512362 400879 370587 390928 383291 213964 260048 219356 219579 246477 365646 309447
2699 309447 154735 255686 292561 148574 7755 47412 105808 107524 140143 138870 224236
2688 224236 268259 267241 279855 343253 172461 104564 163745 60360 30614 56409 21975
2677 21975 19896 63100 -46493 79684 237523 113555 10291 44939 16834 -10562 33041
2666 33041 -79821 -44503 -101663 50328 -31560 -3585 3043 -13732 -6060 47605 -70164 -172617
2654 -172617 -48470 -14891 -90023 -83367 6323 -33239 -128421 -150850 -152723 71831 19572 -123536
2642 -123536 -27953 7637 9297 1872 -71054 -48503 96559 182112 -94894 -166137 -50285
2631 -50285 -31328 -79964 -187464 -241563 -166870 -70774 -78202 18397 -63636 8471 67801 -38918
2619 -38918 -339251 -206005 -43135 49558 79124 22972 35135 1075 -16731 -40995 50276
2608 50276 25717 97212 -39075 -134062 -97133 -107814 -202202 -223574 -304942 -205374 -143546 -91032
2596 -91032 -13395 -62640 -115160 -79741 -93868 -31031 -2308 42403 -85243 -117451 -55311 9567
2584 9567 -27416 2767 30939 -49692 42762 39144 -16094 -98317 -48396 37534 -131335 -173238
2572 -173238 -208964 -279608 -316302 -295589 -190468 -91256 -85905 -82593 -159519 -145614 -158383 -151017
2560 -151017 -224802 -138748 -38883 -31285 -10509 -23915 20718 -183297 -161416 -126678 -48872 31933
2548 31933 45886 -165586 -40709 -22803 -59714 -201108 -68615 -44769 -189987 -207907 -32990
2537 -32990 -115309 -257014 -284181 -133156 7168 -71473 -154945 -95497 -140971 -242603 -47743
2526 -47743 30699 -147218 -153976 -221462 -146471 -94491 -42516 -2986 -35744 89286 -134325
2515 -134325 -243377 -288559 -256108 -273010 -121663 -32099 -157183 -222679 -219919 -102114 -129552
2504 -129552 -159356 28849 79704 170561 -56743 -43983 -24982 -200665 -225542 22166 47473
2493 47473 -104130 -191708 -174796 6225 -195920 -149921 -29967 28769 28125 -26788 10693
2482 10693 -127963 -130950 10591 -66332 16095 -66519 -1799 -73014 -46075 -693 -37629 -197161
2470 -197161 -125628 -39075 -65560 -100145 -61965 -97165 -88389 -127256 -43822 112423 2780
2459 2780 -199051 -307163 -181597 -108046 -163256 -86330 -32174 -85469 -222301 -268391 -356335
2448 -356335 -251395 -116622 -183720 -139208 -114499 -89601 -206836 -198044 -179655 -197138 -219355
2437 -219355 -110256 -69080 -98956 -77586 -149588 -302050 -174035 -119240 -118464 4490 -45332
2426 -45332 -112280 57088 29439 1928 -48803 -153408 -172084 -184739 -85645 -106619 -111015 -220060
2414 -220060 -96110 -185414 -102050 -19300 -77463 -1318 -51589 -105895 -255823 -45004 -15830
2403 -15830 -3238 -46297 -78203 -118154 -143408 -287457 -206269 -121882 -234226 2854 -44446
2392 -44446 -105542 -78844 -160196 -67084 -166793 -119622 -38003 -59441 -45510 -7707 -104397 -80589
2380 -80589 -102489 -171591 -186586 -35390 -58188 -231680 -196183 -170108 -211409 -201457 -84805
2369 -84805 -109322 -30730 -158662 -148192 -85487 -164781 -169405 -210684 -163373 -165912 -157963 -221240
2357 -221240 -91215 -25660 -193908 -289085 39982 145027 -112811 -204917 24206 99496
2347 99496 -148647 -92662 -14147 -164490 -79371 -65840 40794 -85621 -161453 -105431 -231485
2336 -231485 -171638 35367 -122756 -167831 -103401 -41912 36939 -68378 13787 22342 -25557
2325 -25557 -181078 -195096 -16160 15973 -34254 -209579 -176017 -59150 -176529 -156629 11406
2314 11406 -64893 -204137 -151992 -35596 13367 -118577 20694 40009 112466 26547 -92933
2303 -92933 -184035 -207503 -89535 -109095 -324728 -287896 14686 288 -72846 -7 179217
2292 179217 -21056 -70577 -96315 -57946 -93771 -157355 -101511 -145968 -100459 -142424 -87594
2281 -87594 -109424 -177752 -156443 -7920 -97157 -202689 39223 -21822 17500 138501 -125290
2270 -125290 -149237 -43325 2313 -71585 -92671 -55731 -145985 -109960 -185469 -140289 -180465
2259 -180465 -145610 -6373 -2420 -39447 74418 97817 792 -83053 -146636 -40017 -130854
2248 -130854 -27885 47774 31983 -119960 -100537 -129463 -18680 -41132 -150683 -275694 -182980
2237 -182980 -107291 22398 -24218 28686 11364 -26998 47379 19182 139691 -131175 -199120
2226 -199120 -116063 -59295 4425 6148 21052 -35202 79096 39110 203512 142156 127050
2215 127050 85390 140329 4274 26702 -16075 -31802 -5387 32166 172530 135390 42280
2204 42280 95804 139258 134617 173952 180731 181204 165914 144618 228193 251182 201157 157384 27414
2191 27414 145802 123402 214470 145130 145594 98237 -48906 157739 245050 153014 145450 270951
2179 270951 213120 220933 147871 291009 328703 212082 408114 288068 277066 355508 326810
2168 326810 425565 373304 222013 196562 206225 461864 398618 338008 416542 342463 369723
2157 369723 537186 476261 562257 570398 547503 606431 604001 635464 798818 852748 1016007
2146 1016007 904141 1023643 1101370 1136465 1087077 1302480 1320848 1387296 1232623 1437892
2136 1437892 1463198 1546551 1757212 1915693 2020874 2019599 2176833 2329432 2491393 2723392
2126 2723392 2842074 3138944 3535590 3731215 3961263 4433892 4723982 5182200 5798528 6434174
2116 6434174 7235270 8042749 8959137 9435249 9466715 8921862 8269025 7571481 6866144 5987089
2106 5987089 5414617 4749908 4300980 3878696 3443086 3192265 2901967 2665237 2570437 2297736
2096 2297736 2064448 1937997 1762644 1738089 1580389 1465920 1480505 1289089 1251599 1252588 995390
2085 995390 1022383 1042744 977256 898194 806531 974629 846567 643438 622917 629541 582677
2074 582677 442070 424368 456087 346595 271814 439240 506871 428255 445256 439102 354219
2063 354219 246598 144656 37916 127152 234425 335637 237238 180177 92312 -6676 110843
2052 110843 212892 330856 325977 324101 426497 207484 169696 237509 252534 152066 85711
2041 85711 36590 13197 243660 189308 21413 85060 129919 39526 67436 172848 129218
2030 129218 85928 96196 24983 -32103 -124619 -67774 72594 21618 25719 -37573 53865 89058
2018 89058 44386 28067 -11271 -41077 30796 -81106 -190818 -250031 -174888 -256427 -111569
2007 -111569 -163213 65606 -11371 -120802 -69519 -73434 59621 -45458 -22508 -30082 -110131
1996 -110131 -51787 -72865 -26103 4556 -59985 92159 -18976 -38234 -66355 -80696 -17343
1985 -17343 -48264 -101838 -174403 -114125 -13199 -46917 -5364 -128972 -135652 88540 -41885
1974 -41885 40121 -79120 -5483 45918 -164821 -16376 -3446 -13938 1989 -17965 -49723
1963 -49723 -175728 -158218 -168856 -189856 -42502 -117663 -8502 -48348 -89059 -3096 69536
1952 69536 -139816 -124839 -132582 -199015 -224374 -221217 -174856 92821 87296 2852 -100289 -117088
1940 -117088 -163196 -136147 -164850 -106446 67353 -64955 -90431 -25305 -28919 -138063 -88640
1929 -88640 16515 -23092 4617 -75120 -169596 -220486 -188475 -163479 -204934 -153816 18440
1918 18440 41780 34674 -80262 2847 45280 -22493 -39280 18291 79287 84861 25391 140128
1906 140128 78540 -55395 -67417 58490 110345 55057 13854 7123 85649 -95122 -133405
1895 -133405 -20047 10424 -39265 72853 79978 -112494 -97896 67518 -79085 -301862 -307027
1884 -307027 -247106 -293960 -144520 -26138 -139196 -57968 -128770 -91018 -29236 -198593 -168880
1873 -168880 -172828 -251491 -208079 -95034 -72080 -61732 -26642 31935 3910 -54912 77934
1862 77934 60647 -96223 -43765 -58499 -61522 -34374 -185693 -121775 -111169 -65210 27890 -7972
1850 -7972 175886 146290 95635 25580 92720 3051 -87218 -166108 34691 46955 168299
1839 168299 -3613 -51157 69787 149511 -39803 -196296 -42281 57786 -29425 -61359
1829 -61359 -38180 -83556 -24115 -85853 -17670 -8181 -109566 45416 -40024 -24174 -32114 -167740
1817 -167740 28301 39507 -191025 -207907 -65769 26287 -103076 11222 24072 -139439
1807 -139439 -1137 -169259 -49953 -71988 -46170 -27058 -103693 -120045 -163194 -187937 -95340
1796 -95340 18734 -29508 -139882 -122145 -136230 -112740 -62159 -132870 -82448 -53434 -206472
1785 -206472 -184968 -119581 -45276 -105814 11547 -140945 -185910 -83399 -89453 -257516 -296479
1774 -296479 -158645 8942 -48629 -192362 -83750 -60322 -280374 -264643 -136068 41097
1764 41097 -10508 -172947 107604 28201 -129226 -49247 -73677 -259246 -182339 -199086 -180183
1753 -180183 -39307 -150594 -132568 -205836 -176667 -80696 -108062 -169344 -134839 -55978 -272944
1742 -272944 -139736 -161582 -63669 -118276 -132495 -51223 -39757 -234375 -145682 -80685 -92840
1731 -92840 2801 70234 20355 -36961 39303 -29451 -94970 -22641 -54705 853 52666 50641
1719 50641 -97822 -63823 -20187 -95526 -21793 -45999 47058 -64921 -200650 -110076 -82714
1708 -82714 -140897 -129276 -199843 -97921 -121326 -190648 -67942 -4578 -153063 -4881 -192650
$$ [...]
##END NTUPLES=NMR SPECTRUM
##END=
