##TITLE=1H_CA-9298-2
 CDCl3
 8 sc, 
 30.10.2024
##JCAMPDX= 6.0         $$ Bruker NMR JCAMP-DX V2.0
##DATA TYPE= NMR SPECTRUM
##DATA CLASS= NTUPLES
##ORIGIN= UXNMR, Bruker Analytische Messtechnik GmbH
##OWNER= root
$$ XWIN-NMR		Version 3.5
$$ Wed Oct 30 15:31:59 2024 Russian Standard Time (UT+4h)  she@DPX200
##.OBSERVE FREQUENCY= 200.1318
##.OBSERVE NUCLEUS= ^1H
##.ACQUISITION MODE= SIMULTANEOUS
##.ACQUISITION SCHEME= undefined
##.AVERAGES= 8
##.DIGITISER RES= 18
##SPECTROMETER/DATA SYSTEM= spect
##.PULSE SEQUENCE= zg30
##.SOLVENT NAME= DMSO
##.SHIFT REFERENCE= (INTERNAL, DMSO, 0, 21.0282)
##AUDIT TRAIL= $$ (NUMBER, WHEN, WHO, WHERE, WHAT)
$$ ##TITLE= Audit trail, XWIN-NMR		Version 3.5
$$ ##JCAMPDX= 5.01
$$ ##ORIGIN= Bruker BioSpin GmbH
$$ ##OWNER= she
$$ F:/spectra/data/she/nmr/H-F/1/pdata/1/auditp.txt
$$ ##AUDIT TRAIL=  $$ (NUMBER, WHEN, WHO, WHERE, WHAT)
(   1,<2024-10-30 15:29:37.35 +0400>,<she>,<DPX200>,
      <created by zg, POWCHK disabled, PULCHK disabled
       configuration hash MD5:
       00 E9 B6 7A A2 85 ED C7 34 08 36 98 17 FE 4E 26
       data hash MD5: 16K
       E7 A7 63 B1 6D 25 24 14 71 64 4F 14 C1 2F 6C 8D>)
(   2,<2024-10-30 15:29:39.78 +0400>,<she>,<DPX200>,
      <Start of raw data processing
       efp BC_mod = 2 LB = 0.24 FT_mod = 6 PKNL = 1 PHC0 = -26376.83 PHC1 = 47.78743 SI = 16K 
       data hash MD5: 16K
       66 86 9A 9E BD 17 FE BA E3 69 E9 A5 C9 40 CE E6>)
(   3,<2024-10-30 15:30:04.87 +0400>,<she>,<DPX200>,
      <pk PHC0 = 31.68174 PHC1 = -40.8 
       data hash MD5: 16K
       60 6F 8C 72 45 E3 5F EC F4 82 A6 FF 2A 67 1E 83>)
(   4,<2024-10-30 15:30:09.14 +0400>,<she>,<DPX200>,
      <abs ABSG = 5 
       data hash MD5: 16K
       24 E0 56 4B 24 17 55 FD 8C D4 FA 7C 0A 45 70 5A>)
$$ ##END=
$$ 
$$ hash MD5
$$ E8 43 64 52 03 C8 D0 13 47 49 96 DC 81 DD C7 6B
##$RELAX= 
##$RELAX= 
##$RELAX= 
##$RELAX= 
##$RELAX= 
##$RELAX= 
$$ Bruker specific parameters
$$ --------------------------
##$DU= <F:/spectra>
##$EXPNO= 1
##$NAME= <H-F>
##$PROCNO= 1
##$TYPE= <nmr>
##$USER= <she>
##$AMP= (0..31)
100 100 100 100 100 100 100 100 100 100 100 100 100 100 100 100 100 100 
100 100 100 100 100 100 100 100 100 100 100 100 100 100 
##$AQSEQ= 0
##$AQ_mod= 1
##$AUNM= <au_zg>
##$AUTOPOS= <>
##$BF1= 200.13
##$BF2= 200.13
##$BF3= 200.13
##$BF4= 200.13
##$BF5= 200.13
##$BF6= 200.13
##$BF7= 200.13
##$BF8= 200.13
##$BYTORDA= 1
##$CFDGTYP= 0
##$CFRGTYP= 5
##$CHEMSTR= <none>
##$CNST= (0..31)
1 1 145 1 1 1 1 1 1 1 1 1 1 1 1 1 1 1 1 1 1 1 1 1 1 1 1 1 1 1 1 1 
##$CPDPRG= <>
##$CPDPRG1= <>
##$CPDPRG2= <>
##$CPDPRG3= <>
##$CPDPRG4= <mlev>
##$CPDPRG5= <mlev>
##$CPDPRG6= <mlev>
##$CPDPRG7= <mlev>
##$CPDPRG8= <mlev>
##$CPDPRGB= <>
##$CPDPRGT= <>
##$D= (0..31)
0 1.2 0 0 0 0 0 0 0 0.06 0 0.03 0 0 0 0 0.0002 0 0 0 0 0 0 0 0 0 0 0 0 
0 0 0 
##$DATE= 1730287776
##$DBL= (0..7)
120 120 120 120 120 120 120 120 
##$DBP= (0..7)
150 150 150 150 150 150 150 150 
##$DBP07= 0
##$DBPNAM0= <>
##$DBPNAM1= <>
##$DBPNAM2= <>
##$DBPNAM3= <>
##$DBPNAM4= <>
$$ [...]
##$SUBNAM3= <"">
##$SUBNAM4= <"">
##$SUBNAM5= <"">
##$SUBNAM6= <"">
##$SUBNAM7= <"">
##$SUBNAM8= <"">
##$SUBNAM9= <"">
##$SW= 24.0689170037331
##$SWIBOX= (0..15)
0 0 2 0 0 0 0 0 0 0 0 0 0 0 0 0 
##$SW_h= 4816.95568400771
##$TD= 16384
##$TD0= 1
##$TE= 0
##$TE2= 300
##$TE3= 300
##$TEG= 300
##$TL= (0..7)
0 120 120 120 120 120 120 120 
##$TP= (0..7)
150 150 150 150 150 150 150 150 
##$TP07= 0
##$TPNAME0= <>
##$TPNAME1= <>
##$TPNAME2= <>
##$TPNAME3= <>
##$TPNAME4= <>
##$TPNAME5= <>
##$TPNAME6= <>
##$TPNAME7= <>
##$TPOAL= (0..7)
0.5 0.5 0.5 0.5 0.5 0.5 0.5 0.5 
##$TPOFFS= (0..7)
0 0 0 0 0 0 0 0 
##$TUNHIN= 0
##$TUNHOUT= 0
##$TUNXOUT= 0
##$USERA1= <user>
##$USERA2= <user>
##$USERA3= <user>
##$USERA4= <user>
##$USERA5= <user>
##$V9= 5
##$VALIST= <valist>
##$VCLIST= <CCCCCCCCCCCCCCC>
##$VD= 0
##$VDLIST= <DDDDDDDDDDDDDDD>
##$VPLIST= <PPPPPPPPPPPPPPP>
##$VTLIST= <TTTTTTTTTTTTTTT>
##$WBST= 1024
##$WBSW= 4
##$XGAIN= (0..3)
0 0 0 0 
##$XL= 0
##$YL= 0
##$YMAX_a= 554840
##$YMIN_a= -508506
##$ZGOPTNS= <>
##$ZL1= 120
##$ZL2= 120
##$ZL3= 120
##$ZL4= 120
##$ABSF1= 20.99291
##$ABSF2= -3.076221
##$ABSG= 5
##$ABSL= 3
##$ALPHA= 0
##$AQORDER= 0
##$ASSFAC= 0
##$ASSFACI= 0
##$ASSFACX= 0
##$ASSWID= 0
##$AUNMP= <proc_1d>
##$AZFE= 0.1
##$AZFW= 0.1
##$BCFW= 0
##$BC_mod= 2
##$BYTORDP= 0
##$COROFFS= 0
##$CY= -3
##$DATMOD= 1
##$DC= 0
##$DFILT= <>
##$DTYPP= 0
##$F1P= 0
##$F2P= 0
##$FCOR= 1
##$FTSIZE= 16384
##$FT_mod= 6
##$GAMMA= 0
##$GB= 0
##$INTBC= 1
##$INTSCL= 3.70164e-10
##$ISEN= 128
##$LB= 0.24
##$LEV0= 0
##$LPBIN= 0
##$MAXI= 10000
##$MC2= 0
##$MEAN= 0
##$ME_mod= 0
##$MI= 1.114404
##$NCOEF= 0
##$NC_proc= -6
##$NLEV= 6
##$NOISF1= 3.799351
##$NOISF2= 2.8
##$NSP= 0
##$NTH_PI= 0
##$NZP= 0
##$OFFSET= 21.02817
##$PC= 1
##$PHC0= -26345.15
##$PHC1= 6.987431
##$PH_mod= 1
##$PKNL= yes
##$PPARMOD= 0
##$PSCAL= 0
##$PSIGN= 0
##$REVERSE= no
##$SF= 200.13000010891
##$SI= 16384
##$SIGF1= 3
##$SIGF2= 2
##$SINO= 5.538805
##$SIOLD= 16384
##$SREGLST= <1H.CDCl3>
##$SSB= 0
##$STSI= 16384
##$STSR= 0
##$SW_p= 4816.95568400771
##$SYMM= 0
##$S_DEV= 0
##$TDeff= 16384
##$TDoff= 0
##$TI= <>
##$TILT= no
##$TM1= 0
##$TM2= 0
##$TOPLEV= 0
##$USERP1= <user>
##$USERP2= <user>
##$USERP3= <user>
##$USERP4= <user>
##$USERP5= <user>
##$WDW= 1
##$XDIM= 16384
##$YMAX_p= 311793333
##$YMIN_p= -1457274
$$ End of Bruker specific parameters
$$ ---------------------------------
##NTUPLES= NMR SPECTRUM
##VAR_NAME=  FREQUENCY,     SPECTRUM/REAL,   SPECTRUM/IMAG
##SYMBOL=    X,             R,               I
##VAR_TYPE=  INDEPENDENT,   DEPENDENT,       DEPENDENT
##VAR_FORM=  AFFN,          ASDF,            ASDF
##VAR_DIM=   16384,         16384,           16384
##UNITS=     HZ,            ARBITRARY UNITS, ARBITRARY UNITS
##FACTOR=    0.29402158847633, 1,            1
##FIRST=     4208.36759073393, 0,            0
##LAST=      -608.588093273776, 0,           0
##MIN=       -608.588093273776, -1457274,    0
##MAX=       4208.36759073393, 311793333,    0
$$ Real data points
##PAGE= N=1
##DATA TABLE= (X++(R..R)), XYDATA
$$ [...]
$$ plain form
7726 164720 -162103 -176646 -101581 -111172 66159 67218 16079 -127154 -95859 -187941 -245959
7715 -245959 -185222 24936 71829 -122000 -95157 34722 -89090 -6613 -28746 -203871 -258224
7704 -258224 -277460 -172056 43455 -13639 -193990 -228082 -129949 -111483 -154531 -66025 -74443
7693 -74443 -78563 -117337 -225743 -275357 -135765 -70703 -13228 19066 -9105 -35739 -17213 -69844
7681 -69844 110116 28751 64412 92572 -28482 -62472 24477 113308 -4879 -193892 -47948
7670 -47948 -72796 -133919 -11587 -54054 -120331 -185453 -156878 -181223 32410 79289 -57023
7659 -57023 -27181 -16787 -224680 -32531 189772 182683 181925 -67878 -133746 -48416 -44743 315
7647 315 -138301 -298213 113042 96410 -26645 -123895 -65311 -14192 -111929 -187014 -7582
$$ packed form
7726A64720l26823j4543P5065r591J77331J059n1139j43233L1295r2082n8018
7715b45959O0737K10158M6893j93829K6843J29879j23812Q2477k2133j75125n4353
7704b58224j9236J05404K15511n7094j80351l4092R8133J8466m3048Q8506q418
7693g4443m120l8774j08406m9614J39592O5062N7475L2294k8171k6634J8526n2631
7681f9844J79960q1365L5661K8160j21054l3990Q6949Q8831j18187j89013J45944
7670d7948k4848o1123J22332m2467o6277o5122K8575k4345K13633M6879j36312
7659e7023K9842J0394k07893J92149K22303p089p58k49803o5868Q5330L673M5058
7647C15j38616j59912M11255j6632j23055r7250N8584N1119r7737p5085J79432
$$ plain form
7636 -7582 38963 -21813 -57524 -67820 94918 64772 137109 22784 8286 14964 -36299 -21533
7624 -21533 -104033 -86276 -135980 -45894 224383 139256 -3832 -93823 13680 85621 -66333
7613 -66333 -110739 78457 96027 114703 75389 57587 67569 19357 110505 247430 122263
7602 122263 179446 303966 258469 273382 297267 110936 131844 107579 174153 266703 173055
7591 173055 313123 351574 253955 334073 323590 342884 478346 376240 601020 508193 679970
7580 679970 658134 510753 754666 769393 799253 730451 829486 1048373 995612 997829 1059256
7569 1059256 1147436 1241622 1408692 1681523 1775891 2003771 2494173 2713082 2982148 3458995
7559 3458995 3594722 3508623 3335045 3034848 2881469 2479871 2133162 1790910 1567231 1384076
$$ packed form
7636g582M6545o0776l5711j0296J62738l0146P2337j14325j4498O678n1263J4766
7624b1533q2500J7757m9704R0086K70277q5127j43088q9991J07503P1941j51954
7613f6333m4406J89196J7570J8676l9314j7802R982m8212R1148J36925j25167
7602A22263N7183J24520m5497J4913K3885j86331K0908k4265O6574R2550r3648
7591A73055J40068L8451r7619Q0118j0483J9294J35462j02106K24780r2827J71777
7580F79970k1836j47381K43913J4727K9860o8802R9035K18887n2761K217O1427
7569A059256Q8180R4186J67070K72831R4368K27880M90402K18909K69066M76847
7559C458995J35727q6099j73578l00197j53379m01598l46709l42252k23679j83155
$$ plain form
7549 1384076 1328289 1213465 1209643 1054971 1031677 789256 748838 932225 732848 758366 661493
7538 661493 486852 501084 568972 597453 561721 602224 381544 235740 220385 101763 273511
7527 273511 273330 292844 329977 162238 88628 157649 258502 172250 184794 240984 61020
7516 61020 71390 91130 339309 124966 107157 179769 111993 75672 121586 79184 181363
7505 181363 324557 251086 247556 191992 142240 38320 90003 196487 12352 -27687 81597
7494 81597 -64108 -64738 62606 106186 177580 122254 -26509 -212083 -106148 -16567 170366
7483 170366 129632 81903 -20733 34320 -71563 -13954 -25564 130280 66183 -71096 69367
7472 69367 64714 -29946 50866 -20657 37830 144092 31905 -74994 -51363 116054 59960
$$ packed form
7549A384076n5787j14824l822j54672k3294k42421m0418J83387j99377K5518r6873
7538F61493j74641J4232O7888K8481l5732M0503k20680j45804j5355j18622J71748
7527B73511j81J9514L7133j67739p3610O9021J00853q6252J2544N6190j79964
7516F1020J0370J9740K48179k14343j7809P2612o7776l6321M5914m2402J02179
7505A81363J43194p3471l530n5564m9752j03920N1683J06484j84135m0039J09284
7494H1597j45705o30J27344M3580P1394n5326j48763j85574J05935Q9581J86933
7483A70366m0734m7729j02636N5053j05883N7609j1610J55844o4097j37279J40463
7472F9367m653r4660Q0812p1523N8487J06262j12187j06899K3631J67417n6094
$$ plain form
7461 59960 -54936 -9178 60483 31163 166999 90844 219668 166313 201613 65595 2718
7450 2718 136982 37573 -134725 -124578 88978 94263 -102554 -37377 83575 -111715 -179628
7439 -179628 -94932 61184 146033 153195 -43026 -382 89917 10519 157673 59629 -146305
7428 -146305 -25615 99757 17417 -579 38183 16399 -158095 110482 -119974 -130678 -42856
7417 -42856 -4714 -21412 3942 124804 176379 81573 -8450 196870 135819 207885 385001
7406 385001 151486 10067 4342 19058 84953 195803 263098 218491 207301 329181 670168
7395 670168 729190 638438 466166 284264 49841 29339 177490 262843 282135 411711 220878
7384 220878 268683 62534 19680 125242 -98233 71560 30172 77415 78493 127981 200301
$$ packed form
7461E9960j14896M5758O9661k9320J35836p6155J28824n3355L5300j36018o2877
7450B718J34264r9409j72298J0147K13556N285j96817O5177J20952j95290o7913
7439a79628Q4696J56116Q4849P162j96221M2644R0299p9398J47154r8044k05934
7428a46305J20690J25372q2340j7996L8762k1784j74494K68577k30456j0704Q7822
7417d2856L8142j6698K5354J20862N1575r4806r0023K05320o1051P2066J77116
7406C85001k33515j41419n725J4716O5895J10850O7295m4607j1190J21880L40987
7395F70168N9022r0752j72272j81902k34423k0502J48151Q5353J9292J29576j90833
7384B20878M7805k06149m2854J05562k23475J69793m1388M7243J078M9488P2320
$$ plain form
7373 200301 250936 192097 59588 -23427 58315 76462 147610 -85413 -161689 -56957 -24228
7362 -24228 -75218 -118192 -18283 1042 -33772 8669 53503 209204 138461 -54597 -71578
7351 -71578 -81663 11192 -58134 -44054 41467 -28577 -93696 77460 -54593 -92000 -48814
7340 -48814 -38400 69134 49820 17625 -20082 117019 78741 117495 -22502 14911 2094
7329 2094 257328 132477 69781 60568 153858 104084 -7864 7181 -83242 52885 13799
7318 13799 241264 141928 -105710 25152 165540 114062 42449 -35582 -17833 -118930 -86919
7307 -86919 -34349 -129599 -152521 68685 133288 -28303 -144341 33067 81976 94179 101518
7296 101518 -12052 50982 178880 142740 115461 48954 111684 102201 176303 155416 201959
$$ packed form
7373B00301N0635n8839j32509q3015Q1742J8147P1148k33023p6276J04732L2729
7362b4228n0990m2974R9909J9325l4814M2441M4834J55701p0743j93058j6981
7351g1578j0085R2855o9326J4080Q5521p0044o5119J71156j32053l7407M3186
7340d8814J0414J07534j9314l2195l7707J37101l8278L8754j39997L7413j2817
7329B094K55234j24851o2696r213R3290m9774j11948J5045r0423J36127l9086
7318A3799K27465r9336k47638J30862J40388n1478p1613p8031J7749j01097L2011
7307h6919N2570r5250k2922K21206O4603j61591j16038J77408M8909J2203P339
7296A01518j13570O3034J27898l6140k7279o6507O2730r483P4102k0887M6543
$$ plain form
7285 201959 95306 62216 56378 3486 -1501 198539 117885 109290 57332 -107425 -74952 104214
7273 104214 13107 63338 233143 403205 252548 -413 113619 161423 34486 92681
7263 92681 96592 28591 78594 71681 94282 43142 132014 80526 147554 73650 -33372 -131863
7251 -131863 16454 182316 73743 141239 -87465 -44785 -1485 -229297 90136 311395
7241 311395 140907 296994 185202 35119 98304 66326 161470 151948 230193 218522 297809
7230 297809 119358 325870 229224 225552 220712 152861 375525 383406 335343 297237 154762
7219 154762 289960 558028 555122 560543 477433 449957 641846 427317 125276 347724 155563
7208 155563 116793 307749 230880 309001 378395 298179 384167 397968 322579 269846 407925
$$ packed form
7285B01959j06653l3090n838n2892m987K00040q0654q595n1958j64757L2473J79166
7273A04214r1107N0231J69805J70062j50657k52961J14032M7804j26937N8195
7263I2681L911o8001N0003o913K2601n1140Q8872n1488O7028p3904j07022r8491
7251a31863J48317J65862j08573O7496k28704M2680M3300k27812L19433K21259
7241C11395j70488J56087j11792j50083O3185l1978R5144r522P8245j1671P9287
7230B97809j78451K06512r6646l672m840o7851K22664P881m8063l8106j42475
7219A54762J35198K68068k906N421q3110k7476J91889k14529l02041K22448j92161
7208A55563l8770J90956p6869P8121O9394q0216Q5988J3801p5389n2733J38079
$$ plain form
7197 407925 427920 378220 596296 580686 407180 502712 510888 425897 502940 565757 371175
7186 371175 362128 386049 167617 304444 404702 320488 386624 482936 150349 349060 423765
7175 423765 451548 400545 410286 473113 407022 616554 526751 522188 482060 382557 307998 424697
7163 424697 702497 686977 754699 557181 373724 504909 425256 355266 338426 338224 557162
7152 557162 546892 293928 462759 551839 643394 562754 617434 674996 590427 606549 381410
7141 381410 289618 479514 511456 525211 593208 677560 641810 661769 758180 805902 786677
7130 786677 822646 620876 711449 747073 716245 673113 737869 752698 1027806 1228533 1154085
7119 1154085 1162576 990915 1004899 1043192 1073922 935290 1092606 1144237 1335730 1463289 1346552
$$ packed form
7197D07925J9995m9700K18076j5610j73506R5532Q176q4991P7043O2817j94582
7186C71175r047K3921k18432J36827J00258q4214O6136R6312l32587J98711P4705
7175D23765K7783n1003R741O2827o6091K09532q9803m563m0128r9503p4559J16699
7163D24697K77800j5520O7722j97518j83457J31185p9653o9990j6840k02K18938
7152E57162j0270k52964J68831Q9080R1555q0640N4680N7562q4569J6122k25139
7141C81410r1792J89896L1942J3755O7997Q4352l5750J9959R6411M7722j9225
7130G86677L5969k01770R0573L5624l0828m3132O4756J4829K75108K00727p4448
7119A154085Q491j71661J3984L8293L0730j38632J57316N1631J91493J27559j16737
$$ plain form
7108 1346552 1202903 1223564 1396248 1242692 1467725 1564330 1664350 1767147 2106204 2043137
7098 2043137 2075925 2112784 2226582 2300132 2374722 2647356 2729332 3089733 3108199 3359660 3565667
7087 3565667 3906989 3920629 3948525 4222617 4443790 4793092 4811581 4840398 5045484 5321560
7077 5321560 5679547 5749571 5977379 6291608 6615644 6834135 7448093 7958467 8310346 8698647
7067 8698647 9432173 9923309 10547107 11038878 11754350 12278393 12699030 13311243 14231138 15071945
7057 15071945 16180006 17165135 18523612 20049479 21910166 23613958 26068538 28895092
7049 28895092 32622972 37011655 42449258 49089014 58185658 69006707 83615886 101580229
7041 101580229 123696755 131844756 112126130 87403081 68349188 55749131 47064680
$$ packed form
7108A346552j43649K0661J72684j53556K25033R6605J00020J02797L39057o3067
7098B043137L2788L6859J13798P3550P4590K72634Q1976L60401J8466K51461K06007
7087C565667L41322J3640K7896K74092K21173L49302J8489K8817K05086K76076
7077E321560L57987P0024K27808L14229L24036K18491O13958N10374L51879L88301
7067H698647P33526M91136O23798M91771P15472N24043M20637O12213R19895Q40807
7057A5071945J108061R85129J358477J525867J860687J703792K454580K826554
7049B8895092L727880M388683N437603O639756R096644J0821049J4609179J7964343
7041A01580229K2116526Q148001j9718626k4723049j9053893j2600057q684451
$$ plain form
7034 47064680 41395328 36507907 32649801 29199166 26559686 24035645 21886136 19914601
7026 19914601 18554653 16980476 15692025 14719315 13646953 12787689 11879916 11130328 10564927
7017 10564927 9921876 9196941 8762683 8380756 7824285 7329360 7082443 6712949 6400724
7008 6400724 6065514 5649031 5288128 5038989 4904050 4725112 4634382 4385220 4281208 4105187
6998 4105187 3914025 3747947 3652674 3643277 3627591 3649354 3759538 3624744 3312718 3224194 3031682
6987 3031682 2850039 2823483 2826566 2812084 2608102 2515809 2344214 2340023 2256145 2280925 2157210
6976 2157210 1954407 2066405 2029659 2092277 1974982 1979870 1793339 1831506 1565268 1401129
6966 1401129 1464357 1562603 1332505 1389487 1199453 1429886 1590741 1121164 1077682 1099271
$$ packed form
7034D7064680n669352m887421l858106l450635k639480k524041k149509j971535
7026A9914601j359948j574177j288451r72710j072362q59264r07773p49588n65401
7017A0564927o43051p24935m34258l81927n56471m94925k46917l69494l12225
7008F400724l35210m16483l60903k49139j34939j78938r0730k49162j04012j76021
6998D105187j91162j66078r5273r397j5686K1763J10184j34794l12026q8524j92512
6987C031682j81643k6556L083j4482k03982r2293j71595m191q3878K4780j23715
6976B157210k02803J11998l6746O2618j17295M888j86531L8167k66238j64139
6966A401129O3228R8246k30098N6982j90034K30433J60855m69577m3482K1589
$$ plain form
6956 1099271 1106939 1284992 1419586 1405679 1229112 1255270 1002212 1010688 981831 998143 1044293
6945 1044293 1065844 948070 868911 829864 968274 912717 821338 804252 766529 723061 790465
6934 790465 831190 593781 519322 456433 518468 660210 566101 433901 463265 428916 528514
6923 528514 622457 687216 456090 473589 606667 439125 406985 599641 504018 255229 413077
6912 413077 583714 462602 487432 375904 397351 501959 335024 443620 551800 380133
6902 380133 507998 396592 277536 307101 371193 152034 31863 331686 348278 469985
6892 469985 225464 275529 114882 53522 47155 131525 327209 112693 195369 296229 199378
6881 199378 190897 66235 352884 287372 136657 273245 257108 226825 179297 273301 230562
$$ packed form
6956A099271P668J78053J34594j3907j76567K6158k53058Q476k8857J6312M6150
6945A044293K1551j17774p9159l9047J38410n5557r1379j7086l7723m3468O7404
6934G90465M0725k37409p4459o2889O2035J41742r4109j32200K9364l4349R9598
6923E28514R3943O4759k31126J7499J33078j67542l2140J92656r5623k48789J57848
6912D13077J70637j21112K4830j11528K1447J04608j66935J08596J08180j71667
6902C80133J27865j11406j19056K9565O4092k19159j20171K99823J6592J21707
6892D69985k44521N0065j60647o1360o367Q4370J95684k14516Q2676J00860r6851
6881A99378q481j24662K86649o5512j50715J36588j6137l0283m7528R4004m2739
$$ plain form
6870 230562 421495 192555 116974 322195 242290 266428 347220 380721 435076 13459 238165
6859 238165 151750 279733 355768 230840 249716 152075 185998 221702 232676 -3543 102234
6848 102234 159632 291083 358038 128643 126013 125473 87287 95265 -36491 158092 241486 284388
6836 284388 332844 49280 126749 50314 70147 104733 220415 406120 213656 115663 -101399
6825 -101399 50056 214195 102963 153140 -6574 -51856 16736 -108370 -28775 -163145
6815 -163145 -199529 58400 12725 -105050 -820 73029 -51866 -76949 266024 257447 295576
6804 295576 249812 50928 187804 187751 281619 54934 22840 -86360 -58161 48854 -170409
6793 -170409 19934 -56311 -168238 53358 38274 -4036 75362 21563 106307 175984 146332
$$ packed form
6870B30562J90933k28940p5581K05221p9905K4138Q0792L3501N4355m21617K24706
6859B38165q6415J27983P6035j24928J8876r7641L3923L5704J0974k36219J05777
6848A02234N7398J31451O6955k29395k630n40l8186P978j31756J94583Q3394M2902
6836B84388M8456k83564P7469p6435J9833L4586J15682J85705j92464r7993k17062
6825a01399J51455J64139j11232N0177j59714m5282O8592j25106P9595j34370
6815a63145l6384K57929m5675j17775J04230P3849j24895k5083L42973q577L8129
6804B95576m5764j98884J36876n3R3868k26685l2094j09200K8199J07015k19263
6793a70409J90343p6245j11927K21596j5084m2310P9398n3799Q4744O9677k9652
$$ plain form
6782 146332 71802 -56853 -140021 -76953 89178 167247 117313 135656 81083 -23697 -70424
6771 -70424 -63089 72475 23157 -16147 61314 -9346 -1551 140775 2197 -26811 158237
6760 158237 8420 -60437 97241 232657 163121 83097 167680 27066 88208 100035 -136700
6749 -136700 -44101 -66743 153591 134074 269068 152357 -42260 76019 59159 140163 148144
6738 148144 292193 143579 92184 100115 333753 339478 266243 406970 192330 288640 205195
6727 205195 41260 258122 197780 97595 269974 218468 242001 236464 233450 425465 503055
6716 503055 418982 424839 307026 445112 298280 252102 279572 431230 497652 564040 573550
6705 573550 394714 420730 276959 444485 313335 258558 312380 245243 436816 652247
$$ packed form
6782A46332p4530j28655q3168O3068J66131P8069m9934J8343n4573j04780m6727
6771g0424P335J35564m9318l9304P7461p0660P795J42326j38578k9008J85048
6760A58237j49817o8857J57678J35416o9536q0024Q4583j40614O1142J1827k36735
6749a36700R2599k2642K20334j9517J34994j16711j94617J18279j6860Q1004P981
6738A48144J44049j48614n1395P931K33638N725p3235J40727k14640R6310q3445
6727B05195j63935K16862o0342j00185J72379n1506K3533n537l014J92015P7590
6716E03055q4073N857j17813J38086j46832m6178K7470J51658O6422O6388R510
6705E73550j78836K6016j43771J67526j31150n4777N3822o7137J91573K15431
$$ plain form
6695 652247 559670 553748 435049 351257 490076 510324 483999 520585 489839 612219 758399
6684 758399 804119 814234 1124565 1152400 1047848 906270 824983 570963 593137 625749 710560
6673 710560 530515 330099 353406 542030 558504 339995 375934 444336 360367 414552 420548
6662 420548 369568 228829 282825 286777 83264 434085 351983 397779 398804 229444 424876
6651 424876 555775 623663 422519 371703 303688 246156 271484 288803 419035 279667 276744
6640 276744 226495 89298 175585 298676 355196 326766 242205 179428 222722 405756 331670
6629 331670 371114 224774 162888 186489 34684 14084 45138 23645 49754 8997 215971
6618 215971 38646 -82282 -14232 -139635 -125237 116198 122703 -971 51653 -121473 -110649
$$ packed form
6695F52247r2577n922j18699q3792J38819K0248k6325L6586l0746J22380J46180
6684G58399M5720J0115L10331K7835j04552j41578q1287k54020K2174L2612Q4811
6673G10560j80045k00416K3307J88624J6474k18509L5939O8402q3969N4185N996
6662D20548n0980j40739N3996L952k03513L50821q2102M5796J025j69360J95432
6651D24876J30899O7888k01144n0816o8015n7532K5328J7319J30232j39368k923
6640B76744n0249j37197Q6287J23091N6520k8430q4561o2777M3294J83034p4086
6629C31670L9444j46340o1886K3601j51805k0600L1054k1493K6109m0757K06974
6618B15971j77325j20928O8050j25403J4398K41435O505j23674N2624j73126J0824
$$ plain form
6607 -110649 -120711 -21022 107196 159160 24859 -199849 41194 184433 40177 -132544
6597 -132544 -111779 37292 152197 -80661 -172656 -134077 -64092 70016 104070 -83579 -85424
6586 -85424 -122643 20451 -91833 -75133 -99465 -91874 -21689 -88082 -49675 -95205 -220272
6575 -220272 -233069 65690 -53131 -138642 -127625 152137 -46021 -142206 -130243 -95283 116582
6564 116582 137917 122463 11402 -19325 -210617 -88611 -187238 -137495 -17820 -142918 -53479
6553 -53479 -135565 -106306 -89697 112782 28350 -169362 -153731 12864 19639 -33171 -119633
6542 -119633 -184225 -212261 -91100 -28953 -291235 -152918 44492 136086 39695 109445 132463
6531 132463 8103 96582 105650 47528 -76821 -100304 -169260 78996 74342 47066 -107097
$$ packed form
6607a10649j0062R9689J28218N1964j34301k24708K41043J43239j44256j72721
6597a32544K0765J49071J14905k32858r1995L8579O9985J34108L4054j87649j845
6586h5424l7219J43094j12284J6700k4332P591P0185o6393L8407m5530j25067
6575b20272j2797K98759j18821q5511J1017K79762j98158r6185J1963L4960K11865
6564A16582K1335j5454j11061l0727j91292J22006r8627M9743J19675j25098Q9439
6553e3479q2086K9259J6609K02479q4432j97712J5631J66595O775n2810q6462
6542a19633o4592k8036J21161O2147k62282J38317J97410R1594r6391O9750K3018
6531A32463j24360Q8479R068n8122j24349k3483o8956K48256m654k7276j54163
$$ plain form
6520 -107097 -60984 85266 157268 -58605 -30607 -41235 3140 -80592 -35093 115955 -122711
6509 -122711 118777 63458 -84692 -1107 43706 -27350 -36100 -38604 97049 69852 138649
6498 138649 -19861 -63258 -40010 -64999 -23499 -70988 37115 125323 -119337 -56658 -155711
6487 -155711 -64422 -121291 -78929 47317 -71754 -174915 -203094 -31620 12956 20212 -36006
6476 -36006 55734 -17827 -239010 -156996 -95430 -86588 -5070 116994 -3008 -137244 -146142
6465 -146142 -64462 -147847 -103526 -32724 -68128 100115 13355 20346 3742 -10135 65850 12447
6453 12447 -265719 -190950 -164941 -122306 -114936 30877 -87752 115106 274773 -59767 -206681
6442 -206681 -96 54612 -36328 -118804 -123766 -66120 -95209 -133577 56028 68490 19786
$$ packed form
6520a07097M6113J46250P2002k15873K7998j0628M4375q3732M5499J51048k38666
6509a22711K41488n5319j48150Q3585M4813p1056q750k504J35653k7197O8797
6498A38649j58510m3397K3248k4989M1500m7489J08103Q8208k44660O2679r9053
6487a55711R1289n6869M2362J26246j19071j03161k8179J71474M4576P256n6218
6476c6006R1740p3561k21183Q2014O1566Q842Q1518J22064j20002j34236q898
6465a46142Q1680q3385M4321P0802l5404J68243q6760O991j6604j3877P5985n3403
6453A2447k78166P4769K6009M2635P370J45813j18629K02858J59667l34540j46914
6442b06681K06585N4708r0940q2476m962N7646k9089l8368J89605J2462m8704
$$ plain form
6431 19786 -44578 -189434 -62639 -23432 -117160 -72133 -21133 -198669 -109723 -185150 -55759
6420 -55759 163108 -46074 -80351 63427 86536 -71983 -57346 229194 44480 -121770
6410 -121770 -150107 88506 154253 -8735 -310947 -183856 -85624 -111939 71036 -65123
6400 -65123 -109355 -83020 -16975 -109316 -87265 -13568 -12328 -44687 219806 61102 -161574
6389 -161574 71431 146967 161912 45303 126549 93062 4759 -82434 16453 4871 -66067
6378 -66067 -28807 98256 73588 18932 -3143 42598 16134 -91486 106012 125421 130160
6367 130160 112738 231071 137215 111464 145223 183141 131934 -461 58528 284994 254582
6356 254582 61954 51336 235321 130651 177398 142093 139943 265889 182544 339439 527602
$$ packed form
6431A9786o4364j44856J26795L9207r3728M5027N1000j77536Q8946p5427J29391
6420e5759K18867k09182l4277J43778K3109j58519J4637K86540j84714j66250
6410a21770k8337K38613O5747j62988l02212J27091R8232k6315J82975j36159
6400f5123m4232K6335O6045r2341K2051P3697J240l2359K64493j58704k22676
6389a61574K33005P5536J4945j16609Q1246l3487q8303q7193R8887j1582p0938
6378f6067L7260J27063k4668n4656k2075M5741k6464j07620J97498J9409M739
6367A30160j7422J18333r3856k5751L3759L7918n1207j32395N8989K26466l0412
6356B54582j92628j0618J83985j04670M6747l5305k150J25946q3345J56895J88163
$$ plain form
6345 527602 645805 712397 744989 798926 778981 913962 1176710 1300752 1423099 1208681
6335 1208681 1156371 1065741 863835 589661 633135 567424 502962 466296 368044 169341 90668
6324 90668 116421 164138 326905 161261 240998 319829 270382 116636 87993 156599 4758
6313 4758 222524 239679 111419 -19459 135500 119057 -108997 -61465 35837 -33078 -48807
6302 -48807 163980 100002 38558 -82697 84011 34880 -68867 -13708 -56851 80540 230734
6291 230734 69063 39267 72324 -123959 -28226 -68002 -43791 132873 84573 141140 72823
6280 72823 2296 -3747 80203 107548 -104338 -52660 -24563 76687 54059 30736 -490 14772
6268 14772 107463 11444 -68666 -22464 16961 10295 119498 116110 87288 -45227 77716 30621
$$ packed form
6345E27602J18203O6592L2592N3937j9945J34981K62748J24042J22347k14418
6335A208681n2310r0630k01906k74174M3474o5711o4462l6666r8252j98703p8673
6324I0668K5753M7717J62767j65644P9737P8831m9447j53746k8643O8606j51841
6313D758K17766J7155j28260j30878J54959j6443k28054M7532R7302o8915j5729
6302d8807K12787o3978o1444j21255J66708m9131j03747N5159m3143J37391J50194
6291B30734j61671k9796L3057j96283R5733l9776K4211J76664m8300N6567o8317
6280G2823p0527o043Q3950K7345k11886N1678K8097J01250k2628k3323l1226J5262
6268A4772R2691r6019q0110M6202L9425o666J09203l388k8822j32515J22943m7095
$$ plain form
6256 30621 -87744 -57851 -9069 -53053 -39272 -24479 64816 96025 199953 243347 85870
6245 85870 48286 43949 356 -16993 31487 57849 108031 220692 498992 257599 394410
6234 394410 402119 370915 422774 538159 249163 -60737 116429 203114 189024 190368 258488
6223 258488 103430 197152 138370 111888 64320 73052 5342 119404 122578 69674 10676 76497
6211 76497 -149212 -215433 -148620 -152938 -306460 -222400 -246247 -119166 -21842 18591 -34406
6200 -34406 -2588 150334 -38032 58367 50693 -53580 -27575 105700 87057 154449 -29211
6189 -29211 74298 -105950 -92526 62881 90384 55627 288555 52776 51599 103455 53324
6178 53324 97196 147303 -7503 -15773 26840 110277 45462 -73887 -26261 -103743 34539
$$ packed form
6256C0621j18365K9893M8782m3984J3781J4793Q9295L1209J03928M3394j57477
6245H5870l7584m337m3593j7349M8480K6362N0182J12661K78300k41393J36811
6234C94410P709l1204N1859J15385k88996l09900J77166Q6685j4090J344O8120
6223B58488j55058R3722n8782k6482m7568Q732o7710J14062L174n2904n8998O5821
6211G6497k25709o6221O6813m318j53522Q4060k3847J27081R7324M0433n2997
6200c4406L1818J52922j88366R6399p674j04273K6005J33275j8643O7392j83660
6189b9211J03509j80248J3424J55407K7503l4757K32928k35779j177N1856n0131
6178E3324M3872N0107j54806q270M2613Q3437o4815j19349M7626p7482J38282
$$ plain form
6167 34539 49599 36254 243830 37268 -93740 219694 -84663 6718 83356 67837 -9267
6156 -9267 115829 237909 189105 52856 93192 -30376 -151563 -240043 -299978 -157492 -103430
6145 -103430 -30630 -68979 -152337 -26719 -66524 -67473 -143747 -169269 -63621 30846 -93011
6134 -93011 -191139 -198098 110391 96717 -58475 111902 164798 -46956 -180659 -24784 -66235
6123 -66235 -142259 -45373 42154 149095 330475 179590 134395 114516 -4357 -31924 -12572
6112 -12572 -46618 -7303 -52274 -94714 -22946 -47482 68945 41230 -51479 -873 -65029 -46436
6100 -46436 -91877 -3297 40865 30377 131507 135565 17461 -14919 42475 126814 5484
6089 5484 -12081 -47633 26262 165918 192403 -71154 -64035 89628 31096 93572 55406 91084
$$ packed form
6167C4539J5060j3345K07576k06562j31008L13434l04357R1381P6638j5519p7104
6156i267J25096J22080m8804j36249M0336j23568j21187q8480n9935J42486N4062
6145a03430P2800l8349q3358J25618l9805r49p6274k5522J05648R4467j23857
6134i3011r8128o959L08489j3674j55192J70377N2896k11754j33703J55875m1451
6123f6235p6024R6886Q7527J06941J81380j50885m5195j9879j18873k7567J9352
6112a2572l4046L9315m4971m2440P1768k4536J16427k7715r2709N0606o4156J8593
6100d6436m5441Q8580M4162j0488J01130M058j18104l2380N7394Q4339j21330
6089E484j7565l5552P3895J39656K6485k63557P119J53663n8532O2476l8166L5678
$$ plain form
6077 91084 74299 55734 287107 96117 5328 -36185 19497 180819 123018 86443 57418
6066 57418 79172 53817 -13944 79064 140921 144892 170592 -7438 -28929 -69267 176080 149570
6054 149570 221115 259947 21990 185311 36223 17848 55029 -30010 97773 24991 12012
6043 12012 11003 52972 -11837 309665 224905 4694 93635 147566 292513 151191 92638
6032 92638 130960 126163 106107 32769 215399 212188 179717 207817 82054 118645 164156 279680
6020 279680 180504 134268 165912 200507 118394 106169 249491 327798 218068 -5973 -129821
6009 -129821 -73718 93928 -4673 93470 121905 62268 87388 53507 174002 366154 310333
5998 310333 238611 243243 180635 82248 57465 259483 148779 89624 -8347 102172 264468
$$ packed form
6077I1084j6785j8565K31373j90990r0789m1513N5682J61322n7801l6575k9025
6066E7418K1754k5355o7761R3008O1857L971K5700j78030k1491m0338K45347k6510
6054A49570P1545L8832k37957J63321j49088j8375L7181q5039J27783p2782j2979
6043A2012j009M1969o4809L21502q4760k20211Q8941N3931J44947j41322n8553
6032I2638L8322m797k0056p3338J82630l211l2471K8100j25763L6591M5511J15524
6020B79680r9176m6236L1644L4595q2113j2225J43322P8307j09730k24041j23848
6009a29821N6103J67646r8601R8143K8435n9637K5120l3881J20495J92152n5821
5998C10333p1722M632o2608r8387k4783K02018j10704n9155r7971J10519J62296
$$ plain form
5987 264468 167151 294332 455083 391462 421488 356299 241496 167366 148095 -18089 -11165
5976 -11165 198089 323180 213825 12062 134851 82964 119750 80992 69755 223925 149214
5965 149214 75137 75848 150795 62573 278865 130639 29735 228035 126789 100164 74453
5954 74453 -132548 -95213 -68903 -139855 82262 200654 247544 59188 96721 266105 363104
5943 363104 191153 68239 212686 194823 10791 -87843 -139852 50010 172828 -43295
5933 -43295 29249 71290 126209 120548 196268 200132 104396 91084 142012 262121 254215 279596
5921 279596 158817 116057 216288 146954 -21129 38630 158907 134064 270120 183447 255513
5910 255513 257738 68378 77032 37752 227204 197455 2507 41404 -5068 -147562 151541
$$ packed form
5987B64468r7317J27181J60751o3621L0026o5189j14803p4130j9271j66184O924
5976a1165K09254J25091j09355k01763J22789n1887L6786l8758j1237J54170p4711
5965A49214p4077P11P4947q8222K16292j48226j00904J98300j01246k6625k5711
5954G4453k07001L7335K6310p0952K22117J18392M6890j88356L7533J69384R6999
5943C63104j71951j22914J44447j7863j84032r8634n2009J89862J22818k16123
5933d3295P2544M2041N4919n661P5720L864r5736j3312N0928J20109p906K5381
5921B79596j20779m2760J00231o9334j68083N9759J20277k4843J36056q6673P2066
5910B55513K225j89360Q654l9280J89452k9749j94948L8897m6472j42494K99103
$$ plain form
5899 151541 168132 282483 236500 143146 -22431 -10991 9316 10579 27141 -51820 97699
5888 97699 139850 23449 -51320 17771 36785 15496 177760 230542 54331 126035 -85873
5877 -85873 -2909 -150218 -221448 96870 162302 53433 54094 221035 98153 147904 268519
5866 268519 219197 20195 214968 176105 -112453 -141325 -91783 -39323 76819 134210 65397
5855 65397 93077 181782 147467 75638 52751 119880 66334 154740 347135 132312 172758
5844 172758 224147 215698 29200 9745 149776 224146 258396 186737 156644 116786 31888
5833 31888 7584 80865 69477 56494 89945 7086 201835 294621 142858 154551 124775
5822 124775 98488 240979 266290 20703 195658 130409 213964 48315 -82852 83946
$$ packed form
5899A51541J6591J14351m5983r3354j65577J1440K0307J263J6562p8961J49519
5888I7699M2151j16401p4769O9091J9014k1289J62264N2782j76211P1704k11908
5877h5873Q2964j47309p1230L18318O5432j08869O61J66941j22882M9751J20615
5866B68519m9322j99002J94773l8863k88558k8872M9542N2460J16142N7391o8813
5855F5397K7680Q8705l4315p1829k2887O7129n3546Q8406J92395k14823M0446
5844A72758N1389q449j86498j9455J40031P4370L4250p1659l0093l9858q4898
5833C1888k4304P3281j1388j2983L3451q2859J94749R2786j51763J1693k9776
5822A24775k6287J42491K5311k45587J74955o5249Q3555j65649j31167J66798
$$ plain form
5812 83946 75025 105662 188196 175150 -71582 97717 8908 -106627 -42527 47262 35992
5801 35992 -13888 39912 163791 225211 128377 93905 155076 269513 256540 235853 321388
5790 321388 258124 239415 243361 345605 333950 243727 189124 240519 332237 313115 323143 206664
5778 206664 345247 182131 202801 231677 278870 96879 142465 175940 9579 -51497 70403
5767 70403 257117 161097 29557 -49408 191980 323650 389359 220319 336352 214365
5757 214365 241392 262547 239222 223112 283747 255136 182832 259909 69884 61325 250163
5746 250163 108526 81493 239125 223237 361275 470860 161289 251879 143311 275891
5736 275891 273372 217347 84191 98488 196173 322966 209702 30433 219197 74427 291524
$$ packed form
5812H3946q921L0637Q2534j3046k46732J69299q8809j15535O4100Q9789j1270
5801C5992m9880N3800J23879O1420r6834l4472O1171J14437j2973k0687Q5535
5790C21388o3264j8709L946J02244j1655r0223n4603N1395R1718j9122J0028j16479
5778B06664J38583j63116K0670K8876M7193j81991M5586L3475j66361o1076J21900
5767G0403J86714r6020j31540p8965K41388J31670O5709j69040J16033j21987
5757B14365K7027K1155k3325j6110O0635k8611p2304P7077j90025q559J88838
5746B50163j41637k7033J57632j5888J38038J09585l09571R0590j08568J32580
5736B75891k519n6025j33156J4297R7685J26793j13264j79269J88764j44770K17097
$$ plain form
5725 291524 272831 231359 181306 259898 344872 282488 308798 179977 331473 304186 323509
5714 323509 409357 361517 324972 234760 305462 311327 188922 274292 434699 321244 348707
5703 348707 307116 300619 306731 281707 351769 341733 374761 306602 275950 248200 169864 279182
5691 279182 307441 361351 530401 566067 510722 326253 394281 390217 340701 493866 459215
5680 459215 499200 409391 520560 431988 512107 525691 608952 556004 496625 441656 264018
5669 264018 21659 236845 478077 617925 620276 554793 531511 423226 442307 419014 438100
5658 438100 403855 403982 379018 362170 398316 424424 450210 627880 615699 544871 543135 630169
5646 630169 662142 702931 812684 802461 844567 692085 947999 1074299 924587 1090215
$$ packed form
5725B91524j8693m1472n0053P8592Q4974o2384K6310j28821J51496k7287J9323
5714C23509Q5848m7840l6545r0212P0702N865j22405Q5370J60407j13455K7463
5703C48707m1591o497O112k5024P0062j0036L3028o8159l0652k7750p8336J09318
5691B79182K8259N3910J69050L5666n5345j84469O8028m064m9516J53165l4651
5680D59215L9985q9809J11169q8572Q0119J3584Q3261n2948n9379n4969j77638
5669B64018k42359K15186K41232J39848K351o5483k3282j08285J9081k3293J9086
5658D38100l4245J27k4964j6848L6146K6108K5786J77670j2181p0828j736Q7034
5646F30169L1973M0789J09753j0223M2106j52482K55914J26300j49712J65628
$$ plain form
5636 1090215 1175447 1210028 1029587 958794 1060245 1063581 1095047 1160052 1102499 986943 1131193
5625 1131193 983917 816009 933356 1017322 1259397 1019351 821166 956788 1074852 1088507
5615 1088507 1109177 1049382 1053928 952835 819769 771925 875133 907528 810607 989855 835080
5604 835080 891934 790702 669777 867370 747609 850989 860591 821895 779392 807641 703592
5593 703592 679320 656736 574504 647705 708196 732005 638063 567774 558871 563166 731602 780252
5581 780252 645421 749838 618039 485531 433460 462744 569572 912945 678079 622244
5571 622244 634340 593713 549912 617583 623929 645451 582874 732575 698112 603608 555944 634888
5559 634888 687922 407260 538465 542140 520177 642497 585247 528988 562448 659393 619793
$$ packed form
5636A090215Q5232L4581j80441p0793J01451L336L1466O5005n7553j15556J44250
5625A131193j47276j67908J17347Q3966K42075k40046j98185J35622J18064J3655
5615A088507K0670n9795M546j01093j33066m7844J03208L2395r6921J79248j54775
5604H35080N6854j01232j20925J97593j19761J03380R602l8696m2503K8249j04049
5593G03592k4272k2584q2232P3201O0491K3809r3942p0289q903M295J68436M8650
5581G80252j34831J04417j31799j32508n2071K9284J06828L43373k34866n5835
5571F22244J2096m0627m3801O7671O346K1522o2577J49701l4463r4504m7664P8944
5559F34888N3034k80662J31205L675k1963J22320n7250n6259L3460R6945l9600
$$ plain form
5548 619793 566412 622295 440631 484444 439263 588430 601035 567319 536123 373581 429234
5537 429234 600362 575881 716639 862192 778857 655927 547512 507390 589646 530864 437969
5526 437969 370049 589453 457712 528537 520911 392097 492841 514231 519862 433785 615809
5515 615809 846254 675114 537664 444969 582982 557447 571426 387005 418217 479374 270613
5504 270613 466315 591422 626487 661816 508373 572773 644984 759544 678405 604096 677339
5493 677339 576883 370943 520096 453887 423926 433811 478464 379484 281857 348128 469542
5482 469542 545367 490078 426397 415281 474612 534074 751214 654547 765602 708844 691056
5471 691056 827916 791094 665949 689678 702790 590812 700367 892590 990578 979013 747929
$$ packed form
5548F19793n3381N5883j81664M3813m5181J49167J2605l3716l1196j62542N5653
5537D29234J71128k4481J40758J45553q3335j22930j08415m0122Q2256n8782r2895
5526D37969o7920K19404j31741P0825p626j28814J00744K1390N631q6077J82024
5515F15809K30445j71140j37450r2695J38013k5535J3979j84421L1212O1157k08761
5504B70613J95702J25107L5065L5329j53443O4400P2211J14560q1139p4309P3243
5493F77339j00456k05940J49153o6209k9961R885M4653r8980r7627O6271J21414
5482D69542P5825n5289o3681j1116N9331N9462K17140r6667J11055n6758j7788
5471F91056J36860l6822j25145K3729J3112j11978J09555J92223R7988j1565k31084
$$ plain form
5460 747929 870120 774073 819102 804417 871471 821225 987302 1026016 805325 982031 854723
5449 854723 803816 796025 843776 679683 565335 602349 824978 882522 952515 891016 979899
5438 979899 1107878 942645 989317 922847 768163 825644 899477 1029216 1185589 1023244
5428 1023244 948060 886967 835476 835174 928476 789386 818427 1045858 1123017 1042637 1031332
5417 1031332 833172 755123 941155 1004184 958183 874162 813299 776331 653489 742099 785349
5406 785349 819098 903759 837134 756541 876321 1049852 967079 741289 858565 825383 947864
5395 947864 898200 838496 1074806 957576 847022 930350 866178 1046903 1083835 1310656 1294013
5384 1294013 1273664 1186637 1077846 1151934 1155733 979866 1136437 1251810 1221405 1357543 1262853
$$ packed form
5460G47929J22191r6047M5029j4685O7054n0246J66077L8714k20691J76706j27308
5449H54723n0907p791M7751j64093j14348L7014K22629N7544O9993o1499Q8883
5438I79899J27979j65233M6672o6470j54684N7481P3833J29739J56373j62345
5428A023244p5184o1093n1491l02R3302j39090K9041K27431P7159q0380j1305
5417A031332j98160p8049J86032O3029m6001q4021o0863l6968j22842Q8610M3250
5406G85349L3749Q4661o6625q0593J19780J73531q2773k25790J17276l3182J22481
5395I47864m9664n9704K36310j17230j10554Q3328o4172J80725L6932K26821j6643
5384A294013k0349q7027j08791P4088L799j75867J56571J15373l0405J36138r4690
$$ plain form
5373 1262853 1374132 1474167 1280667 1336613 1427911 1501411 1317582 1398747 1454579 1328755
5363 1328755 1482817 1429069 1544888 1455428 1404635 1666693 1619443 1549462 1652852 1629267 1632944
5352 1632944 1450853 1544479 1609023 1656184 1751756 1822617 1948559 2043996 1771052 1967822 1957755
5341 1957755 1964786 2123040 2131882 2246393 2432508 2390708 2222723 2293266 2439506 2615199 2856347
5330 2856347 2844286 2887825 2907745 2817953 2853937 2918607 3032457 2724185 2680927 2702029 2820196
5319 2820196 3043899 3096036 3022711 2886041 3040760 2967735 3191514 3140049 3107037 3080764 3022375
5308 3022375 2864017 2866009 2823578 2847237 2991508 3060600 3049047 2790014 2882263 2849139 2736325
5297 2736325 2830799 2938596 3150319 3026851 3010943 2967580 2858501 2781850 3067026 3084592
$$ packed form
5373A262853J11279J00035j93500N5946R1298P3500j83829Q1165N5832j25824
5363A328755J54062n3748J15819q9460n0793K62058m7250o9981J03390k3585L677
5352A632944j82091R3626O4544M7161R5572P0861J25942R5437k72944J96770j0067
5341A957755P031J58254Q842J14511J86115m1800j67985P0543J46240J75693K41148
5330B856347j2061M3539J9920q9792L5984O4670J13850l08272m3258K1102J18167
5319B820196K23703N2137p3325j36670J54719p3025K23779n1465l3012k6273n8389
5308C022375j58358J992m2431K3659J44271O9092j1553k59033R2249l3124j12814
5297B736325R4474J07797K11723j23468j5908m3363j09079p6651K85176J7566
$$ plain form
5287 3084592 2882752 2881462 2894849 2912236 2837558 3088693 3065389 2984252 3066729 3218942 3078372
5276 3078372 2794805 2574511 2437246 2635721 2731722 2590960 2487625 2397009 2374551 2404544
5266 2404544 2234695 2248561 2424993 2218264 2240077 2349186 2163146 2113102 2137338 2087517
5256 2087517 2297192 2272228 2052471 2113618 1933452 1919989 2092510 2207780 2268078 2286407
5246 2286407 2389471 2270799 2280925 2164302 2206742 2096300 2118734 2271074 2358406 2386645
5236 2386645 2261017 2255788 2283931 2413066 2270870 2349521 2390094 2258811 2235468 2205204 2243569
5225 2243569 2490294 2401240 2301781 2373116 2377742 2639389 2703774 2971015 3059439 2996297 2997705
5214 2997705 2859716 2971918 2994046 3001286 2913488 2965985 2845721 2825592 2976507 2903505 2889181
$$ packed form
5287C084592k01840j290J3387J7387p4678K51135k3304q1137Q2477J52213j40570
5276C078372k83567k20294j37265J98475R6001j40762j03335r0616k2458K9993
5266B404544j69849J3866J76432k06729K1813J09109j86040n0044K4236m9821
5256B087517K09675k4964k19757O1147j80166j3463J72521J15270O0298J8329
5246B286407J03064j18672J0126j16623M2440j10442K2434J52340Q7332K8239
5236B386645j25628n229K8143J29135j42196P8651M0573j31283k3343l0264L8365
5225B243569K46725q9054r9459P1335M626K61647O4385K67241Q8424o3142J408
5214B997705j37989J12202K2128P240q7798N2497j20264k0129J50915p3002j4324
$$ plain form
5203 2889181 3038320 3118928 3216761 3395799 3403696 3614197 3872405 4177506 4583512 4757303
5193 4757303 5150028 5574076 5755055 5265791 4971893 4610685 4365157 4420953 4359669 4607815
5183 4607815 4656847 4812358 4936397 5057208 5114131 5444890 5723146 6226476 6664050 7134321
5173 7134321 7752076 8484077 9415430 10558639 11603726 12858124 12843017 11791608 10306080
5164 10306080 9128853 8509725 7855822 7717540 7347558 7007981 6839311 6741714 6747699 6747704 6999622
5153 6999622 7050128 7232631 7448057 7810567 8152386 8733322 9449723 10280517 11375491 12588851
5143 12588851 12834463 11906712 10398395 9021822 8407852 7754088 7348836 7116513 6690620
5134 6690620 6322848 5953920 5841281 5733529 5544663 5566930 5550574 5499247 5597041 5657369
$$ packed form
5203B889181J49139Q0608R7833J79038P897K10501K58208L05101M06006J73791
5193D757303L92725M24048J80979m89264k93898l61208k45528N5796o1284K48146
5183D607815M9032J55511J24039J20811N6923L30759K78256N03330M37574M70271
5173G134321O17755P32001R31353J143209J045087J254398j5107j051409j485528
5164A0306080j177227o19128o53903j38282l69982l39577j68670r7597N985NK51918
5153F999622N0506J82503K15426L62510L41819N80936P16401Q30794J094974J213360
5143A2588851K45612r27751j508317j376573o13970o53764m05252k32323m25893
5134F690620l67772l68928j12639j07752j88866K2267j6356n1327R7794O0328
$$ plain form
5124 5657369 5761992 6054493 6236899 6705660 7091680 7125565 6845210 6515092 6164516 5973219
5114 5973219 5634135 5627189 5407834 5358194 5264952 5062619 5036630 5004784 4891218 4791130 4832685
5103 4832685 4984468 4876841 4983990 5027579 5017540 4997528 5038107 4857786 4915158 5056193
5093 5056193 4987215 5010322 4987604 4954964 4932892 5036778 5164937 5095783 5089857 4988354 5084756
5082 5084756 5264606 5381914 5330617 5349818 5490880 5518745 5492814 5307256 5474733 5455753
5072 5455753 5516579 5324659 5211820 5242479 5417088 5514143 5514536 5602476 5633916 5617469 5810913
5061 5810913 5869579 5945781 5916258 5962558 5908751 5983314 5768014 5946130 6071690 6153067 6100133
5050 6100133 6132989 6269353 6421555 6495712 6501103 6733407 6799717 6764093 6803885 6973373 7047016
$$ packed form
5124E657369J04623K92501J82406M68761L86020L3885k80355l30118l50576j91297
5114E973219l39084o946k19355m9640r3242k02333k5989l1846j13566j00088M1555
5103D832685J51783j07627J07149M3589j0039k0012M0579j80321N7372J41035
5093E056193o8978K3107k2718l2640k2072J03886J28159o9154n926j01503R6402
5082E084756J79850J17308n1297J9201J41062K7865k5931j85558J67477j8980
5072E455753O0826j91920j12839L0659J74609R7055L93Q7940L1440j6447J93444
5061E810913N8666P6202k9523M6300n3807P4563k15300J78116J25560Q1377n2934
5050F100133L2856J36364J52202P4157N391K32304O6310l5624L9792J69488P3643
$$ plain form
5039 7047016 7042786 7138482 7152056 7385512 7547192 7535575 7763541 7653385 7653000 7799969 8108207
5028 8108207 8132495 8175107 8262389 8273843 8414066 8601734 8562165 8697158 8862004 9038386
5018 9038386 9269882 9329853 9344891 9683373 9687335 9897383 10089595 10143974 9961285 10049702 10106679
5007 10106679 10276424 10550490 10889115 10906452 10818413 11173330 11441735 11324197 11395324 11472142
4997 11472142 11389544 11403755 11330673 11396423 11495979 11594447 11605511 11593077 11588126 11844232 12032452
4986 12032452 11996353 12219809 12712625 12683690 12881604 13183104 13499415 13894724 14261731 14692566
4976 14692566 14753009 15344535 15842277 16250186 16503294 16790961 17292797 17830876 18366504 18533780
4966 18533780 19140916 19785447 20664993 21559417 22337651 23085501 23958505 24669243 25624290
$$ packed form
5039G047016m230R5696J3574K33456J61680j1617K27966j10156l85J46969L08238
5028H108207K4288M2612Q7282J1454J40223J87668l9569J34993J64846J76382
5018I038386K31496N9971J5038L38482L962K10048J92212N4379j82689Q8417N6977
5007A0106679J69745K74066L38625J7337q8039L54917K68405j17538P1127P6818
4997A1472142q2598J4211p3082O5750R9556R8468J1064j2434m951K56106J88220
4986A2032452l6099K23456M92816k8935J97914L01500L16311L95309L67007M30835
4976A4692566O0443N91526M97742M07909K53108K87667N01836N38079N35628J67276
4966A8533780O07136O44531Q79546Q94424P78234P47850Q73004P10738R55047
$$ plain form
4957 25624290 26359542 27184248 28006001 28744362 29959066 31192768 32180442 33359347 34832079
4948 34832079 36231406 37698699 39677579 41785871 43784369 45852071 48451952 50906286
4940 50906286 53847858 57440581 61762584 66605461 72123891 78856549 86975802 97002153
4932 97002153 108498571 121981049 135435413 142826801 140409435 131908636 123763382 118990331
4924 118990331 117244906 118761499 122435974 127750231 133366778 140085449 149138356 161136582
4916 161136582 176472847 192838028 205116753 210005829 206422089 196567044 185982038
4909 185982038 178140266 170201336 160289322 151252867 145199304 142284902 141468720 141836689
4901 141836689 143045376 146334254 152385413 161858060 173972992 184790524 185691932 172834571
$$ packed form
4957B5624290P35252Q24706Q21753P38361J214704J233702R87674J178905J472732
4948C4832079J399327J467293J978880K108292J998498K067702K599881K454334
4940E0906286K941572L592723M322003M842877N518430O732658Q119253J0026351
4932I7002153J1496418J3482478J3454364P391388k417366q500799q145254m773051
4924A18990331j745425J516593L674475N314257N616547O718671R052907J1998226
4916A61136582J5336265J6365181J2278725M889076l583740r855045j0585006
4909A85982038p841772p938930r912014r036455o053563k914402q16182L67969
4901A41836689J208687L288878O051159R472647J2114932J0817532R01408j2857361
$$ plain form
4893 172834571 154445455 137840116 125508349 117187519 111225172 107021278 104260581 102418165
4885 102418165 101907922 102260638 103610213 106329892 110286188 115751638 123043946 132366378
4877 132366378 143409221 154291383 159932742 158583079 151850655 144010700 138660077 136578058
4869 136578058 137498366 140930981 145987374 151824295 158502594 167331547 178947744 193473626
4861 193473626 206613413 213417283 212630648 205218509 194930605 185544969 179323364 174838928
4853 174838928 168950907 161456382 155515087 152651799 152069150 152411914 153377827 156407143
4845 156407143 162697829 172719653 183931769 189389654 180886407 161443651 140219033
4838 140219033 122706268 109425540 99317787 91233206 84403285 78533800 73248964 68576095
$$ packed form
4893A72834571j8389116j6605339j2331767q320830n962347m203894k760697j842416
4885A02418165n10243L52716J349575K719679L956296N465450P292308R322432
4877A32366378J1042843J0882162N641359j349663o732424p839955n350623k082019
4869A36578058R20308L432615N056393N836921O678299Q828953J1616197J4525882
4861A93473626J3139787O803870p86635p412139j0287904r385636o221605m484436
4853A74838928n888021p494525n941295k863288n82649L42764R65913L029316
4845A56407143O290686J0021824J1212116N457885q503247j9442756k1224618
4838A40219033j7512765j3280728j0107753q084581o829921n869485n284836m672869
$$ plain form
4830 68576095 64442508 60613101 57482265 54671974 52327187 50198911 47946113 46133419
4822 46133419 44299065 42867761 41385418 39791940 38686194 37139018 36182350 35216957
4814 35216957 34415572 33657183 32792993 31933792 31226556 30563213 29835811 29250258 28397474
4805 28397474 27918341 27576318 27252663 26898894 26556626 26183866 25897012 25509518 25252881
4796 25252881 24942882 24645690 24604719 24621127 24517995 24520884 24338653 24180086 24169256 24052276
4786 24052276 23941278 23711186 23829882 24085925 24141500 24421253 24477666 24556421 24514364 24546607
4776 24546607 24585715 24623279 24755287 24992756 25051377 24975897 24733156 24794351 24721063 25038285
4766 25038285 25282024 25317318 25587160 26155601 26488849 26804117 26977649 27316812 27922012 28169878
$$ packed form
4830F8576095m133587l829407l130836k810291k344787k128276k252798j812694
4822D6133419j834354j431304j482343j593478j105746j547176r56668r65393
4814C5216957q01385p58389q64190q59201p07236o63343p27402n85553q52784
4805B8397474m79133l42023l23655l53769l42268l72760k86854l87494k56637
4796B5252881l09999k97192m0971J6408j03132K889j82231j58567j0830j16980
4786B4052276j10998k30092J18696K56043N5575K79753N6413P8755m2057L2243
4776B4546607L9108L7564J32008K37469N8621p5480k42741O1195p3288L17222
4766B5038285K43739L5294K69842N68441L33248L15268J73532L39163O05200K47866
$$ plain form
4756 28169878 28723896 29001224 29211188 29862578 30070992 30717900 31463331 32050063 32945415
4747 32945415 33775316 34298708 35103050 35775409 36769413 37860162 38975367 40123863 41450115
4738 41450115 42716516 44130168 45337323 46694032 48529236 50202597 51838188 53485919
4730 53485919 55530307 57841843 60432829 62998825 65915781 68975658 72318834 76167789
4722 76167789 80225020 85004240 90525355 96823321 104199612 112837207 123009171 135123392
4714 135123392 149860613 167244876 186828886 205189010 214829230 210561526 198620259
4707 198620259 187640876 181300067 179808815 181846009 185713719 189868794 195558071 203876749
4699 203876749 214067121 223801690 232634764 243536268 257469279 273352352 286534364
$$ packed form
4756B8169878N54018K77328K09964O51390K08414O46908P45431N86732Q95352
4747C2945415Q29901N23392Q04342O72359R94004J090749J115205J148496J326252
4738D1450115J266401J413652J207155J356709J835204J673361J635591J647731
4730E3485919K044388K311536K590986K565996K916956L059877L343176L848955
4722G6167789M057231M779220N521115O297966P376291Q637595J0171964J2114221
4714A35123392J4737221J7384263J9584010J8360124R640220m267704j1941267
4707A98620259j0979383o340809j491252K037194L867710M155075N689277Q318678
4699B03876749J0190372R734569Q833074J0901504J3933011J5883073J3182012
$$ plain form
4692 286534364 292838035 293888416 292406157 292035064 296637551 305319288 310011653 301747247
4684 301747247 285131142 270378364 262144065 261070325 266142522 274938938 283114171 286453446
4676 286453446 284806322 280831996 278204532 278163394 279432470 282717147 288307051 292651913
4668 292651913 289309007 276438934 258424013 239347869 223316990 211900861 204663746
4661 204663746 200106654 196626456 193646401 192418795 193972465 198452353 205966689 215626110
4653 215626110 224546825 226981782 220002536 207927492 195309334 184906102 177816455 173484554
4645 173484554 171229576 170704933 171325623 172302936 173861386 176366122 180111715 185581456
4637 185581456 192819025 201613961 211641091 222037273 230299570 235926006 239251888 240071155
$$ packed form
4692B86534364O303671J050381j482259l71093M602487Q681737M692365q264406
4684C01747247j6616105j4752778q234299j073740N072197Q796416Q175233L339275
4676B86453446j647124l974326k627464m1138J269076L284677N589904M344862
4668B92651913l342906j2870073j8014921j9076144j6030879j1416129p237115
4661B04663746m557092l480198k980055j227606J553670M479888P514336R659421
4653B15626110Q920715K434957o979246j2075044j2618158j0403232p089647m331901
4645A73484554k254978n24643O20690R77313J558450K504736L745593N469741
4637A85581456P237569Q794936J0027130J0396182Q262297N626436L325882Q19267
$$ plain form
4629 240071155 239144033 238310556 239200767 242222782 247821015 254930213 263449545 273313805
4621 273313805 284658433 296470145 306177754 311390097 311793333 308638663 303587345 298465820
4613 298465820 295032325 293697025 292977603 290549325 285772939 280797504 277844713 278352520
4605 278352520 281485084 286027714 291637317 297442020 300900718 300421337 297105156 293961608
4597 293961608 291085980 286431003 278591931 267936230 254490173 238279503 222716239
4590 222716239 210002887 200920683 194464499 190636733 188743802 187712962 187289724 187865968
4582 187865968 188795488 190005741 192028116 194455754 196043711 193904428 188440007 182262346
4574 182262346 177025302 173038208 169408394 166186464 163393792 161033743 159168294 157932261
$$ packed form
4629B40071155r27122q33477Q90211L022015N598233P109198Q519332R864260
4621B73313805J1344628J1811712R707609N212343M03236l154670n051318n121525
4613B98465820l433495j335300p19422k428278m776386m975435k952791N07807
4605B78352520L132564M542630N609603N804703L458698m79381l316181l143548
4597B93961608k875628m654977p839072j0655701j3446057j6210670j5563264
4590B22716239j2713352r082204o456184l827766j892931j030840m23238N76244
4582A87865968R29520J210253K022375K427638J587957k139283n464421o177661
4574A82262346n237044l987094l629814l221930k792672k360049j865449j236033
$$ plain form
4566 157932261 158267146 160382110 164281770 169450147 173123729 171995120 165479621 157256940
4558 157256940 150318710 145197557 142488685 141237839 141284770 142377834 144184191 147111259
4550 147111259 151148770 157093920 164708882 174646331 186451411 199705837 212257551 221240051
4542 221240051 225932838 228677098 230379133 229571615 225645813 219414795 213450297 208531419
4534 208531419 205050089 203731759 204722846 207472020 210708014 212898807 214105605 215568811
4526 215568811 218714081 222957782 226644022 228476559 226802070 220115137 208790667 195063337
4518 195063337 182252024 171737093 163946555 157926774 153331035 150241562 148953933 148673860
4510 148673860 148418826 146985480 143149752 136720903 128062570 117289017 106691323 97271733
$$ packed form
4566A57932261L34885K114964L899660N168377L673582j128609o515499q222681
4558A57256940o938230n121153k708872j250846M6931J093064J806357K927068
4550A47111259M037511N945150P614962R937449J1805080J3254426J2551714Q982500
4542B21240051M692787K744260J702035q07518l925802o231018n964498m918878
4534B08531419l481330j318330R91087K749174L235994K190793J206798J463206
4526B15568811L145270M243701L686240J832537j674489o686933j1324470j3727330
4518A95063337j2811313j0514931p790538o019781m595739l089473j287629k80073
4510A48673860k55034j433346l835728o428849q658333j0773553j0597694r419590
$$ plain form
4502 97271733 89012527 82103662 76219756 71158899 66544797 62729105 59171560 56080140
4494 56080140 53048492 50500282 48016161 46106590 44197560 42678044 40917930 39447186
4486 39447186 37989301 36651892 35608660 34350010 33393433 32546558 31335120 30276103
4478 30276103 29686977 29037613 28325886 27726351 27157719 26671682 26059091 25742491 25287925
4469 25287925 24846978 24368783 23834302 23268944 22648819 22225021 22048821 21919843 21503191
4460 21503191 21258845 20787359 20379235 20284048 20158507 19974933 19709599 19475209 19219548 19146433
4450 19146433 19029200 18961240 18909064 18753976 18889498 18917880 19029133 18646571 18458079 17952239
4440 17952239 17806129 17685387 17711171 17388167 17110800 17029543 16957213 16811297 16652063 16762126
$$ packed form
4502I7271733q259206o908865n883906n060857m614102l815692l557545l091420
4494E6080140l031648k548210k484121j909571j909030j519516j760114j470744
4486C9447186j457885j337409j043232j258650r56577q46875j211438j059017
4478C0276103n89126o49364p11727n99535n68632m86037o12591l16600m54566
4469B5287925m40947m78195n34481n65358o20125m23798j76200j28978m16652
4460B1503191k44346m71486m08124r5187j25541j83574k65334k34390k55661p3115
4450A9146433j17233o7960n2176j55088J35522K8382J11253l82562j88492n05840
4440A7952239j46110j20742K5784l23004k77367q1257p2330j45916j59234J10063
$$ plain form
4430 16762126 16816980 16750568 16538591 16195528 15990590 16028875 15890958 15527721 15179013 15149292
4420 15149292 14897955 14865340 14826991 14613167 14580608 14607099 14396536 14429723 14632059 14929300
4410 14929300 15155142 15443055 15637810 15310354 14900976 14507731 14180819 13848578 13674004
4401 13674004 13540328 13465896 13302478 13184285 13343838 13482619 13362605 13414508 13678913 13866604
4391 13866604 14020866 14136255 13939141 13700022 13524123 13539454 13329641 12946845 12649277 12435324
4381 12435324 12266135 11891129 11630925 11486905 11552139 11789202 11668798 11244385 11224817 10875781
4371 10875781 10444593 10323456 10303959 10233509 9925323 10061527 9861552 9531051 9388235 9125751
4361 9125751 8939798 8945934 8799235 8561065 8597280 8498358 8337058 8382069 8344363 8426930 8652112
$$ packed form
4430A6762126N4854o6412k11977l43063k04938L8285j37917l63237l48708k9721
4420A5149292k51337l2615l8349k13824l2559K6491k10563L3187K02336K97241
4410A4929300K25842K87913J94755l27456m09378l93245l26912l32241j74574
4401A3674004j33676p4432j63418j18193J59553J38781j20014N1903K64405J87691
4391A3866604J54262J15389j97114k39119j75899J5331k09813l82796k97568k13953
4381A2435324j69189l75006k60204j44020O5234K37063j20404m24413j9568l49036
4371A0875781m31188j21137j9497p0450l08186J36204j99975l30501j42816k62484
4361I125751j85953O136j46699k38170L6215r8922j61300M5011l7706Q2567K25182
$$ plain form
4350 8652112 8660607 8429521 8077739 8010273 7860474 7499590 7474400 7353228 7258489 7231924 7031297
4339 7031297 6960021 6981312 6950690 6932042 6681354 6713724 6756415 6794508 6781004 6739820 6703610
4328 6703610 6657220 6786789 6520629 6520363 6547079 6602066 6839552 7173822 7115485 7019656 7169987
4317 7169987 7562426 7788432 7908191 7943382 7908341 7809186 7764254 7298611 7256561 7329475 7213734
4306 7213734 7551827 7840044 7860487 8051651 8234486 8240292 8548483 8629590 8656788 8648057 8716641
4295 8716641 8485189 8210896 7917349 7770701 7632401 7683058 7632782 7653611 7716880 7902264
4285 7902264 7981492 7812085 7568302 7734675 7657850 7338970 7054642 6800761 6635905 6578581
4275 6578581 6301325 6212026 6184593 6078989 6065066 6094004 5967290 5724482 5823930 5578609
$$ packed form
4350H652112Q495k31086l51782o7466j49799l60884k5190j21172r4739k6565k00627
4339G031297p1276K1291l0622j8648k50688L2370M2691L8093j3504m1184l6210
4328F703610m6390J29569k66160k66K6716N4987K37486L34270n8337r5829J50331
4317G169987L92439K26006J19759L5191l5041r9155m4932m65643m2050P2914j15741
4306G213734L38093K88217K0443J91164J82835N806L08191Q1107K7198q731O8584
4295H716641k31452k74293k93547j46648j38300N0657n0276K0829O3269J85384
4285G902264P9228j69407k43783J66373p6825l18880k84328k53881j64856n7324
4275F578581k77256q9299k7433j05604j3923K8938j26714k42808R9448k45321
$$ plain form
4265 5578609 5550399 5338046 5207922 5067672 5190084 5076925 4983167 5016775 5161385 4972471
4255 4972471 5006410 5109449 4892223 4965800 4790086 4516488 4644363 4649392 4363976 4481157
4245 4481157 4594281 4319186 4284932 4352491 4398273 4307561 4146728 3942179 3937532 3954733 3602072
4234 3602072 3550642 3659401 3629954 3604850 3409312 3571320 3405326 3479002 3369570 3286184
4224 3286184 3226679 3352676 3210640 3225849 3275861 3280322 3342194 3327566 3358589 3279213 3364125
4213 3364125 3245142 3416473 3501309 3304815 3183049 3151955 3010805 2683389 2737062 2916503
4203 2916503 2777206 2741460 2676059 2592769 2702520 2714943 2900827 2804015 2702603 2689731 2838135
4192 2838135 2945863 2846472 2885308 2696960 2867460 2893905 3019526 2882576 3183806 3424167
$$ packed form
4265E578609k8210k12353j30124j40250J22412j13159r3758L3608J44610j88914
4255D972471L3939J03039k17226P3577j75714k73598J27875N029k85416J17181
4245D481157J13124k75095l4254O7559M5782r0712j60833k04549m647J7201l52661
4234C602072n1430J08759k9447k5104j95538J62008j65994P3676j09432q3386
4224C286184n9505J25997j42036J5209N0012M461O1872j4628L1023p9376Q4912
4213C364125j18983J71331Q4836j96494j21766l1094j41150l27416N3673J79441
4203B916503j39297l5746o5401q3290J09751J2423J85884r6812j01412j2872J48404
4192B838135J07728r9391L8836j88348J70500K6445J25621j36950L01230K40361
$$ plain form
4182 3424167 3463818 3743145 3894371 3861866 3708498 3636685 3748240 3667978 3603123 3478667
4172 3478667 3464204 3532166 3543369 3520443 3516017 3572518 3371321 3545999 3699134 3411776 3512329
4161 3512329 3436552 3747374 3598695 3716004 3754414 3713500 3713700 3754097 3979338 4110622 4303957
4150 4303957 4314568 3988493 4111002 4213034 4174742 4144393 4176181 4377125 4617807 4735138
4140 4735138 4516645 4289594 4515091 4301251 4369521 4370653 4267753 4295569 4262820 4485948
4130 4485948 4490096 4498114 4461314 4567611 4636339 4630499 4562414 4814006 4865282 5028259 5173505
4119 5173505 5219464 5336599 5544650 5588370 5847964 6075605 5995862 5859538 6314601 6549059
4109 6549059 6658942 6856412 6942098 7007358 7132254 7389959 7940657 8535326 8825220 9255325
$$ packed form
4182C424167L9651K79327J51226l2505j53368p1813J11555q0262o4855j24456
4172C478667j4463O7962J1203k2926m426N6501k01197J74678J53135k87358J00553
4161C512329p5777L10822j48679J17309L8410m0914K00M0397K25241J31284J93335
4150D303957J0611l26075J22509J02032l8292l0349L1788K00944K40682J17331
4140D735138k18493k27051K25497k13840O8270J132j02900K7816l2749K23128
4130D485948M148Q018l6800J06297O8728n840o8085K51592N1276J62977J45246
4119E173505M5959J17135K08051M3720K59594K27641p9743j36324M55063K34458
4109F549059J09883J97470Q5686O5260J24896K57705N50698N94669K89894M30105
$$ plain form
4099 9255325 9663362 10114913 10098991 9563968 9182011 9039286 8566910 8366650 8400051 8513093
4089 8513093 8344282 8231089 8424606 8496507 8737822 8873375 9083899 9375354 9823982 10107055
4079 10107055 10279478 10687176 11042828 11358217 11726814 12052742 12513744 12898479 13403047
4070 13403047 13474994 13886952 14428604 15053232 15445276 15898905 16818379 17645707 18495609 19472972
4060 19472972 20614105 21769643 22904911 24017542 25627369 27426083 29553053 32269022
4052 32269022 34989176 38398389 42853695 47937698 53496755 60294877 67791735 74906692
4044 74906692 76731528 73067305 67969735 64065036 62250079 62009013 63360287 65474581
4036 65474581 67686064 70245622 72911663 75316286 77629765 80521702 84257639 87774640
$$ packed form
4099I255325M08037M51551j5922n35023l81957j42725m72376k00260L3401J13042
4089H513093j68811j13193J93517P1901K41315J35553K10524K91455M48628K83073
4079A0107055J72423M07698L55652L15389L68597L25928M61002L84735N04568
4070A3403047P1947M11958N41652O24628L92044M53629R19474Q27328Q49902R77363
4060A9472972J141133J155538J135268J112631J609827J798714K126970K715969
4052C2269022K720154L409213M455306N084003N559057O798122P496858P114957
4044G4906692J824836l664223n097570l904699j814957k41066J351274K114294
4036F5474581K211483K559558K666041K404623K313479K891937L735937L517001
$$ plain form
4028 87774640 89005472 86269761 81844777 77520464 73706834 70123059 66863893 63839895
4020 63839895 61454632 59391888 58527260 58784791 60372896 63138892 66657851 69210729
4012 69210729 67322369 60760371 52795592 45969321 40671580 36728091 33691433 31112813
4004 31112813 28974169 27040923 25369186 23947459 22630008 21610519 20441604 19665781
3996 19665781 18805245 18056599 17313801 16744129 16203226 15780552 15286134 14772225 14416567
3987 14416567 13895689 13508447 13309026 13063971 12847695 12332846 11904265 11615267 11382516
3978 11382516 11087965 10681977 10634519 10454622 10341448 9960278 9776228 9501909 9253353 9070825
3968 9070825 8874008 8843450 8759480 8597678 8418552 8310878 8232848 8216815 8266584 8256276 8154885
$$ packed form
4028H7774640J230832k735711m424984m324313l813630l583775l259166l023998
4020F3839895k385263k062744q64628K57531J588105K765996L518959K552878
4012F9210729j888360o561998p964779o826271n297741l943489l036658k578620
4004C1112813k138644j933246j671737j421727j317451j019489j168915p75823
3996A9665781q60536p48646p42798n69672n40903m22674m94418n13909l55658
3987A4416567n20878l87242j99421k45055k16276n14849m28581k88998k32751
3978A1382516k94551m05988m7458j79897j13174l81170j84050k74319k48556j82528
3968I070825j96817l0558q3970j61802j79126j07674p8030j6033M9769j0308j01391
$$ plain form
3957 8154885 8055409 8245786 8454979 8619601 8673232 8676837 8843966 9058526 9388572 9922058
3947 9922058 10338609 10507516 10514585 10460075 10317666 10204228 9973399 10166823 10093139 10022195
3937 10022195 10316195 10417010 10695633 11061131 11283415 11263744 11252270 11269390 11502187 11498449
3927 11498449 11425845 11404469 11226765 11320077 11030589 10945044 10915755 10866976 10938818 10948121 11369869
3916 11369869 11931980 12460805 12840777 13412203 13866818 14126215 14379983 14643634 14670009 14441087
3906 14441087 14019465 13865416 13519954 13132105 12757036 13040916 13065508 13368141 13680214 14042607
3896 14042607 14730436 15244118 15739980 15899449 16413445 16559477 16622516 16379369 15884666 15320903
3886 15320903 14598000 13806793 13497259 12923221 12756219 12673054 12894120 13108501 13201341 13358082
$$ packed form
3957H154885r9476J90377K09193J64622N3631L605J67129K14560L30046N33486
3947I922058M16551J68907P069n4510j42409j13438k30829J93424p3684p0944
3937A0022195K94000J00815K78623L65498K22284j9671j1474J7120K32797l738
3927A1498449p2604k1376j77704R3312k89488q5545k9289m8779P1842R303M21748
3916A1369869N62111N28825L79972N71426M54615K59397K53768K63651K6375k28922
3906A4441087m21622j54049l45462l87849l75069K83880K4592L02633L12073L62393
3896A4042607O87829N13682M95862J59469N13996J46032O3039k43147m94703n63763
3886A5320903p22903p91207l09534n74038j67002q3165K21066K14381R2840J56741
$$ plain form
3876 13358082 13459254 13297564 13023772 12862938 12368246 11937295 11524854 11337771 11158607
3867 11158607 11141233 11091067 10963080 10786147 10787087 11071172 11247861 11637592 11887749 12124218
3857 12124218 12472981 12323062 11681716 11063925 10504649 9895464 9621529 9609395 9380784 9201967
3847 9201967 8971168 8847239 8848638 8566909 8558301 8665346 8836439 8497984 8570643 8501348 8500139
3836 8500139 8497716 8391210 8335052 8117067 8089326 8155699 8112804 8001247 8062398 8187998 8258944
3825 8258944 8299920 8332703 8482369 8231097 8271575 8286095 8405868 8530639 8348892 8616658
3815 8616658 8701700 8654833 8716300 8673844 8778535 9093579 9239700 9257140 9319273 9766434 10193636
3804 10193636 10369535 10820010 11256677 11986968 12453926 12906830 13334992 13250650 13345369 13303720
$$ packed form
3876A3358082J01172j61690k73792j60834m94692m30951m12441j87083j79164
3867A1158607j7374n0166j27987j76933R40K84085J76689L89731K50157K36469
3857A2124218L48763j49919o41346o17791n59276o09185k73935j2134k28611j78817
3847I201967k30799j23929J399k81729q608J07045J71093l38455P2659o9295j209
3836H500139k423j06506n6158k17985k7741O6373m2895j11557O1151J25600P0946
3825H258944M0976L2783J49666k51272M0478J4520J19773J24771j81747K67766
3815H616658Q5042m6867O1467m2456J04691L15044J46121J7440O2133M47161M27202
3804A0193636J75899M50475M36667P30291M66958M52904M28162q4342R4719m1649
$$ plain form
3794 13303720 13098522 12956565 13085102 13138536 13376883 13760081 14297796 14839608 15637055 16093437
3784 16093437 16446350 16935821 17200044 17250152 16953534 16388784 15952648 15569891 15126138 14890624
3774 14890624 14611958 14261399 14187765 14474650 14643558 14963312 15348353 15409076 15574692 15536708
3764 15536708 15601052 15408806 15053688 14802932 14323508 13981810 13643989 13380583 13016954 12926934
3754 12926934 12825698 12473947 12292498 12417888 12398376 12591453 12690737 12326703 12237297 12192138
3744 12192138 12141529 11922367 11654021 11501334 11437459 11136560 10898316 10696471 10467454 10230926
3734 10230926 9955112 9728747 9578893 9524077 9866987 9887107 9670707 9393777 9210872 8851171
3724 8851171 8286143 8046395 7859268 7400375 6911115 6959149 6630126 6653701 6574718 6381268
$$ packed form
3794A3303720k05198j41957J28537N3434K38347L83198N37715N41812P97447M56382
3784A6093437L52913M89471K64223N0108k96618n64750m36136l82757m43753k35514
3774A4890624k78666l50559p3634K86885J68908L19754L85041O0723J65616l7984
3764A5536708O4344j92246l55118k50756m79424l41698l37821k63406l63629r0020
3754A2926934j01236l51751j81449J25390j9512J93077R9284l64034q9406m5159
3744A2192138n0609k19162k68346j52687o3875l00899k38244k01845k29017k36528
3734A0230926k75814k26365j49854n4816L42910K0120k16400k76930j82905l59701
3724H851171n65028k39748j87127m58893m89260M8034l29023K3575p8983j93450
$$ plain form
3714 6381268 6530612 6265984 6205361 6102470 6072528 5922739 5859953 5671448 5707462 5727156
3704 5727156 5678892 5700974 5609249 5522580 5487446 5453128 5330279 5301453 5256691 5189591 5221101
3693 5221101 5382192 5134694 5090278 4966745 5222852 5127499 5084201 5018252 4720734 4863113
3683 4863113 4877056 4858576 5014041 4992449 4852559 4783086 4974946 4803161 4805819 4830711 4756128
3672 4756128 4714655 4454720 4704117 4700505 4681333 4706375 4653651 4703246 4647511 4745796 4574049
3661 4574049 4402275 4465920 4358574 4423048 4536807 4443842 4502994 4554926 4482929 4545471 4327777
3650 4327777 4300951 4423331 4443104 4295347 4353465 4450730 4352357 4337297 4455741 4470920 4387337
3639 4387337 4183096 4237488 4539911 4357594 4382464 4474812 4249718 4282653 4327143 4422182 4288405
$$ packed form
3714F381268J49344k64628o0623j02891k9942j49789o2786j88505L6014J9694
3704E727156m8264K2082r1725q6669l5134l4318j22849k8826m4762o7100L1510
3693E221101J61091k47498m4416j23533K56107r5353m3298o5949k97518J42379
3683D863113J3943j8480J55465k1592j39890o9473J91860j71785K658K4892p4583
3672D756128m1473k59935K49397l612j9172K5042n2724M9595n5735R8285j71747
3661D574049j71774O3645j07346O4474J13759r2965N9152N1932p1997O2542k17694
3650D327777k6826J22380J9773j47757N8118R7265r8373j5060J18444J5179q3583
3639D387337k04241N4392L02423j82317K4870R2348k25094L2935M4490R5039j33777
$$ plain form
3628 4288405 4211889 4251639 4248664 4313337 4155002 4252993 4333324 4182650 4130624 4269794 4325093
3617 4325093 4307965 4257592 4178866 4186087 4265869 4163487 4212513 4344531 4283954 4315434 4167232
3606 4167232 4115926 4137283 3958278 4010975 4053421 4020680 3866521 3941690 3885186 3973033 4032095
3595 4032095 3890271 3922427 3888045 3820637 3953279 3934806 3862518 3996313 3798736 3724292 3807944
3584 3807944 3891087 3866360 3833973 3999591 3922538 4088477 3901503 3661920 3613419 3697007 3924953
3573 3924953 3889323 3685465 3520881 3636626 3714039 3643691 3750758 3644636 3483995 3545311
3563 3545311 3447351 3661173 3662450 3439799 3639159 3722187 3570263 3668034 3668784 3596574 3620351
3552 3620351 3628564 3526988 3393448 3665951 3970586 3837448 3844332 3841433 3771714 3833689 3643768
$$ packed form
3628D288405p6516L9750k975O4673j58335R7991Q0331j50674n2026J39170N5299
3617D325093j7128n0373p8726P221P9782j02382M9026J32018o0577L1480j48202
3606D167232n1306K1357j79005N2697M2446l2741j54159P5169n6504Q7847N9062
3595D032095j41824L2156l4382o7408J32642j8473p2288J33795j97577p4444Q3652
3584C807944Q3143k4727l2387J65618p7053J65939j86974k39583m8501Q3588K27946
3573C924953l5630k03858j64584J15745P7413p0348J07067j06122j60641O1316
3563C545311r7960K13822J277k22651J99360Q3028j51924R7771P50p2210K3777
3552C620351Q213j01576j33540K72503L04635j33138O884k899o9719O1975j89921
$$ plain form
3541 3643768 3603156 3777002 3627095 3583476 3500356 3421677 3486236 3616280 3688130 3617323 3744072
3530 3744072 3641791 3762131 3632541 3623487 3689125 3690969 3762576 3488678 3580736 3597733 3724441
3519 3724441 3757353 3606890 3689189 3900519 3797365 3927549 3748335 3811893 3821403 3864059 3851282
3508 3851282 4080754 4172672 4199446 4136782 4226629 4356203 4384800 4672062 4864525 5126894
3498 5126894 5356078 5335366 4983540 4831054 4517280 4265022 4317001 4233176 4142073 4037852
3488 4037852 3998954 3821225 3865491 3674622 3675165 3797398 3779249 3519142 3536509 3487411 3574811
3477 3574811 3604274 3622489 3574830 3488283 3510303 3449980 3591452 3399953 3368015 3481522 3406111
3466 3406111 3427299 3381819 3339204 3412724 3251596 3277673 3329117 3342294 3153126 3256974 3041898
$$ packed form
3541C643768m0612J73846j49907m3619q3120p8679O4559J30044P1850p0807J26749
3530C744072j02281J20340j29590r054O5638J844P1607k73898R2058J6997J26708
3519C724441L2912j50463Q2299K11330j03154J30184j79214O3558R510M2656j2777
3508C851282K29472R1918K6774o2664Q9847J29574K8597K87262J92463K62369
3498E126894K29184k0712l51826j52486l13774k52258N1979q3825r1103j04221
3488D037852l8898j77729M4266j90869N43J22233j8149k60107J7367m9098Q7400
3477C574811K9463J8215m7659q6547K2020o0323J41472j91499l1938J13507p5411
3466C406111K1188m5480m2615P3520j61128K6077N1444J3177j89168J03848k15076
$$ plain form
3455 3041898 2965971 2897081 3184317 3383300 3352603 3168807 3173765 3247384 3276226 3109356 3150822
3444 3150822 2812735 3033395 3152331 3154008 2927276 2821345 2882523 2906057 2751912 2765254
3434 2765254 2688209 2657825 2665333 2636167 2807901 2496860 2556807 2720928 2699577 2665147 2615740
3423 2615740 2462837 2452375 2522296 2637855 2549068 2407681 2387478 2157835 2141786 2168183 2276206
3412 2276206 2225338 2159513 2065342 2158446 2166530 2053079 2148902 2278265 2250220 2163514 2052271
3401 2052271 2094286 1996662 1915101 2121972 1963297 1932958 1922498 1821169 1744373 1880067 1883454
3390 1883454 1937434 1866176 1876484 1760939 1811611 1830362 1812497 1814993 1885905 1821137 1767505
3379 1767505 1764786 1956079 1837658 1982631 1673088 1586801 1718530 1888916 1764560 1749054
$$ packed form
3455C041898p5927o8890K87236J98983l0697j83796M958P3619K8842j66870M1466
3444C150822l38087K20660J18936J677k26732j05931O1178K3534j54145J3342
3434B765254p7045l0384P508k9166J71734l11041N9947J64121k1351l4430m9407
3423B615740j52903j0462O9921J15559q8787j41387k0203k29643j6049K6397J08023
3412B276206n0868o5825r4171R3104Q084j13451R5823J29363k8045q6706j11243
3401B052271M2015r7624q1561K06871j58675l0339j0460j01329p6796J35694L387
3390A883454N3980p1258J0308j15545N0672J8751j7865K496P0912o4768n3632
3379A767505k719J91293j18421J44973l09543q6287J31729J70386j24356j5506
$$ plain form
3369 1749054 1618379 1645745 1881183 1764533 1907065 1758873 1774872 2027270 1875005 1661193
3359 1661193 1756811 1848659 2045350 1737328 1711672 1866998 1858523 1847330 1860269 1680581 1726638
3348 1726638 1782545 1785396 1744095 1784553 1868914 1832623 2010549 2001986 1834871 2108390 2117841
3337 2117841 2070906 2117932 2022365 2123812 2050414 2153076 2260053 2343434 2387729 2422837 2657206
3326 2657206 2710939 2686142 2796445 2980340 2935011 2778193 2947721 2809475 2803627 2899166 2778045
3315 2778045 2812513 2679505 2677449 2729309 2645015 2468249 2395955 2389109 2522882 2363274 2352970
3304 2352970 2409580 2354616 2304579 2300372 2316326 2232764 2192926 2241776 2083023 1922249 2072604
3293 2072604 2066249 2199011 2057455 2108475 2224886 2144799 2213629 2283716 2190625 2308993 2258760
$$ packed form
3369A749054j30675K7366K35438j16650J42532j48192J5999K52398j52265k13812
3359A661193R5618R1848J96691l08022k5656J55326q475j1193J2939j79688M6057
3348A726638N5907K851m1301M0458Q4361l6291J77926q563j67115K73519R451
3337B117841m6935M7026r5567J01447p3398J02662J06977Q3381M4295L5108K34369
3326B657206N3733k4797J10303J83895m5329j56818J69528j38246n848R5539j21121
3315B778045L4468j33008k056N1860q4294j76766p2294o846J33773j59608j0304
3304B352970N6610n4964n0037m207J5954q3562l9838M8850j58753j60774J50355
3293B072604o355J32762j41556N1020J16411q0087O8830P0087r3091J18368n0233
$$ plain form
3282 2258760 2315753 2355816 2288201 2379402 2198526 1942769 2357334 2367285 2372708 2469970 2513846
3271 2513846 2420901 2396446 2476245 2712977 2799420 2681952 2691507 2785906 2844244 2726745 2872068
3260 2872068 2940808 3152727 3022339 2989838 3120152 3475770 3161557 3155716 3374672 3117800
3250 3117800 3203425 3263762 3306286 3368789 3380557 3237511 3340508 3385553 3534409 3488437 3441763
3239 3441763 3813062 3853887 3758294 3903611 3918088 3944322 4162418 4198589 4358036 4535294
3229 4535294 4433057 4522659 4597688 4546618 4344787 4200791 4224900 4344256 4483355 4479585 4575647
3218 4575647 4447461 4477303 4526360 4762213 4618508 4455090 4329943 4067380 4005268 4130992
3208 4130992 4036125 3867775 3913663 3702332 3575157 3585714 3507829 3615833 3441541 3502795
$$ packed form
3282B258760N6993M0063o7615R1201j80876k55757M14565R951N423R7262M3876
3271B513846r2945k4455P9799K36732Q6443j17468R555R4399N8338j17499J45323
3260B872068O8740K11919j30388l2501J30314L55618l14213n841K18956k56872
3250C117800Q5625O0337M2524O2503J1768j43046J02997M5045J48856m5972m6674
3239C441763L71299M0825r5593J45317J4477K6234K18096L6171J59447J77258
3229D535294j02237Q9602P5029n1070k01831j43996K4109J19356J39099l770R6062
3218D575647j28186K9842M9057K35853j43705j63418j25147k62563o2112J25724
3208D130992r4867j68350M5888k11331j27175J0557p7885J08004j74292O1254
$$ plain form
3198 3502795 3487812 3500558 3684957 3520879 3439036 3422460 3404148 3613795 3726855 3494468
3188 3494468 3489836 3547516 3496575 3439067 3485908 3721215 3828527 3844838 3678801 3563640 3598529
3177 3598529 3569349 3663838 3705888 3656125 3682290 3680091 3651279 3605584 3616479 3746779 3639953
3166 3639953 3512191 3409539 3622570 3710816 3758824 3907813 3894813 3683386 3861099 3782531
3156 3782531 3570698 3512529 3543162 3583793 3463670 3438790 3396960 3292224 3278951 3218792 3327241
3145 3327241 3415153 3356357 3095670 2988037 3165130 3047580 3046282 3082629 3106793 3076271 3287249
3134 3287249 3188548 3495778 3247275 3086799 3230274 3189472 3134045 3268038 3228869 3368943
3124 3368943 3405444 3315554 3565568 3853180 3781458 3956885 4156690 4063449 3995786 4197058
$$ packed form
3198C502795j4983J2746J84399j64078q1843j6576j8312K09647J13060k32387
3188C494468m632N7680n0941n7508M6841K35307J07312J6311j66037j15161L4889
3177C598529k9180R4489M2050m9763K6165k199k8812m5695J0895J30300j06826
3166C639953j27762j02652K13031Q8246M8008J48989j3000k11427J77713p8568
3156C782531k11833n8169L0633M0631j20123k4880m1830j04736j3273o0159J08449
3145C327241Q7912n8796k60687j07633J77093j17550j298L6347K4164l0522K10978
3134C287249r8701L07230k48503j60476J43475m0802n5427J33993l9169J40074
3124C368943L6501q9890K50014K87612p1722J75427J99805r3241o7663K01272
$$ plain form
3114 4197058 4537922 4500957 4715435 4854088 4901196 5268739 5281000 5386506 5760233 5925730
3104 5925730 6107690 6451504 6777276 7161599 7566932 7976220 8660759 9266777 9998644 10971443
3094 10971443 12142806 13343554 15063298 17205004 19981915 22983202 26411860 29588886
3086 29588886 29069482 25460532 21517266 18257312 16237264 14681363 13795262 13002590 12541138
3077 12541138 11977912 11766192 11476768 11504786 11676419 12020847 12438760 12929965 13836764 14779791
3067 14779791 16286449 18340837 20624699 23810716 27266740 29149570 27224096 22882852
3059 22882852 19144827 16271313 14006450 12585783 11506741 10625020 9961933 9351394 8934324
3050 8934324 8450354 7826465 7442708 7038277 7009347 6867862 6644398 6530336 6355365 6184147
$$ packed form
3114D197058L40864l6965K14478J38653M7108L67543J2261J05506L73727J65497
3104E925730J81960L43814L25772L84323M05333M09288O84539O06018P31867R72799
3094A0971443J171363J200748J719744K141706K776911L001287L428658L177026
3086B9588886n19404l608950l943266l259954k020048j555901q86101p92672m61452
3077A2541138n63226k11720k89424K8018J71633L44428M17913M91205R06799R43027
3067A4779791J506658K054388K283862L186017L456024J882830j925474m341244
3059B2882852l738025k873514k264863j420667j079042q81721o63087o10539m17070
3050H934324m83970o23889l83757m04431k8930j41485k23464j14062j74971j71218
$$ plain form
3040 6184147 6154854 6023371 5918612 6221284 6154650 6209746 6121546 6061850 6070734 6204422 6209028
3029 6209028 6252003 6549058 6866536 7203201 7364321 7610195 7804016 8156200 8544234 9312972
3019 9312972 10180323 10948439 12334452 13660738 14774415 14492423 13092608 11655103 10537326
3010 10537326 9981101 9648059 9422308 9385494 9523349 9583314 9560126 9836625 10257866 10605594
3000 10605594 11091659 11551810 11831044 12614800 13727942 15032458 16436645 18645890 21316182
2991 21316182 23518085 23219442 20374649 17314485 15255069 13575584 12447453 11726740
2983 11726740 11123826 10773340 10284547 9883757 9563031 9699728 9876405 9906893 9899340 9972495
2973 9972495 10311108 10666769 11441087 12158173 13068787 14043006 15323540 15486501 14386481
$$ packed form
3040F184147k9293j31483j04759L02672o6634N5096q8200n9696Q884J33688M606
3029F209028M2975K97055L17478L36665J61120K45874J93821L52184L88034P68738
3019I312972Q67351P68116J386013J326286J113677k81992j399815j437505j117777
3010A0537326n56225l33042k25751l6814J37855N9965k3188K76499M21241L47728
3000A0605594M86065M60151K79234P83756J113142J304516J404187K209245K670292
2991B1316182K201903k98643k844793l060164k059416j679485j128131p20713
2983A1726740o02914l50486m88793m00790l20726J36697J76677L0488p553P3155
2973I972495L38613L55661P74318P17086R10614R74219J280534J62961j100020
$$ plain form
2964 14386481 12827159 11539068 10772374 10347298 9982684 9546484 9283946 9079053 8620039
2955 8620039 8379373 8496578 8447405 8448898 8220772 8385278 8523697 8627214 8710593 8744305
2945 8744305 8933919 9148767 9291650 9248775 9440177 9646408 9788493 10159952 10617581 10980389
2935 10980389 11453541 12045132 12331860 12875033 13349615 13795232 14270703 14945754 15785307
2926 15785307 16728740 17239988 17580820 17769069 17508162 16827071 16015986 15072233 13960130
2917 13960130 13102135 12279252 11351760 10899460 10371054 9938889 9643346 9404151 9089761
2908 9089761 8666735 8224878 7784471 7539596 7236970 6974551 6741614 6540182 6473778 6500607
2898 6500607 6205486 5904863 6026858 5651491 5345872 5300568 5267011 4985695 4494872 4518387
$$ packed form
2964A4386481j559322j288091p66694m25076l64614m36200k62538k04893m59014
2955H620039k40666J17205m9173J493k28126J64506J38419J03517Q3379L3712
2945H744305J89614K14848J42883m2875J91402K06231J42085L71459M57629L62808
2935A0980389M73152N91591K86728N43173M74582M45617M75471O75051Q39553
2926A5785307R43433N11248L40832J88249k60907o81091q11085r43753j112103
2917A3960130q57995q22883r27492m52300n28406m32165k95543k39195l14390
2908I089761m23026m41857m40407k44875l02626k62419k32937k01432o6404K6829
2898F500607k95121l00623J21995l75367l05619m5304l3557k81316m90823K3515
$$ plain form
2888 4518387 4537184 4512930 4288706 4141866 4146518 4161296 3846937 3869495 3690864 3678532 3699024
2877 3699024 3569816 3456469 3192708 3110432 3052154 3070496 3160000 2891631 2892893 2890948 3028023
2866 3028023 2827170 2724975 2818157 2675828 2872711 2510342 2433566 2323723 2378794 2385911
2856 2385911 2316011 2299046 2255901 2230284 1973782 1906786 1854185 1713074 1932268 2151055 1962956
2845 1962956 1741867 1701883 1900340 2012155 1981847 1950340 1910366 1986373 1903108 1777184 1845867
2834 1845867 1740661 1807970 1830984 1719422 1445011 1362859 1535624 1581073 1633106 1604940 1720579
2823 1720579 1787857 1817836 1708017 1663947 1535748 1565100 1421960 1461308 1560913 1242617 1263290
2812 1263290 1365708 1162206 1325911 1273618 1360077 1296422 1242907 1264819 997917 1153985
$$ packed form
2888D518387J8797k4254k24224j46840M652J4778l14359K2558j78631j2332K0492
2877C699024j29208j13347k63761q2276n8278J8342Q9504k68369J262j945J37075
2866C028023k00853j02195R3182j42329J96883l62369p6776j09843N5071P117
2856B385911o9900j6965m3145k5617k56502o6996n2601j41111K19194K18787j88099
2845A962956k21089l9984J98457J11815l0308l1507l9974P6007q3265j25924O8683
2834A845867j05206O7309K3014j11562k74411q2152J72765M5449N2033k8166J15639
2823A720579O7278K9979j09819m4070j28199K9352j43140L9348R9605l18296K0673
2812A263290J02418k03502J63705n2293Q6459o3655n3515K1912k66902J56068
$$ plain form
2802 1153985 1150112 1138618 1214005 988625 1181830 1306263 1250582 1353263 1297195 1241886 1169348
2791 1169348 1151078 1158317 1134413 1148169 1148762 1111195 1149751 1236173 1032566 1013959 1096081 1100992
2779 1100992 1213076 1151349 1337091 1255413 1220325 1060837 1198134 1166263 1117721 1272383
2769 1272383 1414978 1258303 1235928 1186477 1272977 1412486 1449533 1604597 1451630 1339530
2759 1339530 1412701 1515398 1664064 1547493 1530516 1627322 1482477 1633469 1664378 1885295
2749 1885295 1977076 2001471 1993981 2161739 2385249 2348234 2568457 2763092 2852593 3256860 3821419
2738 3821419 4484058 4941900 5070787 4686700 4198271 3478393 3254895 3029841 2831263 2855606
2728 2855606 2750442 2897088 2820518 2873426 2906750 2946068 3073842 2925528 3208230 3725245
$$ packed form
2802A153985l873j1494P5387k25380J93205J24433n5681J02681n6068n5309p2538
2791A169348j8270P239k3904J3756N93l7567L8556Q6422k03607j8607Q2122M911
2779A100992J12084o1727J85742q1678l5088j59488J37297l1871m8542J54662
2769A272383J42595j56675k2375m9451Q6500J39509L7047J55064j52967j12100
2759A339530P3171J02697J48666j16571j6977R6806j44845J50992L0909K20917
2749A885295R1781K4395p490J67758K23510l7015K20223J94635Q9501M04267N64559
2738C821419O62639M57842J28887l84087m88429p19878k23498k25054j98578K4343
2728B855606j05164J46646p6570N2908L3324L9318J27774j48314K82702N17015
$$ plain form
2718 3725245 4163160 4422776 4751198 5214008 4993194 4366117 3768884 3342245 3143319 3127335
2708 3127335 2953878 2762282 2653981 2474332 2632333 2680656 2641912 2649846 2642726 2489728 2370670
2697 2370670 2374989 2368202 2306447 2508127 2593441 2639108 2779360 2749165 2695605 2755674 2636883
2686 2636883 2690633 2996765 2895779 2998027 2989376 2939397 2873053 2954089 2847817 3117860 3032877
2675 3032877 3061066 3121624 3474089 3403554 3292372 3539956 3719390 3801654 3696139 3846106
2665 3846106 3667890 3466658 3438961 3299334 3165675 3327614 3461279 3205558 3150630 3270771
2655 3270771 3357797 3264525 3255970 3488694 3528844 3473570 3422216 3503739 3513122 3662359 3650449
2644 3650449 3583396 3350864 3200274 2995859 2744220 2842481 2731672 2660566 2616536 2632189
$$ packed form
2718C725245M37915K59616L28422M62810k20814o27077n97233m26639j98926j5984
2708C127335j73457j91596j08301j79649J58001M8323l8744P934p120j52998j19058
2697B370670M319o787o1755K01680Q5314M5667J40252l0195n3560O0069j18791
2686B636883N3750L06132j00986J02248q651m9979o6344Q1036j06272K70043q4983
2675C032877K8189O0558L52465p0535j11182K47584J79434Q2264j05515J49967
2665C846106j78216k01232k7697j39627j33659J61939J33665k55721n4928J20141
2655C270771Q7026r3272q555K32724M0150n5274n1354Q1523R383J49237j1910
2644C650449o7053k32532j50590k04415k51639R8261j10809p1106m4030J5653
$$ plain form
2634 2632189 2693777 2582197 2636683 2504536 2325401 2295739 2187755 2280006 2194657 2053044
2624 2053044 1949519 1642890 1754183 1723543 1548231 1631341 1502524 1232284 1178789 1304397
2614 1304397 1194813 1228588 1221037 1047624 1092450 950720 911445 1027749 866884 889897 732858
2603 732858 779268 852592 648922 409855 461433 603586 647374 448275 447475 487440 478826
2592 478826 442899 250077 379037 352511 602999 563369 364253 344872 293903 261220 230835
2581 230835 287702 275132 153306 337331 363500 349204 296551 292411 400857 249091 132788
2570 132788 142312 164589 50110 107469 188110 195900 260617 105837 254016 114959 263796
2559 263796 228563 43637 98033 290599 148468 133609 196470 28219 144125 -21698
$$ packed form
2634B632189O1588j11580N4486j32147j79135k9662j07984R2251q5349j41613
2624B053044j03525l06629J11293l0640j75312Q3110j28817k70240n3495J25608
2614A304397j09584L3775p551j73413M4826j41730l9275J16304j60865K3013j57039
2603G32858M6410P3324k03670k39067N1578J42153M3788j99099q00L9965q614
2592D78826l5927j92822J28960k6526K50488l9630j99116j9381n0969l2683l0385
2581B30835N6867j2570j21826J84025K6169j4296n2653m140J08446j51766j16303
2570A32788R524K2277j14479N7359Q0641P790O4717j54780J48179j39057J48837
2559B63796l5233j84926N4396J92566j42131j4859O2861j68251J15906j65823
$$ plain form
2549 -21698 -184963 32555 136395 199065 -43218 -199783 -77581 2851 -47944 -15052 171895
2538 171895 2419 -44776 50861 13750 -66643 -112610 -172335 -198855 39029 71844 -18145
2527 -18145 80377 -63985 -125945 -144556 -199156 24451 -16948 -188597 -241920 -78252 -180483
2516 -180483 -232058 -245194 -248842 -103004 -94298 -33475 -120891 -212650 -256007 -298900 -285504 -130483
2504 -130483 -243146 -178945 -166425 -100828 -134400 -163821 -214097 -60604 -233811 -284414 -72347
2493 -72347 -156993 -209223 -41926 -201599 -152155 -92 -150386 -299726 -192644 -87738
2483 -87738 34709 -32631 -141099 -106992 -168290 -176659 -267448 -264603 -252907 -239199 -198209 -10754
2471 -10754 -129504 -294290 -251724 15489 -193106 -318298 -215955 -132544 -95178 -188977 -63909
$$ packed form
2549b1698j63265K17518J03840O2670k42283j56565J22202Q0432n0795L2892J86947
2538A71895j69476m7195R5637l7111q0393m5967n9725k6520K37884L2815q9989
2527a8145R8522j44362o1960j8611n4600K23607m1399j71649n3323J63668j02231
2516a80483n1575j3136l648J45838Q706O0823q7416r1759m3357m2893J3396J55021
2504a30483j12663O4201J2520O5597l3572k9421n0276J53493j73207n0603K12067
2493g2347q4646n2230J67297j59673M9444J52063j50294j49340J07082J04906
2483h7738J22447o7340j08468L4107o1298q369r0789K845J1696J3708M0990J87455
2471a0754j18750j64786M2566K67213k08595j25192J02343Q3411L7366r3799J25068
$$ plain form
2460 -63909 -96593 -169335 -115768 -5676 86561 -71541 -210622 -103090 -6501 -12118 -21893
2449 -21893 -253096 -354513 -192241 -18018 -233390 -304979 -338717 -123065 17168 -44371
2439 -44371 -75676 -257499 -304368 -264262 -127100 -88205 -46775 -271181 -157669 -69292 -176298
2428 -176298 -141323 -90757 -240063 -259462 32230 -129783 -275509 -309862 -380230 -356015 -223724
2417 -223724 -239101 -96887 77930 -132076 -142565 -150990 -91116 -197627 -304597 -325637 -167295
2406 -167295 -335588 -321520 -156285 -41331 -102331 -253068 -308366 -225424 -160342 -152465 -132779
2395 -132779 -274642 -211620 -118055 -136380 -85112 -165470 -184067 -84420 -144033 -128663 -231883
2384 -231883 -37352 -230018 -180131 -141025 -312475 -289887 -296307 -145216 -274191 -351175 -357592
$$ packed form
2460f3909l2684p2742N3567J10092R2237j58102j39081J07532R6589n617r775
2449b1893k31203j01417J62272J74223k15372p1589l3738K15652J40233o1539
2439d4371l1305j81823m6869M0106J37162L8895M1430k24406J13512Q8377j07006
2428a76298L4975N0566j49306j9399K91692j62013j45726l4353p0368K4215J32291
2417b23724j5377J42214J74817k10006j0489q425N9874j06511j06970k1040J58342
2406a67295j68293J4068J65235J14954o1000j50737n5298Q2942O5082P877J9686
2395a32779j41863O3022R3565j8325N1268q0358j8597R9647n9613J5370j03220
2384b31883J94531j92666M9887L9106j71450K2588o420J51091j28975p6984o417
$$ plain form
2373 -357592 -275001 -244894 -314919 -395175 -256553 -262424 -98914 -109926 -156395 -278579 -225002
2362 -225002 -124204 -251195 -218960 -396748 -345863 -313008 -389133 -278218 -402995 -506235
2352 -506235 -318068 -166340 -259728 -235280 -198063 -309845 -153998 -152515 -428044 -286481 -45634
2341 -45634 -118986 -376216 -219604 -248687 -341337 -374922 -295922 -246402 -394800 -244869 -142953
2330 -142953 -312583 -227884 -291234 -353241 -191429 -342595 -195317 -314403 -274297 -366289 -227612
2319 -227612 -219928 -337020 -207783 -255316 -132715 -133134 -173334 -277093 -342680 -213026 -273485
2308 -273485 -406435 -451430 -200360 -187692 -157013 -420942 -433808 -272633 -265809 -321423 -255380
2297 -255380 -160824 -217695 -411011 -428743 -318513 -226914 -210224 -131315 -359817 -547351 -256660
$$ packed form
2373c57592Q2591L0107p0025q0256J38622n871J63510j1012m6469j22184N3577
2362b25002J00798j26991L2235j77788N0885L2855p6125J10915j24777j03240
2352e06235J88167J51728r3388K4448L7217j11782J55847J483k75529J41563K40847
2341d5634p3352k57230J56612k9083r2650l3585P9000M9520j48398J49931J01916
2330a42953j69630Q4699o3350o2007J61812j51166J47278j19086M0106r1992J38677
2319b27612P684j17092J29237m7533J22601m19m0200j03759o5587J29654o0459
2308b73485j32950m4995K51070J2668L0679k63929j2866J61175O824n5614O6043
2297b55380R4556n6871j93316j7732J10230R1599J6690P8909k28502j87534K90691
$$ plain form
2286 -256660 -94382 -179390 -119685 -176622 -449018 -96152 -24115 -226198 -146273 -93236 -98287
2275 -98287 -191795 -351544 -269171 -9426 -152787 -81068 37410 -70324 36886 72096 -144675
2264 -144675 -213762 -170629 -308312 -208432 -231124 -254514 -71334 145579 -55547 -129623 -70320
2253 -70320 -183939 -77228 -144540 -285915 -232423 -16660 56248 -96255 -28368 -210489 -358366
2242 -358366 -276497 -320565 -78377 -186550 -244033 5162 -264281 -399693 -241147 -80048
2232 -80048 -30334 -195281 -50737 -80074 -77440 6842 72887 -30046 -9199 -83006 -87952 -136325
2220 -136325 -383784 -412500 -243724 -44704 -33246 -155438 -301203 -227624 -242471 -183305 -90755
2209 -90755 -43929 -172320 -211462 -264677 -253775 -155636 -206616 -109862 -229664 -160920 -158400 -227310
$$ packed form
2286b56660J62278q5008N9705n6937k72396L52866P2037k02083P9925N3037n051
2275i8287r3508j59749Q2373K59745j43361P1719J18478j07734J07210L5210k16771
2264a44675o9087M3133j37683R9880k2692k3390J83180K16913k01126p4076N9303
2253g0320j13619J06711o7312j41375N3492K15763P2908j52503O7887j82121j47877
2242c58366Q1869m4068K42188j08173n7483K49195k69443j35412J58546J61099
2232h0048M9714j64947J44544k9337K634Q4282O6045j02933K0847p3807m946m8373
2220a36325k47459k8716J68776J99020J1458j22192j45765P3579j4847N9166R2550
2209i0755M6826j28391l9142n3215J0902R8139n0980R6754j19802O8744K520o8910
$$ plain form
2197 -227310 -26218 82846 6258 -71055 -108522 -191430 -115360 -70597 -198139 -218195 -303639
2186 -303639 -236751 -15126 87975 65539 149535 68201 -86469 -112912 -315898 -346681 -370802
2175 -370802 -251635 -381576 -149232 -238515 -181445 -76279 -56441 -94245 -107090 -191585 -234466
2164 -234466 -99069 -3955 -233566 -79204 95556 -128936 -35526 -1849 -89711 -5564 -218894
2153 -218894 -150075 -53755 4970 62192 -9014 230601 302961 57410 -35030 193157 142132
2142 142132 29556 57050 88677 203981 246035 126293 40114 87350 258857 203826 18342
2131 18342 147250 152924 252857 45586 225251 408024 388168 451711 421047 667702 643203
2120 643203 472880 678022 721989 789660 713907 716158 636507 837555 1120320 1032748 1160463
$$ packed form
2197b27310K01092J09064p6588p7313l7467q2908P6070M4763j27542k0056q5444
2186c03639O6888K21625J03101k2436Q3996q1334j54670k6443k02986l0783k4121
2175c70802J19167j29941K32344q9283N7070J05166J9838l7804j2845q4495m2881
2164b34466J35397R5114k29611J54362J74760k24492R3410L3677q7862Q4147k13330
2153b18894O8819R6320N8725N7222p1206K39615P2360k45551r2440K28187n1025
2142A42132j12576K7494L1627J15304M2054j19742q6179M7236J71507n5031j85484
2131A8342J28908N674R9933k07271J79665J82773j9856O3543l0664K46655k4499
2120F43203j70323K05142M3967O7671p5753K251p9651K01048K82765q7572J27715
$$ plain form
2109 1160463 1150166 1126585 1316152 1360736 1491106 1533546 1602090 1803053 1655907 1736178 1848895
2098 1848895 1995104 2236211 2324520 2486027 2689289 2641852 2798739 3234612 3385196 3541356
2088 3541356 3630727 3862075 4181087 4427884 5102840 5233911 5916723 6606608 7180570 7772057
2078 7772057 8688068 9650241 11138949 12881333 15122851 18061438 21704819 26097888 30820820
2069 30820820 30195033 24496543 19178934 15213634 12650544 10822253 9485240 8504896
2061 8504896 7602484 7041323 6540013 6062637 5412181 4813683 4269195 4018858 3650625 3259108
2051 3259108 3052311 2765233 2593839 2548983 2373486 2292304 1959092 1699835 1619857 1593536
2041 1593536 1481532 1485113 1543506 1067403 1148751 1123426 1114919 1144612 1025010 808669 743339
$$ packed form
2109A160463j0297k3581J89567M4584J30370M2440O8544K00963j47146Q0271J12717
2098A848895J46209K41107Q8309J61507K03262m7437J56887M35873J50584J56160
2088C541356Q9371K31348L19012K46797O74956J31071O82812O89885N73962N91487
2078G772057R16011R62173J488708J742384K241518K938587L643381M393069M722932
2069C0820820o25787n698490n317609l965300k563090j828291j337013r80344
2061H504896r02412n61161n01310m77376o50456n98498n44488k50337l68233l91517
2051C259108k06797k87078j71394m4856j75497q1182l33212k59257p9978k6321
2041A593536j12004L581N8393m76103Q1348k5325q507K9693j19602k16341o5330
$$ plain form
2030 743339 854930 627607 685008 608854 542651 617183 582466 575963 494682 528775 426125
2019 426125 478023 229442 367865 266007 325445 339380 203865 342370 333820 277591 134818
2008 134818 171006 295935 66126 205540 202060 76613 171270 183809 101732 238399 240317
1997 240317 -71922 5665 243060 87072 -126770 -26442 -20506 -13527 7307 188109 -47426
1986 -47426 -125487 -98257 140807 29796 -200633 -92502 -25282 -139611 37984 18114 -114880
1975 -114880 99902 -50047 -78793 -88659 -55092 -100314 -130177 -159096 -120071 -175064 -131222
1964 -131222 -124915 -37477 -262290 -350487 -352027 -228101 -58827 -75137 -208672 -174941 -213850
1953 -213850 -326561 -407286 -326908 -371945 -147384 -305187 -311454 -130497 -338759 -272561 -201801
$$ packed form
2030G43339J11591k27323N7401p6154o6203P4532l4717o503q1281L4093j02650
2019D26125N1898k48581J38423j01858N9438J3935j35515J38505q550n6229j42773
2008A34818L6188J24929k29809J39414l480j25447R4657J2539q2077J36667J918
1997B40317l12239P7587K37395j55988k13842J00328N936O979K0834J80802k35535
1986d7426p8061K7230K39064j11011k30429J08131O7220j14329J77595j9870j32994
1975a14880K14782j49949k8746r866L3567m5222k9863k8919L9025n4993M3842
1964a31222O307Q7438k24813q8197j540J23926J69274j6310j33535L3731l8909
1953b13850j12711q0725Q0378m5037K24561j57803o267J80957k08262O6198P0760
$$ plain form
1942 -201801 -284856 -169550 -231982 -196743 -275089 -299114 -253378 -193696 -4157 -128792 -210436
1931 -210436 -477679 -471304 -344787 -303580 -127941 -73588 -37708 -103320 -290601 -360650 -293024
1920 -293024 -267829 -212658 -195807 -130037 -252046 -333715 -207342 -327165 -174998 -320508 -236989
1909 -236989 -182426 -186328 -247904 -193532 -60181 -69692 -244307 -205845 -13291 -98460 -167541
1898 -167541 -142159 -333875 -357779 -290397 -152943 -142029 -98988 -157260 -224410 -116680 -127191
1887 -127191 -214080 -168606 -102886 55831 70640 -192004 -94907 -22981 -245687 -226867 -199338
1876 -199338 -150976 -101747 -257070 -84519 -87927 -145609 -152661 -190580 -138884 61768 -167620
1865 -167620 -172379 -74293 -179930 -187793 -98631 -167569 -115039 -224219 -229472 -302065 -382077 -259449
$$ packed form
1942b01801q3055J15306o2432L5239p8346k4025M5736N9682J89539j24635q1644
1931b10436k67243O375J26517M1207J75639N4353L5880o5612j87281p0049O7626
1920b93024K5195N5171J6851O5770j22009q1669J26373j19823J52167j45510Q3519
1909b36989N4563l902o1576N4372J33351r511j74615L8462J92554q5169o9081
1898a67541K5382j91716k3904O7382J37454J0914M3041n8272o7150J07730j0511
1887a27191q6889M5474O5720J58717J4809k62644R7097P1926k22706J8820K7529
1876a99338M8362M9229j55323J72551l408n7682p052l7919N1696K00652k29388
1865a67620m759R8086j05637p863Q9162o8938N2530j09180n253p2593q0012J22628
$$ plain form
1853 -259449 -288419 -163760 -232186 -311007 -139513 -259642 -335905 -247612 -221164 -341129 -200974
1842 -200974 -100529 -271046 -175569 -234985 -165921 -244283 -289907 -277801 -240029 -86662 -42532
1831 -42532 -238877 -323871 -120545 -69187 -286272 -285747 -345371 -368404 -245602 -173104 -141869
1820 -141869 -156172 -383548 -223337 -67014 -114140 -289192 -76357 -79888 -201001 -43971
1810 -43971 -173667 -392228 -254245 -125156 -186580 -203786 -338641 -295693 -507450 -327814
1800 -327814 3080 -24989 -95360 -254328 -253441 -303240 -301300 -143867 -195885 -200645 -155142 -4181
1788 -4181 -56575 -57104 -54928 -303330 -207838 -230160 -244851 -127253 -187922 -290850 -272116 -228173
1776 -228173 -259505 -358999 -344099 -184860 -124935 -281490 -222996 -183125 -305528 -277387 -180759
$$ packed form
1853b59449k8970J24659o8426p8821J71494j20129p6263Q8293K6448j19965J40155
1842b00974J00445j70517R5477n9416O9064p8362m5624J2106L7772J53367M4130
1831d2532j96345q4994K03326N1358k17085N25n9624k3033J22802P2498L1235
1820a41869j4303k27376J60211J56323m7126j75052K12835l531j21113J57030
1810d3971j29696k18561J37983J29089o1424j7206j34855M2948k11757J79636
1800c27814L30894k8069p0371j58968Q87m9799J940J57433n2018m760M5503J50961
1788d181n2394n29K176k48402R5492k2322j4691J17598o0669j02928J8734M3943
1776b28173l1332r9494J4900J59239N9925j56555N8494L9871j22403K8141R6628
$$ plain form
1765 -180759 -277795 -290886 -286135 -358748 -184024 -100883 -279045 -207798 -276239 -126687 -105729
1754 -105729 -143091 -363373 -171355 -8678 -249556 -307470 -203191 -286820 -311412 -153658
1744 -153658 -218938 -163643 -279355 -270651 -300796 -168443 -214998 -80649 -72252 8407 -5540
$$ packed form
1765a80759r7036j3091M751p2613J74724Q3141j78162P1247o8441J49552K0958
1754a05729l7362k20282J92018J62677k40878n7914J04279q3629k4592J57754
1744a53658o5280N5295j15712Q704l0145J32353m6555J34349Q397Q0659j3947
$$ [...]
##END NTUPLES=NMR SPECTRUM
##END=
