##TITLE=1H_CA-9297-6
 CDCl3
 8 sc, 
 29.11.2024
##JCAMPDX= 6.0         $$ Bruker NMR JCAMP-DX V2.0
##DATA TYPE= NMR SPECTRUM
##DATA CLASS= NTUPLES
##ORIGIN= UXNMR, Bruker Analytische Messtechnik GmbH
##OWNER= root
$$ XWIN-NMR		Version 3.5
$$ Fri Nov 29 14:09:16 2024 Russian Standard Time (UT+4h)  she@DPX200
##.OBSERVE FREQUENCY= 200.1315
##.OBSERVE NUCLEUS= ^1H
##.ACQUISITION MODE= SIMULTANEOUS
##.ACQUISITION SCHEME= undefined
##.AVERAGES= 8
##.DIGITISER RES= 18
##SPECTROMETER/DATA SYSTEM= spect
##.PULSE SEQUENCE= zg30
##.SOLVENT NAME= CD3CN
##.SHIFT REFERENCE= (INTERNAL, CD3CN, 0, 19.5356)
##AUDIT TRAIL= $$ (NUMBER, WHEN, WHO, WHERE, WHAT)
$$ ##TITLE= Audit trail, XWIN-NMR		Version 3.5
$$ ##JCAMPDX= 5.01
$$ ##ORIGIN= Bruker BioSpin GmbH
$$ ##OWNER= she
$$ F:/spectra/data/she/nmr/H-F/1/pdata/1/auditp.txt
$$ ##AUDIT TRAIL=  $$ (NUMBER, WHEN, WHO, WHERE, WHAT)
(   1,<2024-11-29 14:07:17.92 +0400>,<she>,<DPX200>,
      <created by zg, POWCHK disabled, PULCHK disabled
       configuration hash MD5:
       00 E9 B6 7A A2 85 ED C7 34 08 36 98 17 FE 4E 26
       data hash MD5: 16K
       B3 01 9E 8E 08 90 25 8C 7C E4 44 49 8E 7E E7 8E>)
(   2,<2024-11-29 14:07:45.29 +0400>,<she>,<DPX200>,
      <Start of raw data processing
       efp BC_mod = 2 LB = 0.24 FT_mod = 6 PKNL = 1 PHC0 = -26718.66 PHC1 = 15.58744 SI = 16K 
       data hash MD5: 16K
       8E 55 0C 11 BA B9 64 69 50 1F B9 F9 AC 96 40 77>)
(   3,<2024-11-29 14:08:04.98 +0400>,<she>,<DPX200>,
      <pk PHC0 = 0.01585702 PHC1 = 0 
       data hash MD5: 16K
       BF D1 20 3A 5C E8 A2 F2 8B F6 81 7D 59 4E C9 55>)
(   4,<2024-11-29 14:08:08.18 +0400>,<she>,<DPX200>,
      <abs ABSG = 5 
       data hash MD5: 16K
       98 25 80 3E A3 2B AC DB 02 4B D4 25 27 09 36 63>)
$$ ##END=
$$ 
$$ hash MD5
$$ D0 93 24 C1 7A 4E 00 FA 12 47 D3 78 E7 BD F8 76
##$RELAX= 
##$RELAX= 
##$RELAX= 
##$RELAX= 
##$RELAX= 
##$RELAX= 
$$ Bruker specific parameters
$$ --------------------------
##$DU= <F:/spectra>
##$EXPNO= 1
##$NAME= <H-F>
##$PROCNO= 1
##$TYPE= <nmr>
##$USER= <she>
##$AMP= (0..31)
100 100 100 100 100 100 100 100 100 100 100 100 100 100 100 100 100 100 
100 100 100 100 100 100 100 100 100 100 100 100 100 100 
##$AQSEQ= 0
##$AQ_mod= 1
##$AUNM= <au_zg>
##$AUTOPOS= <>
##$BF1= 200.13
##$BF2= 200.13
##$BF3= 200.13
##$BF4= 200.13
##$BF5= 200.13
##$BF6= 200.13
##$BF7= 200.13
##$BF8= 200.13
##$BYTORDA= 1
##$CFDGTYP= 0
##$CFRGTYP= 5
##$CHEMSTR= <none>
##$CNST= (0..31)
1 1 145 1 1 1 1 1 1 1 1 1 1 1 1 1 1 1 1 1 1 1 1 1 1 1 1 1 1 1 1 1 
##$CPDPRG= <>
##$CPDPRG1= <>
##$CPDPRG2= <>
##$CPDPRG3= <>
##$CPDPRG4= <mlev>
##$CPDPRG5= <mlev>
##$CPDPRG6= <mlev>
##$CPDPRG7= <mlev>
##$CPDPRG8= <mlev>
##$CPDPRGB= <>
##$CPDPRGT= <>
##$D= (0..31)
0 1.2 0 0 0 0 0 0 0 0.06 0 0.03 0 0 0 0 0.0002 0 0 0 0 0 0 0 0 0 0 0 0 
0 0 0 
##$DATE= 1732874837
##$DBL= (0..7)
120 120 120 120 120 120 120 120 
##$DBP= (0..7)
150 150 150 150 150 150 150 150 
##$DBP07= 0
##$DBPNAM0= <>
##$DBPNAM1= <>
##$DBPNAM2= <>
##$DBPNAM3= <>
##$DBPNAM4= <>
$$ [...]
##$SUBNAM3= <"">
##$SUBNAM4= <"">
##$SUBNAM5= <"">
##$SUBNAM6= <"">
##$SUBNAM7= <"">
##$SUBNAM8= <"">
##$SUBNAM9= <"">
##$SW= 24.0689530833862
##$SWIBOX= (0..15)
0 0 2 0 0 0 0 0 0 0 0 0 0 0 0 0 
##$SW_h= 4816.95568400771
##$TD= 16384
##$TD0= 1
##$TE= 0
##$TE2= 300
##$TE3= 300
##$TEG= 300
##$TL= (0..7)
0 120 120 120 120 120 120 120 
##$TP= (0..7)
150 150 150 150 150 150 150 150 
##$TP07= 0
##$TPNAME0= <>
##$TPNAME1= <>
##$TPNAME2= <>
##$TPNAME3= <>
##$TPNAME4= <>
##$TPNAME5= <>
##$TPNAME6= <>
##$TPNAME7= <>
##$TPOAL= (0..7)
0.5 0.5 0.5 0.5 0.5 0.5 0.5 0.5 
##$TPOFFS= (0..7)
0 0 0 0 0 0 0 0 
##$TUNHIN= 0
##$TUNHOUT= 0
##$TUNXOUT= 0
##$USERA1= <user>
##$USERA2= <user>
##$USERA3= <user>
##$USERA4= <user>
##$USERA5= <user>
##$V9= 5
##$VALIST= <valist>
##$VCLIST= <CCCCCCCCCCCCCCC>
##$VD= 0
##$VDLIST= <DDDDDDDDDDDDDDD>
##$VPLIST= <PPPPPPPPPPPPPPP>
##$VTLIST= <TTTTTTTTTTTTTTT>
##$WBST= 1024
##$WBSW= 4
##$XGAIN= (0..3)
0 0 0 0 
##$XL= 0
##$YL= 0
##$YMAX_a= 916227
##$YMIN_a= -434628
##$ZGOPTNS= <>
##$ZL1= 120
##$ZL2= 120
##$ZL3= 120
##$ZL4= 120
##$ABSF1= 19.4313
##$ABSF2= -4.637833
##$ABSG= 5
##$ABSL= 3
##$ALPHA= 0
##$AQORDER= 0
##$ASSFAC= 0
##$ASSFACI= 0
##$ASSFACX= 0
##$ASSWID= 0
##$AUNMP= <proc_1d>
##$AZFE= 0.1
##$AZFW= 0.1
##$BCFW= 0
##$BC_mod= 2
##$BYTORDP= 0
##$COROFFS= 0
##$CY= -3
##$DATMOD= 1
##$DC= 0
##$DFILT= <>
##$DTYPP= 0
##$F1P= 0
##$F2P= 0
##$FCOR= 1
##$FTSIZE= 16384
##$FT_mod= 6
##$GAMMA= 0
##$GB= 0
##$INTBC= 1
##$INTSCL= 2.524811e-10
##$ISEN= 128
##$LB= 0.24
##$LEV0= 0
##$LPBIN= 0
##$MAXI= 10000
##$MC2= 0
##$MEAN= 0
##$ME_mod= 0
##$MI= 1.114404
##$NCOEF= 0
##$NC_proc= -5
##$NLEV= 6
##$NOISF1= 3.799351
##$NOISF2= 2.8
##$NSP= 0
##$NTH_PI= 0
##$NZP= 0
##$OFFSET= 19.5356
##$PC= 1
##$PHC0= -26718.64
##$PHC1= 15.58744
##$PH_mod= 1
##$PKNL= yes
##$PPARMOD= 0
##$PSCAL= 0
##$PSIGN= 0
##$REVERSE= no
##$SF= 200.129998818123
##$SI= 16384
##$SIGF1= 3
##$SIGF2= 2
##$SINO= 5.538805
##$SIOLD= 16384
##$SREGLST= <1H.CDCl3>
##$SSB= 0
##$STSI= 16384
##$STSR= 0
##$SW_p= 4816.95568400771
##$SYMM= 0
##$S_DEV= 0
##$TDeff= 16384
##$TDoff= 0
##$TI= <>
##$TILT= no
##$TM1= 0
##$TM2= 0
##$TOPLEV= 0
##$USERP1= <user>
##$USERP2= <user>
##$USERP3= <user>
##$USERP4= <user>
##$USERP5= <user>
##$WDW= 1
##$XDIM= 16384
##$YMAX_p= 380334109
##$YMIN_p= -223768
$$ End of Bruker specific parameters
$$ ---------------------------------
##NTUPLES= NMR SPECTRUM
##VAR_NAME=  FREQUENCY,     SPECTRUM/REAL,   SPECTRUM/IMAG
##SYMBOL=    X,             R,               I
##VAR_TYPE=  INDEPENDENT,   DEPENDENT,       DEPENDENT
##VAR_FORM=  AFFN,          ASDF,            ASDF
##VAR_DIM=   16384,         16384,           16384
##UNITS=     HZ,            ARBITRARY UNITS, ARBITRARY UNITS
##FACTOR=    0.29402158847633, 1,            1
##FIRST=     3909.6597374437, 0,             0
##LAST=      -907.295946564008, 0,           0
##MIN=       -907.295946564008, -223768,     0
##MAX=       3909.6597374437, 380334109,     0
$$ Real data points
##PAGE= N=1
##DATA TABLE= (X++(R..R)), XYDATA
$$ [...]
11396 -116065 -131154 -40804 30566 -9160 31874 68676 -55085 -59925 -45632 -25566 -17687 -27123
11384 -27123 -63864 -28944 23526 -59276 -45662 38534 -55044 -54154 -9101 -14136 60293 59179
11372 59179 -26874 -44691 -36381 -3154 -13003 -14132 89358 84907 -11061 -55494 -78282 -50163
11360 -50163 -35716 14449 -3564 -11540 -57819 -15092 870 52636 -11793 -44694 -67997 -37009
11348 -37009 35805 14448 31136 15121 76356 12936 -2953 -37914 -61603 18115 -97272
11337 -97272 -49550 62686 30571 2852 -10561 6508 20089 -4796 -89913 27152 10320
11326 10320 33533 40729 21007 35300 -34776 -1046 -27595 4722 3970 -38273 -56171 -3273
11314 -3273 -30733 -28619 59509 53980 97514 47519 -21486 -18772 18095 19092 -54306 -62095 -17623
11301 -17623 -16841 -35483 -26803 -23764 -107930 -97034 -65803 -17118 -85159 -144061 -132984 -89155
11289 -89155 -57744 -62934 -105610 -124060 -82930 -81030 -71624 -54505 20271 -2224 -103789 -15508
11277 -15508 -36699 -74652 -112796 -69979 -55015 -59157 -33657 -82891 7031 11058 -55330 231
11265 231 30514 -64142 -60303 -29095 -34136 -52969 -44177 -86551 -49901 -23740 -59 -59330 -4852
11252 -4852 -105377 -124722 -60497 -63520 14055 -74982 -88760 -95817 -21116 414 -9485 -12848
11240 -12848 -53335 -68732 -61668 -102978 -45264 -73060 -47783 -12371 -64868 -35856 -154785 -89833
11228 -89833 -58850 -11028 -38798 -64104 -31629 -20654 -67496 -24317 -40371 -24801 -30047 -103511
11216 -103511 -107413 -119928 -59396 -52330 -75555 -144628 -166645 -131575 -99497 -89690 -67467 -15962
11204 -15962 -75114 -66345 -74302 -91334 -53352 -89002 -103691 -53222 -25432 -14019 -20078 -117388
11192 -117388 -92713 -66580 -47986 -50427 -61318 -23497 -18010 -38226 -53767 -44617 -18188 -47391
11180 -47391 -91737 -55394 -62116 -103171 -172582 -181662 -110294 -92215 -42370 -19860 -42239 -56557
11168 -56557 -43554 -76309 -97787 -115906 -91118 -65300 -40178 -127689 -71342 -9384 -33484 45961
11156 45961 16429 -19866 -21183 -15265 -65514 -70455 -39846 19108 -29880 -81914 -107968 -107830 -63206
11143 -63206 -133907 -64965 -64780 -92121 -46895 -38414 -37936 -37359 -46794 -4643 -23786 -45543 -51374
11130 -51374 -93442 -71065 -19265 -38180 -50382 -113388 -90347 -28236 -79670 -31281 -38135 -68020
11118 -68020 -114335 -107701 -25640 -74342 -45702 -97615 -20201 -71821 -118479 -35213 -39717 -29765
11106 -29765 -61656 -143399 -76264 -92950 -57286 -37573 -92057 -141565 -43596 -22017 -14769 -32210
11094 -32210 -21801 -93477 -123629 -69807 -56460 -28786 -14270 -66256 -106226 -175841 -54038
11083 -54038 -57416 -98187 -65455 -50975 -67317 -99975 -79340 -102385 -168661 -143152 -62909 -91728
11071 -91728 -60403 -97964 -3723 -29057 -106598 -112147 -51145 -38004 -10630 -34362 -274 -64467
11059 -64467 -41982 -12306 -83893 -31019 -57266 -92384 -14522 -105178 -66770 -7509 -39912 -101030
11047 -101030 -107660 -120435 -59580 -83124 -24586 -62990 -43202 -110144 -43102 -69360 -55519 -91548
11035 -91548 -58210 -93818 -15811 -66381 -24181 -39954 -113724 -59462 -74705 -69780 -52675 -16376
11023 -16376 -8002 -22219 -101561 -113589 -111297 -105412 -128348 -129851 -89043 -21931 -9519 22650
11011 22650 13561 69649 -30825 -42579 -11375 -17728 -3738 -59352 -79977 -133406 -110532 -68283
10999 -68283 -93996 -74135 -104232 -100505 -13265 -23929 -52557 -34141 -95617 -98086 -132003 -95362
10987 -95362 -176602 -180536 -117789 -10945 -21877 -102281 -42365 -110920 -50108 -31142 -45771 -55606
10975 -55606 -74593 -95786 -57679 -72936 -67001 -4773 -35986 -43319 -21414 -1369 -15696 -36057
10963 -36057 -26325 -13635 -69383 -65299 -80899 -38684 -101738 -51129 -3391 -15590 10592 -56717
10951 -56717 -62266 -89315 -140045 -83070 -100645 -63525 -55347 -62409 -67399 -121883 -155544 -56718
10939 -56718 -83852 -50731 -119221 -188137 -132214 -5167 2899 -51831 -72266 -77016 -74163 -101003
10927 -101003 -48307 -9338 -92525 -13726 -53057 -63551 -46226 17379 -28449 -125168 -142174
10916 -142174 -203701 -103721 -42064 -34543 -77472 -56405 -81188 -96136 -60605 -36261 -67813 -117166
10904 -117166 -106641 -50113 -221 -34878 -15065 -60108 -70273 -73505 -111445 -81957 -18091 -92884
10892 -92884 -46108 -2466 -68288 -41145 -31153 -50946 -129330 -64445 -62058 -123473 -94143 -54571
10880 -54571 -10141 -129928 -107042 -102936 3098 79842 -12496 14195 -97708 -50094 -46739
10869 -46739 -19861 -53807 -74880 -89315 -112508 -83739 -12216 -46456 -51738 -88774 -90378 -94724
10857 -94724 -116238 -92983 -122862 -141525 -155378 -65914 -16061 -72730 -116711 -92560 -48111 -52704
10845 -52704 -86121 -84619 -24961 -53151 -55381 -49193 -28621 -9515 18647 3236 -84117 -72054
10833 -72054 -48210 -45920 10168 -35942 -104835 -171831 -72837 -62255 -91883 -42810 -12760 -30018
10821 -30018 -75473 -117465 -139944 -100424 -75453 -121800 -116821 -21746 4024 -22467 -39022 -102353
10809 -102353 -50865 -19955 -32881 -91254 -63694 -91725 -7963 24370 -57371 -23564 -116223
10798 -116223 -93277 -47135 -14437 -8835 -1797 -113344 -144473 -98256 -85696 -130514 -42307 -35409
10786 -35409 -66741 -72484 -54631 -59216 -48170 -34304 -83633 -31194 -37399 -60687 15737 -12496
10774 -12496 -68486 -99751 -126507 -63208 -42657 -28390 -54855 -47582 -52804 -51604 -57009 -56913 -14309
10761 -14309 26813 -6408 -53672 -32166 -33001 -43552 -35907 24227 33967 -65897 -46066 -55294 -94404
10748 -94404 -106165 -78847 -53266 -69484 -54719 -74541 -108771 -11984 -52713 -43738 -59259 -97332
10736 -97332 -96168 -75914 -60202 -60200 16070 -41933 -107582 -144942 -89523 -124982 -54609 -41726 -122307
10723 -122307 -32939 -1274 -50503 -61952 -112830 -97945 -65814 -55133 -153649 -170296 -89888
10712 -89888 -83266 -145857 -67833 127742 84739 -43453 -66618 -18621 -4674 -46745 -1576
10701 -1576 -83481 -68929 -22889 -85774 -99817 -77883 7600 -24526 -31654 20368 -3370 2832
10689 2832 -35803 -41426 -39593 45049 10802 6828 57834 18178 -39495 -80519 -71435 -47347 31270
10676 31270 -71677 -57537 -31312 -73453 -41326 -55531 -8387 -17588 -16984 -41750 -42871 -63432
10664 -63432 -97785 -89862 -92911 -64085 -70429 -42606 -22542 11276 3033 40738 -12849 -60593
10652 -60593 -33950 31460 -56960 -50030 20466 28266 14289 43907 -25026 18570 27511 -24322
10640 -24322 -26563 -72089 -63999 -88840 -46140 -69019 -53976 -42097 -37332 -66773 -123129 -96510
10628 -96510 -65218 -108923 -90994 -36138 -86444 -105821 -80967 -3900 12015 -36178 -98041 -82219
10616 -82219 -130269 -78840 -86086 -71664 4481 -49363 -43608 -32501 -82517 -151063 -81140 -62906
10604 -62906 -17322 38480 34936 -4369 -1094 -34615 -25488 -52294 -78118 -46643 -38689 -26990
10592 -26990 -3540 20774 22196 -38307 -99121 -128498 -72342 -117535 -118090 1788 46098 -34587
10580 -34587 -47378 -60337 5959 -13162 -7168 -53207 12915 -43233 -24162 -37614 1389 -41127
10568 -41127 -42769 -32751 -34322 59430 27196 29557 17376 -17601 -40692 -6908 -8925 56587
10556 56587 41534 -4251 -81118 -13803 -87989 -77585 -14659 -18837 -43990 15746 42757 69674
10544 69674 31345 -65725 -89113 44167 -2938 -62359 -5616 -8431 5659 65059 147086 21856
10532 21856 19532 28785 26802 -12839 -63276 38429 -18219 -24736 32568 5203 -35542 -7766
10520 -7766 6807 3177 9482 -37353 -36324 -11489 -48623 -48839 -33420 -57453 -18356 -32087 -34774
10507 -34774 -60151 26752 44629 -33728 -18271 -86079 -46738 51152 72463 26670 23687 20646
10495 20646 -26556 -83697 -83252 8478 13025 -21019 35714 48268 69971 8901 58341 78610
10483 78610 82815 60381 29405 -365 19501 46154 76749 124113 111621 92532 125483 145819
10471 145819 93472 26306 -6347 -12834 58240 44753 64069 10334 20983 26331 74300 19644
10459 19644 66241 33700 -43201 89227 40708 44006 113472 49743 54410 44651 57137 101548
10447 101548 96094 61181 25588 23522 -36609 10979 31534 71791 13137 -24153 -50765 -34887
10435 -34887 58459 81828 87195 73754 35357 26099 -24910 -15304 -6019 -3649 29754 28630 48447
10422 48447 20899 61705 69643 59748 96635 59440 55355 17954 46400 29787 8925 -30374
10410 -30374 25945 95963 -57713 -22335 101069 28015 70500 102731 81582 15411 1017
10399 1017 -22290 -30417 -15911 6997 15358 -15096 35559 1025 15384 71300 46615 59146
10387 59146 21220 6761 32460 40910 37538 82474 104745 77319 36170 36925 -23727 -1213
10375 -1213 21785 59163 116850 70413 75384 120417 133443 91182 32237 79222 43118 50608
10363 50608 89084 47011 87769 56768 48556 97213 64911 141666 139105 206976 164721 161216
10351 161216 120488 138062 79440 128042 124282 127755 114321 110040 113343 181228 169328 115253
10339 115253 175976 159807 194193 132864 227074 188709 229245 239012 171670 216070 200009 176964
10327 176964 224075 261218 245515 262575 246840 233654 291322 323995 258226 277859 395122
10316 395122 397462 463547 403216 403382 497362 546840 576342 595947 635653 595924 576528 675399
10304 675399 635410 595112 522955 499561 640277 652576 590510 621627 630877 766725 750327
10293 750327 728125 871524 1057506 1071457 1062359 1068401 1087151 1127735 1255414 1234198 1247887
10282 1247887 1229824 1262459 1266684 1177828 1192893 1187615 1296500 1303638 1352345 1402521 1507491
10271 1507491 1571282 1705012 1666691 1696855 1691514 1694916 1637252 1552576 1414854 1386146 1350291
10260 1350291 1342907 1228847 1147600 1127786 1092501 1136059 1090233 1136752 1121827 1170507 1013052
10249 1013052 995366 1008517 948737 838645 821975 814147 729684 621987 630481 563909 489119
10238 489119 430723 435733 417785 432329 360532 356799 274006 291531 290167 325998 307051 220308
10226 220308 184006 216280 244591 217068 156627 173097 183939 122893 122391 181517 147867 183864
10214 183864 188356 152180 188332 180690 119557 99403 155258 73141 70455 108491 98651 97818 133417
10201 133417 157079 85489 62064 28696 40348 56558 82112 60779 93599 69322 92955
10190 92955 137193 64492 -2736 41820 30285 -36480 135718 97558 -22388 -29142 -21074 -55475
10178 -55475 -16337 41200 67773 60550 75766 -2685 -57560 -76336 5347 -88065 -60984 -39960
10166 -39960 -36005 -77426 -39764 30595 37872 -17405 4839 96956 3449 -14747 6068 25888
10154 25888 45667 -53742 27415 -7986 9061 -1174 53470 70831 98524 29705 -53750 3948
10142 3948 -37032 -43234 12522 24984 -72625 24426 59341 73201 103903 23090 129235 105512
10130 105512 66393 59642 8820 52009 -7024 19008 32363 20786 67615 13240 -29391 -11286
10118 -11286 -12946 11208 72746 108716 99181 9725 1322 4183 -4485 -77350 31845 82181
10106 82181 33875 13437 25106 27942 -48886 -6751 82690 29554 16192 25780 27256 -3182
10094 -3182 46626 101377 49521 25901 -160 2772 -53750 -21853 30776 -16219 -68895 -34106
10082 -34106 4759 40835 -32051 -45933 -13994 -30375 -1648 -66532 17991 -1845 -24186 -1147
10070 -1147 -23398 -74172 -70464 -40133 27501 -2696 -9961 -40953 42307 29654 15257 -50257
10058 -50257 -159353 -64241 -61349 -46799 -14711 9395 -16788 -38832 -63493 -14035 13185 -6912
10046 -6912 -50672 21889 -14695 -41739 -74119 -12858 -67986 -19628 -4294 39945 -20254 -26516
10034 -26516 -8667 9390 -14517 -14557 -81165 -76018 -28569 35704 51363 50755 -14587 -93543 -57387
10021 -57387 -8294 -37233 -82144 -61181 -13853 19931 -2575 -37309 -35217 -73448 -101257 -6440
10009 -6440 33520 -11438 -113947 -89787 -76385 -144542 -24196 -57456 -15873 -22646 -67301 -97066
9997 -97066 -117499 -97003 -89101 -96010 -98724 -80011 -30075 -35946 33644 23086 -61984 -32932 23649
9984 23649 -95889 -164148 -40972 -76604 3264 5313 5334 41108 -41531 -20862 21740 -84185
9972 -84185 -77045 -51692 -52974 -56649 -132702 -74253 -88908 -111793 -95955 -76007 -50666 -127775
9960 -127775 -175590 -104807 -70274 -68875 -61386 -14620 31777 -15006 9211 -17616 -60272 -49071
9948 -49071 -7667 -34982 2688 -81668 -144405 -32471 -78742 -73447 -30052 -48377 -23123 -35510
9936 -35510 21533 -81690 -133314 -53367 -46172 -150476 -88226 -28309 -32197 25682 -28083 2051
9924 2051 68664 -13834 -48532 -19108 -57099 -79857 16198 36037 3930 -26191 -31166 -14498
9912 -14498 11191 -1069 -29680 -62506 -74284 -81141 8653 56763 25688 79663 51710 -69805
9900 -69805 -62804 6609 45811 486 77633 37475 -78179 -7070 133424 81193 54669 71445
9888 71445 17129 32837 91954 35768 59290 68046 74686 20544 -45168 -17507 58434 48428
9876 48428 88516 93905 57390 190218 118350 144711 166052 117660 202063 302128 324981 245666
9864 245666 279208 329876 282188 288643 317455 321061 279844 326536 349096 290296 279354 176094
9852 176094 193597 258053 266993 247447 172508 197689 231371 143323 169709 195849 129315 186187
9840 186187 194720 205214 163118 126453 80473 97057 163510 97588 119502 142943 71711 18250
9828 18250 31828 30243 84764 83232 85050 28657 23484 100745 -44846 -49740 77199 61074
9816 61074 2422 45105 35778 41528 126835 153338 65449 83926 28068 8361 32835 4478
9804 4478 116488 87178 93787 100917 42296 -18377 -4491 27413 43761 88045 62846 11980
9792 11980 -58920 14378 -3503 20206 33503 19967 -40676 -9862 -12145 -11206 38350 37961 27542
9779 27542 95338 73898 66905 41864 -6709 -33383 -25856 49304 -20451 16066 29227 58380
9767 58380 95712 -34459 -101185 -28843 91677 95189 69560 89393 83940 19286 126987 79490
9755 79490 108559 175561 30266 41427 22683 66845 93861 44865 60809 -28451 9067 41710
9743 41710 64892 89597 93380 81077 114700 25304 7143 100974 16885 57412 80039 49076
9731 49076 64699 108143 62190 28343 134539 200868 161279 163122 106443 58530 75438 137771
9719 137771 57537 16872 3369 38688 93569 18006 81773 50811 62937 71894 38482 87731
9707 87731 121020 84232 71659 70103 38624 129453 194000 158035 97060 167817 152159 107581
9695 107581 123015 86977 131021 140235 99025 92412 176146 149538 81488 101933 31674 192
9683 192 75504 9142 115995 151018 102457 127684 232979 218270 211099 226769 208237 276518
9671 276518 270468 195501 122867 154704 123849 199038 235527 259386 277583 167946 211595 294331
9659 294331 218299 220686 268059 293134 276362 261678 296746 275451 258553 249373 269946 294073
9647 294073 322829 302130 348588 349780 232004 239046 226096 303679 319213 335493 249296 274349
9635 274349 222195 340034 362820 457785 398176 373970 454981 410132 479613 510539 391241
9624 391241 358226 415043 419699 458272 481292 477363 443375 506724 536177 594744 616866 613548
9612 613548 662034 635530 595784 544210 513415 448240 434716 487754 500690 558242 568597 504447
9600 504447 486308 400353 402620 458245 440235 400810 319663 312568 427962 402178 380591 397720
9588 397720 362233 330727 336759 406908 385626 386500 324273 291957 262971 230802 304943 295011
9576 295011 278070 312109 212836 170895 205862 237073 279530 264557 229148 240412 194967 207020
9564 207020 206027 156527 167200 225076 163670 115045 151608 155389 162786 198235 163685 187151
9552 187151 203279 115786 164292 263531 197195 111111 89438 66978 156727 169451 66092
9541 66092 55828 45009 112887 121373 105003 124690 57266 104705 124629 69902 73500 85176
9529 85176 136831 147979 129713 153172 192775 134231 104921 113190 146920 221504 134003 129746
9517 129746 167245 145605 104840 151772 165577 92419 110871 97770 141508 127165 60638 105775
9505 105775 108681 151575 117926 52875 84399 118268 139878 95862 158625 77876 118977 120503
9493 120503 157975 143321 122840 42578 74684 120874 117222 65299 104718 135587 139219 89433
9481 89433 142056 157531 127769 109976 83494 135492 189804 176434 119897 143096 214775 119069
9469 119069 53443 72349 60994 127159 61841 -7699 -1568 80463 111899 112461 69832 133624
9457 133624 127219 133512 101609 32954 46364 62269 110393 43453 40377 -23782 -38871 37107
9445 37107 104160 70864 104499 64624 40036 112546 84857 141239 87557 70137 71432 32095
9433 32095 43928 61987 40421 110015 69635 71165 44007 104385 118025 198498 200904 144676
9421 144676 114661 48466 69913 56858 64334 70609 -16931 -669 61609 69917 95305 52540
9409 52540 39200 70411 5925 83858 70955 49356 79010 72229 83702 56277 111770 89511
9397 89511 70824 51991 12265 71796 8500 67236 85086 146811 117305 70279 103497 122977
9385 122977 35657 -19214 44572 55075 56701 8900 -2770 41353 63432 84419 12377 62762
9373 62762 100631 30572 74323 197347 156604 149677 149584 87572 119414 101665 41849 102175
9361 102175 104290 73067 74776 129059 137871 198273 107850 119738 81712 60173 63525 60662 47101
9348 47101 144718 178633 72553 42847 16050 65155 41401 76777 59486 104280 143131 194808
9336 194808 76639 126762 83440 6045 -58061 107393 144542 191927 135145 90298 61588
9325 61588 97926 118479 142372 138337 83603 110250 148301 154581 108735 181395 142995 141022
9313 141022 213600 82659 143548 138327 60850 114260 109800 162474 151941 117773 182079 181206
9301 181206 203429 192720 160660 171570 154132 175873 145937 157002 163566 165566 158026 226790
9289 226790 249919 222964 272012 264406 248255 236332 183831 280265 293635 283863 280882 239882
9277 239882 325375 232387 234546 229748 213971 187354 153966 237007 253795 189449 305801 302525
9265 302525 287646 270209 157868 198297 236554 292099 277784 263110 286744 296696 316146 253778
9253 253778 170456 122648 166914 200477 177574 183968 189783 277747 233878 257417 233984 159916
9241 159916 153114 133142 152848 160546 142351 178062 177740 182502 84987 123526 119967 135521 126911
9228 126911 120810 62979 75816 27247 88664 94942 75673 106310 148072 141475 97835 157207
9216 157207 139237 200538 114356 90539 97765 64650 9778 31342 135798 139932 106259 165425
9204 165425 135727 52788 68887 141849 114205 41305 24716 22801 -21273 1754 33607 66161
9192 66161 79397 93648 36259 48160 43731 115434 148202 164393 93823 87577 115455 61729
9180 61729 94270 43873 122627 99319 46210 77814 102488 97504 51784 111221 222947 174251
9168 174251 173748 187830 178748 161531 85367 182589 158512 145775 153622 130328 161004 192211
9156 192211 171949 156846 185433 174883 160478 137166 163974 153365 164221 199501 185794 179192
9144 179192 226158 219155 204827 226301 221455 244823 340581 307615 232469 214271 285956 257423
9132 257423 225853 151671 148386 221602 269608 296874 316190 339004 283774 268200 314638 365199
9120 365199 351876 345804 305463 287058 328863 353620 384771 366743 373816 378594 429787 491797
9108 491797 464848 484496 436024 474115 519389 522738 564767 552975 499231 483898 474684 506886
9096 506886 431186 406812 368532 354195 343512 368280 341258 369748 370270 271391 299183 253387
9084 253387 339127 305220 289777 307900 330255 361989 332575 357551 395828 346156 336380 343619
9072 343619 314660 328738 317619 305000 322668 364710 278250 224673 232108 283039 284056 314402
9060 314402 355407 335641 289511 278326 317294 228704 295665 348206 363112 368316 333801 245759
9048 245759 194874 280619 302387 246037 244493 262260 302172 311921 271962 359301 328129 285618
9036 285618 351411 341178 348601 339632 321881 385486 423652 444442 388948 314202 332900 385302
9024 385302 314803 280313 304762 300782 330237 291920 231533 272698 297889 293069 274073 279683
9012 279683 313779 242932 282281 302922 250785 184090 210468 218104 212762 169757 143191 157288
9000 157288 174447 180051 219868 213096 169086 167739 221416 234970 230856 191712 103775 149245
8988 149245 169360 140377 188165 140185 179898 167628 168357 152730 154644 179537 156299 170743
8976 170743 165518 154505 108154 197318 186261 161115 98209 103395 89655 125585 93863 151782
8964 151782 104692 101553 148739 113148 127852 209431 203829 247970 180770 123443 185728 183337
8952 183337 215549 233382 206201 127357 205216 175214 165889 137944 218808 232185 135456 167854
8940 167854 122360 190407 247852 224761 240134 184621 218853 238089 237988 212801 166887 172055
8928 172055 187411 162030 171769 152643 137116 215164 217799 178136 220520 280201 227163 194089
8916 194089 232047 166749 244831 250465 195709 270739 215820 177129 217348 197068 145535 194480
8904 194480 205085 156684 155768 197315 234755 226881 191525 155808 111495 195624 217907 226229
8892 226229 163380 157834 128744 178373 186847 242354 227632 190855 188245 127402 194378 189354
8880 189354 159758 148803 167628 89886 130651 139742 208729 170818 122697 176128 91776 135756
8868 135756 154108 190081 170728 177999 150670 137348 97800 137030 130280 154870 204718 186606
8856 186606 229222 268493 184768 173489 158282 130424 198203 177964 199656 180024 152290 175406
8844 175406 144283 183441 214996 91412 169696 192900 236783 283827 243792 146458 187805
8833 187805 143101 217991 164783 157388 237465 191204 109430 104252 105432 160994 240066 196133
8821 196133 174090 189751 105639 188669 255834 192754 116043 163328 191866 175249 186147 187339
8809 187339 210638 119297 168430 175340 186125 177203 161689 132730 108585 147199 162377 175841
8797 175841 195244 183081 219276 210313 198818 239072 194992 154307 194913 235666 236986 241984
8785 241984 231186 176538 208184 240397 154101 233547 137946 45690 129844 149602 211921 149790
8773 149790 145497 156219 201980 184180 149563 213766 225048 216061 272883 280225 260661 179746
8761 179746 222300 218508 176135 149556 190816 230587 204391 181584 210390 239474 208289 188123
8749 188123 187183 216635 212608 180738 157549 179151 133650 169847 186496 161673 218055 153505
8737 153505 122099 135108 157954 169885 210281 256031 251508 255318 261859 199838 191679 194511 172354
8724 172354 192801 144928 227180 287732 195992 255946 256592 193288 246220 210825 206030 229367
8712 229367 192691 153242 201153 166926 261306 222357 230224 148540 209890 195294 181488 177475
8700 177475 176839 190937 197779 228917 232754 286365 249205 156748 193039 202615 111424 208870 192362
8687 192362 163869 182845 184828 130969 161836 174555 188868 214254 186320 165353 187511 262130
8675 262130 283136 283650 313603 225000 239361 290381 207196 151151 180138 212230 279226 210144
8663 210144 192655 199076 127337 66991 126538 210974 196631 187655 166024 205091 219278 249697
8651 249697 274277 183504 250832 214435 173226 257633 222348 145320 227009 266673 277672 259650
8639 259650 280458 307064 262476 269292 264998 173760 191438 204133 277434 223313 168377 217025
8627 217025 257273 254904 261934 213147 217878 156457 240692 308462 285972 300784 326620 306855
8615 306855 321590 261423 289391 322931 276063 256657 202541 213487 333905 292867 179188
8604 179188 284900 237467 185068 238747 294159 248845 269484 243052 313648 361944 383762
8593 383762 319361 280391 247094 297518 328806 305682 233184 203867 230066 336051 341221 375642
8581 375642 356937 314991 273429 256572 352390 344745 290538 303848 237133 247450 278044 248819
8569 248819 286938 347553 310629 298462 280838 238673 283028 277850 303387 315228 295678 321175
8557 321175 349949 332951 333471 266077 262780 317432 297310 307260 332454 284420 273106 290668
8545 290668 242564 258999 357013 287474 246067 250942 236519 286989 267998 304735 195704 290174
8533 290174 361020 394742 400371 326211 318131 294139 311473 242130 312355 291322 266974 369962
8521 369962 368767 281496 313765 378460 306383 277894 336579 393173 401414 457435 361198 413253
8509 413253 410786 393504 364686 368008 403500 424643 494737 546505 533759 538464 550374 477852
8497 477852 471069 470922 455187 391843 476860 463065 446490 412135 393760 457111 424278 427148
8485 427148 380743 406125 506428 485185 471345 437911 403467 480177 478632 484239 452162 462212
8473 462212 470669 452070 515675 457888 418273 440089 502862 516153 565121 559077 466775 520126
8461 520126 558405 561635 600951 661989 703933 683490 635405 644537 736331 759569 666528 678217
8449 678217 649006 690284 735194 671965 712301 734788 788353 731968 791095 763072 768390 832492
8437 832492 879812 890000 919010 934444 927605 990435 918973 1011693 1051287 1056242 1095719 1132745
8425 1132745 1244831 1262521 1357675 1320617 1434643 1535023 1577821 1704783 1806170 1887873
8415 1887873 2000412 1945057 1905258 1913231 1998843 2083529 2176068 2291962 2377025 2472462 2618042
8404 2618042 2685076 2724840 2864665 2977127 2973678 3035753 3181048 3165982 3268626 3303520 3369164
8393 3369164 3412273 3482552 3555777 3613584 3682654 3747607 3862485 3970057 4041094 4112744 4162754
8382 4162754 4199834 4208449 4241041 4214106 4145363 4109088 3957211 3865078 3838332 3686159 3570471
8371 3570471 3603708 3457757 3350594 3357682 3372069 3192015 3158206 3121542 3042780 2939995 2871020
8360 2871020 2745681 2615445 2565044 2459524 2342000 2230776 2179142 2122002 1949951 1851184
8350 1851184 1830437 1809661 1704315 1558717 1528383 1575467 1484694 1385633 1346424 1381549 1346785
8339 1346785 1316672 1232843 1189230 1162180 1143702 1196449 1132140 1063708 1020449 1108152 1048998
8328 1048998 1032956 1067244 1033234 940164 982065 997548 938179 944281 924712 889508 921785 811885
8316 811885 849275 830659 890613 914153 879439 861959 867867 935081 909369 906983 852123 796372
8304 796372 842768 865125 926278 811700 863615 843609 859322 849821 833626 891397 938884 905800
8292 905800 931278 993042 920425 925552 1005489 1013545 1010540 1003281 1032784 1062821 1141909 1125546
8280 1125546 1071537 1107908 1138400 1196712 1179480 1190552 1261518 1357289 1275930 1294140 1323575
8269 1323575 1325576 1337637 1397543 1481594 1438691 1515909 1508094 1559118 1538144 1502195 1594341 1599787
8257 1599787 1709375 1742296 1691123 1710189 1716491 1606903 1564545 1607400 1584635 1563992 1490649
8246 1490649 1577053 1652569 1603844 1575426 1567095 1586360 1583287 1534405 1505818 1452251 1494726 1482096
8234 1482096 1449969 1546403 1521294 1423727 1457335 1387442 1418729 1425244 1457777 1443579 1396319 1326136
8222 1326136 1356183 1441701 1401284 1363109 1327280 1267218 1282043 1346145 1397873 1380292 1385598 1419904
8210 1419904 1475285 1477662 1512860 1604668 1557827 1621804 1549983 1640606 1601990 1550775 1558408 1617874
8198 1617874 1581499 1671770 1609043 1843533 1828535 2359389 1141602 700575 1412167 1336513
8188 1336513 1524241 1496694 1574683 1527163 1578793 1616466 1645386 1600725 1607237 1504953 1488939
8177 1488939 1462949 1502450 1435586 1475611 1451456 1470429 1442209 1551102 1552089 1491184 1436192 1499972
8165 1499972 1439340 1449223 1476111 1413221 1415381 1437485 1436350 1392276 1312140 1359820 1383759 1383828 1314930
8152 1314930 1295542 1215025 1212766 1237808 1264575 1284355 1346363 1337402 1316994 1366203 1380054 1357788
8140 1357788 1398793 1398840 1346374 1401577 1373044 1338945 1423492 1462904 1452455 1520199 1520699 1507451
8128 1507451 1457253 1589783 1585439 1589552 1694517 1734897 1763473 1765645 1745229 1822124 1889424 1978393
8116 1978393 1945211 2039186 2142650 2203387 2309394 2410174 2418235 2590997 2665466 2754893 2806289
8105 2806289 2953629 3069403 3128127 3117351 3191196 3415284 3482363 3605662 3810617 3916200
8095 3916200 4097790 4199483 4378539 4515812 4840466 4982849 5332979 5536451 5768424 6084474
8085 6084474 6344386 6665905 6966968 7331067 7750552 8095873 8400113 8828665 9365574 9850885
8075 9850885 10530824 11258161 12152216 13088282 14336830 15921626 17840854 19942854 22742973
8066 22742973 26034925 30619946 36514797 44781774 54204188 59292703 59048934 51639073
8058 51639073 41498102 32198857 26307877 22509731 19815624 17700879 15951682 14581144
8050 14581144 13428226 12269976 11100921 10290289 9677275 9172178 8633738 8116860 7554961
8041 7554961 7156064 6836028 6592466 6338406 6093773 5867396 5655130 5618053 5499599 5278805
8031 5278805 5137776 5025667 4868781 4681607 4574012 4373265 4219272 4185645 4061427 3967793
8021 3967793 3903807 3873604 3790261 3853692 3789216 3731299 3715403 3698565 3792522 3762520 3818523
8010 3818523 3827555 3770775 3772093 3772980 3712419 3653023 3642110 3633636 3588453 3616546 3600181 3622927
7998 3622927 3603270 3704647 3718339 3715852 3861033 3966425 3909553 3847527 3882000 3886075 3809937
7987 3809937 3697104 3616218 3498481 3447456 3403837 3266101 3201529 3106043 3156998 3064998 3025747
7976 3025747 3040642 3039925 2929744 2904588 2876146 2859163 2834717 2780119 2665030 2630328 2476126
7965 2476126 2491891 2370203 2282672 2256614 2223463 2175891 2168185 2173563 2092464 1956646 1986846
7954 1986846 1986705 2060658 1941011 1913026 1889636 1892068 1876966 1854587 1913669 1817100 1824717 1830019
7942 1830019 1879100 1844471 1865301 1871879 1885024 1821184 1869903 1923933 1839753 1913561 1874486 1876090
7930 1876090 1946432 1948037 1957717 1924524 1953272 2031138 2086015 2005683 1999134 1915845 2000791 1932521
7918 1932521 1990763 2017416 1983737 2040076 2041949 2039103 2079800 2051618 2001588 2035409 2022421 2038419
7906 2038419 2047687 2054141 2102784 2172318 2106365 2142073 2091503 2093407 2143241 2142729 2191474 2187308 2192496
7893 2192496 2277639 2330775 2387216 2337418 2309200 2360211 2349132 2409259 2363249 2299073 2286216
7882 2286216 2355031 2332946 2294247 2379516 2339822 2344076 2371468 2424682 2432546 2452793 2444236 2460330
7870 2460330 2498185 2476917 2467059 2477138 2427162 2402024 2395636 2521904 2548485 2504617 2535378 2582276
7858 2582276 2626251 2644170 2668162 2682044 2676748 2765054 2807570 2781410 2765151 2855298 2904527 2878334
7846 2878334 2993277 3010077 3047102 3013310 2992128 3062132 3203949 3185628 3160432 3238600 3310240
7835 3310240 3270592 3397159 3465432 3538384 3612860 3612764 3695245 3742027 3783171 3843037 3928092 3999967
7823 3999967 4095922 4226463 4249789 4380783 4478266 4555107 4653492 4734926 4911689 5073585 5257668
7812 5257668 5423954 5485728 5648936 5738312 5810715 5881180 5983325 6083876 6133954 6209526 6274802
7801 6274802 6376296 6487020 6618566 6762349 6931947 7087665 7330708 7532901 7677718 7894381
7791 7894381 8083474 8271384 8411906 8523953 8642971 8735360 8803696 8917182 9002096 9190806
7781 9190806 9286229 9480883 9620218 9777068 10010698 10231281 10505439 10702901 10963916 11368987
7771 11368987 11677358 11942521 12248665 12608766 12968670 13323362 13684201 14122597 14607697
7762 14607697 15066105 15588843 16161449 16829837 17526052 18238825 18954157 19833477 20798977
7753 20798977 21776091 22714294 23792017 24859330 25940470 27144276 28362213 29450993
7745 29450993 30376633 31282336 32237156 33481341 34884682 36665378 38552458 40468179 42682678
7736 42682678 45055334 47420102 49672218 51746851 53336153 54385442 54870202 55173271
7728 55173271 55624940 56389778 57507474 59011987 60864272 62974556 65511541 68222549
7720 68222549 70952910 73620663 75890070 77910971 79827279 81711129 83741244 85769128
7712 85769128 87555136 88796776 89715442 90708773 92251893 94817089 98003341 101627496
7704 101627496 105230866 107859826 108615951 107199083 103870212 99682646 95730742 92306567
7696 92306567 89544034 87546128 86251615 85575191 85211615 85347194 85962937 86902764 88382415
7687 88382415 90424789 92697493 94976437 96944891 98388333 99367907 100114011 100499013 100584776
7678 100584776 100619598 101016113 101826011 102925643 103662833 103481790 102267150 100539644 98800591
7669 98800591 97459202 96736090 96514453 96772998 97125723 97309058 96865338 95498895 93465383
7660 93465383 90983707 88764016 86907967 85237439 83102841 80421986 77144198 73658663
7652 73658663 70391387 67210559 64017403 60704680 57328930 54160012 51497938 48993925
7644 48993925 46663520 44493930 42413790 40232955 38174107 36224093 34528653 33059766
7636 33059766 31650360 30246206 28811334 27606150 26539950 25426946 24350116 23400912
7628 23400912 22488119 21577604 20700983 20010986 19222954 18480099 17857993 17188691 16663089
7619 16663089 16208192 15703549 15164416 14683815 14237862 13770465 13213466 12853350 12503258
7610 12503258 12162743 11824759 11413050 11107170 10771309 10414875 10085866 9813071 9556808
7601 9556808 9334534 9167719 8914854 8784942 8530672 8280637 8056736 7827983 7652946 7513157
7591 7513157 7320494 7115544 6954184 6814450 6624482 6434824 6371506 6218236 6080046 5973232
7581 5973232 5790844 5674658 5495210 5352829 5204730 5071388 4951090 4870142 4746148 4683987
7571 4683987 4553038 4559236 4461357 4328549 4274709 4184757 4111540 4041563 3910540 3874121 3801078
7560 3801078 3688508 3720258 3570878 3465667 3461086 3397944 3411305 3329561 3245354 3288963 3250722
7549 3250722 3218033 3192146 3214061 3217169 3102847 3053946 3037674 3018823 2976128 2885104 2894896 2877282
7537 2877282 2734339 2711599 2754811 2721914 2727254 2657163 2623283 2571152 2508194 2552624 2483410
7526 2483410 2453376 2528373 2488817 2452227 2400793 2411834 2404809 2310347 2293703 2421041 2347118
7515 2347118 2340386 2337547 2261333 2233576 2137352 2175574 2159863 2202603 2089077 1999813 2007467 1888198
7503 1888198 1884292 1946218 1860851 1848235 1864581 1870455 1868288 1843181 1879578 1832203 1826817 1826175 1755338
7490 1755338 1764666 1773858 1743517 1779164 1799841 1792202 1737420 1724159 1759469 1746715 1683182 1711928
7478 1711928 1696124 1652235 1620860 1600804 1529916 1541720 1605897 1589737 1606829 1681740 1616492
7467 1616492 1670960 1594911 1566489 1571802 1645493 1593031 1609427 1659834 1610936 1615891 1593352 1542015
7455 1542015 1512891 1494565 1560450 1628127 1549051 1443153 1397620 1411450 1419681 1449271 1486898
7444 1486898 1483503 1441543 1521380 1504745 1533600 1544213 1585027 1600813 1586681 1602257 1574964 1556405
7432 1556405 1545604 1551116 1509595 1503430 1442971 1453027 1456199 1440844 1403769 1411983 1389854 1345046
7420 1345046 1340900 1216562 1253120 1266169 1326845 1347308 1336253 1297314 1305864 1249942 1197977 1237727
7408 1237727 1262899 1176902 1179295 1213197 1190158 1140091 1163468 1106376 1110442 1156777 1137898 1139617
7396 1139617 1139189 1173043 1102685 1121025 1065371 1028242 1029050 1031635 1060064 1013799 955465 941745
7384 941745 918177 881283 872734 850194 810763 807156 774319 834711 855941 854968 792897 742286
7372 742286 767683 822221 782440 694535 704751 702073 688579 668847 678117 549500 610198 609289
7360 609289 626224 628251 645440 729576 664121 570725 546693 530333 547770 587786 578490 551963
7348 551963 536239 615444 528479 486432 475551 538762 615155 542497 507586 457414 489619 493802
7336 493802 478610 439099 471482 426174 431444 431885 463645 480360 458295 524681 413081 496610
7324 496610 533488 457943 426715 433246 411247 447915 474430 509046 500988 436679 449479 408669
7312 408669 399235 504484 449749 437586 465987 478819 479234 432777 364802 441753 487214 489598
7300 489598 555438 504078 507009 563078 571534 462682 506689 588405 498513 450893 511871 482537
7288 482537 503610 501422 470998 523354 516199 554328 541369 457722 515728 515546 554035 523904
7276 523904 560755 592322 534225 598877 593911 650459 595753 572621 592063 636399 619310 686348
7264 686348 683500 652341 717171 698627 658026 684845 632897 683791 784821 725527 725453 754280
7252 754280 820183 777789 743556 740853 763907 865637 822197 815776 805810 889885 906530 873897
7240 873897 884575 904382 921299 904682 944323 1039493 1030739 919328 1041363 1079720 1037513
7229 1037513 1137653 1115133 1131870 1191327 1265514 1269012 1270107 1355579 1381526 1441786 1425422 1551422
7217 1551422 1511692 1533942 1554341 1687786 1821942 1856850 1870218 1974410 1951935 2048319 2053686
7206 2053686 2206130 2328535 2325431 2475836 2522119 2739207 2783712 2897900 3066797 3024664
7196 3024664 2980893 2930037 2955650 3023283 3043608 3171596 3324718 3446710 3666957 3904152
7186 3904152 4132698 4316722 4568373 4662870 4698068 4622319 4445201 4303645 4207206 4208134 4243658
7175 4243658 4207597 4198499 4301005 4396036 4529968 4607561 4659824 4703139 4699620 4534425 4432532
7164 4432532 4335674 4134589 3949454 3822418 3748207 3609224 3506772 3365316 3253090 3242066
7154 3242066 3040679 2913784 2805446 2749766 2705677 2646893 2585495 2492305 2398732 2326153 2230772
7143 2230772 2171439 2119089 2030506 2040797 1959437 1801294 1793879 1792054 1807736 1709933 1589242
7132 1589242 1637424 1610713 1549353 1496790 1474179 1447956 1389997 1423015 1346879 1311588 1226100
7121 1226100 1221069 1269431 1282187 1148680 1087346 1144342 1128659 1106889 1167072 1052372 1082066
7110 1082066 1134964 1123923 1092740 931272 896960 936109 949946 975762 983188 925166 903321
7099 903321 875665 883511 864867 843015 973662 934270 854456 937984 846153 814839 879142 827023
7087 827023 882707 889785 893933 891099 861031 844030 894869 904071 899591 896681 874625 838820 789265
7074 789265 788452 770534 833941 896402 990042 907792 861956 798155 799691 753534 842186 882889
7062 882889 831948 906638 876082 857264 832991 896515 934998 946362 945535 924547 951999 890485
7050 890485 952230 982904 1009785 972968 948035 964468 944151 894896 961029 1003742 1004197 965494
7038 965494 964360 935397 966508 1018158 980830 1042534 1029291 999819 1021705 905564 932241 1003036
7026 1003036 943077 967441 906875 930611 998130 971807 919235 937541 959658 1002474 951817
7015 951817 922264 1001381 1006008 987891 922471 895522 1023574 971407 961891 1026594 1008495 968240
7003 968240 990942 1016567 1038974 1011011 1027291 1091440 1047485 1054889 1176540 1275090 1297703 1324876
6991 1324876 1190162 1196467 1319088 1336175 1365289 1380217 1433491 1525174 1607145 1676389 1662157
6980 1662157 1708828 1799085 1838246 1898771 1958099 1948968 1871078 1846272 1913497 1882588 1943300 2014572
6968 2014572 2072542 2146808 2173783 2266147 2322304 2435235 2549261 2437627 2539797 2494592 2502212
6957 2502212 2497503 2433126 2387538 2248769 2197229 2166212 2039597 1932438 1950175 1878909 1868692
6946 1868692 1804883 1906289 1908585 1900686 1924466 1810214 1725590 1750413 1734649 1688027 1629337
6935 1629337 1557524 1485120 1408621 1355758 1255064 1244525 1279809 1144833 1089277 1056596 1008942
6924 1008942 990019 1018734 1006006 1003703 961156 944693 925330 870870 832640 859426 804340 845381
6912 845381 786868 775419 824182 792892 701596 705745 794832 725207 656120 636532 695062 650898
6900 650898 667715 642606 689924 639984 691263 639924 523222 641094 657058 545675 501834
6889 501834 563423 582897 490559 540717 519659 571452 542472 513646 526194 575227 434268
6878 434268 437668 522077 476831 387009 381433 403127 395374 425984 444114 402935 416283 378626
6866 378626 398675 384749 305214 314047 379013 363380 285232 335179 368262 333941 302347 284944
6854 284944 291544 308122 254328 409871 289292 288894 240439 206437 238065 270676 264843 191507
6842 191507 211870 273969 241411 307949 274925 185411 146508 201517 185852 206309 184259 275299
6830 275299 254280 252264 235270 245385 225406 208368 188900 147604 200048 184223 235665 206275
6818 206275 220247 244184 195035 168375 209327 196655 147967 200824 181160 143088 151619 181396
6806 181396 205088 122124 234046 280436 242324 137350 147168 217657 237303 178280 161533
6795 161533 132700 164080 148730 167272 201151 158053 249871 199100 138361 190467 231228 167471
6783 167471 219926 234253 199064 184884 196216 174463 164596 201027 90318 182750 191595 146241
6771 146241 257283 198091 142754 143280 217958 227491 237384 254931 182583 83910 137850 78778
6759 78778 110640 182316 140751 120739 206602 127934 98826 157257 161926 250617 161591 231168
6747 231168 215045 172399 99446 147617 124720 150144 187990 216768 199091 210247 269761 244332
6735 244332 152455 147493 199349 154633 110932 188825 189325 196211 174760 216681 181348 176085 167032
6722 167032 153252 246260 270703 260816 262214 243549 255106 176776 189039 111880 178234 229838
6710 229838 236019 270060 257791 196359 201243 258709 266273 273370 157377 209261 208244 203478 203815
6697 203815 204614 215628 259630 205847 293553 240117 255663 229362 260174 293634 230011 313114
6685 313114 296453 294381 281726 283868 304739 320082 354065 318322 335806 344536 287745 221164
6673 221164 282209 260954 223848 317526 302206 362881 359469 250657 230364 265821 325589 315151
6661 315151 288786 313114 258380 271970 283430 324433 302998 245631 320537 280984 412015
6650 412015 427047 340474 353469 328851 361669 380938 378917 367855 378966 408898 421637 338046
6638 338046 365039 383114 405544 478539 464635 442692 409971 350407 384333 465912 513896 497317
6626 497317 503662 491480 500473 468694 395058 351833 427341 480064 489299 478510 444953 414432
6614 414432 282209 317198 339463 395964 342048 248282 310258 309581 353993 383365 325467 335670
6602 335670 331918 403091 400250 393823 361393 368544 318059 371436 380612 379798 409916 325476 319291
6589 319291 380913 385535 340598 400725 358159 338049 337854 323677 328938 309917 323069 329043 400117
6576 400117 365420 359451 371242 393230 436837 428496 415939 417398 455971 389458 394540 404479 402714
6563 402714 421142 383705 367342 335283 292034 242485 354305 397507 292639 215288 296272
6552 296272 290633 301203 420273 318625 281299 328993 360803 405190 357676 368733 360425 318874
6540 318874 304290 324685 397466 345912 334506 338219 346576 328335 287803 250686 310122 346962
6528 346962 451912 381714 370158 346581 246943 248143 285572 432403 407603 363523 333234
6517 333234 415273 322868 331577 304195 235253 318017 352239 334822 340416 298071 275467 244769
6505 244769 277587 351218 323339 308293 330225 380856 353977 303766 343648 383388 328611 362852
6493 362852 303474 330650 306511 256718 262164 292036 392733 397804 376534 387690 382147 369686
6481 369686 325738 344811 287638 313540 398398 349758 434092 465844 398906 354485 444471 471677
6469 471677 522486 430043 416453 439433 280907 306898 298088 357157 403313 465142 408066 408271
6457 408271 335181 328474 310584 306788 340118 349072 365937 425113 378715 406718 383196 446766
6445 446766 470130 445134 427826 412884 441613 496796 485137 406648 436388 480238 468083 451198
6433 451198 410624 434528 505703 638432 626900 585695 619270 524745 509554 539915 553998
6422 553998 490704 509520 426030 427786 480136 515219 541123 495069 521377 471966 419369 454614
6410 454614 468979 536286 478189 439063 495548 495043 385113 429563 436393 444853 501754 434057
6398 434057 367000 368471 402266 438977 444653 410603 371484 338550 330399 461826 524494 409513
6386 409513 408266 415255 400494 439790 483815 541272 466221 498204 461047 485100 522217 485940
6374 485940 398175 400872 455900 454229 431300 512452 492347 368547 478832 357264 411694
6363 411694 436918 369482 553368 513754 453730 392839 425807 434396 415755 411975 443260 440713
6351 440713 491077 466897 496814 423235 440478 445770 410365 497412 424718 476302 534665 571564
6339 571564 541086 509008 517147 520569 539748 561359 494306 502420 463601 396067 440159 501798
6327 501798 473182 508441 479362 486628 529712 471260 444302 426566 476107 531463 571146 565203
6315 565203 523679 507406 518273 571035 641486 586897 510972 546625 555394 510463 528958 522954
6303 522954 492100 614908 646188 537122 585591 574290 528003 554477 623898 699205 623259
6292 623259 596609 649649 614727 648141 590178 619832 679250 657455 694120 642308 526949
6281 526949 548560 651693 653581 627777 626280 736635 594857 548001 593335 583761 550507 586908
6269 586908 545795 595496 590405 528689 619421 607299 559401 504679 498492 551597 556948 658022
6257 658022 681292 757860 734848 723552 726075 726158 703757 678579 653915 635163 733383 691648
6245 691648 676333 695007 772093 781350 701088 670931 729504 723219 790704 823507 763994 749501
6233 749501 722585 714740 760853 776574 826092 812561 828056 881867 907648 959108 971734 891702
6221 891702 903533 912729 954926 923857 929967 907147 899787 876680 927427 941553 901253 887155
6209 887155 897574 908605 879106 895586 976139 1020842 952675 987472 956750 1002592 1020385 981895
6197 981895 1000368 1020071 985319 974516 1005697 982738 1004504 989893 932937 906548 890187 965787
6185 965787 909081 947528 930685 923698 1058823 940301 984817 1018020 1053937 1012817 938155
6174 938155 967433 950378 972110 943990 948427 995669 1016131 916474 922150 972044 1000017 933520
6162 933520 974195 1011194 996096 998490 962174 968221 960655 914644 804755 879620 977112 888790
6150 888790 952463 974272 933276 887299 891541 940291 901383 929965 849803 853182 990433 1007455
6138 1007455 1004909 944132 873158 956766 1057339 986106 1028354 991844 963695 985822 991646 919990
6126 919990 885237 950095 949621 959774 1029109 1035170 1033103 965992 918287 962258 997072 987607 996792
6113 996792 971665 1014472 995355 1030001 1095817 1056978 1067882 1099304 1084691 1079084 1088433 1106576
6101 1106576 1082620 1081392 1115243 1121625 1132591 1105063 1037233 1069736 1097090 1180011 1214059 1110511
6089 1110511 1104091 1093458 1158206 1202594 1232947 1170351 1192973 1165189 1249264 1264203 1258886 1330996
6077 1330996 1323194 1338807 1377402 1315123 1373701 1339421 1340957 1305059 1329996 1402019 1456124 1431474
6065 1431474 1448252 1485684 1432782 1492560 1533137 1587755 1565391 1519103 1504874 1448682 1440457 1428620
6053 1428620 1520147 1569727 1560813 1480113 1403627 1509909 1509535 1541083 1586830 1557865 1602811 1500219
6041 1500219 1498422 1534055 1541999 1468243 1399855 1472410 1433945 1402206 1454655 1514444 1513113 1518239
6029 1518239 1538190 1495840 1535488 1529875 1567356 1611448 1544688 1601386 1648226 1656341 1645685 1601820
6017 1601820 1560679 1597442 1729830 1714846 1690341 1718039 1734059 1762095 1798460 1853584 1855047
6006 1855047 1800790 1765630 1875876 1929227 1975422 2026351 2010768 2049100 2080788 2070472 2108955
5995 2108955 2165833 2215022 2254829 2328167 2319279 2286321 2332925 2347952 2458668 2526993 2589443
5984 2589443 2639181 2772408 2882692 2864713 2977912 3028141 3194350 3288966 3388421 3383188 3327424
5973 3327424 3384194 3472523 3617431 3729037 3800619 3856669 4096822 4237837 4442695 4689659
5963 4689659 4789042 4922049 5137106 5380593 5557266 5805678 6045507 6246077 6369928 6439486
5953 6439486 6594071 6701075 6861040 7123079 7508701 7862272 8334616 8911395 9549825 10314499
5943 10314499 10933321 11541396 11874202 11796817 11293595 10785553 10073612 9498783 9093345 8915792
5933 8915792 8900914 8891117 8976925 9112928 9427278 9712727 10035359 10332981 10620338 10830628
5923 10830628 10783467 10753114 10680278 10587515 10589449 10643411 10794586 11162455 11470885 11724471 12181025
5912 12181025 12704621 13194699 13572961 13759946 13830606 13772793 13513739 13268188 13110271 12808074
5902 12808074 12537198 12382301 12194474 11996182 11882304 11864116 11934888 12013945 12163147 12362554
5892 12362554 12392258 12362403 12181519 11650408 11124882 10536255 10154152 9630053 9310850 9069873
5882 9069873 8832434 8603043 8349528 8190645 8057719 7895957 7856307 7709673 7657346 7622842
5872 7622842 7475772 7467742 7338776 7332469 7304311 7280131 7237774 7249286 7175515 7109016 7028585
5861 7028585 7039177 6966524 6988153 6927626 6980405 6910337 6926224 6932499 6922645 6897148 6981613 6997522
5849 6997522 7013746 7102313 7185525 7269195 7375704 7416486 7420605 7512713 7544918 7612754 7632806
5838 7632806 7634982 7833167 7887526 7886747 8030230 8104674 8276790 8412794 8512602 8684429 8804695
5827 8804695 8947398 9054432 9232909 9286857 9368210 9579588 9567367 9769287 9975544 10053012
5817 10053012 10181415 10295080 10410238 10598220 10786513 10928057 11051045 11202307 11347169
5808 11347169 11472753 11659154 11749229 11971654 12151647 12320042 12553634 12673164 12869091 13090274
5798 13090274 13272108 13593821 13900160 14255020 14529785 14802461 15240695 15747567 16178496
5789 16178496 16658890 17277284 17924943 18539891 19264627 19974325 20661490 21521291 22276713
5780 22276713 22909701 23399021 23815827 24064783 24157572 24204729 24239321 24303954 24456171 24691142
5770 24691142 24925291 25411717 25872365 26392365 27078194 27699528 28471534 29391213 30285891
5761 30285891 31288920 32357338 33481253 34611672 35791079 37172226 38530644 39967114
5753 39967114 41665900 43430632 45265483 47364957 49520396 51860964 54521646 57359081
5745 57359081 60333552 63776282 67683020 71848252 76331481 81409910 87026669 93482263
5737 93482263 100909579 109392075 118296883 125777143 130837762 133076101 133828582 135034678
5729 135034678 137947535 142875549 149668136 158366176 168865742 181104478 194592546 209251653
5721 209251653 224724713 240791106 258070112 276880027 297367539 319665203 342621274
5714 342621274 363570116 377039216 380334109 374350976 363800158 354948855 350264619 347654327
5706 347654327 344882799 341885215 341118332 343348039 343808712 337614953 322403818 301110606
5698 301110606 279654648 262403804 249337982 237480786 225024009 211153395 196583432
5691 196583432 182700253 170458931 160091955 151475660 144212709 137799689 131956767 126513127
5683 126513127 121385267 116589846 112201621 108378575 105078470 102134916 99468585 97040468
5675 97040468 94753739 92665869 90703007 88742681 86894033 85002373 82985893 80929145
5667 80929145 78734369 76346825 74004707 71631651 69518108 67521737 65714566 64028140
5659 64028140 62424034 61046866 59949946 59183764 58429069 57774625 57065629 56204164 55119342
5650 55119342 53864315 52303546 50642841 49082466 47623566 46290985 44981252 43893208
5642 43893208 42802283 41863754 41119060 40442982 39902458 39519082 39169372 38813287 38417260
5633 38417260 37942931 37292660 36540584 35649555 34672848 33635621 32639606 31729132 30978205
5624 30978205 30380708 29874833 29430431 28984900 28680641 28296494 28105593 27901671 27677525
5615 27677525 27664891 27582063 27620341 27708401 27794631 27922435 28088918 28251434 28354622 28399914
5605 28399914 28401881 28395543 28516298 28673030 28931851 29184089 29553363 29883870 30188098 30607782
5595 30607782 31066462 31564933 32157388 32671267 33258112 33918229 34616468 35455374 36294268
5586 36294268 37381834 38565827 39973778 41432222 42978207 44830783 47172686 49895743
5578 49895743 53199352 56951201 60881210 64726592 67252761 67823250 66351071 63146993
5570 63146993 59241462 55635162 52753837 50443817 48731698 47448817 46231933 45274550
5562 45274550 44408623 43649368 42906823 42281868 41820968 41508149 41328228 41230638 41228640 41280203
5552 41280203 41353810 41469238 41509021 41655198 41962853 42376389 42804923 43283643 43731267 44068419
5542 44068419 44305535 44386437 44109639 43742901 43281057 42800627 42458440 42213931 42056253 41955752
5532 41955752 41948813 41768508 41690094 41622472 41657785 41735013 41901076 42226568 42583988 42977707
5522 42977707 43426619 43877838 44120431 44365175 44363100 44118701 43806276 43663531 43549486 43584350
5512 43584350 43825740 44045730 44258096 44390251 44367240 44078581 43727492 43217315 42754865 42474897
5502 42474897 42377704 42341340 42372059 42490124 42775515 43138665 43575729 44042573 44729584 45485625
5492 45485625 46414011 47402519 48429049 49487706 50470999 51271020 51863900 52070789 51922028
5483 51922028 51335828 50329549 49223174 48089353 46977306 45968437 45228877 44668800 44345148
5474 44345148 44140982 44235591 44470040 44915485 45603703 46646056 47630020 48577269 49441875
5465 49441875 49896354 49996367 49665258 48997397 47986387 46784756 45328708 43829460 42208897
5456 42208897 40611671 39072225 37757780 36539240 35464611 34486072 33693664 32978833 32356852
5447 32356852 31947543 31633378 31491293 31322917 31201754 31100299 30915074 30471165 29872153
5438 29872153 29003841 28087745 27088469 26038018 25136034 24333516 23691331 23025056 22530704
5429 22530704 22091443 21533424 21140774 20759039 20446397 20112788 19879311 19670628 19475965
5420 19475965 19341990 19115287 19053259 18975108 18862739 18867692 18876429 18802415 18657750 18613295 18555031
5409 18555031 18505027 18538085 18692611 18808664 19014501 19204295 19410454 19634694 19867832 20178170
5399 20178170 20479667 20944562 21362981 21856711 22476584 23151107 23872992 24624666 25596249
5390 25596249 26770222 28005898 29451014 31151200 33219561 35807159 38885200 42556396
5382 42556396 47060821 52485827 58982302 66572682 74474617 81030647 84199280 82438560
5374 82438560 76309328 67702606 58905039 51252173 45187877 40435215 36689595 33668713
5366 33668713 31122327 28896492 26857334 25109237 23591409 22262009 21122124 20008441
5358 20008441 18998178 17997035 17011878 16281205 15604709 14919259 14372031 13907712 13491557
5349 13491557 13203254 12711289 12307016 11917109 11536814 11251917 10940338 10625144 10289640
5340 10289640 9972606 9774488 9497069 9229890 8974652 8600709 8472437 8361432 8101322
5331 8101322 7849987 7729461 7579240 7374823 7235364 7099779 7006973 6923995 6782661 6718857
5321 6718857 6614646 6550221 6480090 6470483 6452487 6402366 6387204 6421732 6498703 6499310 6380728 6256190
5309 6256190 6226200 6114983 5846726 5729103 5587714 5480539 5320873 5182285 5130524 4986047
5299 4986047 4921679 4760138 4714088 4675063 4605446 4485018 4376252 4366679 4289072 4203218 4061079
5288 4061079 3958516 3960401 3906716 3830576 3772351 3798927 3770321 3787562 3688991 3555140 3527952
5277 3527952 3559108 3516757 3482009 3416924 3408709 3417795 3361345 3352707 3421931 3319390 3370279 3358613
5265 3358613 3283607 3214884 3274861 3309714 3286245 3244101 3244294 3266543 3303300 3286964 3161004 3240089
5253 3240089 3239264 3301748 3340131 3331629 3348113 3386382 3464781 3467172 3490531 3445814 3481001 3510967
5241 3510967 3528395 3707728 3676141 3590968 3615359 3544475 3460330 3471662 3494312 3464961 3448568
5230 3448568 3441709 3462704 3465933 3478056 3388172 3498163 3463007 3431766 3493258 3395198 3392190 3365646
5218 3365646 3367444 3326746 3334898 3345514 3339084 3295139 3299737 3331779 3334504 3306559 3340064 3314609
5206 3314609 3311615 3321379 3324601 3305462 3361439 3434929 3444200 3401114 3368846 3447578 3515639 3494002
5194 3494002 3415283 3363473 3517751 3483767 3428040 3379604 3418824 3462640 3487990 3515907 3542721
5183 3542721 3515216 3559527 3663916 3733262 3779243 3834282 3837739 4038340 4181719 4218434 4245412
5172 4245412 4255299 4214451 4176235 4127338 4081005 4062836 4095775 4107892 4083968 4111175 4156281 4170034
5160 4170034 4158461 4233297 4303820 4410287 4383958 4409927 4461587 4547563 4577424 4692797 4746726
5149 4746726 4817438 4932532 5112584 5194305 5329132 5523198 5685292 5863982 6044483 6106871
5139 6106871 6228314 6357593 6423024 6422919 6434124 6488901 6490387 6516379 6547418 6660133 6756848
5128 6756848 6900930 6920406 7055569 7140795 7199167 7362208 7557702 7621646 7622385 7647260 7654618
5117 7654618 7688982 7726312 7810416 7879863 7908420 7942594 8007958 8141215 8316258 8478380 8557479
5106 8557479 8637208 8718196 8765800 8778159 8786898 8845373 8990067 9079602 9129252 9248599 9435414
5095 9435414 9581914 9724328 9807039 9881266 10117394 10358622 10549926 10655653 10795969 11031157
5085 11031157 11334973 11554750 11824199 12097366 12345855 12564827 12916757 13320569 13532343
5076 13532343 13877471 14267348 14624588 14993808 15421787 15803398 16195087 16639732 17085442
5067 17085442 17562339 17869468 18108712 18359094 18702734 19070434 19510344 20013640 20533812
5058 20533812 21029442 21701006 22433264 23088828 23889774 24626319 25452649 26355070 27183668
5049 27183668 28006074 28926857 29713985 30443571 31372402 32189193 33119703 34059423 35063572
5040 35063572 36222464 37342099 38504402 39642294 40824769 42088675 43188168 44260543
5032 44260543 45414031 46418289 47290655 48036677 48610346 48888475 49043692 49201262 49479088
5023 49479088 49872511 50296071 51039383 52046201 53295004 54830922 56746598 58756982 60943669
5014 60943669 63320342 65803565 68307847 70578444 72642415 74492464 75847506 76676859
5006 76676859 76815359 76262788 74850734 72944719 70736170 68578369 66575731 64845389
4998 64845389 63592465 62785044 62162962 61833532 61736631 61624464 61887253 62356430 63057490
4989 63057490 63997354 65197871 66508289 68113212 69720437 71222396 72407067 72870495
4981 72870495 72453511 70872387 68247925 64803789 60999212 57280122 53715026 50773619
4973 50773619 48324419 46219900 44453161 42941580 41688184 40590282 39705844 38852083
4965 38852083 38369020 37995455 37758093 37744926 37789073 37961319 38160464 38092290 37753982 36947240
4955 36947240 35659572 34175758 32504499 30824548 29255641 27852278 26622436 25571428
4947 25571428 24592026 23736407 22960217 22321884 21660257 21041270 20421863 19826879 19296593
4938 19296593 18824554 18323522 17946155 17556750 17105117 16699330 16310137 16081767 15697182
4929 15697182 15473148 15216989 14907225 14709846 14450592 14258512 14018182 13855094 13774562 13595080
4919 13595080 13439306 13349800 13148210 12988296 12823951 12724294 12527940 12395920 12270299 12113141
4909 12113141 11957553 11883346 11760696 11720303 11681337 11664743 11629496 11631196 11613186 11573463 11572782
4898 11572782 11583678 11633596 11614993 11641270 11675220 11626480 11639649 11648949 11634823 11766565 11873850
4887 11873850 11898075 11998560 12056719 12141870 12243109 12383801 12491988 12596840 12722778 12952651
4877 12952651 13214228 13391012 13547722 13680062 13841746 13868642 13933298 13957439 13927848 13853028
4867 13853028 13886820 13978222 14018799 14096332 14132725 14204437 14424343 14553732 14682919 14963836
4857 14963836 15266684 15511920 15618611 15866662 16041455 16099177 16140279 16066475 16065256 16127038
4847 16127038 16075711 16047851 16173541 16222659 16243850 16150642 16038319 15767563 15556330 15423889
4837 15423889 15354883 15392639 15442668 15472752 15533619 15640723 15694070 15819070 15877295 15886936 15880226
4826 15880226 15921990 15877800 15743415 15716799 15726786 15743434 15780985 15911932 15993059 16085574 16207069
4815 16207069 16282003 16361536 16464376 16459190 16528817 16596344 16730340 16897299 17197539 17470107
4805 17470107 17735199 18033928 18390619 18713555 19005685 19197188 19342191 19469646 19634956
4796 19634956 19987873 20242228 20433385 20654143 20930746 21099482 21263974 21594471 21784606
4787 21784606 21852428 21879949 21920517 21877252 21770271 21735358 21657404 21447272 21201559 21047953
4777 21047953 20778175 20540757 20427016 20334392 20228019 20160794 20099458 20208833 20261659 20335539
4767 20335539 20245865 20112598 19992246 19759655 19506025 19300400 19119165 18797330 18477197 18274689
4757 18274689 17958191 17664601 17480716 17316227 17191409 17094207 17027792 16932913 16813867 16767339
4747 16767339 16694570 16540389 16443118 16387747 16289750 16060427 15875051 15566094 15242522 15027958
4737 15027958 14837828 14732148 14644746 14577663 14591581 14487791 14314728 14069432 13826536 13526691
4727 13526691 13262170 12888741 12612423 12382927 12165164 11920375 11723228 11465716 11349232
4718 11349232 11207284 11100786 11018079 10877176 10884468 10871420 10867127 10672945 10581428 10428550 10316832
4707 10316832 10169798 10038794 9923922 9801208 9757184 9726177 9712451 9640834 9618265 9651055
4697 9651055 9616106 9540067 9592833 9570442 9471928 9491153 9542013 9483500 9483218 9516485 9542408 9560186
4685 9560186 9533689 9585384 9554547 9676045 9716733 9777715 9885885 9813546 9880003 9898292 9877991
4674 9877991 9932543 9996670 10132748 10092838 10118424 10096560 10039456 10066459 10078240 10108486 10214316
4663 10214316 10247372 10334875 10414486 10473860 10631025 10709946 10685607 10747948 10783427 10754291 10638445
4652 10638445 10567683 10540733 10466747 10364806 10208184 10044447 10012652 9950500 9825072 9724368
4642 9724368 9679611 9545581 9419094 9292301 9175803 9022672 8917588 8790207 8635515 8456750
4632 8456750 8263779 8201158 8002490 7895538 7704608 7597767 7477303 7392641 7161007 7047665
4622 7047665 6908359 6866580 6758930 6644606 6534635 6479810 6400884 6344345 6384579 6236027
4612 6236027 6302061 6257293 6206930 6099498 6016661 5971293 5925326 5908916 5911371 5801520 5852670
4601 5852670 5775183 5713271 5743465 5683571 5739322 5666868 5603229 5602292 5559780 5570673 5624648 5613913
4589 5613913 5521326 5522794 5488073 5534241 5591001 5621121 5624624 5726349 5754133 5678742 5660125 5794660
4577 5794660 5811750 5829810 5852955 5828763 5871251 5891307 6038605 6091215 6188852 6268514 6361936
4566 6361936 6403174 6438068 6486288 6558053 6548711 6547513 6618198 6620144 6643169 6681127 6733150 6818250
4554 6818250 6927044 6982643 6975116 7053293 7213708 7300891 7376404 7522618 7640083 7734063 7762569
4543 7762569 7811471 7798248 7763640 7792791 7744846 7751921 7803658 7771731 7769251 7812269 7875586 7978793
4531 7978793 8057321 8149405 8372465 8333337 8396037 8520824 8578049 8691566 8866193 8846342 8738982
4520 8738982 8673790 8539553 8452640 8453332 8465599 8366000 8279091 8268243 8302682 8347587 8409070 8353244
4508 8353244 8448117 8575605 8608951 8640546 8737003 8838039 8788396 8872225 8937297 8892666 8877367
4497 8877367 8894307 8947497 8961701 8922761 8946224 8990838 8983609 8962637 8985968 9014637 9038649 9017656
4485 9017656 9094523 9166049 9188837 9147976 9245560 9182246 9175640 9213060 9214836 9187855 9139159 9175751
4473 9175751 9155567 9160469 9112016 9155412 9145719 9122908 9210789 9211583 9239147 9255510 9288838 9305885
4461 9305885 9400998 9513423 9582131 9653194 9879063 9985681 10101671 10214562 10304158 10436465
4451 10436465 10440138 10492862 10588200 10651427 10676316 10745708 10770740 10847231 10911249 10963681 10907759
4440 10907759 10948934 10977847 11079486 11156548 11192911 11345112 11461439 11482115 11536874 11571530 11572974
4429 11572974 11378173 11243664 11115622 11093422 11050045 11051521 10941321 10997598 11053813 11044773 11079075
4418 11079075 11231235 11449689 11574113 11771455 11928548 12156780 12259153 12344075 12438941 12491906
4408 12491906 12514458 12420670 12239127 12124042 11950904 11834600 11735922 11636648 11628563 11564800 11485922
4397 11485922 11510406 11502061 11419961 11415402 11453978 11492982 11610979 11705438 11770202 11910845 11857700
4386 11857700 11784916 11739335 11722602 11680258 11735190 11777986 11838841 11933725 12025580 12192725 12345425
4375 12345425 12480864 12577632 12776717 12786393 12932971 12971172 12979718 13071007 13111898 13220939 13283238
4364 13283238 13354826 13306937 13372452 13542029 13699967 13690956 13775714 13834870 14011635 14161204 14238743
4353 14238743 14429498 14622988 14651621 14787112 15043524 15303362 15448791 15612497 15765567 15974169
4343 15974169 16228732 16436885 16702627 16772187 16923009 17062719 17190931 17330084 17418454 17521314
4333 17521314 17484554 17573553 17635594 17649800 17719462 17814948 17826871 17794537 17820219 17764896 17872653
4322 17872653 17875073 17980558 18040237 18060490 18120932 18233253 18332472 18314227 18463150 18550527 18589623
4311 18589623 18661767 18675062 18799517 18937515 19059709 19148399 19232180 19274783 19406200 19491715
4301 19491715 19664825 19664801 19690460 19699947 19755439 19802976 19926609 19999237 20056697 20194251 20290485
4290 20290485 20328575 20447874 20675036 20810295 21036354 21173241 21329267 21496104 21721478 21924865
4280 21924865 22016175 22145168 22208946 22343538 22496102 22604055 22737995 22874005 23005127 23114736
4270 23114736 23306543 23444796 23541092 23770431 23932511 24140413 24292763 24443773 24609286 24681379
4260 24681379 24913975 25012062 24935506 24831389 24793697 24689253 24605147 24563674 24505645 24442738 24408355
4249 24408355 24411198 24363286 24315515 24213511 24199117 24195490 24060440 23915522 23827951 23668624 23451664
4238 23451664 23173068 22903108 22690771 22445959 22136795 21947789 21795799 21582724 21355843
4229 21355843 21168358 21017289 20930038 20754320 20550746 20384950 20241527 20119718 20032018 19840728
4219 19840728 19680677 19506711 19383322 19255320 19017140 18853372 18679848 18555757 18359210
4210 18359210 18265491 18038261 17938540 17769948 17686711 17583742 17488219 17407314 17243830 17120538
4200 17120538 16991508 16914807 16754152 16615057 16466543 16359208 16228411 16162077 16049361 15915533
4190 15915533 15715701 15619567 15531422 15456717 15405260 15234909 15197095 15102213 15058355 14980359 14927890
4179 14927890 14771457 14676963 14672373 14674869 14579846 14512729 14466169 14356762 14301537 14232099 14215941
4168 14215941 14141286 14099940 14149152 14123003 14116733 14151717 14172398 14148832 14122572 14146987 14175328
4157 14175328 14175505 14248959 14325744 14398024 14503416 14517608 14622353 14744502 14868044 14905303 15063802
4146 15063802 15225161 15282999 15484649 15524095 15666305 15877878 15993726 16174955 16323373 16494189
4136 16494189 16639757 16850028 17014822 17125163 17339158 17443653 17603587 17740441 17748501 17758101
4126 17758101 17743779 17706356 17646067 17583323 17487329 17390149 17227295 17064395 16928508 16846496 16645084
4115 16645084 16444130 16248804 16001029 15802046 15603125 15487106 15299656 15150494 14971810
4106 14971810 14860386 14709644 14642897 14551075 14357679 14179564 14140529 13995996 13857575 13704280
4096 13704280 13637827 13551262 13426876 13387456 13334293 13308562 13312321 13326676 13276812 13204342 13236930
4085 13236930 13253625 13241370 13220778 13217509 13300998 13312056 13298137 13357337 13392235 13431923 13462161
4074 13462161 13567117 13741380 13749533 13815178 13786955 13805083 13799906 13837403 13869804 14062201 14102634
4063 14102634 14148568 14207148 14292467 14376187 14356834 14404367 14478302 14547309 14505654 14539809 14527675
4052 14527675 14473532 14452760 14420107 14346137 14303434 14223109 14166429 14108021 13947841 13836005 13716137
4041 13716137 13612983 13426654 13253363 13110825 12900886 12684029 12476691 12275849 12033295
4032 12033295 11917113 11792660 11544958 11360779 11118995 10911898 10704466 10439683 10182354
4023 10182354 10010273 9786359 9714345 9537676 9332294 9146231 8940457 8817351 8645605 8507187
4013 8507187 8330326 8156329 8057296 7927689 7766931 7638024 7557884 7450935 7333332 7269791
4003 7269791 7202290 7101242 7141483 7070474 6972513 6892576 6799846 6789194 6850949 6724457 6698677
3992 6698677 6683651 6681794 6695368 6593207 6634818 6523246 6551746 6473815 6463572 6395904 6467670
3981 6467670 6446216 6441547 6564099 6534602 6587759 6644306 6688390 6726382 6804214 6895728 6914895
3970 6914895 6919551 7149611 7294129 7458954 7567864 7695203 7829732 8118178 8162538 8250490
3960 8250490 8242762 8248648 8294543 8185441 8181417 8183727 8224618 8216483 8358528 8549378 8704964 8965560
3948 8965560 9224834 9362048 9493065 9554792 9607364 9594454 9421987 9229784 8988784 8629573
3938 8629573 8346121 8053251 7749030 7348245 7104035 6913346 6780216 6580367 6426058 6234712
3928 6234712 6203143 6139010 6128026 6076144 6087922 6122474 6116924 6166645 6158502 6228741 6400191 6422712
3916 6422712 6406205 6381519 6326323 6138943 5935188 5829368 5749430 5727637 5758522 5705549 5700762
3905 5700762 5639747 5606984 5532097 5638885 5695250 5672826 5701693 5757792 5863539 5960583 6225859
3894 6225859 6402154 6468616 6609867 6693228 6782186 6990936 7142638 7390907 7788596 8164156
3884 8164156 8656103 9235830 9752661 10450291 11249573 12014532 12673253 13120619 13200821 12927243
3874 12927243 12309938 11450440 10545414 9810828 8965846 8253405 7719294 7236664 6831760
3865 6831760 6415120 5951804 5664822 5372482 5165997 4874486 4667581 4491468 4359877 4212645
3855 4212645 4003974 3959982 3849964 3667551 3663803 3546633 3401956 3338669 3241576 3174365 3092653
3844 3092653 3040524 3018640 2956148 2892099 2801356 2715961 2654471 2538976 2493803 2456648 2396526
3833 2396526 2321122 2361554 2295400 2242606 2188303 2034279 1985738 1905131 1894527 1884171 1868720
3822 1868720 1808624 1772300 1785492 1713520 1629382 1614158 1617773 1575601 1450373 1483880 1455791
3811 1455791 1365668 1458936 1407860 1359016 1386357 1362886 1363544 1314359 1285600 1204301 1217598 1265282
3799 1265282 1255504 1221661 1167266 1167594 1190750 1121819 1164521 1148758 1066886 1071204 1114538 1052732
3787 1052732 1036015 992129 1056015 965806 889182 921138 790513 857570 923385 932140 805260
3776 805260 826271 846600 859002 836614 818610 775018 833709 832841 707108 730673 759715 720163
3764 720163 712389 711569 801302 791817 796013 836013 792581 745078 756068 671866 663781 645327 669558
3751 669558 749183 723072 629568 741545 741060 700290 705598 720197 701914 663687 645791 644943
3739 644943 687164 636197 630755 616279 636464 692683 671279 635898 630727 622498 584756 638343
3727 638343 593623 612259 647040 617531 653067 635495 647121 618802 686368 738699 654182 633644
3715 633644 676768 694747 708751 754462 773755 730370 761219 723214 725732 685959 732243 668320
3703 668320 662430 675352 701568 671411 633896 699407 652996 696904 627435 596174 637757 644391
3691 644391 678480 676830 705438 738461 745082 690315 677585 544431 554789 573038 662565 705701
3679 705701 610999 626630 616246 603232 658907 759621 725054 638780 560988 550157 532169
3668 532169 636368 698196 621412 624653 576368 568249 638260 638159 644428 636115 557252 608030 545035
3655 545035 500496 550090 556640 590645 590894 483791 518311 524093 446715 497412 452138 305109
3643 305109 397343 361723 332916 342362 407071 319068 298149 363387 260493 264853 254272 246722
3631 246722 200442 307130 275493 283858 385258 334309 286218 332928 284378 266402 228210
3620 228210 217843 190986 187894 293768 314805 266041 211194 183641 140242 104688 66807 131893
3608 131893 177512 76120 121997 191611 169589 115691 184563 161551 150074 85388 110016
3597 110016 205877 216278 122274 68136 125863 180816 136054 108683 67181 77976 15980 115095
3585 115095 112888 155096 105204 88268 151080 172351 176498 153768 139029 76796 67902 130585
3573 130585 85642 111537 136669 94884 93714 55191 92356 59986 132998 77371 154552 144979
3561 144979 146540 100167 64805 83142 137578 121446 47445 75740 91084 139628 109554 103042
3549 103042 73829 98556 55965 43509 91357 63468 103974 20956 56603 12901 75073 123824
3537 123824 9098 36416 47632 65510 65277 27562 76545 112825 90915 29233 88675 101721
3525 101721 60772 41368 -6592 49397 50788 101150 110533 26307 -328 41869 77324 122977
3513 122977 76540 -15630 56420 61023 102468 35223 74010 30636 -66532 16842 67923 34607
3501 34607 72176 16430 -50342 -30849 -32119 52581 46341 28303 13851 20777 29136 4971 -34631
3488 -34631 -8713 14333 30538 56884 36517 -8185 -9206 58098 64989 92301 36634 26406
3476 26406 75649 24048 7057 74109 67764 27210 -4478 -33738 -46256 4715 12395 31510
3464 31510 -1955 -2910 20114 58239 61898 -19934 -106395 -38323 67371 77281 71789 121091 30221
3451 30221 19782 29065 -26279 -34903 -92862 -32108 34544 45034 -13406 -3243 7346 9389
3439 9389 8593 -16616 27737 -21041 -47767 18517 6341 -1631 -86291 -82235 -46090 -32040 -81466
3426 -81466 -91107 -1635 -16866 -85791 34053 84600 83128 72616 53963 97266 74712 38204
3414 38204 23437 5405 -22649 -11600 39046 51965 48044 -37805 -49032 -38103 -47219 -84723
3402 -84723 -70146 -32432 -9619 7458 -17458 -49322 -47258 -31649 -8510 167 -48339 -36694
3390 -36694 41033 118083 65819 -26510 -2802 -2419 -29197 -68777 -2229 42463 81008 7404
3378 7404 -2270 17004 -4677 -98232 -76646 -18957 39803 602 25271 30275 5635 -70077
3366 -70077 -75873 -54322 -8482 -681 -25272 -56709 -74005 -23806 -338 -60518 -33105 -6113
3354 -6113 -16002 -39878 287 -31585 2970 36104 -4054 44285 27401 56245 -34030 51615
3342 51615 -49176 -45335 -24052 -9212 53307 13948 -57596 -94015 -86292 -64605 -54508 -8627
3330 -8627 -42915 -79209 -32685 29702 -41872 3896 -36245 -47341 16150 -11088 -25958 7785
3318 7785 -25284 15212 43677 -4684 -6689 18716 53957 19180 -4007 23572 -50919 -40247
3306 -40247 -24009 35820 83098 86551 3616 -21715 -1037 -3165 -28482 -48873 2634 -24866
3294 -24866 -24493 5515 -17686 24517 32038 6988 21090 -38202 -27204 22636 29783 32446 65957
3281 65957 -19697 -463 44917 -8579 42583 -23845 -27321 -10530 9443 45938 58006 73351
3269 73351 -39722 -66241 16825 38858 7499 21242 23794 9822 72066 104758 50006 12908
3257 12908 -48693 -58309 -25622 18220 93169 -8105 72004 7612 -49781 -42824 -154519 -115139
3245 -115139 -67 77957 35320 13008 -39036 31921 53096 34186 -12227 -4657 44654 -1574
3233 -1574 16103 -17742 -68151 -58713 -46240 -63347 -91878 -8485 -37788 -49325 -20417 6054
3221 6054 -4203 50102 30368 10924 57907 66071 52538 21632 19572 29391 47313 -14584 9356
3208 9356 46422 47117 29514 23847 27015 64112 30814 43798 126063 77044 22051 50174 -7752
3195 -7752 -8777 22190 1120 104026 152141 123523 66142 68648 49318 45828 -29117 13248
3183 13248 26 80795 58609 9485 84072 94638 72574 84630 97297 91839 90464 42782
3171 42782 56547 115326 111480 150835 145017 105988 139308 143426 98765 118320 108930 110197 56626
3158 56626 89477 111038 167288 122276 18515 100232 166583 160960 158307 124168 119879 81821
3146 81821 97046 136918 226245 228135 161949 171323 195167 216082 216462 185155 243528 250210 234760
3133 234760 371599 395862 393250 325629 338806 405029 442486 399568 433790 387710 545515
3122 545515 675422 759882 675105 634145 706073 735128 795534 863134 868172 915074 991624 1090003
3110 1090003 1148410 1150948 1163371 1256717 1416096 1446067 1574731 1674770 1826928 1978584 2120217
3099 2120217 2331550 2569723 2813385 3131206 3487178 3922278 4463300 5230108 6235792
3090 6235792 7513256 9178264 10358397 10701526 9783989 8061396 6322129 5164126 4421747
3081 4421747 3887655 3418579 3055636 2818953 2650511 2479366 2256967 2030318 1837481 1663702
3071 1663702 1585948 1427823 1394456 1314848 1133279 1097991 1042749 970413 932369 917577 935063
3060 935063 861049 816354 741625 724894 718169 597245 662631 668326 587642 480259 480850 522784
3048 522784 589087 542727 563076 485261 476197 418284 366527 366062 388204 371881 354580 304912
3036 304912 224911 252605 295043 262366 261293 304976 264489 215333 150021 191768 224344 228563
3024 228563 236721 222239 148436 91948 165653 101701 114105 170564 201202 76945 38042 123327
3012 123327 83913 71940 85200 86844 111692 75974 153500 99142 69727 45455 34479 58827
3000 58827 82430 65406 35852 59769 118263 72643 12597 71903 35484 51799 64803 85605
2988 85605 75751 139721 -2573 39809 31215 25020 40311 -7337 18586 -37399 13007 -23515
2976 -23515 8872 24453 14811 -92589 -73216 55150 4805 64530 27282 -43585 -8608 2684
2964 2684 -31467 -14336 58263 35644 21037 69204 46299 -26530 -40268 -41983 -39589 -105321
2952 -105321 29552 -49540 -77494 2142 53689 28568 23717 48744 30217 5576 26180 65191
2940 65191 -32138 -35304 -34345 -31219 -29069 61253 47984 -17843 -28784 26457 -15997 -40079 -38357
2927 -38357 -16679 33001 14593 -53515 -18817 17033 645 36113 -6293 -49601 -72593 -46679
2915 -46679 46867 -15982 36040 4041 18040 -32534 2728 6774 -6239 4306 -36501 -30411
2903 -30411 -36268 6577 44649 -9734 -8617 -44778 -41683 19421 -77961 -11608 19395 45210
2891 45210 19550 72379 31064 45210 35519 66552 68092 57234 87718 136116 -3423 -31289
2879 -31289 29079 -33980 -6920 4666 -6126 -90820 -37201 42394 68830 17335 -6746 -3739
2867 -3739 52127 15290 43871 -5948 -2610 23257 -9353 -28810 -25239 -28001 -29669 18034 23004
2854 23004 18219 -37208 -41068 -12507 -81662 -69465 -62128 -103275 -34162 5212 46879 38927 44079
2841 44079 56659 14364 -46814 -107358 -40127 17842 -2563 64825 18540 -33047 -30377 5051
2829 5051 9452 70701 91288 92961 77595 25663 3754 -25984 38436 47324 22631 -13157 -8279
2816 -8279 1795 -36346 20030 20834 -3808 -38595 -32752 -96884 -89428 -30468 14681 39938 1423
2803 1423 21772 22934 74938 90689 -30075 -28604 10763 29662 66141 23433 75354 -10564
2791 -10564 28481 -5053 -45403 133 -14096 -43857 51080 328 -35874 -9378 -41755 -32925
2779 -32925 -45054 -18345 12820 55820 99014 79968 10678 -34042 21859 25631 -12050 -8887
2767 -8887 -37399 -23667 -26622 -15141 9116 37668 -20498 -7366 30822 -10536 -67747 -56774
2755 -56774 33858 51038 19564 4265 26961 -15736 -58136 -37374 6979 -43596 -40216 -9134
2743 -9134 -6090 31581 22380 4968 -34193 -37828 -21886 -21736 -60969 32315 -11686 -113129 -48404
2730 -48404 -62703 -33038 -8033 -22902 -28723 10903 36415 -45504 -73291 -77132 -407 49103
2718 49103 -5923 -90328 -105219 -72276 -44622 -36798 13842 -10180 31925 -1258 13337 1687
2706 1687 -18084 -38280 -50031 -72424 -31039 -24152 -18363 -33733 -98225 -90680 -71184 -34882 -29132
2693 -29132 -123180 -72251 -19618 -50186 -119683 -139175 -79551 -16885 67582 38353 20121 -10291
2681 -10291 21852 7186 -13836 -66093 -59379 -36079 -69371 -55644 -26532 1102 -41066 -12288
2669 -12288 4556 -13652 75346 49211 12984 58118 -26912 -29080 -26617 -71837 -77369 -85107 -17398
2656 -17398 -53744 30969 14511 -29215 -80696 -69243 10096 19868 -3690 -25470 7956 -57693
2644 -57693 -12546 -9729 31302 48088 -65048 -71309 -82581 -83855 -41988 -57743 44942 13611
2632 13611 -51294 -76582 -99064 -89499 -112002 -93467 -89429 -41107 -52058 -36821 -29600 -73138
2620 -73138 -54149 24858 -11361 -24256 -63803 47966 60176 26797 -4367 25459 34244 -47741
2608 -47741 -21494 65072 -30099 -55054 -58705 42369 -8410 -2838 78026 61356 44707 22667
2596 22667 49464 -5437 16667 20553 -43588 9989 -67028 -51723 23292 -8375 -63060 -30948
2584 -30948 57064 -32198 -6965 -46792 -40494 33221 46399 28930 32153 37677 13484 -17448
2572 -17448 -16503 -56194 9558 83986 27725 58869 -9435 35783 6028 -13913 49713 24124
2560 24124 -107377 -117155 -24465 23048 10578 -36902 -8469 -84490 -37173 -30807 -20390 -19759
2548 -19759 -12197 -35392 -74749 -75248 15530 -36631 24658 20386 -35556 -31623 -14494 -7537 2128
2535 2128 13315 44660 -5202 41326 24180 38415 52343 7096 -11659 -41917 1375 55788
2523 55788 -12698 -58481 -14084 32075 25522 -62175 -26912 49290 11237 -64760 11638 18029
2511 18029 -6975 35907 18986 -4816 -8175 -33071 -47330 5288 -73887 -46094 42947 74787
2499 74787 31880 -15044 22868 42288 -16708 34167 84562 33996 -39558 -81257 -82878 -52721
2487 -52721 -86750 -98156 -41384 -62641 -44678 -23434 5754 -49541 -47209 -78202 90280 37268
2475 37268 -53048 -22506 -6130 192 -29645 25450 8196 -7096 15104 -94647 -46903 65264
2463 65264 -31104 -16261 27121 61236 -10657 -20396 38822 36755 46827 -17582 11964 51508
2451 51508 -5251 -140983 -21356 -18042 58343 60847 -4112 -20624 -74083 -4238 -34006 -22086
2439 -22086 2314 31173 2642 -30940 -45412 -31936 -71092 -115407 -122772 -115954 -64519 -101844
2427 -101844 -18043 59767 8985 77757 1514 -4997 -17008 -1202 -99243 -113637 -69352 -16340
2415 -16340 87112 21559 -26227 -3102 -5804 -1252 -23211 -66716 -137656 -57811 -83150 -90606
2403 -90606 -78679 -63479 -68880 -6544 27216 43987 80397 12823 -45953 -82452 -50685 -35062
2391 -35062 -31532 -49127 -52992 7147 53268 -28602 -30258 -53361 47668 -53966 -58084 -86962
2379 -86962 -79461 26776 17709 -51532 -48002 -75402 -30598 -54043 -27608 -124031 -73766 -38522
2367 -38522 3532 15526 5203 8486 -1369 33399 -28578 -25241 32553 1957 25026 -11809
2355 -11809 -12019 97789 31679 25526 24411 72988 45133 4003 4236 -2939 -54484 -107302 -14856
2342 -14856 -36944 13783 -17760 -32343 -10333 24431 22341 -35271 -32988 -57857 -8350 -40856
2330 -40856 -21307 -30008 24531 27653 3319 -68233 -98324 -33563 -28912 -20507 -14186 -54315 -32268
2317 -32268 -14689 16874 -119835 -137285 -85878 -4472 -922 1581 -3180 18129 -55493 34628
2305 34628 3138 -67511 -111576 -70585 13203 24074 2361 -34987 46299 78127 30049 -6565
2293 -6565 -25726 -32874 -2789 -2384 -23135 -237 -13602 -78886 -12599 -25375 -1247 13891 -55943
2280 -55943 -50119 -115624 -97564 -46670 36857 13156 18492 3515 9291 315 -42755 12932 -30472
2267 -30472 -37489 -35855 -2721 -90464 -33753 -15606 10995 -20744 -70175 -22015 -42129 -38381
2255 -38381 36041 -8325 -36098 47766 10299 1923 34437 -48037 12047 -12588 -56194 -11209
2243 -11209 -74984 -51963 -66529 -82082 -56497 -95052 -69622 -99596 -49490 -2721 -74514 -641
2231 -641 -53613 -9150 -506 182 33187 -20330 -20939 -13660 -22480 -59804 -40332 2306 25260 -31042
2217 -31042 -22917 -34015 -107029 -109917 -39657 345 36617 53641 20146 46289 63107 -710
2205 -710 -36856 -109345 -85432 21601 57482 36790 -24505 -14794 10029 -15570 -4480 -20117
2193 -20117 21469 57111 -1692 -42874 -36231 10247 -322 -23704 48426 17722 -567 -20275
2181 -20275 -50694 -45976 -40179 -1846 28980 30669 57780 -53605 -47540 -24686 -75511 -24561
2169 -24561 2336 -19705 5696 -18118 -49372 -44 519 -24804 -4150 -6726 -49646 -4871
2157 -4871 21520 86642 29194 -22128 17654 -12242 24255 -8423 -83094 -162674 -91361 -28328
2145 -28328 -15140 -40855 -37332 -77075 19564 9546 -96156 -48424 -37905 46967 24038 66110
2133 66110 6777 56102 40872 19162 6440 33352 -30699 -3380 120167 31881 -50345 46618
2121 46618 97007 -3610 -938 -59639 -51449 -6192 -90372 -34196 -59187 -92107 -31657 -102848
2109 -102848 -13844 31181 -63295 -98716 -65306 -319 9114 -45337 -16332 38491 3648 -86724
2097 -86724 -41197 40607 -49203 -28580 -57107 -21154 5698 -29449 -16744 6779 -10641 38667
2085 38667 10322 -38078 28111 -46693 -86588 -109850 -31784 -16161 -12889 -50611 25414 6868
2073 6868 -82740 2798 -15860 12836 20807 -10591 13907 32349 22810 28368 -50995 -9004 60042
2060 60042 5519 -59381 20809 63187 14916 -33560 -39811 -5570 94531 43637 94809 45684
2048 45684 -70249 -63927 -98541 -98854 37639 119500 74213 47567 59536 20624 -77171 -44212
2036 -44212 -57456 35561 -22511 28714 33644 -17177 28639 22466 -7151 -79564 -43069 79586
2024 79586 38834 21163 54168 177627 105473 78451 69075 -13398 48214 128785 87133 29032
2012 29032 91022 -1206 -32929 -15923 14457 10634 -63376 27050 9076 -48240 -48638 -12695
2000 -12695 39534 75031 9199 18328 48182 48435 21762 -26622 -23136 3198 1924 -59672 17966
1987 17966 32958 63601 -21820 -65827 46677 25935 -31184 9884 51780 52031 -14715 1362
1975 1362 43765 57038 26789 18421 -13560 -8354 19312 64266 23060 -7118 31517 75405
1963 75405 10906 4997 -15070 -54410 77995 66772 -61277 -24418 -5568 -61711 307 71709
1951 71709 47546 -37579 9637 -19117 -22579 -6551 -12416 -31014 -44341 6807 110367 70466
1939 70466 -47922 -27500 -43229 -75460 -35100 33402 25095 -43312 -52647 37136 24582 -407
1927 -407 38266 39665 22902 -7018 -10489 -63791 -89661 -17543 -15925 18815 -45095 -33309 -6385
1914 -6385 -32975 26302 74393 70884 10862 67911 28686 -17552 -96339 -30836 30 39902
1902 39902 -15846 -39617 -16628 -27148 18743 -27733 -44699 10730 -18384 -16128 -11268 -12000 41152
1889 41152 -21135 9706 32718 60095 -8905 -28296 -1579 14872 -84457 -125993 -57268 -50170
1877 -50170 -5424 29362 -6026 -41035 -106989 -28073 72026 65968 -47100 -28616 -43169 -46238
1865 -46238 -8133 7883 60615 -6349 -64409 -25331 -75573 -82667 95095 74144 52687 30010
1853 30010 -19441 -52557 -52375 21562 109211 63955 -52402 -22482 -2775 -19485 -19179 -60276
1841 -60276 48136 71154 -129 -102881 -69457 38324 23709 58861 -10289 -17476 -59945
1830 -59945 -62493 -28303 -71767 -56291 -46807 41926 40657 -90166 -121099 -13647 -9328 -49881
1818 -49881 41891 -17343 -4924 -930 27224 -46673 -104926 -12279 -26693 -43980 -28321 -80461
1806 -80461 -111509 -19253 28881 61654 -48568 37928 47187 -17902 -24827 6455 -47998 -19854
1794 -19854 -13836 105 23064 46158 30612 821 -30692 -16005 76574 64667 21661 -8292
1782 -8292 1399 -80493 -76738 -77577 17407 16767 -24026 4592 -18183 -12293 -39035 44668 23551
1769 23551 -48318 33989 16912 35282 26867 19102 37633 58088 37998 -5552 -41413 -3537
1757 -3537 21673 -56920 -95799 9435 21915 -32843 79114 28222 26667 9739 -28871 17931
1745 17931 -19119 -37304 27038 -25665 27750 40231 -22682 -20382 -19099 -30794 17777 -20469
1733 -20469 -18928 -20948 14722 83279 29674 -27110 -43098 -84107 -25213 2904 -61894 3675
1721 3675 -43251 31809 30682 -29542 -61356 -50203 -46718 -2892 74104 46819 -18568 28876
1709 28876 -27211 9983 -38565 -64434 15151 73362 -9932 70634 88961 85222 20234 -46230
1697 -46230 13413 -9758 -44668 -36975 -40825 -8608 63 -61990 -57170 -19286 72976 -21025 -9825
1684 -9825 -8926 -21755 -21744 -3694 -38644 -23922 -10796 -51113 28394 47596 -13947 -40611 -22811
1671 -22811 -11883 -40848 -19323 62062 78265 13726 14843 -469 -44240 4111 33354 18247
1659 18247 19067 -38247 -25939 92282 50267 19975 21943 -85025 -9404 -9576 99320 110042
1647 110042 95976 102367 34480 20277 8677 -1170 11356 108601 72608 43457 -40981 -16874
1635 -16874 -230 21157 -42975 -17293 43825 52183 97039 11186 12861 -19668 -38527 -10215
1623 -10215 -1807 -43213 -7340 66622 75867 -3791 -110042 -80669 -19194 3680 -100213 -30100
1611 -30100 -39487 -12069 60168 54744 153647 28329 -7028 -57934 -97289 2733 43951 -47761
1599 -47761 -49917 36136 62549 639 -33197 -58128 -73585 -23309 -37181 17083 -10775 -78320
1587 -78320 -18476 -56812 -76556 -16037 11037 37391 36462 -20570 -17896 64090 38383 -19935
1575 -19935 -74962 -69178 23296 31548 33095 -21468 -32683 14279 85785 45917 19964 31131
1563 31131 38349 58814 74657 77058 15582 54510 -20036 3816 11283 -81934 5280 61213
1551 61213 -32247 -62083 -13404 -23930 31703 -35215 -25702 -29207 -17394 78447 -7770 35516
1539 35516 69700 59784 15240 27080 28398 32250 36786 -35818 36425 -13226 -60917 -200 16550
1526 16550 15291 -29269 -59651 -19806 -58065 -66934 20992 13077 8614 -44676 -36103 -27731 5625
1513 5625 44685 -746 -36839 16280 18130 -55726 5211 15536 -61428 -77726 6935 7374 -7062
1500 -7062 36305 24108 -20493 -18307 -11430 16228 76091 -19140 -54552 54436 -74846 -43734
1488 -43734 -42163 -143085 -65372 -39039 35542 17121 -8967 3473 -31669 16616 27499 -40704
1476 -40704 -22944 -5455 -93685 -79340 -25582 -14205 -13016 13230 9094 -29043 -90551 -20600
1464 -20600 -21691 -92119 -42188 18457 85038 82312 14436 -60049 -79941 -71539 27507 -30430
1452 -30430 -30403 21948 -23719 -55487 44226 91933 32878 4155 -2882 -16083 3636 826 20090
1439 20090 11047 -6593 -17904 -69261 -8895 83105 48292 -17291 -59204 -53645 -3101 37627
1427 37627 -39099 21136 12207 -36668 -52040 -67110 -66808 -59033 -19934 -6340 28224 19243 54886
1414 54886 -64198 -50389 7053 -38849 48832 -15295 -16021 4505 28545 51648 104807 52920
1402 52920 21543 46854 -58860 4939 92545 67205 91219 65767 14561 11959 43209 14697
1390 14697 34055 80006 71037 20687 -26843 44660 18128 105155 91094 34313 -13906 46607
1378 46607 40441 19479 12539 -29011 -20721 -49806 61672 97647 26963 -31336 -9849 37289
1366 37289 57317 60375 43751 46790 -4033 16368 14672 38121 -64037 -11827 -10208 -7006 30599
1353 30599 -1290 82244 89888 573 -86745 -17404 5425 9109 -3894 -32764 -16424 -36409
1341 -36409 -15392 -25120 -34531 38244 51260 32754 -39794 -17157 74789 17161 -26013 50803
1329 50803 -5548 60 10157 -43660 51862 10917 23912 67886 112197 -5875 2768 72343
1317 72343 49139 26832 -44397 318 42417 -46079 -45257 48130 -14410 29894 7625 -54333
1305 -54333 -88374 19805 73750 83880 20309 18421 -99838 -47069 -10013 -82850 -21619 15688
1293 15688 13518 -16025 23795 30428 35564 -1850 -5810 -2640 -49949 -35346 28023 -30434 12373
1280 12373 -24673 125313 40672 53777 41824 -17327 18507 33452 11621 -42200 -32164 116034
1268 116034 74091 -42020 -68737 -40949 -12385 -32176 -15027 -10702 -88055 -45126 26828 87045
1256 87045 139860 91412 27205 -11015 -7087 -15470 3863 3931 68123 29663 10926 33195 -35202
1243 -35202 -66638 39162 34450 112254 13286 8965 59937 45966 -23061 6561 -22081 -49134
1231 -49134 6884 57382 6524 -30573 -44027 54005 89818 125547 -63730 -49171 1868 -37362
1219 -37362 -13677 78157 52441 -47967 -82772 -26460 -27182 -34876 -5155 -5056 -10528 -33680 35102
1206 35102 -66202 -77622 -94206 -36335 -28598 11982 14355 5101 -23759 -54405 -59729 -71917
1194 -71917 25811 10404 54796 56890 9147 69476 5169 8055 -29716 20280 -1976 30055
1182 30055 -35492 -30401 -2143 -25308 27205 -114 -27652 -37654 51767 48564 8391 -112733
1170 -112733 -49714 -24957 38482 64588 22951 8573 47841 -71581 -48036 30589 -33230
1159 -33230 -13060 -35541 37096 28970 38349 1654 -52242 -60638 11345 79610 7872 -10943
1147 -10943 36095 91028 54508 14455 86607 3538 -17713 13604 44051 91279 22711 -33
1135 -33 -18063 -62110 -17490 -41800 -27746 -73440 -12249 -2841 -1106 -17085 10554 -3271 -29491
1122 -29491 2566 6690 -14063 4034 51974 50994 50047 40756 62563 18781 8663 32457 17603
1109 17603 24859 10127 -11814 35585 -24775 -41712 11798 29656 11530 -59829 -30273 -7675
1097 -7675 18714 -7982 -8485 -50569 -63675 -17301 -28286 -55028 -70978 -89663 -35888 -43432 -47391
1084 -47391 31510 43493 50782 26762 -4866 -30202 -39879 34672 74793 -13066 10843 15414
1072 15414 -31889 56312 12915 490 102986 42513 -40451 -114937 -61734 30429 82918 62754
1060 62754 -36609 -53780 -41490 30619 28540 15756 -2599 68718 -12171 -62502 -30679 19055
1048 19055 27382 14541 30636 43938 43110 -93948 -96496 -73277 -4957 91223 87927 6460 -25144
1035 -25144 -40274 -9577 -47062 -86258 -67188 -30935 -806 40344 -5338 12871 -1663 59359
1023 59359 98782 104357 83821 -31510 -104644 -113156 -32583 43832 -5215 23637 37598 5468
1011 5468 48824 78375 29359 17121 82440 95730 55872 -9544 -14075 39339 -26397 -12084
999 -12084 85500 30503 40416 26828 34491 65528 57968 87930 -10234 17432 13506 26481 1183
986 1183 -24938 -61233 -3286 8979 -27192 83738 15381 -40027 37308 19422 -20623 -17916
974 -17916 58634 67609 22793 47783 63777 41686 72375 134779 89041 28193 65225 14170
962 14170 23486 5403 -18893 14793 -16797 6231 -27158 14470 -43984 -3980 -18020 -60050
950 -60050 -14775 -19872 -48426 21812 18467 -10866 -23566 -18177 -18082 48714 118425 32555 16577
937 16577 1340 22625 -38064 -31773 -64535 -30169 49015 69195 1047 -10112 -2141 -58528
925 -58528 -20208 -9697 5614 -24093 35964 15465 38663 -26644 -54869 -6210 49146 32767
913 32767 16630 -5163 -18475 -38309 -25656 -84706 -73967 -23438 7233 8505 -12617 -16402
901 -16402 -33913 -48508 -20426 14747 23204 5580 34949 90 -16827 -2727 -1610 72339
889 72339 -11353 -92515 -25619 2044 -68736 -21744 19973 23844 45376 95324 125907 129104
877 129104 75509 58141 44142 -36525 -53070 -24797 -29114 -40521 -60981 -39707 7637 33033
865 33033 41483 -5824 65947 42058 23057 41698 -9547 -8845 -5636 9021 -37616 31928 -24112
852 -24112 -14443 -45759 -41209 -46751 -23526 -72465 -12280 10780 258 -12777 -37664 4120 40251
839 40251 -4111 22441 9478 -45115 34448 7220 20527 -56662 -55754 -13889 27793 -10595
827 -10595 -92913 -59493 -54836 -26699 -71286 -83961 34904 7684 47206 51789 93560 18382
815 18382 7389 -1202 -28543 -72317 -37041 -101111 -74274 16190 -84974 -76216 5459 58859
803 58859 48534 12720 -6744 -18162 14645 2266 -29854 -65185 -1747 68742 -5651 28612
791 28612 47682 5317 60103 17012 -22198 -25110 1186 80881 75671 56591 58270 -48654
779 -48654 -10382 52410 18889 -6125 38313 18955 -15048 -92559 -56211 82468 -27663 26923
767 26923 -33468 -28602 -40675 -5157 -19382 39799 16275 -62608 -14881 75321 68401 -36608
755 -36608 -35815 -23709 -23241 -13337 30660 63847 20445 -23305 22751 85137 -23561 2431 -25133
742 -25133 -37578 24099 -31789 81195 30507 -5008 28953 75442 71020 79272 105876 47459
730 47459 28224 -51740 -33929 -8486 -16625 -16382 40722 337 -12036 61782 -2890 -71352 -69759
717 -69759 -32905 -40238 -59747 6204 -33743 -39610 -2862 -16368 -66501 -79144 -45148 20474
705 20474 52093 50609 84708 72390 23884 43861 60979 -33081 -15614 -68797 3744 -31239
693 -31239 -50224 -69006 -39221 -12302 2259 37994 -59117 -21763 -11166 32126 31925 55169
681 55169 17003 -11676 7507 83098 60053 -18638 13559 25311 45376 20215 -17583 39220
669 39220 -67354 -57390 -11581 -114545 -48567 21885 41529 56996 9938 21436 20625 -15011
657 -15011 8827 -21344 -111330 -37727 -21545 53237 42675 24598 43138 9455 52029 -33042
645 -33042 -26534 -6095 24880 60397 90460 30243 55239 52477 36458 62645 92903 23809
633 23809 47018 -31532 -47424 -29828 -1527 -22322 -18277 36781 24521 -5435 85306 34335
621 34335 20060 6070 -4131 -59408 -52270 18409 -17602 30233 38307 16380 -35124 12995
609 12995 44653 50090 43870 20188 81175 44479 66616 26891 50205 -21462 -52609 -10922
597 -10922 -3896 62198 -37152 4631 -534 62141 75896 41243 28819 45695 49773 60787 70925
584 70925 54445 -8731 23228 16621 -20815 -26085 -15286 -36903 100376 127681 97304 13496
572 13496 37766 49344 -693 -9599 26878 64252 -58428 -55155 41208 76643 48175 29173
560 29173 39962 12754 -55869 -62371 -54489 -37233 -24545 -64358 -97920 -85082 37989 44851
548 44851 61263 27362 -41705 -9904 37120 -81679 -80949 81154 63444 50302 60120 43733
536 43733 7550 46708 19883 68770 33382 -32762 -80932 -32090 -50538 -14742 6930 -27655
524 -27655 -53326 -93384 5049 20978 3353 -17579 38642 57631 47552 -59064 -39292 -14950
512 -14950 -7087 -38667 -31704 40193 -26570 27755 39100 52293 44925 -38193 -11830 -2726 6975
499 6975 63136 -51797 -7616 -8999 -18914 24632 -11159 -131691 -111549 -85568 34272 45137
487 45137 73902 85004 54070 -2459 -42817 -49564 -130500 -67216 -12528 28805 5430 -9654
475 -9654 -86968 -47932 42249 17442 -18209 48080 23041 88934 100296 38546 -39240 12200
463 12200 -3703 10357 -26874 -27660 -44645 -53487 -30238 40933 -56778 -49763 7931 -94232 -17027
450 -17027 40744 65811 25274 -48196 -20102 -38808 -24627 -26592 -46368 12222 -12835 3671
438 3671 78914 93287 2827 -22929 -12164 56264 80769 14677 -33352 -72951 -23574 -16438
426 -16438 22849 45859 -48429 95278 84185 17736 -14029 31219 66137 57818 74667 39540
414 39540 -27597 -62513 -49800 -31080 -8483 49335 53909 45761 11646 -33295 -26530 21396 -58045
401 -58045 -26436 -736 32857 56302 -65442 -65486 22321 18510 -19878 -37221 18176 48063 -26283
388 -26283 -26021 -20765 -27265 -39168 -29406 53125 -14208 18294 -16954 -30742 44557 -35787 5501
375 5501 451 8924 19833 15825 -53887 -53928 12463 85262 22022 -8929 40970 18561 -2581
362 -2581 10657 -18332 3946 3171 -12967 62312 46382 -10202 13815 -71369 -90951 -30233 -815
349 -815 -27827 8387 -15471 10218 45612 41589 -9310 -18290 39702 -5233 9519 -14251 -36107
336 -36107 5349 49171 30093 80361 33431 -2141 -6408 -26365 -28475 56054 -3799 -38842
324 -38842 -30034 -39537 60944 29121 91796 30147 -49944 41060 -18742 16104 -36083 23671
312 23671 57140 -18453 -25057 -104728 -56936 41376 -55166 -110953 6419 -46704 -51537 -20880
300 -20880 3657 11630 -8437 38625 55194 -20493 -35675 -28980 -66179 6089 59578 8179
288 8179 -27706 -12849 -32280 -26585 3282 -18956 66404 99618 70142 83957 36878 40162 64425
275 64425 87933 35354 34367 26400 7010 -54480 -55376 -827 48771 -18134 -24997 -34289 -72197
262 -72197 -126229 -91343 -39586 -29964 -49255 -7712 46359 12211 60807 -21126 -46663 -40374
250 -40374 14176 32530 35952 17349 46233 53501 25608 26346 5110 -46696 -61204 -39148 -10438
237 -10438 -12769 60276 46601 -90610 -55604 -27047 -42814 5956 68167 22932 -30280 -21306
225 -21306 -4444 16601 -28540 -15596 -33650 23091 60372 -3075 20284 64811 46974 8543
213 8543 -2617 -34393 -26673 12211 27615 10958 -11056 19892 -6763 7439 -14501 -6065 11591
200 11591 -74787 -130989 -93074 1295 35296 21626 44206 -96697 -78361 -52835 -18430 48956
188 48956 21050 -14520 -64607 4759 12282 23789 9918 8472 78629 47714 18939 -55729
176 -55729 -38564 -14594 -24599 -41670 -25710 70926 57234 27541 24931 2025 28864 13809
164 13809 45556 45778 4061 16215 70603 54772 31186 -5941 -9630 -7687 -51286 -33360 2014
151 2014 21516 38441 8958 -27852 -2664 -25825 -14658 -12564 -53392 -83837 -20381 -7138
139 -7138 59749 103214 114979 18347 -31039 19729 53709 7120 -58908 -86167 -27494 24876
127 24876 51115 20391 -73349 -76446 -2574 14935 -31891 -25485 -38899 -59069 -25812 -81180
115 -81180 -45376 -9774 -62661 -13391 22793 11910 23589 8351 57466 -3311 -23064 -10952
103 -10952 -13692 -11509 -27325 -30059 4087 47806 42170 57638 89267 776 37376 -3870 -11982
90 -11982 44692 55748 33886 17297 35232 -10427 -16033 39193 -1661 26335 51189 -16066
78 -16066 -17404 -22522 -12079 -33270 -26542 -35211 -22847 -9081 26937 54476 26884 6382 -9083
$$ [...]
##END NTUPLES=NMR SPECTRUM
##END=
