##TITLE=1H_CA-9297-5
 CDCl3
 8 sc, 
 29.11.2024
##JCAMPDX= 6.0         $$ Bruker NMR JCAMP-DX V2.0
##DATA TYPE= NMR SPECTRUM
##DATA CLASS= NTUPLES
##ORIGIN= UXNMR, Bruker Analytische Messtechnik GmbH
##OWNER= root
$$ XWIN-NMR		Version 3.5
$$ Fri Nov 29 14:26:16 2024 Russian Standard Time (UT+4h)  she@DPX200
##.OBSERVE FREQUENCY= 200.1315
##.OBSERVE NUCLEUS= ^1H
##.ACQUISITION MODE= SIMULTANEOUS
##.ACQUISITION SCHEME= undefined
##.AVERAGES= 8
##.DIGITISER RES= 18
##SPECTROMETER/DATA SYSTEM= spect
##.PULSE SEQUENCE= zg30
##.SOLVENT NAME= CD3CN
##.SHIFT REFERENCE= (INTERNAL, CD3CN, 0, 19.5518)
##AUDIT TRAIL= $$ (NUMBER, WHEN, WHO, WHERE, WHAT)
$$ ##TITLE= Audit trail, XWIN-NMR		Version 3.5
$$ ##JCAMPDX= 5.01
$$ ##ORIGIN= Bruker BioSpin GmbH
$$ ##OWNER= she
$$ F:/spectra/data/she/nmr/H-F/1/pdata/1/auditp.txt
$$ ##AUDIT TRAIL=  $$ (NUMBER, WHEN, WHO, WHERE, WHAT)
(   1,<2024-11-29 14:24:39.39 +0400>,<she>,<DPX200>,
      <created by zg, POWCHK disabled, PULCHK disabled
       configuration hash MD5:
       00 E9 B6 7A A2 85 ED C7 34 08 36 98 17 FE 4E 26
       data hash MD5: 16K
       75 A0 96 9F 68 C6 28 B9 97 59 CC D6 F6 27 9C 0D>)
(   2,<2024-11-29 14:24:44.26 +0400>,<she>,<DPX200>,
      <Start of raw data processing
       efp BC_mod = 2 LB = 0.24 FT_mod = 6 PKNL = 1 PHC0 = -26718.64 PHC1 = 15.58744 SI = 16K 
       data hash MD5: 16K
       D9 87 61 03 5B 8A CD 9F E4 BC E6 B0 63 16 81 F6>)
(   3,<2024-11-29 14:25:02.04 +0400>,<she>,<DPX200>,
      <pk PHC0 = -157.576 PHC1 = 0 
       data hash MD5: 16K
       0C BA F7 91 45 4E AC 83 A3 0C 76 DF 9F E1 B0 E1>)
(   4,<2024-11-29 14:25:05.07 +0400>,<she>,<DPX200>,
      <abs ABSG = 5 
       data hash MD5: 16K
       C5 C2 A3 4C BE 71 F2 55 92 73 F6 1D AA 2D 13 DF>)
$$ ##END=
$$ 
$$ hash MD5
$$ D9 7C DB DC 49 B0 26 59 AD 13 59 6C 5A F0 CB E9
##$RELAX= 
##$RELAX= 
##$RELAX= 
##$RELAX= 
##$RELAX= 
##$RELAX= 
$$ Bruker specific parameters
$$ --------------------------
##$DU= <F:/spectra>
##$EXPNO= 1
##$NAME= <H-F>
##$PROCNO= 1
##$TYPE= <nmr>
##$USER= <she>
##$AMP= (0..31)
100 100 100 100 100 100 100 100 100 100 100 100 100 100 100 100 100 100 
100 100 100 100 100 100 100 100 100 100 100 100 100 100 
##$AQSEQ= 0
##$AQ_mod= 1
##$AUNM= <au_zg>
##$AUTOPOS= <>
##$BF1= 200.13
##$BF2= 200.13
##$BF3= 200.13
##$BF4= 200.13
##$BF5= 200.13
##$BF6= 200.13
##$BF7= 200.13
##$BF8= 200.13
##$BYTORDA= 1
##$CFDGTYP= 0
##$CFRGTYP= 5
##$CHEMSTR= <none>
##$CNST= (0..31)
1 1 145 1 1 1 1 1 1 1 1 1 1 1 1 1 1 1 1 1 1 1 1 1 1 1 1 1 1 1 1 1 
##$CPDPRG= <>
##$CPDPRG1= <>
##$CPDPRG2= <>
##$CPDPRG3= <>
##$CPDPRG4= <mlev>
##$CPDPRG5= <mlev>
##$CPDPRG6= <mlev>
##$CPDPRG7= <mlev>
##$CPDPRG8= <mlev>
##$CPDPRGB= <>
##$CPDPRGT= <>
##$D= (0..31)
0 1.2 0 0 0 0 0 0 0 0.06 0 0.03 0 0 0 0 0.0002 0 0 0 0 0 0 0 0 0 0 0 0 
0 0 0 
##$DATE= 1732875878
##$DBL= (0..7)
120 120 120 120 120 120 120 120 
##$DBP= (0..7)
150 150 150 150 150 150 150 150 
##$DBP07= 0
##$DBPNAM0= <>
##$DBPNAM1= <>
##$DBPNAM2= <>
##$DBPNAM3= <>
##$DBPNAM4= <>
##$DBPNAM5= <>
$$ [...]
##$SUBNAM3= <"">
##$SUBNAM4= <"">
##$SUBNAM5= <"">
##$SUBNAM6= <"">
##$SUBNAM7= <"">
##$SUBNAM8= <"">
##$SUBNAM9= <"">
##$SW= 24.0689530833862
##$SWIBOX= (0..15)
0 0 2 0 0 0 0 0 0 0 0 0 0 0 0 0 
##$SW_h= 4816.95568400771
##$TD= 16384
##$TD0= 1
##$TE= 0
##$TE2= 300
##$TE3= 300
##$TEG= 300
##$TL= (0..7)
0 120 120 120 120 120 120 120 
##$TP= (0..7)
150 150 150 150 150 150 150 150 
##$TP07= 0
##$TPNAME0= <>
##$TPNAME1= <>
##$TPNAME2= <>
##$TPNAME3= <>
##$TPNAME4= <>
##$TPNAME5= <>
##$TPNAME6= <>
##$TPNAME7= <>
##$TPOAL= (0..7)
0.5 0.5 0.5 0.5 0.5 0.5 0.5 0.5 
##$TPOFFS= (0..7)
0 0 0 0 0 0 0 0 
##$TUNHIN= 0
##$TUNHOUT= 0
##$TUNXOUT= 0
##$USERA1= <user>
##$USERA2= <user>
##$USERA3= <user>
##$USERA4= <user>
##$USERA5= <user>
##$V9= 5
##$VALIST= <valist>
##$VCLIST= <CCCCCCCCCCCCCCC>
##$VD= 0
##$VDLIST= <DDDDDDDDDDDDDDD>
##$VPLIST= <PPPPPPPPPPPPPPP>
##$VTLIST= <TTTTTTTTTTTTTTT>
##$WBST= 1024
##$WBSW= 4
##$XGAIN= (0..3)
0 0 0 0 
##$XL= 0
##$YL= 0
##$YMAX_a= 437367
##$YMIN_a= -867264
##$ZGOPTNS= <>
##$ZL1= 120
##$ZL2= 120
##$ZL3= 120
##$ZL4= 120
##$ABSF1= 19.5356
##$ABSF2= -4.533533
##$ABSG= 5
##$ABSL= 3
##$ALPHA= 0
##$AQORDER= 0
##$ASSFAC= 0
##$ASSFACI= 0
##$ASSFACX= 0
##$ASSWID= 0
##$AUNMP= <proc_1d>
##$AZFE= 0.1
##$AZFW= 0.1
##$BCFW= 0
##$BC_mod= 2
##$BYTORDP= 0
##$COROFFS= 0
##$CY= -3
##$DATMOD= 1
##$DC= 0
##$DFILT= <>
##$DTYPP= 0
##$F1P= 0
##$F2P= 0
##$FCOR= 1
##$FTSIZE= 16384
##$FT_mod= 6
##$GAMMA= 0
##$GB= 0
##$INTBC= 1
##$INTSCL= 2.524811e-10
##$ISEN= 128
##$LB= 0.24
##$LEV0= 0
##$LPBIN= 0
##$MAXI= 10000
##$MC2= 0
##$MEAN= 0
##$ME_mod= 0
##$MI= 1.114404
##$NCOEF= 0
##$NC_proc= -5
##$NLEV= 6
##$NOISF1= 3.799351
##$NOISF2= 2.8
##$NSP= 0
##$NTH_PI= 0
##$NZP= 0
##$OFFSET= 19.55176
##$PC= 1
##$PHC0= -26876.22
##$PHC1= 15.58744
##$PH_mod= 1
##$PKNL= yes
##$PPARMOD= 0
##$PSCAL= 0
##$PSIGN= 0
##$REVERSE= no
##$SF= 200.129995583378
##$SI= 16384
##$SIGF1= 3
##$SIGF2= 2
##$SINO= 5.538805
##$SIOLD= 16384
##$SREGLST= <1H.CDCl3>
##$SSB= 0
##$STSI= 16384
##$STSR= 0
##$SW_p= 4816.95568400771
##$SYMM= 0
##$S_DEV= 0
##$TDeff= 16384
##$TDoff= 0
##$TI= <>
##$TILT= no
##$TM1= 0
##$TM2= 0
##$TOPLEV= 0
##$USERP1= <user>
##$USERP2= <user>
##$USERP3= <user>
##$USERP4= <user>
##$USERP5= <user>
##$WDW= 1
##$XDIM= 16384
##$YMAX_p= 307437048
##$YMIN_p= -124019
$$ End of Bruker specific parameters
$$ ---------------------------------
##NTUPLES= NMR SPECTRUM
##VAR_NAME=  FREQUENCY,     SPECTRUM/REAL,   SPECTRUM/IMAG
##SYMBOL=    X,             R,               I
##VAR_TYPE=  INDEPENDENT,   DEPENDENT,       DEPENDENT
##VAR_FORM=  AFFN,          ASDF,            ASDF
##VAR_DIM=   16384,         16384,           16384
##UNITS=     HZ,            ARBITRARY UNITS, ARBITRARY UNITS
##FACTOR=    0.29402158847633, 1,            1
##FIRST=     3912.89358638057, 0,            0
##LAST=      -904.062097627136, 0,           0
##MIN=       -904.062097627136, -124019,     0
##MAX=       3912.89358638057, 307437048,    0
$$ Real data points
##PAGE= N=1
##DATA TABLE= (X++(R..R)), XYDATA
$$ [...]
8947h49R790K8269J7087n255L4943k3202L0455o6147n5610K1104Q090L1213j4922
$$ -849 8941 37210 54297 49042 83985 60783 91238 25091 -30519 -9415 -1325 29888 14966
8934A4966M1658j2913k9626K8598l2049l5042N0511j2453k369n0712J4761j0271
$$ 14966 56624 43711 14085 42683 10634 -24408 26103 13650 11281 -39431 -24670 -34941
8922c4941j3447K4519K1642R921Q886l0705k5213K9904n3K6716m5200p1778M9280
$$ -34941 -48388 -23869 -2227 7694 16580 -14125 -39338 -9434 -9487 17229 -27971 -99749 -50469
8909e0469j4860K8722r690n819L1748L6136k1433m2289l5948R146N7579M6718
$$ -50469 -65329 -36607 -46297 -52116 -20368 15768 -5665 -47954 -83902 -74756 -17177 29541
8897B9541J027N450l044j895o1738K3773O2094j0244n8849R527j8801J9471j9723
$$ 29541 30568 36018 32974 31079 -30659 -6886 55208 44964 -13885 -4358 -23159 -3688 -23411
8884b3411K0990N7012l9687n2488K983N1746l6022L2407k1959p614N74j6892N8586
$$ -23411 -2421 54591 14904 -37584 -34601 17145 -18877 13530 -8429 -16043 -15469 -32361 26225
8871B6225j1368l5318j615L856M5464M4812l277n7779p050J0653k9425K3443N7
$$ 26225 14857 -20461 -22076 -18220 27244 72056 68779 11000 3950 14603 -14822 8621 8678
8858H678j033K1306m622m070l3972k918K5016P496L416l1101O021P05L8940j6672
$$ 8678 7645 28951 24329 20259 -13713 -16631 8385 15881 19297 -11804 -5783 -5078 33862 17190
8844A7190j7365m352k97J7760j9914M3543j7641k7088K6008L987j5124o0030Q0618
$$ 17190 -175 -4527 -4824 12936 -6978 36565 18924 -8164 17844 21831 6707 -53323 27295
8831B7295O1327k2154n0848j569r478M7276j9043n0588O723M3495r485n1649M594
$$ 27295 88622 66468 15620 14051 4573 51849 32806 -17782 -11059 32436 22951 -28698 -24104
8818b4104K7739K6708j0334J0723l6426P565k7408K5484J8512j3068m5002L6856
$$ -24104 3635 30343 20009 30732 -5694 1871 -25537 -53 18459 5391 -39611 -2755
8806b755m1313M9003N59m3098N8261l5940k463M7525j3572l4405K1518K4654m3946
$$ -2755 -44068 4935 5494 -37604 20657 -15283 -17746 29779 16207 -18198 3320 27974 -15972
8793a5972J8089J2063m8790L4347M8246l5531l0869l6348L2076O3463r7082M124
$$ -15972 2117 14180 -34610 -263 47983 12452 -18417 -54765 -22689 40774 -56308 -52184
8781e2184K4391r470M714j8515N5324J9628l5252j9430K004K0952J9268l4703
$$ -52184 -27793 -37263 -32549 -51064 4260 23888 -11364 -30794 -28790 -7838 11430 -23273
8769b3273K7522n1572P308j6812K4036M1836m3120K3643M7200n686l9913J71j801
$$ -23273 4249 -47323 -40015 -56827 -32791 9045 -34075 -10432 36768 31082 -8831 -8660 -10461
8756a0461J0759J5834J145k4792N259M2427l4075k8230O6663m3816m4766M0011
$$ -10461 298 16132 17277 -7515 -2256 40171 6096 -22134 44529 713 -44053 -4042
8744d042k2108L711M2615q7157K4326L9810k252L2436o2793M2443J2992k7713
$$ -4042 -26150 -22439 20176 -66981 -42655 -2845 -5097 27339 -35454 6989 19981 -7732
8732g732p2529P312p385K9400O2567j7664J9520J2661l8231n995J9859j067r639
$$ -7732 -80261 -72949 -80334 -50934 11633 -6031 13489 26150 -12081 -18076 1783 716 -8923
8719h923P573K221J4465j5427L2924J9767m6511M3042m9846L3158Q827K2052J7281
$$ -8923 -1350 871 15336 -91 32833 52600 6089 49131 -715 32443 41270 63322 80603
8706H0603k7245M3581k5411l6976O2972l3120m5287l218k3082Q189k95l5013L324
$$ 80603 53358 96939 71528 34552 97524 64404 19117 15899 -7183 1006 711 -34302 -30978
8693c0978J7343j5550M4540M0535j5591k8607L3981k6832l2551K4577J694J5545
$$ -30978 -13635 -29185 15355 55890 40299 11692 45673 18841 -13710 10867 12561 28106
8681B8106l7478Q985j3413M8736M6604m0184J1761j2068k3932N1744j2195L0180
$$ 28106 -9372 -387 -13800 34936 81540 41356 53117 41049 17117 68861 56666 86846
8669H6846L3267l2980J0396l1712m9072N7824L0321K4873p513l5579L38N2243
$$ 86846 120113 87133 97529 65817 16745 74569 104890 129763 122250 86671 87009 139252
8657A39252P851l3210j9341J6135r817j2223P4574K2115J5684k4598N2231j3669
$$ 139252 147103 113893 94552 110687 100870 88647 163221 185336 201020 176422 228653 214984
8645B14984l4461K7276Q59M8399k3234k746J7293M8715k6515j0031K4917r416
$$ 214984 180523 207799 208658 257057 233823 231077 248370 297085 270570 260539 285456 276040
8633B76040L7957L580M785L972k9890m2901l0326R5139M0821m2042K4980l862
$$ 276040 313997 317577 322362 326334 296444 253543 223217 318356 359177 317135 342115 338253
8621C38253P460J5330m230L401N4306J6498j0207M0741k9906p012L6652K6513
$$ 338253 345713 361043 356813 360214 414520 431018 420811 461552 431646 424634 461286 487799
8609D87799o3459l8281j7530K0316k8541q1001K0055j2328j7419m2603L6494k466
$$ 487799 424340 386059 368529 388845 360304 279303 299358 287030 269611 227008 263502 261036
8597B61036N967J8446l4832J8431K8674l7844q153q068n676j1226l9749L877k303
$$ 261036 267003 285449 250617 269048 297722 259878 251725 243657 237981 226755 187006 190883 188580
8584A88580l1135K6411k9961j2949o021R802j0503j5312j7984l2206j4778J7898
$$ 188580 157445 183856 153895 140946 134925 144727 134224 118912 100928 68722 53944 71842
8572G1842J3343L5957P637l2070l5249o085K6247J3063n216n1221M6297j1542
$$ 71842 85185 121142 128779 96709 61460 55375 81622 94685 89469 38248 84545 73003
8560G3003m6089K1551K4253n9246l333J8656L2071m4208K68N9159m6565L0561
$$ 73003 26914 48465 72718 13472 10139 28795 60866 16658 16926 76085 29520 60081
8548F0081l9311j0431n390n2747P6785K0689k318k2398K7374l2522p5436P0394
$$ 60081 20770 10339 4949 -47798 28987 49676 47358 24960 52334 19812 -55624 14770
8536A4770r479m4738K9039N643k9338P5929k2936n461J8068l890J2375l416l754
$$ 14770 5291 -39447 -10408 -4765 -34103 41826 18890 13429 31497 27607 39982 36566 32812
8523C2812j5588l3557N0584J2592K8465j5956m8603L0212j6507n834J6178k0568
$$ 32812 17224 -16333 34251 46843 75308 59352 10749 40961 24454 18620 34798 14230
8511A4230L9183J167j0849k9940P710M37k6476L6373k6335J6975j723k5515K4975
$$ 14230 53413 54580 43731 13791 21501 21938 -4538 31835 5500 22475 20752 -4763 20212
8498B0212j270m0673M8698l2074K2797K3830m3643j5851J8499j2633j0360J712
$$ 20212 18942 -21731 26967 -5107 17690 41520 -2123 -17974 525 -12108 -22468 -20756
8486b0756L6720O0089K7923J4894j08656M1416J0632j864p5135K617N2504K6374
$$ -20756 15964 76053 103976 118870 10214 51630 62262 60398 -14737 -12120 40384 66758
8474F6758o560m6276J2356j5685P19k7035K4446n861J3865p108J7472j9823J5290
$$ 66758 60198 13922 26278 10593 11312 -15723 8723 2862 16727 9619 27091 7268 22558
8461B2558j9384J4478P0028p372P764J5825j2975j3617n2511K428N5128l7212
$$ 22558 3174 17652 87680 80308 88072 103897 90922 77305 24794 27222 82350 45138
8449D5138n4680L375J4785O2005k4016k7375J8558L4581j7300j3295J5150J998
$$ 45138 -9542 -6167 8618 70623 46607 19232 37790 72371 55071 41776 56926 58924
8437E8924l69M3259J8246k6638K5083k5890n1725J8929L5907J1689k0707J2272
$$ 58924 58555 101814 120060 93422 118505 92615 40890 59819 95726 107415 86708 98980
8425I8980M404J373N962O7723j8154j1380r466O4290M4773R441J0721k8555J4153
$$ 98980 103384 104757 110719 178442 160288 148908 139442 203732 248505 257946 268667 240112 254265
8412B54265j5476l4994n4624j5371J3361r269P341j0308K3211l1857k6160j2901
$$ 254265 238789 203795 149171 133800 147161 137892 145233 134925 158136 126279 100119 87218
8400H7218K7363p363r764L9476K1549l8754q715R2916l7053J8916j7277l9921
$$ 87218 114581 107218 97454 136930 158479 119725 111010 203926 166873 185789 168512 128591
8388A28591K8061N960j9328P334L463Q355k4204M699k8220m2161N0201J0285k1735
$$ 128591 156652 162612 143284 150618 154081 162436 138232 142931 114711 72550 122751 133036 111301
8375A11301L4544m0870m1495J3848O3107k2808n822K0309J7018P094j5875J1766
$$ 111301 145845 104975 63480 77328 140435 117627 111805 132114 149132 156226 140351 152117
8363A52117J6278n262J7433J9886J2656J4749j0991k3399K4747J4650K6441n1900
$$ 152117 168395 163133 180566 200452 213108 227857 216866 193467 218214 232864 259305 207405
8351B07405k3727O336l0175M0826J4904k8230L0707l1626q057M0845J5845O161
$$ 207405 183678 190014 159839 200665 215569 187339 218046 186420 178363 219208 235053 241214
8339B41214J4791j9641k5026q032K4204m9681J6245J0910J1601L7009L2357j4016
$$ 241214 256005 236364 211338 203306 227510 177829 194074 204984 216585 253594 285951 271935
8327B71935j6906j5669p409J1614k0015L2853j8387K8311L7370n7848R165j8696
$$ 271935 255029 239360 231951 243565 223550 256403 238016 266327 303697 245849 255014 236318
8315B36318J9498J0702l7249K1736j5454p810j8352L9047l6002P3519j9581m5964
$$ 236318 255816 266518 229269 251005 235551 227741 209389 248436 212434 285953 266372 220408
8303B20408k2520M100j4004n3791l1124L0652J1707p787M301K2708o787n2358
$$ 220408 197888 201988 187984 134193 103069 133721 145428 137641 141942 164650 157863 105505
8291A05505K55O5016K2567o9504j0729k2757L5532l5213K8933Q138k1213J8480
$$ 105505 105760 170776 193343 123839 113110 90353 125885 90672 119605 127743 106530 125010
8279A25010N1076J5564l505j1711K020O377J111o8369J004K7594k230m5142P221
$$ 125010 176086 191650 188145 176434 178454 184831 185942 117573 118577 146171 143941 98799 106020
8266A06020L5357l9076N8988l403K5952M36J8380l5740l1889O0401j6128p977
$$ 106020 141377 102301 161289 157886 183838 184274 202654 166914 135025 195426 179298 171321
8254A71321j5865L9319K3583k7626J0751K8434L147k5702K0243n8025K5805j4631
$$ 171321 155456 194775 218358 190732 201483 229917 233064 207362 227605 169580 195385 180754
8242A80754O9277R097l7702M0266j6326k7982J9690J6462J76M5829j8452p412
$$ 180754 250031 259128 221426 261692 245366 217384 237074 253536 253712 299541 281089 273677
8230B73677K0446M8676n6665k6225J4128k5414k083M8300O2294j8291Q2540j3553
$$ 273677 294123 342799 286134 259909 274037 248623 246540 294840 357134 338843 421383 407830
8218D07830k8154M2546R99k3288r662K4145Q4967l5740j9186m8917M0240j1926
$$ 407830 379676 422222 423221 399933 390271 414416 499383 463643 444457 395540 435780 423854
8206D23854l256k1548k9550l6598L434k7853P2269l4519l3966k8594M8762p8301
$$ 423854 420598 399050 369500 332902 336336 308483 380752 346233 312267 283673 332435 254134
8194B54134J1349l32415K58348O01084l04490J8104o9036O3395n8743j1818o5262
$$ 254134 265483 -66932 191416 792500 488010 506114 437078 500473 441730 429912 364650
8183C64650L864K7363J5054l9057L815r200N6147j4320n289k4172K4039K2075
$$ 364650 368514 395877 410931 371874 375689 366489 422636 408316 403027 378855 402894 424969
8171D24969q626L8759l2369k7690j3862k4356L0263K4475j4002J6619L0328K6715
$$ 424969 416343 455102 422733 395043 381181 356825 387088 411563 397561 414180 444508 471223
8159D71223m3496L3151K4742J2080m0676J942K4318L1696o49J4734n891N358j2190
$$ 471223 427727 460878 485620 497700 457024 458966 483284 514980 514331 529065 523174 528532 516342
8146E16342N5871M5597J8576m1899J2121N922J7838M5393n3588L0579K7124L0745
$$ 516342 572213 617810 636386 594487 606608 612530 630368 675761 622173 652752 679876 710621
8134G10621L4803k5124p540N004L7350M440k2934N8580M7615k3712O946M4149
$$ 710621 745424 720300 712760 717764 755114 759554 736620 795200 842815 819103 826049 870198
8122H70198J2878M2886P3274j0974P3610M5116L7753M8365P0858O8381R849M9281
$$ 870198 883076 925962 999236 988262 1061872 1106988 1144741 1193106 1263964 1332345 1342194 1391475
8110A391475J00707K9756J6193Q7784Q7337O1736R0895N1410L2854J45042M3528
$$ 1391475 1492182 1521938 1538131 1625915 1713252 1774988 1865883 1917293 1950147 2095189 2138717
8099B138717P3375J24958J07900R9616J04739J61766J63467J15363J26315J64369
$$ 2138717 2212092 2337050 2444950 2544566 2649305 2811071 2974538 3089901 3216216 3380585
8089C380585J18181J20101J71811J48291J29937K05138K12736J81639J14562K96017
$$ 3380585 3498766 3618867 3790678 3938969 4068906 4274044 4486780 4668419 4782981 5078998
8079E078998L04493K74941L45485M00511M26584N76316O51779O84991Q60657R89183
$$ 5078998 5383491 5658432 6003917 6404428 6831012 7407328 8059107 8744098 9604755 10593938
8069A0593938J215207J351845J437042K016663K525762L508842M872719O135809
$$ 10593938 11809145 13160990 14598032 16614695 19140457 22649299 27522018 33657827
8061C3657827N501753R79454k329662o346676p066617m886559l440381k510340
$$ 33657827 39159580 40139034 37809372 31462696 24396079 19509520 16069139 13558799
8053A3558799j995835j484965j188762q41144p82704m74990m35119m97184m07417
$$ 13558799 11562964 10077999 8889237 8048093 7265389 6790399 6355280 5858096 5450679
8044E450679l39865l11208k19693k58634j45746k10811j52785j32974j66981k13258
$$ 5450679 5110814 4799606 4579913 4321279 4175533 3964722 3811937 3678963 3511982 3298724
8034C298724j83509k69053j29915j40534j13748j53053p6142m6251n0998j17700
$$ 3298724 3115215 2846162 2716247 2575713 2461965 2308912 2232770 2186519 2135521 2017821
8024B017821o4811n8404l8452r8298p3103q1583k6346K7651l3991m1132j9197
$$ 2017821 1953010 1894606 1856154 1757856 1684753 1603170 1576824 1604475 1570484 1529352 1510155
8013A510155p8431l6385K6996N718m6240o2114J3397N637n9763k1124L2410m2936
$$ 1510155 1431724 1395339 1422335 1428053 1381813 1319699 1333096 1338733 1278970 1257846 1290256 1247320
8001A247320l1917J8853n2536m9159o5431M1071q76l2335k2864M5454j11026J3300
$$ 1247320 1215403 1234256 1181720 1132561 1067130 1108201 1107325 1074990 1052126 1097580 986554 999854
7989I99854q105k4830n9465P592k2125Q495M300N4369J6274q2834l3447L641L9390
$$ 999854 991749 966919 907454 915046 892921 901416 905716 960085 976359 893525 860078 863719 903109
7976I03109N7244j1856r105N5400Q130k4850L990r596j3766K8361k0124m349j3676
$$ 903109 960353 948497 939392 994792 1002922 978072 982062 972466 958700 987061 966937 962588 948912
7963I48912j7465L3966j6639l0431J9798j5939L598k4784J4243j9757J7302n416
$$ 948912 931447 965413 948774 918343 938141 922202 925800 901016 915259 895502 912804 907388
7951I07388l1131l0331K6736k266k7228N0068L8496o8162n934l394Q0978l5304
$$ 907388 876257 845926 872662 870396 843168 893236 931732 863570 857636 854242 935220 899916
7939H99916K0936j1856N7644N83N2143N9885l8253J8079O7532j7056j804m018
$$ 899916 920852 908996 966640 967223 1019366 1079251 1040998 1059077 1126609 1109553 1107749 1103731
7927A103731O8839l1271q4416j0969j9116K4654l6692p5131J5658j7536J2776
$$ 1103731 1172570 1141299 1056883 1045914 1026798 1051452 1014760 939629 955287 937751 950527
7916I50527j9894l4247R303R246l4195J9313L7105j5667J4259o4466J4269K0348
$$ 950527 930633 896386 905689 914935 880740 900053 937158 921491 935750 871284 885553 905901
7904I05901Q0298n5721K1975r387j11884O3310L3984O3811M993n067l1552k7126
$$ 905901 986199 930478 952453 943066 831182 894492 928476 992287 997280 992213 960661 933535
7892I33535O153M2323L127j2120Q455k4655j4523P859J9672J2570j7231O074K1893
$$ 933535 939688 982011 985138 973018 981473 956818 942295 950154 969826 982396 965165 971239 993132
7879I93132R747j2668J0431M1827L1416O843L7987N5660Q595L9827O969J7704
$$ 993132 1002879 990211 1000642 1042469 1073885 1080728 1118715 1174375 1182970 1222797 1229766 1247470
7867A247470J1761M5630k1573l663l8094J0199P5573q8952j7233k7985j8098j8711
$$ 1247470 1259231 1304861 1283288 1279625 1241531 1251730 1327303 1238351 1221118 1193133 1175035 1156324
7855A156324O6798M9591m2422q539j3028N7276J6643L8602N5640p999K9157L7503
$$ 1156324 1223122 1272713 1230291 1221752 1208724 1266000 1282643 1321245 1376885 1368886 1398043 1435546
7843A435546J6904O1150P031N5695O5197J8437L3332r575P291O5045J606l5151
$$ 1435546 1452450 1513600 1520631 1576326 1641523 1659960 1693292 1683717 1691008 1756053 1757659 1722508
7831A722508j0814L7856M1528J1685q5454J6105p537k7965M9365L5475K4953N5021
$$ 1722508 1711694 1749550 1791078 1802763 1717309 1733414 1725877 1697912 1747277 1782752 1807705 1862726
7819A862726o54P1689L1002J2501j655P4349J8793K2844M1278Q5744Q2331Q1737
$$ 1862726 1862072 1933761 1964763 1977264 1975609 2049958 2068751 2091595 2132873 2218617 2300948 2382685
7807B382685M0611K2941R1409j8414M8943O5765Q1194M7198K1588M9027J25495
$$ 2382685 2423296 2446237 2537646 2519232 2568175 2633940 2715134 2762332 2783920 2832947 2958442
7796B958442O8338M4427k8109K4535P6717R8780J1214J1508R1660P8837R4701
$$ 2958442 3026780 3071207 3043098 3067633 3144350 3243130 3254344 3265852 3357512 3436349 3531050
7785C531050J02031L1765L1269O9028J06310O1764O3682R4040J40016R3444Q1172
$$ 3531050 3633081 3664846 3696115 3765143 3871453 3933217 3996899 4090939 4230955 4324399 4405571
7774D405571J48948R5719J33822J49116J87553J45544J78503J35169J44854J78331
$$ 4405571 4554519 4650238 4784060 4933176 5120729 5266273 5444776 5579945 5724799 5903130
7764E903130J49438K55763K14524J81779J81085K95460L43220L15901K81506L00492
$$ 5903130 6052568 6308331 6522855 6704634 6885719 7181179 7524399 7840300 8121806 8422298
7754H422298L56878L60105M16442M83792M59341M88833N40911O07670O75724O73421
$$ 8422298 8779176 9139281 9555723 10039515 10498856 10987689 11528600 12136270 12811994 13485415
7744A3485415Q29849R38128J112854J162882J418249J646974J947520K180684
$$ 13485415 14315264 15253392 16366246 17529128 18947377 20594351 22541871 24722555
7736B4722555K113535J431052N20299l72114p14224o61599l84300k1J83306L89762
$$ 24722555 26836090 28267142 28787441 28415327 27701103 27039504 26655204 26655183 26838489 27228251
7726B7228251N75946O82256N75042N83438O84322Q38392J058524J416047J593169
$$ 27228251 27804197 28486453 29061495 29644933 30329255 31167647 32226171 33642218 35235387
7717C5235387J832716J915618K038104K133247K343935K658671L320143M185862
$$ 35235387 37068103 38983721 41021825 43155072 45499007 48157678 51477821 55663683
7709E5663683N218529O033053O131536M488642J313611j913558m461891n037767
$$ 55663683 60882212 66915265 73046801 77535443 78849054 76935496 72473605 67435838
7701F7435838m072933k894303j942965j354742p24906j36756K58585P43026J162675
$$ 67435838 63362905 60468602 58525637 57170895 56445989 56309233 56567818 57310844 58473519
7692E8473519J784581K188108K517608K469167J937769J215564O24358N23418
$$ 58473519 60258100 62446208 64963816 67432983 69370752 70586316 71210674 71734092
7684G1734092R68230J337773O95270n75587j932132k856877k685663j846073q95084
$$ 71734092 72702322 74040095 74735365 74159778 72227646 69370769 66685106 64839033 63943949
7675F3943949J74361J053598J906111K660548L092077K905055J954914N81679
$$ 63943949 64118310 65171908 67078019 69738567 72830644 75735699 77690613 78272292
7667G8272292o03495j042880q39216o30113j139087k015275l076443l925207m282188
$$ 78272292 77668797 76625917 75786701 75156588 74017501 72002226 68925783 65000576 60718388
7658F0718388m493273m578216m443700l952555l367807k774857k382584k164719
$$ 60718388 56225115 51646899 47203199 43250644 39882837 37107980 34725396 32560677
7650C2560677k075967j988482j859856j618763j454896j265607j134849j167014
$$ 32560677 30484710 28496228 26636372 25017609 23562713 22297106 21162257 19995243
7642A9995243j100637r16690q60464q47330p77612o57899n61147n57721m76233
$$ 19995243 18894606 17977916 17117452 16270122 15492510 14834611 14273464 13715743 13239510
7633A3239510m94680m30613l66575m48055l71374l85570m11680l38285l26203
$$ 13239510 12744830 12314217 11947642 11499587 11128213 10742643 10330963 9992678 9666475
7624I666475l42485l41925l14074l37306k84367k71631k92486k42826l17313k66764
$$ 9666475 9323990 8982065 8667991 8330685 8046318 7774687 7482201 7239375 6922062 6655298
7614F655298j45504j87734k20407j71730j78408j49071j50254j39575j63773j11357
$$ 6655298 6509794 6322060 6101653 5929923 5751515 5602444 5452190 5312615 5148842 5037485
7604E037485j04157q6232j08433j23690j40822m7228r2274j03430o0875j46434
$$ 5037485 4933328 4847096 4738663 4614973 4474151 4426923 4334649 4231219 4170344 4023910
7594D023910j20704j40556j00283j09683p7381j26774l3266p7101p7892j8819
$$ 4023910 3903206 3762650 3662367 3552684 3475303 3348529 3315263 3238162 3160270 3141451
7584C141451n3459m3204p1371o0498k5763o5480j2947o3706l8111l5696q5848
$$ 3141451 3087992 3044788 2973417 2912919 2887156 2821676 2808729 2745023 2706912 2671216 2585368
7573B585368L2372l9169k9930M4872q8685l2505n177n6324r6937k0900k0714j7439
$$ 2585368 2617740 2578571 2548641 2593513 2504828 2472323 2467146 2410822 2313885 2292985 2272271 2254832
7561B254832l2739n9739j3775l2850k0931k1577j1340n8014L055k0006l6973K0202
$$ 2254832 2222093 2162354 2148579 2115729 2094798 2073221 2061881 2003867 2006922 1986916 1949943 1970145
7549A970145j9118k2567o6091L0232k012K1570M9879p4801L543K7676l1863J5230
$$ 1970145 1951027 1928460 1862369 1892601 1890589 1912159 1962038 1887237 1890780 1918456 1886593 1901823
7537A901823l5498n4034P135L6804K5456k7153j6339m487N5886L660j2289J6241
$$ 1901823 1866325 1812291 1819426 1856230 1881686 1854533 1838194 1833707 1889593 1893253 1880964 1897205
7525A897205J305l2358K3329M4475j8183J0095J569J6579k1491L1789O7505k6414
$$ 1897205 1898510 1866152 1889481 1933956 1915773 1925868 1927437 1944016 1922525 1954314 2021819 1995405
7513A995405L1988J1200l305J9745N7652J4034j994O2899J9836p286N9957P6711
$$ 1995405 2027393 2038593 2035288 2055033 2112685 2126719 2124725 2187624 2207460 2200174 2260131 2336842
7501B336842R643N8662N8828J9420L3129N5116K6423J17571J02946L2388O9010
$$ 2336842 2346485 2405147 2463975 2483395 2516524 2571640 2598063 2715634 2818580 2850968 2919978
7490B919978J06378M1179P2941J18059P6793P1508J07398J04629J09707J36385
$$ 2919978 3026356 3067535 3140476 3258535 3335328 3406836 3514234 3618863 3728570 3864955
7480C864955J40253J01067P1336J51749J53345J63817J94876K07455K07209K28528
$$ 3864955 4005208 4106275 4177611 4329360 4482705 4646522 4841398 5048853 5256062 5484590
7470E484590J48869J85112K99039L39552L35221L30111L47687M30157M36569L85213
$$ 5484590 5633459 5818571 6117610 6457162 6792383 7122494 7470181 7900338 8336907 8722120
7460H722120L60618L89356M08165L92745L91881M46740M98961N81805O02384N81714
$$ 8722120 9082738 9472094 9880259 10273004 10664885 11111625 11610586 12192391 12794775 13376489
7450A3376489O94321P10479O48697N95065N75405M38488K38636J56049n33j15436
$$ 13376489 14070810 14781289 15429986 16025051 16600456 17038944 17277580 17433629 17433096 17317660
7440A7317660K181J31623J36593J75975L23986M19021N34847N62809O00659O52325
$$ 17317660 17319841 17451464 17588057 17764032 18088018 18507039 19041886 19604695 20205354 20857679
7430B0857679O46775N57114L62875K14083n9836k41212l91940n82310o91763p10959
$$ 20857679 21504454 22061568 22424443 22638526 22578690 22337478 21945538 21363228 20671465 19960506
7420A9960506o88604p23958o34409n64512n15369l80730l21363k23510k43736
$$ 19960506 19271902 18547944 17913535 17349023 16833654 16452924 16131561 15908051 15664315
7411A5664315j56405k07795j51160j91802k70445l28076m13937m77228n30531
$$ 15664315 15507910 15300115 15148955 14957153 14686708 14358632 13944695 13467467 12936936
7402A2936936n72278o16585o59384o09712n72887m85004n04034m69942m15524
$$ 12936936 12364658 11748073 11088689 10478977 9906090 9421086 8917052 8447110 8031586
7393H031586m29505l64409l23055l19588k86292j91908k54309k76487k02739j82885
$$ 8031586 7602081 7237672 6914617 6595029 6308737 6116829 5862520 5586033 5383294 5200409
7383E200409k24083j14237j91219j33861j85255j79208j25029j07012r2729j08395
$$ 5200409 4976326 4862089 4670870 4537009 4351754 4172546 4047517 3940505 3847776 3739381
7373C739381p3902q2290j02165p4844r2270o2756m5474n1767j01766j27457r9426
$$ 3739381 3665479 3583189 3481024 3406180 3313910 3251154 3205680 3153913 3052147 2924690 2825264
7362B825264q9882p0038j15231m7487o2519o7572j23123q9462p805p1195p8817
$$ 2825264 2735382 2665344 2550113 2502626 2440107 2372535 2249412 2159950 2152145 2080950 2002133
7351B002133m2851n6660l0593m4646q4655M607o7735l1664p0512l9085n5704l36
$$ 2002133 1959282 1902622 1872029 1827383 1742728 1747335 1679600 1647936 1577424 1538339 1482635 1482299
7339A482299k4933k5016q9946j9524m3281m8934K784l4458n764m8618n3820n559
$$ 1482299 1457366 1432350 1342404 1322880 1279599 1230665 1233449 1198991 1193227 1144609 1090789 1085230
7327A085230l4983q2379O0249L1412l4643R762p4590n6227Q728K0316K6608n6192
$$ 1085230 1050247 967868 1028117 1059529 1024886 1034648 960058 903831 912559 932875 959483 903291
7315I03291J7558r148k0915l4061l3847L3436K2390J5222l2328R636k9462m4049
$$ 903291 920849 911701 890786 856725 822878 856314 878704 893926 861598 871234 841772 797723
7303G97723M0872Q792j4369k9363Q066p037O3598j2243o048m0193j592L0707m9209
$$ 797723 838595 847387 833018 803655 811721 804684 868282 856039 849991 809798 808206 838913 789704
7290G89704J0658L1304L4804O966k908O8831l9730J1686l6615K3924J8249l1559
$$ 789704 800362 831666 866470 873436 870528 939359 899629 911315 874700 898624 916873 885314
7278H85314L2551J7944L6663o347O9456J4652J8595k8322L8581P1008K2372J8400
$$ 885314 917865 935809 972472 966125 1035581 1050233 1068828 1040506 1079087 1150095 1172467 1190867
7266A190867L379N0762J7910K0782L1411L3742L7405P2136k8750k1870J00743
$$ 1190867 1194246 1245008 1262918 1283700 1315111 1348853 1386258 1458394 1429644 1407774 1508517
7255A508517J05836N7811M2003N7601Q7715J5337Q0456N4321L4441O1470K8028
$$ 1508517 1614353 1672164 1714167 1771768 1859483 1874820 1955276 2009597 2044038 2105508 2133536
7244B133536J23917J04327L0419K3448Q8488Q9048N0240J7471N7962K5700P7618
$$ 2133536 2257453 2361780 2392199 2415647 2504135 2593183 2643423 2660894 2718856 2744556 2822174
7233B822174J46323J17315Q2944M3989J12739K12085J67073J72355K77937J58662
$$ 2822174 2968497 3085812 3168756 3212745 3325484 3537569 3704642 3876997 4154934 4313596
7223D313596J23130J84704J52804J99544J82158J37908J94024J38713J29056R9658
$$ 4313596 4436726 4621430 4774234 4973778 5155936 5293844 5487868 5626581 5755637 5855295
7213E855295O5793J07723l4034n2018p6926j63772k26630j62686k23408k02452
$$ 5855295 5921088 6028811 5994777 5942759 5865833 5702061 5475431 5312745 5089337 4886885
7203D886885k55856k28246k49413k18669j25102j45417j64854j85717r5052j65004
$$ 4886885 4631029 4402783 4153370 3934701 3809599 3664182 3499328 3313611 3218559 3053555
7193C053555j45147m5138m7673j78704o0384l3662m7304o2206j4897L15n793J9246
$$ 3053555 2908408 2863270 2815597 2636893 2576509 2542847 2495543 2433337 2418440 2418755 2412962 2432208
7181B432208L6547n215L9523l609n1796j00524r9390k8420o2263m0313n295L2761
$$ 2432208 2468755 2463540 2503063 2499454 2447658 2347134 2247744 2219324 2157061 2116748 2111453 2144214
7169B144214L6778M9522J10365J32348J26795O2862j988q0546j08959k01656j85183
$$ 2144214 2180992 2230514 2340879 2473227 2600022 2662884 2660896 2580350 2471391 2269735 2084552
7158B084552j18956j50515n1178j01411j7731J9094N5249K7621j3027O7335n2144
$$ 2084552 1965596 1815081 1763903 1662492 1644761 1663855 1719104 1746725 1733698 1801033 1748889
7147A748889p4341m8927j13215p5164q9672r6532r0454o7776q4580o1397m0935
$$ 1748889 1674548 1625621 1512406 1437242 1347570 1251038 1160584 1092808 1008228 946831 905896
7136I05896P791o2973m012M3641L8158n6003m6430n0601K4970J4934l8551j7786
$$ 905896 913687 850714 846702 890343 928501 872498 826068 775467 800437 815371 776820 759034
7124G59034j3924P003J998J418L041r8401J5582m948l8526K6857k0212M452K1726
$$ 759034 745110 752113 754111 755529 758570 660169 675751 670803 632277 659134 638922 643374 665100
7111F65100n112m9006k1133L9454P5115J4627O328K0414M303k7856K8466J2806
$$ 665100 659988 610982 589849 629303 704418 719045 725373 745787 750090 722234 750700 763506
7099G63506M6014J4113L4759K9093M5824O3628j389O9140J9921L5665L9734N8355
$$ 763506 809520 823633 858392 887485 933309 996937 995548 1064688 1084609 1120274 1160008 1218363
7087A218363Q0595j1090N079M1754O8740N0050O3436N0963Q3192P1623j392P2412
$$ 1218363 1298958 1287868 1292947 1334701 1403441 1453491 1516927 1567890 1651082 1722705 1721313 1793725
7075A793725K4380J6064P0425k27k4418m0637L2073R973j6758q5160K5531j2029
$$ 1793725 1818105 1834169 1904594 1904367 1879949 1839312 1871385 1881358 1864600 1779440 1804971 1792942
7063A792942j6463n5566k046L456j9248l3583K1265M834N3096M4003L554L3545
$$ 1792942 1776479 1720913 1718867 1722323 1703075 1669492 1690757 1695591 1748687 1792690 1796244 1829789
7051A829789j1721Q273p750m3001r6121n3866p5640q8925m3768p4297j5213l5419
$$ 1829789 1818068 1826341 1818591 1775590 1679469 1625603 1549963 1461038 1417270 1342973 1327760 1292341
7039A292341K1148l5649p0295k0374k2208J1304M1885m3648l5015l9746k2563
$$ 1292341 1313489 1277840 1207545 1187171 1164963 1176267 1218152 1174504 1139489 1099743 1077180
7028A077180m50l0706q5364l6973m0944m8506o000m0898M567p3468J0972l9651
$$ 1077180 1076730 1046024 960660 923687 882743 834237 828237 787339 791906 718438 729410 689759
7016F89759r519J349O365k4738j3178l4490M43l9744K1896q68M0404L2099p2284
$$ 689759 680240 681589 687954 663216 650038 615548 615991 576247 598143 597275 637679 669778 597494
7003E97494M2364L889J4464m3077j0062N0299L0209K9901K140m3263n1753K2017
$$ 597494 639858 643747 658211 615134 605072 655371 685580 715481 717621 674358 622605 644622
6991F44622L5785k4241L6297L8963k1888J5455K4427N5107l105M3676K647l030
$$ 644622 680407 656166 692463 731426 709538 724993 749420 804527 801422 845098 847745 844715
6979H44715N728K0604J3162K2453L8618P9292l2900K1714O9819k4659M7973Q9968
$$ 844715 850443 871047 884209 906662 945280 1024572 991672 1013386 1083205 1058546 1106519 1196487
6967A196487L4023Q3290M7346L9613N5127R4334N3805O1825M4873M1031N7755
$$ 1196487 1230510 1313800 1361146 1400759 1455886 1550220 1604025 1665850 1710723 1751754 1809509
6956A809509J9576O531K588O675k4420K95K6517j9628K0151M8889N5542Q7388
$$ 1809509 1829085 1835616 1838204 1844879 1820459 1820754 1847271 1827643 1847794 1896683 1952225 2039613
6944B039613O6051R2873O8945J7579O744J03329J446j4736k6287j05080r5668
$$ 2039613 2105664 2198537 2267482 2285061 2291805 2395134 2396580 2381844 2355557 2250477 2154809
6933B154809n5111q0187o8064r7955o2248j10631q19m481l4828o663k7942o8989
$$ 2154809 2099698 2019511 1951447 1853492 1791244 1680613 1679794 1675313 1640485 1633822 1605880 1536891
6921A536891m957j8632n2209l7756n4299l8363m4405j10822r5588m8960n0518
$$ 1536891 1531934 1513302 1461093 1423337 1369038 1330675 1286270 1175448 1079860 1030900 980382
6910I80382m3387q5690m6425m6159m8714l2504m7855j0734p7248l3233k5422j0368
$$ 980382 936995 851305 804880 758721 710007 677503 629648 618914 541666 508433 483011 472643
6898D72643J6398K1439O278q3573n5743L5630j6821n9626O5236o3512J9201m9260
$$ 472643 489041 510480 516758 433185 377442 413072 396251 336625 401861 338349 357550 308290
6886C08290p6688J2199M2193n1596l2869K3665q160m1744M2967k2547J6776J6581
$$ 308290 231602 243801 285994 234398 201529 225194 217034 175290 218257 195710 212486 229067
6874B29067j7857m1628j3554O2791l8239j9166n1290M8376K5219k617k5510k4790
$$ 229067 211210 169582 156028 218819 180580 161414 110124 158500 183719 181102 155592 130802
6862A30802R345j5968k171M0682m2470j3554k429j766K055n650l6866l4100p504
$$ 130802 140147 124179 122008 162690 120220 106666 104237 102471 104526 98876 62010 27910 20406
6849B0406J8431J7864J1440j8798j9539L3757r237n0029k1453O8799N499L7964
$$ 20406 38837 56701 68141 49343 29804 63561 54324 4295 -17158 51641 57140 95104
6837I5104j4553l3666J9257K745J4766r103J0138m1217J4528M0399o2623O330
$$ 95104 80551 46885 66142 68887 83653 74550 84688 43471 57999 98398 35775 42105
6825D2105O8516q47q533K3092l3587k4227O9782m1739q294L5197J4833M8587K0279
$$ 42105 110621 109774 101241 124333 90746 66519 136301 94562 86268 121465 136298 184885 205164
6812B05164k8185L0534q939j2695m3032J6349o745r383j9677k9979O951M8164
$$ 205164 176979 207513 198574 185879 142847 159196 152451 143068 123391 93412 100363 148527
6800A48527O4079j185n1540L0157M5079M7123k4759n2171l8940n7224L489j9724
$$ 148527 212606 211421 159881 190038 235117 282240 257481 205310 166370 109146 112635 92911
6788I2911M2875J6799l3423l7022J3148n296j6784K6759J215m417J6650l6014
$$ 92911 135786 152585 119162 82140 95288 89992 73208 99967 101182 96765 113415 77401
6776G7401l1909O7791K3394N117m1504q9993L2643j5562n0581J0265L8184k1478
$$ 77401 45492 113283 136677 141794 100290 10297 42940 27378 -23203 -12938 25246 3768
6764C768n8423r107L3403o424L6803l292l238J5390J8222J992j9392m4494K4980
$$ 3768 -54655 -63762 -30359 -36783 20 -3272 -6510 8880 27102 29094 9702 -34792 -9812
6751i812K0543k2646J906k0233p1577K6025K8621p196J7336L1265J7286m6968
$$ -9812 10731 -11915 -10009 -30242 -101819 -75794 -47173 -54369 -37033 -5768 11518 -35450
6739c5450n434L1952m394M870O027M5683m3414k4911k6958m990K6252M7100n5802
$$ -35450 -40884 -8932 -13326 -8456 -2429 43254 -160 -25071 -52029 -57019 -30767 16333 -39469
6726c9469j5709l311L5198l514k805k8949J9230K0579k2260q524R151J9976j2149
$$ -39469 -55178 -58489 -23291 -26805 -29610 -58559 -39329 -18750 -41010 -49534 -40383 -20407 -32556
6713c2556L2892J6921o396k1957L0179P643K0469k5826J586J3028n8277J3107
$$ -32556 336 17257 10861 -11096 19083 26726 47195 21369 22955 35983 -22294 -9187
6701i187O42p136k5910K7609L6548n5472L3554Q202l8350k0687Q7975j0507j3376
$$ -9187 -8545 -15681 -41591 -13982 22566 -32906 648 8850 -29500 -50187 37788 27281 13905
6688A3905j561q339O666K8452L2305j7693l4030L8103J6942j8973m3006J8201
$$ 13905 12344 4005 10671 39123 71428 53735 19705 57808 74750 55777 12771 30972
6676C0972j6306K6669L334o7185K3475L2653k838l198l634K5484l9394L4785n6374
$$ 30972 14666 41335 44669 -22516 959 33612 30774 27576 23942 49426 10032 44817 -11557
6663a1557m2722k2315R955Q9237L40k7581M529p0636M6823M2571k1176K0862Q40
$$ -11557 -54279 -76594 -66639 22598 22938 -4643 -114 -70750 -23927 18644 -2532 18330 19170
6650A9170j044j1512J3393J6417n6984q726k2282O4267m372k5602q703J9776K7843
$$ 19170 18126 6614 20007 36424 -20560 -29286 -51568 12699 8327 -17275 -25978 -6202 21641
6637B1641q0840K816L0792k0596L307j255J0628j5377M7665K8439j9935j2641
$$ 21641 -59199 -56383 -25591 -46187 -42880 -44135 -33507 -48884 -1219 27220 7285 -5356
6625e356M898p055j8345O708j1264J6353l144J9485m0678N0457k7960r797K7441
$$ -5356 -458 -7513 -25858 -19150 -30414 -14061 -17205 2280 -38398 12059 -15901 -25698 1743
6612A743K2270k5673k1207k9036O9954J5900L5158l8606j6074M1505k3346J9094
$$ 1743 24013 -1660 -22867 -51903 18051 33951 69109 30503 14429 55934 32588 51682
6600E1682j3345k8194K7512n5212K4138l2634K5590N8075N5658q301n4729r239
$$ 51682 38337 10143 37655 -17557 6581 -26053 -463 57612 113270 104969 50240 41001
6588D1001N696J8840j1932k0794M7523K6817N242K3792J5933j8856j4255k1556
$$ 41001 46697 65537 53605 32811 80334 107151 112393 136185 152118 133262 119007 97451
6576I7451K6668j2695k6515K7452l4790L4162k6418K96p337o8253K2950M4310
$$ 97451 124119 111424 84909 112361 77571 111733 85315 85611 78274 10021 32971 77281
6564G7281m7067l5269l4883M0102J4083l244k9327K0659M4377L4154q313l5329
$$ 77281 30214 -5055 -39938 164 14247 11003 -18324 2335 46712 80866 72553 37224
6552C7224n3399J0878P7273r322k3220n1095M902J1256k1225P0231k26l0808M4149
$$ 37224 -16175 -5297 71976 62654 39434 -11661 -6759 4497 -16728 53503 53277 22469 66618
6539F6618O119k7166l8817P129k8766N239J7622n6713M7272K8146Q38k0058K7777
$$ 66618 72737 45571 6754 13883 -14883 -9644 7978 -48735 -1463 26683 27521 7463 35240
6526C5240l92O661j7053k1727l5545K0373L7284M2541J0527p4801J1655J8567
$$ 35240 34848 41509 24456 2729 -32816 -12443 24841 67382 77909 3108 14763 33330
6514C3330L5604p8252R539N717j6283L606n210N4308K9693o2607m1801N6332K1887
$$ 33330 68934 -9318 221 5938 -10345 -6739 -11949 42359 72052 9445 -32356 23976 45863
6501D5863J0456l2116m329k0491J655j3217q528l5323M3462L8856n428j9201J7210
$$ 45863 56319 24203 19874 -617 1038 -12179 -20707 -56030 -12568 26288 20860 1659 18869
6488A8869k3501n5255M5780M1889n94j7213k0755K0799k1620j1264J9611K5389
$$ 18869 -4632 -59887 -14107 27782 27188 9975 -10780 10019 -11601 -22865 -3254 22135
6476B2135L4888n8200N338K554j6413p937l5640L5620N8857m1202k7290K557j607
$$ 22135 57023 -1177 4161 6715 -9698 -17635 -53275 -17655 41202 0 -27290 -24733 -26340
6463b6340O0191J5337m0466J9827o060j4600K5984L3149r1304j2757K5434K8334
$$ -26340 33851 49188 8722 28549 22489 7889 33873 67022 -24282 -37039 -11605 16729
6451A6729M4134j4936M789l3792M2499o132l5631N0410M628o30J0261Q435l5944
$$ 16729 60863 45927 50716 16924 59423 53291 17660 68070 72698 72068 82329 90764 54820
6438E4820K691k4889N5064J562M4069k0718l077L7512l482L7391n1222k9139N2763
$$ 54820 57511 32622 87686 89248 133317 112599 109522 147034 143552 180943 129721 100582 153345
6425A53345m4248l5029J8622J277N727N320L0922M2999j3962l7469l4864O345
$$ 153345 109097 74068 92690 93967 99694 105014 135936 178935 164973 127504 92640 98985
6413I8985K3744k353L4753p3672J8365O49Q142K94K099K164n366K1543L8761j3862
$$ 98985 122729 120376 155129 81457 99822 100471 108613 108907 111006 113170 107804 129347 168108 154246
6399A54246p379M2127m7289k7221Q182m10K7598N3331l7531j0067J0442j2618
$$ 154246 146867 188994 141705 114484 122666 122256 149854 203185 165654 155587 166029 153411
6387A53411l5788l7005j8423J5587M2155K0834o492l6619R305M196M2874l7030
$$ 153411 117623 80618 62195 77782 119937 140771 134279 97660 106965 111161 154035 117005
6375A17005n9641k6692O143o285K935N222L5790j2367l9881L3610K1466k3716
$$ 117005 57364 30672 36815 30530 33465 38687 74477 62110 22229 55839 77305 53589
6363E3589J6458j624J8227m0986m7670K0083M1656P084J127j4908r976k3227N1748
$$ 53589 70047 68423 86650 45664 -2006 18077 59733 66817 67944 53036 43060 19833 71581
6350G1581m54k7349j1151k4672L0730J7642j6364q02k1675l4496N4096K6439m2660
$$ 71581 71127 43778 32627 7955 38685 56327 39963 39161 17486 -17010 37086 63525 20865
6337B0865Q32j1768L5751m235J0923J4432j4914k5322K6553N8115k5574L0034
$$ 20865 21697 9929 45680 41445 52368 66800 51886 26564 53117 111232 85658 115692
6325A15692j5037k9729l4863J8710k3001o163n5358R516O1718N0206J4539L1474
$$ 115692 100655 70926 36063 54773 31772 25609 -29749 -20233 41485 91691 106230 137704
6313A37704k9009l7066K0380L2779r969q102J3172K979k4215K4271P482J5721
$$ 137704 108695 71629 92009 124788 114819 106717 119889 122868 98653 122924 130406 146127
6301A46127l4644j1967K5840K5677L2020j2686j0524J5511J5878J2533l7671J6220
$$ 146127 111483 99516 125356 151033 183053 170367 159843 175354 191232 203765 166094 182314
6289A82314k4413O562r035J2808P374J3734L9792j6243R702J5331K3802j8885
$$ 182314 157901 164463 155428 168236 175610 189344 229136 212893 222595 237926 261728 242843
6277B42843P2867l4133j8038L2551q716m5058K3170l0805p203J9969N807O072
$$ 242843 315710 281577 263539 296090 287374 242316 265486 234681 227478 247447 253254 259326
6265B59326L940k406k0897J9405O389J9907k5417J2747j5448L0970m3210l0900
$$ 259326 263266 260860 239963 259368 265757 285664 260247 272994 257546 288516 245306 214406
6253B14406K5125m6853l5172O9863n644p2879M1973L9874M529j2414J7428K19
$$ 214406 239531 192678 157506 227369 221725 148846 190819 230693 235222 222808 240236 240455
6241B40455P899r482k8460m4219J7389K8025j2520J7876k0915K5918o2134K5436
$$ 240455 248354 238872 210412 166193 183582 211607 199087 216963 196048 221966 159832 185268
6229A85268R378n8799J7151L9145l98l3436j09L8864K970p460J612J4322q348
$$ 185268 194646 135847 152998 192143 191745 158309 158200 197064 200034 192574 194186 208508 200160
6216B00160J6914K903l5846n51L4448j017k3351k4380j0562M9255q169K0909j8645
$$ 200160 217074 219977 184131 183580 218028 217011 193660 169280 158718 207973 199804 220713 202068
6203B02068K4681n954j0169q0727L1380k6520R282K5387k0159j6605N4552O1026
$$ 202068 226749 220795 210626 129899 161279 134759 144041 169428 149269 132664 187216 248242
6191B48242P889l5804j5536J3269k455l959L7147k1045m4121L835M7306J1622
$$ 248242 256131 220327 204791 218060 215605 211646 248793 227748 183627 187462 234768 246390
6179B46390m2481j3205k9846J7460K5657l2398K2430J3469n1144j7506P1592m3762
$$ 246390 203909 190704 160858 178318 203975 171577 194007 207476 156332 138826 210418 166656
6167A66656j2695K4569k7581p196M1662m624O432k2672J816P5227K7540m2426
$$ 166656 153961 178530 150949 143753 185415 180791 187223 164551 166367 241594 269134 226708
6155B26708N580J9451N438O314J8860l5069k5804M2786J3375J3724k8988L9806
$$ 226708 232288 251739 257177 263491 282351 247282 221478 264264 277639 291363 262375 302181
6143C02181O454K9183r139K2922l1700j5167m7479O5130J1901J1386P113k5965
$$ 302181 308635 337818 328679 351601 319901 304734 257255 322385 334286 345672 352785 326820
6131C26820J2014K0586l8752N542k3513K4801P510M011q36K3600K8626n3487N3854
$$ 326820 338834 359420 320668 326210 302697 327498 335008 339019 338183 361783 390409 336922 390776
6118C90776j3141o163J4989m5550K8964l4235P505K5560j7028J8762k3410m4J063
$$ 390776 377635 371472 386461 340911 369875 335640 343145 368705 351677 370439 347029 346985 348048
6105C48048o739J6549k7912K1012M864N4906L5399q1180L4702j149J8915m3125
$$ 348048 341309 357858 329946 350958 355822 410728 446127 364947 399649 398500 417415 374290
6093C74290l3895l0551L0956K6545J8593m579K6609n3396K4773r216q533M801
$$ 374290 340395 309844 340800 367345 385938 381359 407968 354572 379345 370129 361596 366397
6081C66397k8934K6241J3327J8186n5752L8666Q9996o304k0406l222k0947r061
$$ 366397 337463 363704 377031 395217 339465 378131 468127 461823 441417 438195 417248 408187
6069D08187o551j1916J265K0334M1645K803j6326l298K6084K9587n3526n2050
$$ 408187 401636 389720 390985 411319 452964 455767 439441 436143 462227 491814 438288 386238
6057C86238k818M5504j1056L2579m6238M4837O936j0778M3033L3303n4382L7313
$$ 386238 383420 428924 417868 450447 404209 449046 455982 445204 488237 521540 467158 504471
6045E04471l383O808P087k2150k5588J8913K1823r654j4923K0802M9512J1581
$$ 504471 501088 507896 514983 492833 467245 486158 507981 498327 483404 504206 553718 565299
6033E65299l7889L3107J1321K6209m98j1717J4758J8858j1511J9602L6735r029
$$ 565299 527410 560517 571838 598047 597549 585832 600590 619448 607937 627539 664274 655245
6021F55245J2258k356M6131m5005O952j3203K3593N4164J77l5848L8804k8198
$$ 655245 667503 665147 711278 666273 673225 660022 683615 737779 737956 702108 740912 712714
6009G12714j7820L3355J4705O4023J0396l4019L637M769K3618L9739K8088K6223
$$ 712714 694894 728249 742954 806977 817373 783354 786991 791760 815378 855117 883205 909428
5997I09428K2710j00537K5989N5410n848J9988N5864J2221j4061J148m443N713
$$ 909428 932138 831601 857590 913000 907152 927140 983004 995225 981164 982312 977869 983582
5985I83582K3374M1457J7759K2462Q9465K9758L1258K0884N0273O8121Q0374N8550
$$ 983582 1006956 1048413 1066172 1088634 1178099 1207857 1239115 1259999 1310272 1378393 1458767 1517317
5973A517317O2550K7801J00124L1483O937M0283O4582J5800P5078J21212Q7280
$$ 1517317 1579867 1607668 1707792 1739275 1746212 1786495 1851077 1866877 1941955 2063167 2150447
5962B150447J60102J63484J49595J31412J06992L1038j15223q0311l6965m656
$$ 2150447 2310549 2474033 2623628 2755040 2862032 2893070 2777847 2697536 2660571 2655915
5952B655915L8656L5781K8431M4801N8450M3047P5240R3209R7033Q1323J00764
$$ 2655915 2694571 2730352 2758783 2803584 2862034 2905081 2980321 3073530 3170563 3251886 3352650
5941C352650J10776J2245q0087j12015j58828j04753n8173n9978j02562q2759
$$ 3352650 3463426 3475671 3395584 3283569 3124741 3019988 2961815 2901837 2799275 2716516
5931B716516k0568p837p1600N942P6207O8375N1448Q3559P5622J1910L6008P9047
$$ 2716516 2695948 2688111 2616511 2622453 2698660 2767035 2818483 2902042 2977664 2989574 3025582 3104629
5919C104629N6740Q2279R1411J07557J05260J59477J43856J22950N0738R7511
$$ 3104629 3161369 3243648 3335059 3442616 3547876 3707353 3851209 3974159 4024897 4122408
5909D122408Q9036M568l0568M5920P989K6972R3402P2394J10437J04321R5236
$$ 4122408 4211444 4216012 4185444 4231364 4239353 4266325 4359727 4432121 4542558 4646879 4742115
5898D742115R7741J37166N0250J4298L629p3628j9868q4054n4914j33126n5611
$$ 4742115 4839856 4977022 5027272 5041570 5045199 4971571 4951703 4867649 4812735 4679609 4623998
5887D623998k2713l8966j26200k6941m705J7774L3684J4341k6484l6990n7829
$$ 4623998 4601285 4562319 4436119 4409178 4404473 4422247 4455931 4470272 4443788 4406798 4348969
5876D348969j84292k05945j95922j21636j90542j28744q4256j03352o6155m4182
$$ 4348969 4164677 3958732 3762810 3641174 3450632 3321888 3237632 3134280 3068125 3023943
5866C023943m4198j1674m7985j2706j00625j768j8687O228k7927m6925M410j2131
$$ 3023943 2979745 2968071 2920086 2907380 2806755 2804987 2786300 2792528 2764601 2717676 2722086 2709955
5854B709955K0789R949n683M2539M512L3431M3479P5517N5520n826l2451Q9335
$$ 2709955 2730744 2740693 2735010 2777549 2782061 2815492 2858971 2934488 2990008 2984182 2951731 3041066
5842C041066k0527K5560J30638N2499N3743M7205Q4407P1886M8039M2463M4614
$$ 3041066 3020539 3046099 3176737 3229236 3282979 3330184 3414591 3486477 3534516 3576979 3621593
5831C621593N8275J05755O6057L1050M9320R5107N8119P7041O5162P6997N8166
$$ 3621593 3679868 3785623 3851680 3882730 3932050 4027157 4085276 4162317 4227479 4304476 4362642
5820D362642l5O8501L5468l879J09192P3035M3781L7879L8866N6954J37153R7241
$$ 4362642 4362607 4431108 4466576 4462697 4571889 4644924 4688705 4726584 4765450 4822404 4959557 5056798
5808E056798J18857R6653J15059J11722O2377J36134L6328R6035J24234J06688
$$ 5056798 5175655 5272308 5387367 5499089 5561466 5697600 5733928 5829963 5954197 6060885
5798F060885R4720J19254J42162J85833J63983J04775K17059K06817K32213K28578
$$ 6060885 6155605 6274859 6417021 6602854 6766837 6871612 7088671 7295488 7527701 7756279
5788G756279K32709J54339K53667K40917K19421K92473K88131K83625L48966L80768
$$ 7756279 7988988 8143327 8396994 8637911 8857332 9149805 9437936 9721561 10070527 10451295
5778A0451295L98422M26231M84606M69948M74725M27243M00430M12472L58554
$$ 10451295 10849717 11275948 11760554 12230502 12705227 13132470 13532900 13945372 14303926
5769A4303926L23284L49049L57509L91594L66509M21569M88276N19260O51181
$$ 14303926 14627210 14976259 15333768 15725362 16091871 16513440 17001716 17520976 18172157
5760A8172157O17457P05044P02796P30143P73190P79994R34874R58602J072763
$$ 18172157 18789614 19494658 20197454 20927597 21700787 22480781 23415655 24374257 25447020
5751B5447020J174258J299922J341669J375663J489185J371243J420759J513960
$$ 25447020 26621278 27921200 29262869 30638532 32127717 33498960 34919719 36433679
5743C6433679J501580J536901J694025J728136J832647K022546K157798K295338
$$ 36433679 37935259 39472160 41166185 42894321 44726968 46749514 48907312 51202650
5735E1202650K576328K851425L227733L525404L982398M417186M899912N492970
$$ 51202650 53778978 56630403 59858136 63383540 67365938 71783124 76683036 82176006
5727H2176006O205860P026827P849814Q784596R407536R743592J0512817J2436392
$$ 82176006 88381866 95408693 103258507 112043103 121450639 131194231 141707048 154143440
5719A54143440J5787573K0626643K5163246K5847691J8101910M434293r349929
$$ 154143440 169931013 190557656 215720902 241568593 259670503 264104796 254754867
5712B54754867j9287206j9496911j3836975q128627l593912K53986L540050O391778
$$ 254754867 235467661 215970750 202133775 194005148 190411236 190665222 194205272 200597050
5704B00597050R102605J1807793J4150192J6926863J9743399K0388992J3842338
$$ 200597050 209699655 221507448 235657640 252584503 272327902 292716894 306559232
5697C06559232Q77816j3820666k6863076l1167831k8991806k5437715k1692400
$$ 306559232 307437048 293616382 266753306 235585475 206593669 181155954 159463554
5690A59463554j8043925j4680641j1908702r849272q176164o927279n825874n260088
$$ 159463554 141419629 126738988 114830286 104981014 96804850 89877571 84051697 78791609
5682G8791609m541852l932453l407631l003398k650953k378650k081008j888868
$$ 78791609 74249757 70317304 66909673 63906275 61255322 58876672 56795664 54906796
5674E4906796j724816j525878j634933j732489j825793j706136j538169j281228
$$ 54906796 53181980 51656102 50021169 48288680 46462887 44756751 43218582 41937354
5666D1937354j137067j033641q84221q50138q63270p68065o85737o34905m89917
$$ 41937354 40800287 39766646 38882425 38032287 37169017 36400952 35715215 35080310 34590393
5657C4590393m57393m99633n05168n54301n30381n01063n14062n17823m20565
$$ 34590393 34133000 33633367 33128199 32573898 32043517 31542454 31028392 30510569 30090004
5648C0090004m28415l36150k33374l6666o2811K15487L61807M09004L88117K99284
$$ 30090004 29661589 29325439 29092065 29055399 28992588 29208075 29569882 29978886 30367003 30666287
5638C0666287L30165L41628L15679L52417J78229l07234n15444p43692p37717
$$ 30666287 30996452 31338080 31653759 32006176 32184405 31877171 31361727 30618035 29880318
5629B9880318n32654k33424L1899K08845L86207M64822M26350M78878L98423L37311
$$ 29880318 29347664 29114240 29146139 29354984 29741191 30206013 30632363 31111241 31509664 31846975
5619C1846975J58818j25911k52412m33861p06996n94421o43284o49585n96406
$$ 31846975 32005793 31879882 31627470 31193609 30486613 29892192 29248908 28599323 28002917
5610B8002917n11479m18613m08481k00199n6338Q4803K02807J02118j29480n17368
$$ 28002917 27491438 27072825 26664344 26464145 26407807 26492610 26695417 26797535 26668055 26150687
5600B6150687q75340j160233j266898j146720j013059q30781o68733m91332l49046
$$ 26150687 25275347 24115114 22848216 21701496 20688437 19857656 19188923 18697591 18348545
5591A8348545k80643l06996j88224n5426m5206Q255L0616O0369j2697L4358L9124
$$ 18348545 18067902 17760906 17572682 17517256 17472050 17480305 17510921 17571290 17558593 17592951 17632075
5580A7632075J6446J7699L6626J22116K40961K86331L13908M25436L99537N03610
$$ 17632075 17648521 17666220 17702846 17824962 18065923 18352254 18666162 19091598 19491135 19994745
5570A9994745O80843P89908R64931J209379J361693J220371Q96617K30039m78790
$$ 19994745 20675588 21465496 22430427 23639806 25001499 26221870 27118487 27348526 26869736
5561B6869736j000129j195966j009732q94763o04417m34268l36223k06219r2150
$$ 26869736 25869607 24673641 23663909 22769146 22164729 21730461 21394238 21188019 21095869
5552B1095869m0440j16888j58329j39892k05616k42840j62073r6385m2052P8237
$$ 21095869 21055429 20938541 20780212 20640320 20434704 20191864 20029791 19933406 19891354 19969591
5542A9969591J29713K32324K23391K59203M42355N01225N42421O39371P66551
$$ 19969591 20099304 20331628 20555019 20814222 21256577 21757802 22300223 22939594 23706145
5533B3706145R77190R65450J069733J074988R66950R31265P79504O14866K17053
$$ 23706145 24683335 25648785 26718518 27793506 28760456 29691721 30471225 31086091 31303144
5524C1303144j37075n28624p52897o87857n19880l29824o4816J23322L83847N87393
$$ 31303144 31166069 30637445 29884548 29196691 28676811 28346987 28282171 28405493 28789340 29376733
5514B9376733P71431J099054J331520J620013J895704K098765K284684K308250
$$ 29376733 30148164 31247218 32578738 34198751 36094455 38193220 40477904 42786154
5506D2786154K252117K054633J816169J343687O53187j74969j239816k066375
$$ 42786154 45038271 47092904 48909073 50252760 50905947 50730978 49491162 47424787
5498D7424787k567421k616421k263936j809168j377485q99965m59946p89L33146
$$ 47424787 44857366 42240945 39977009 38167841 36790356 35890391 35430445 35429656 35762802
5489C5762802O81566J045539J400900J785504K097138K279671K241648J697843
$$ 35762802 36444368 37489907 38890807 40676311 42773449 45053120 47294768 48992611
5481D8992611R30189j52974j120617j840465k340221k643917k799249k722588
$$ 48992611 49922800 49769826 48649209 46808744 44468523 41824606 39025357 36302769
5473C6302769k539728k154377j767620j379628j057849q70590p14838n47940m13889
$$ 36302769 33763041 31608664 29841044 28461416 27403567 26532977 25818139 25270199 24856310
5464B4856310k49746r393K06815L00688M17496L45661J42190m24031r36449j317698
$$ 24856310 24606564 24597171 24803986 25104674 25522170 25867831 26010021 25585990 24649541 23331843
5454B3331843j524327j437894j421026j191842j181559j155216r17522q91198
$$ 23331843 21807516 20369622 18948596 17756754 16575195 15419979 14502457 13611259
5446A3611259p39169o83156n94039n55485m92980m67426n06603m22702l57135
$$ 13611259 12872090 12188934 11594895 11039410 10546430 10079004 9572401 9149699 8792564
5437H792564l75236l00208l19904k63517j91035k36946j86970k27080j83743j54825
$$ 8792564 8417328 8117120 7797216 7533699 7342664 7105718 6918748 6691668 6507925 6353100
5427F353100j70922j62136j33820j61315j96884j54571j67431j57794j49102j21664
$$ 6353100 6182178 6020042 5886222 5724907 5528023 5373452 5206021 5048227 4899125 4777461
5417D777461j46844j40381j19412r4986o7960q5498o7184r0709m2265q4965p6055
$$ 4777461 4630617 4490236 4370824 4275838 4207878 4122380 4055196 3964487 3922222 3837257 3761202
5406C761202p7497q5092m0679l4100r9302o6346m0994p2715o1243J3866j437o7748
$$ 3761202 3683705 3598613 3557934 3523834 3424532 3358186 3317192 3244477 3183234 3197100 3195663 3127915
5394C127915k7692m6549M803J510J2344M36n6957l7086q6945L1318q828k9063
$$ 3127915 3100223 3053674 3058477 3059987 3072331 3072767 3015810 2978724 2891779 2923097 2914269 2885206
5382B885206j5115M4084j3018l8502J1456k1406l5714r4939m777l2805j6708l1982
$$ 2885206 2870091 2914175 2901157 2862655 2874111 2852705 2816991 2722052 2717275 2684470 2667762 2635780
5370B635780m5443K2574K8864r187n3613j5830k5335n3922l6916k0307q8815l0005
$$ 2635780 2590337 2612911 2641775 2632588 2578975 2563145 2537810 2483888 2446972 2426665 2337850 2307845
5358B307845k9373k9991j7953q3621o3813m3021j5734q736M0108j3327n8159n9306
$$ 2307845 2278472 2248481 2230528 2146907 2083094 2040073 2024339 2015603 2055711 2042384 1984225 1924919
5346A924919L0473N079l116j5074k9351q2676j7399J7099n6074m07K2549M816
$$ 1924919 1955392 1960471 1957355 1942281 1912930 1830254 1812855 1829954 1773880 1773473 1796022 1800838
5334A800838k1110l7082J0330o51n0406o126k5316j3180K9724r624m3631l0084
$$ 1800838 1779728 1742646 1752976 1752325 1701919 1695793 1670477 1657297 1687021 1677397 1633766 1603682
5322A603682j574N4127N4863n9745o5262Q774m2830k6490j6817p190j6265k8088
$$ 1603682 1602108 1656235 1711098 1651353 1586091 1594865 1552035 1525545 1508728 1501538 1485273 1457185
5310A457185Q56m1771n858L1836l3558J694k126n5562m0408m330m4068k3378L8474
$$ 1457185 1458041 1416270 1410412 1442248 1408690 1410384 1408258 1352696 1312288 1307958 1263890 1240512 1278986
5297A278986N067m731n9863M0061N575K6361j2894j3295l843j3578K1028l0288
$$ 1278986 1284053 1279322 1219459 1259520 1265095 1291456 1278562 1265267 1261424 1247846 1268874 1238586
5285A238586k7921J3092p00l0600J1226l0123o1720P819L1406M2624k996K2413
$$ 1238586 1210665 1223757 1223057 1192457 1203683 1173560 1111840 1119659 1151065 1193689 1190693 1213106
5273A213106K2006L2996J3594K8817k7062l6794L3844J9736J5938O4948M9615
$$ 1213106 1235112 1268108 1281702 1310519 1283457 1246663 1280507 1300243 1316181 1381129 1430744
5262A430744M7841n6696l0819M9081k3124K8408N8407k6029K9934O7939j7957
$$ 1430744 1478585 1421889 1391070 1440151 1417027 1445435 1503842 1477813 1507747 1575686 1557729
5251A557729p53K1200O7914M805k1011K9346N0944M6963M9912j7496N9570j1737
$$ 1557729 1556976 1578176 1646090 1650895 1629884 1659230 1710174 1757137 1807049 1789553 1849123 1837386
5239A837386L5415O9920o930o3503M3448J105J4619j369M599j3495N5275k6451
$$ 1837386 1872801 1942721 1935791 1872288 1915736 1916841 1931460 1930091 1934690 1921195 1976470 1950019
5227A950019L7818J1941j8464j799M3586J9339L2766L1050j4886R482J0810o6856
$$ 1950019 1987837 1999778 1981314 1979515 2023101 2042440 2075206 2106256 2091370 2100852 2111662 2044806
5215B044806L630L3434J6869J5300o3658N7703q157k8134L835P1722K399k1202
$$ 2044806 2048436 2081870 2098739 2114039 2050381 2108084 2099927 2071793 2075628 2147350 2149749 2128547
5203B128547m7190K2139l0504q0360M8934j8327j3702J5538J2890m9466m8482
$$ 2128547 2081357 2103496 2072992 1992632 2041566 2023239 2009537 2025075 2037965 1988499 1940017
5192A940017m860n380K7664j5350K9348o508K8335r33N275j7692L8433j7117J6039
$$ 1940017 1935157 1929777 1957441 1942091 1971439 1964931 1993266 1992333 1997608 1979916 2018349 2001232 2017271
5179B017271k4282L0697R875m232J7682j7120J9812k5147O411M3733K5228m528
$$ 2017271 1992989 2023686 2033561 2029329 2047011 2029891 2049703 2024556 2030967 2074700 2099928 2095400
5167B095400j8912J5002J7074l4635p361R2719q564l1399M5985M0800J2958N6828
$$ 2095400 2076488 2091490 2108564 2073929 2066568 2159287 2150723 2119324 2165309 2206109 2219067 2275895
5155B275895n6655M4233N2801J4485J4977l6105R3995N979J6618L4993l736N3125
$$ 2275895 2219240 2263473 2316274 2330759 2345736 2309631 2403626 2409605 2426223 2461216 2457480 2510605
5143B510605P0682K510N6047K7773L2975L6776L2208N2259J50189L1545M6688
$$ 2510605 2581287 2583797 2639844 2667617 2700592 2737368 2769576 2821835 2972024 3003569 3050257
5132C050257J09091N7380R6966J15160R5818J02739J80804J63559O3068R0338
$$ 3050257 3159348 3216728 3313694 3428854 3524672 3627411 3808215 3971774 4034842 4125180
5122D125180P1597q792L2362M0556J5812J11257J03566J44890N3003N7763N3573
$$ 4125180 4196777 4187985 4220347 4260903 4276715 4387972 4491538 4636428 4689431 4747194 4800767
5111D800767R4140J25172Q0940R7437P5525M9036R770l9135k1279R3067L5734
$$ 4800767 4894907 5020079 5101019 5198456 5273981 5323017 5332787 5293652 5272373 5365440 5401174
5100E401174M1453L2935J12641L1029M3743J11790J18682J35927M6147J6347m080
$$ 5401174 5442627 5475562 5588203 5619232 5662975 5774765 5893447 6029374 6075521 6091868 6087788
5089F087788P586Q8978R7022N9242Q2977R9431O4586O1739J24953J86833J06767
$$ 6087788 6095374 6184352 6281374 6340616 6423593 6523024 6587610 6649349 6774302 6961135 7067902
5078G067902J25594J32118J90074J51809J91594K33510J96491K61703L40441K25465
$$ 7067902 7193496 7325614 7515688 7667497 7859091 8092601 8289092 8550795 8891236 9116701
5068I116701K64385K82832K97988M23433K82556K43895L48203L36874K75545L33630
$$ 9116701 9381086 9663918 9961906 10385339 10667895 10911790 11259993 11596867 11872412 12206042
5058A2206042L75018L56049L25292L56311M53367M93745M95733N03852N43280
$$ 12206042 12581060 12937109 13262401 13618712 14072079 14565824 15061557 15565409 16108689
5049A6108689O18582O63347P00051O49306P32940P39521P00635Q14273Q22687
$$ 16108689 16727271 17390618 18090669 18739975 19472915 20212436 20913071 21727344 22550031
5040B2550031Q47261Q65183Q53583R75561J077529J153052J213246J255383J418737
$$ 22550031 23397292 24262475 25116058 26091619 27169148 28322200 29535446 30790829 32209566
5031C2209566J628174J704688J904063K000562K088756K195652K324258K429995
$$ 32209566 33837740 35542428 37446491 39447053 41535809 43731461 46055719 48485714
5023D8485714K705422K974204L257360L602555L847938M001760L877506L659442
$$ 48485714 51191136 54165340 57422700 61025255 64873193 68874953 72752459 76411901
5015G6411901L065575K280596J253671L19984k44209n41952l02667J00914O60223
$$ 76411901 79477476 81758072 83011743 83331727 83087518 82545566 82242899 82343813 83004036
5006H3004036J203519J608260J904733K014175J900267J737452J497415J357864
$$ 83004036 84207555 85815815 87720548 89734723 91634990 93372442 94869857 96227721
4998I6227721J353820J461969J709708K032330K476122K683490K455296J692440
$$ 96227721 97581541 99043510 100753218 102785548 105261670 107945160 110400456 112092896
4990A12092896K61239j464622l254198m501996n043040n085718m599540l793825
$$ 112092896 112354135 110889513 107635315 103133319 98090279 93004561 88405021 84611196
4982H4611196k953270k344955j886628j683674j554329j775230j911375k046811
$$ 84611196 81657926 79312971 77426343 75742669 74188340 72413110 70501735 68454924
4974F8454924k069999j951621j664316j237619r77449q20058q21365r62840j417047
$$ 68454924 66384925 64433304 62768988 61531369 60553920 59733862 58912497 57949657 56532610
4965E6532610k075384k684839l161686l372801l256858k957014k615649k392671
$$ 56532610 54457226 51772387 48610701 45237900 41981042 39024028 36408379 34015708
4957C4015708k070944j797913j543662j370845j267072j167252j029550r48450
$$ 34015708 31944764 30146851 28603189 27232344 25965272 24798020 23768470 22820020
4949B2820020q12293p51983p07446o10334n92650o16594n51658n72530n00930
$$ 22820020 22007727 21255744 20548298 19937964 19345314 18728720 18177062 17604532 17103602
4940A7103602m56271n65378m87564m67729m32021l38457l02678l65193l41543
$$ 17103602 16647331 16081953 15594389 15126660 14694639 14356182 14053504 13688311 13346768
4931A3346768k05280k18181j97527j84545k10293j35625j40090j68319j72035
$$ 13346768 13141488 12923307 12725780 12541235 12330942 12195317 12055227 11886908 11714873
4922A1714873j09689j9954m6042p3797j4922n690o1392N076M9496J9582j6207
$$ 11714873 11605184 11585230 11539188 11465391 11450469 11444779 11383387 11388463 11437959 11457541 11441334
4911A1441334l896N7898J9648P2475O5508P2394R6340J08524J11336K13444J73468
$$ 11441334 11437438 11495336 11514984 11587459 11652967 11725361 11821701 11930225 12041561 12255005 12428473
4900A2428473J75542K57143L10053L37915M23736M72189M90475N59564O90129
$$ 12428473 12604015 12861158 13171211 13509126 13932862 14405051 14895526 15455090 16145219
4891A6145219P46033R88218J008083R88618J022200Q17178N23273J25174j44387
$$ 16145219 16891252 17879470 18887553 19876171 20898371 21715549 22238822 22363996 22219609
4882B2219609k01309q8979J0124K02464L45571M71622N65536N34625O05232O27763
$$ 22219609 22018300 21929321 21939445 22141909 22487480 22959102 23524638 24059263 24664495 25292258
4872B5292258O44083O35874N54864L45921P8988j61275k89655k63661k77572k67473
$$ 25292258 25936341 26572215 27127079 27473000 27551988 27390713 27101058 26837397 26559825 26292352
4862B6292352k39814k48186j28396J5908J64422L37641M67416N46236M87202K81595
$$ 26292352 26052538 25804352 25675956 25691864 25856286 26193927 26661343 27207579 27694781 27976376
4852B7976376r221j70223l35679j40963r3402J08629L48827M68583O39329P07109
$$ 27976376 27967155 27796932 27461253 27320290 27226888 27335517 27684344 28152927 28792256 29499365
4842B9499365Q86846J147813J289965J536447J683542J771625J749396J504933
$$ 29499365 30386211 31534024 32823989 34360436 36043978 37815603 39564999 41069932
4834D1069932J132376O28262J70816j83101l56946k90197j55646N425K36494O29394
$$ 41069932 42202308 42830570 43001386 42818285 42461339 42171142 42015496 42020921 42257415 42886809
4824D2886809Q78642J160290J466491J684993J941016J946101J682662J492016
$$ 42886809 43765451 44925741 46392232 48077225 50018241 51964342 53647004 55139020
4816E5139020J026949N47011o649n57518q32176j127903j169535j260451j308624
$$ 55139020 56165969 56712980 56706331 56148813 55316637 54188734 53019199 51758748 50450124
4807E0450124j352214j377978j416075j335115j275125r26655o54258l04747N2107
$$ 50450124 49097910 47719932 46303857 44968742 43693617 42766962 42112704 41807957 41860064
4798D1860064M59626R01466J152486J263776R79346L05527n64849j397941k069177
$$ 41860064 42319690 43221156 44373642 45637418 46616764 46922291 46357442 44959501 42890324
4789D2890324k381231k455424k265895j951592j674841j458822j245733j122690
$$ 42890324 40509093 38053669 35787774 33836182 32161341 30702519 29456786 28334096
4781B8334096r12422q82834q21110p07484o59074o78553o72737n34518m64661
$$ 28334096 27421674 26538840 25717730 25010246 24351172 23672619 22999882 22465364 22000703
4772B2000703m13629k51464k51969k32115k45539k98566k21452l20235l57513
$$ 22000703 21587074 21335610 21083641 20851526 20605987 20307421 20085969 19765734 19408221
4763A9408221l67152l85151l39752l16161k57893j71833j87232j63340k40995
$$ 19408221 19041069 18655918 18316166 18000005 17742112 17570279 17383047 17219707 16978712
4754A6978712k25447k74614k54569k45022k99218l43410k91864k41102k33402
$$ 16978712 16753265 16478651 16224082 15979060 15679842 15336432 15044568 14803466 14570064
4745A4570064k52114k51921k15661j46632j73036j27965n8577j9144p0396P0224
$$ 14570064 14317950 14066029 13850368 13703736 13530700 13402735 13344158 13325014 13254618 13324842
4735A3324842K6303J24002j7590q2392j98972k79218l07792l44855k58104k63433
$$ 13324842 13351145 13475147 13457557 13375165 13176193 12896975 12589183 12244328 11986224 11722791
4725A1722791j33241j23846j8028l6641N4160J2133J58965K6558j8407M3916K9439
$$ 11722791 11589550 11465704 11447676 11411035 11465195 11477328 11636293 11662851 11644444 11688360 11717799
4714A1717799l6464j89600p0806k1026n2401l0625n8062j7j8759n656N5299Q3935
$$ 11717799 11681335 11491735 11420929 11399903 11347502 11316877 11258815 11258798 11240039 11234383 11289682 11373617
4702A1373617J8663M2609R4351Q4644N3973Q6787R9413O9459j4569O3707P8441
$$ 11373617 11392280 11434889 11529240 11613884 11667857 11754644 11854057 11923516 11908947 11972654 12051095
4691A2051095J37279J37390J73053K38799K80218L70474M08938M20076M24762
$$ 12051095 12188374 12325764 12498817 12737616 13017834 13388308 13797246 14217322 14642084
4682A4642084L56332K50271J61486J01692p1276j03261r5084q5534q4450P0240
$$ 14642084 14998416 15248687 15410173 15511865 15440589 15337328 15242244 15156710 15072260 15142500
4672A5142500J36628K06703L55166M04018M87151N63793O86363Q05538Q83911
$$ 15142500 15279128 15485831 15840997 16245015 16732166 17295959 17982322 18787860 19671771
4663A9671771J100943J102816J001435O75011J18471m13572q63123r81163r39230
$$ 19671771 20772714 21875530 22876965 23551976 23670447 23256875 22393752 21412589 20473359
4654B0473359q51133p51100o71707o39036n32662n78756m16400m12615l64272
$$ 20473359 19622226 18871126 18199419 17560383 17027721 16448965 16032565 15619950 15255678
4645A5255678k09657j27571q462R0212J24457J48789J44871O3091o0448j42089
$$ 15255678 15046021 14918450 14909988 15000200 15124657 15273446 15418317 15481408 15420960 15278871
4635A5278871m71111o52233p14443q31158q07013p81629p46583n39433m69538
$$ 15278871 14807760 14155527 13441084 12609926 11802913 11021284 10274701 9735268 9265730
4626I265730m65281m04940k44543k77946k55063k47241j71217k08960j46684q9591
$$ 9265730 8800449 8395509 8150966 7873020 7617957 7370716 7199499 6990539 6843855 6754264
4616F754264j40974j37536j54537j18272j18002q9794o9438r8950j26591j3342
$$ 6754264 6613290 6475754 6321217 6202945 6084943 5995149 5925711 5826761 5700170 5686828
4606E686828R83m1357n02q3237l6300J02308K7590n4675J16192J853M9531k1200
$$ 5686828 5687811 5646454 5645952 5562715 5526415 5628723 5656313 5601638 5717830 5719683 5769214 5748014
4594E748014K1177N2907j387J14111L2058Q1221R5573J43365J88121K44915K32144
$$ 5748014 5769191 5822098 5820711 5934822 5966880 6048101 6143674 6287039 6475160 6720075 6952219
4583F952219L97920M24701M74996N12987L36296N4032j93379n16807m85755l64321
$$ 6952219 7350139 7774840 8249836 8762823 9099119 9153151 8959772 8442965 7957210 7592889
4573G592889l24575k59602j88720j65017p2657o7194l6226K6749k8216K5362R0488
$$ 7592889 7268314 7008712 6819992 6654975 6582318 6515124 6478898 6505647 6477431 6502793 6593281
4562F593281M6461L3220M6447J03004N8107M3777R4361l534R1615Q8401M3153
$$ 6593281 6639742 6672962 6719409 6822413 6880520 6924297 7018658 7015124 7106739 7195140 7238293
4551G238293P7648R4633J06226J28440J32872J62254J00849P2741J40119J68788
$$ 7238293 7315941 7410574 7516800 7645240 7778112 7940366 8041215 8113956 8254075 8422863
4541H422863J86307J68166J89553J49387J84836J20726J12195Q7812M8870l9559
$$ 8422863 8609170 8777336 8966889 9116276 9301112 9421838 9534033 9621845 9670715 9631156
4531I631156k6193l2388J7885k4331R20J3489N4574Q8334P4505Q8045J52171J92488
$$ 9631156 9604963 9572575 9590460 9566129 9567049 9580538 9635112 9723446 9797951 9885996 10038167 10230655
4519A0230655J24420J32564M8473Q0393N7965J1261o165r3301r2537j02908l7365
$$ 10230655 10355075 10487639 10536112 10616505 10674470 10685731 10679566 10586265 10493728 10390820 10353455
4508A0353455j7729k4494m8778j3676k5316o2910L7494k0306j9192j01090o9040
$$ 10353455 10335726 10311232 10262454 10248778 10223462 10160552 10198046 10177740 10158548 10057458 9988418
4497I988418p190k55o9574K5624k8159M3318K7941R2771Q0367J27970K01216N5402
$$ 9988418 9981228 9980973 9911399 9937023 9908864 9952182 9980123 10072894 10153261 10281231 10482447 10537849
4485A0537849Q7013M1649L2943J9646m9805l15k0502j14095j18319q5488r1028
$$ 10537849 10624862 10666511 10699454 10719100 10669295 10668980 10648478 10534383 10416064 10330576 10239548
4474A0239548j59841j05934j27456j09223r5431j43106j09460q2045j72825o3278
$$ 10239548 10079707 9973773 9846317 9737094 9641663 9498557 9389097 9307052 9134227 9070949
4464I070949m1057j15776m0668j1892m5494J2345N0357m3257M4788R3701M2198
$$ 9070949 9029892 8914116 8873448 8861556 8816062 8828407 8878764 8835507 8880295 8973996 9016194
4453I016194Q4704L9503P6246R6422L6726N6617K3185j2768K3693m640l5476j9302
$$ 9016194 9100898 9140401 9216647 9313069 9349795 9406412 9429597 9416829 9440522 9435882 9400406 9381104
4441I381104k9278M616l0438j3010L7201j9177L5625L3856P6669J25576J05234
$$ 9381104 9351826 9356442 9326004 9312994 9350195 9331018 9366643 9400499 9477168 9602744 9707978
4430I707978L5022M8122L5115N8957M6063N1244M9807K0000n1481P880j4963m2761
$$ 9707978 9743000 9791122 9826237 9885194 9931257 9982501 10032308 10052308 10000827 10008707 9993744 9950983
4418I950983j0883n7178n7677j13661j3609O961m5621q8935J9033P440M8050J9050
$$ 9950983 9940100 9882922 9825245 9711584 9697975 9704936 9659315 9570380 9589413 9596853 9644903 9663953
4406I663953J10108P8974L5589N4485M2316O5295J14412P9507P7530J23061Q2145
$$ 9663953 9774061 9853035 9888624 9943109 9985425 10050720 10165132 10244639 10322169 10445230 10527375
4395A0527375N3598L3262l4660K3252K5819k28K6075M9930L4659P6308O1194J18231
$$ 10527375 10580973 10614235 10579575 10602827 10628646 10628418 10654493 10704423 10739082 10815390 10876584 10994815
4383A0994815R1449J47627J64033J18555J56949Q2245J42268J09585J47384R1214
$$ 10994815 11086264 11233891 11397924 11516479 11673428 11755673 11897941 12007526 12154910 12246124
4373A2246124P4746J00120J10654Q8827J45101J85163K22881K48594J87875K58266
$$ 12246124 12320870 12420990 12531644 12620471 12765572 12950735 13173616 13422210 13610085 13868351
4363A3868351K41509K08120J99765J55655K05869J36708J27146J68299J65678
$$ 13868351 14109860 14317980 14517745 14673400 14879269 15015977 15143123 15311422 15477100
4354A5477100K16437J73222J73497J91510K26933J90547J84762K55092K17009
$$ 15477100 15693537 15866759 16040256 16231766 16458699 16649246 16834008 17089100 17306109
4345A7306109L43367L25083K62358K26571K90249J89974K09143K07908J62676
$$ 17306109 17649476 17974559 18236917 18463488 18753737 18943711 19152854 19360762 19523438
4336A9523438J26576J42501J70241J23223K13740K78564L31706L11271L25284
$$ 19523438 19650014 19792515 19962756 20085979 20299719 20578283 20909989 21221260 21546544
4327B1546544L34647M06444M18162M15008M51503M92232M59905M40409L97208
$$ 21546544 21881191 22287635 22705797 23120805 23572308 24064540 24524445 24964854 25362062
4318B5362062L98979M54392L82140M32328M50607M67193N63640N71072N76525
$$ 25362062 25761041 26215433 26597573 27029901 27480508 27947701 28511341 29082413 29658938
4309B9658938N82955O30168O29754O46646P12079O67115O61786O66479P61444
$$ 29658938 30241893 30872061 31501815 32148461 32860540 33527655 34189441 34855920 35617364
4300C5617364P87965Q30683R66657R75934J012900R70727R09323J002423J062947
$$ 35617364 36405329 37236012 38202669 39178603 40191503 41162230 42071553 43073976 44136923
4291D4136923J017116J038974J110674J015050J006704R06366Q63413Q09127P91744
$$ 44136923 45154039 46193013 47303687 48318737 49325441 50231807 51095220 51904347 52696091
4282E2696091P18055P47328O98660O92192O98622P30478Q13341Q41574Q43553
$$ 52696091 53414146 54161474 54860134 55552326 56250948 56981426 57794767 58636341 59479894
4273E9479894Q58205Q56143Q69153Q86833P00363N90507N04392M18256K55745
$$ 59479894 60338099 61194242 62063395 62950228 63650591 64241098 64745490 65163746 65419491
4264F5419491J47008K42337L23120K76687K83671K79797M02357L99624L38153
$$ 65419491 65566499 65808836 66131956 66408643 66692314 66972111 67374468 67774092 68112245
4255F8112245M53420M17455M15197M53609L36317L93854L66809K77062J97849
$$ 68112245 68565665 68983120 69398317 69851926 70188243 70582097 70948906 71225968 71423817
4246G1423817J78659R2672R2578L7478Q2421P9819P5421J4880k4331q2835n6297
$$ 71423817 71602476 71695148 71787726 71825204 71907625 71987444 72062865 72077745 72053414 71970579 71914282
4235G1914282j7565J34555J91703L09568M76485N61927O39789N23519L64334K95288
$$ 71914282 71896717 72031272 72222975 72532543 73009028 73570955 74210744 74734263 75098597 75393885
4225G5393885K17032J58606J92826K49884K66623K69556M10874M76597N68462
$$ 75393885 75610917 75769523 75962349 76212233 76478856 76748412 77159286 77635883 78204345
4216G8204345P26416Q32509R18411J013823J198538J420419J472878J646324J756468
$$ 78204345 78930761 79763270 80681681 81695504 82894042 84314461 85787339 87433663 89190131
4207H9190131J800444J644438J386700J124422O77676L03581n0170k29389k78221
$$ 89190131 90990575 92635013 94021713 95146135 95823811 96127392 96077222 95847833 95569612
4198I5569612j96357j48143j68409k76249n66426r26581j158837j336312j453534
$$ 95569612 95373255 95225112 95056703 94780454 94214028 93287447 92128610 90792298 89338764
4189H9338764j416793j510225j547593j619664j753693k048984k235743k370560
$$ 89338764 87921971 86411746 84864153 83244489 81490796 79441812 77206069 74835509
4181G4835509k404680k335481k301297k121793j903362j806502j650058j585359
$$ 74835509 72430829 70095348 67794051 65672258 63768896 61962394 60312336 58726977
4173E8726977j537648j458988j378017j379937j351706j280214j283754j200645
$$ 58726977 57189329 55730341 54352324 52972387 51620681 50340467 49056713 47856068
4165D7856068j187110j147421j116869j181683j123251j076437j032264r59782
$$ 47856068 46668958 45521537 44404668 43222985 42099734 41023297 39991033 39031251
4157C9031251r46644q39600q08054p80154p48556o75398o11257o09785n34260
$$ 39031251 38084607 37245007 36436953 35656799 34908243 34232845 33621588 33011803 32477543
4148C2477543o25772o61160o24793o27895o91628o33827n01303n32552m30599
$$ 32477543 31851771 31190611 30565818 29937923 29246295 28612468 28111165 27578613 27148014
4139B7148014l88687l10948k77184k81413j47455j12740q0769o1206R9667N4879
$$ 27148014 26759327 26448379 26171195 25889782 25742327 25629587 25548818 25487612 25587279 25642158
4129B5642158N6114O3634M0058j74870m20145n59374p21795p09324o89302n58506
$$ 25642158 25698272 25761906 25801964 25627094 25206949 24647575 23925780 23216456 22527154 21968648
4119B1968648m80111n18019m94786m46872m23316n15909m12247l06867l14324
$$ 21968648 21488537 20970518 20475732 20028860 19605544 19089635 18677388 18370521 18056197
4110A8056197k93419k07245j25816j18586j58637j87469j69080k27775j36870
$$ 18056197 17762778 17555533 17429717 17311131 17152494 16965025 16795945 16568170 16431300
4101A6431300n7477J0464M4923J82232K30189J67357M0986k0356k50343l44381
$$ 16431300 16373823 16384287 16429210 16611442 16841631 17008988 17049974 17029618 16779275 16434894
4091A6434894m82574m73734m79447m91997n12173n29124m87520m54131n13409
$$ 16434894 15952320 15478586 14999139 14507142 13994969 13465845 12978325 12524194 12010785
4082A2010785m45886l55483l79951k86351k85129k31878k22210j70835j30603
$$ 12010785 11564899 11209416 10829465 10543114 10257985 10026107 9803897 9633062 9502459
4073I502459j30495n9977j10313j14331l0363j75997j30108n6843q6481r6640
$$ 9502459 9371964 9311987 9201674 9087343 9056980 8880983 8750875 8694032 8607551 8510911
4063H510911o6748m2275o1185q1619r4597r8910j23869j50281j04484j52338r4571
$$ 8510911 8444163 8401888 8340703 8259084 8164487 8065577 7941708 7791427 7686943 7534605 7440034
4052G440034q0364j07174j30797j17897l3603j1150m6511q4933j18486o8288k1896
$$ 7440034 7359670 7252496 7121699 7003802 6970199 6959049 6912538 6827605 6709119 6640831 6618935
4041F618935k243q5293n0535k5532n8653k7072q0910m5375q3897m4189j2444n1770
$$ 6618935 6616692 6531399 6480864 6455332 6396679 6369607 6288697 6243322 6159425 6115236 6102792 6051022
4029F051022j2767o7792j3218M728k2971n6713K2643o0628m4817P0793K973j8902
$$ 6051022 6038255 5970463 5957245 5961973 5939002 5882289 5904932 5844304 5799487 5870280 5873253 5854351
4017E854351j6782L0492j4064L3103K5656L4063q528L3549L6975K1245k8950Q3820
$$ 5854351 5837569 5868061 5853997 5887100 5912756 5946819 5938291 5971840 6008815 6030060 6001110 6084930
4005F084930P3153J9664Q0802p445M3371K2501l134K6090p817M7512P0358k3488
$$ 6084930 6158083 6177747 6258549 6251104 6294475 6316976 6313842 6339932 6332115 6379627 6449985 6426497
3993F426497o684N5661P4010O5531M6110N3697L1971O7156M8587P0925J64461
$$ 6426497 6419813 6475474 6549484 6615015 6661125 6714822 6746793 6813949 6862536 6933461 7097922
3982G097922O3427J30662J10788J56862J03832O3067L6421n5322j27049j09175
$$ 7097922 7161349 7292011 7402799 7559661 7663493 7726560 7762981 7707659 7580610 7471435
3972G471435L4683j761O935k0389l6595P6377K9633L3408M3944R5159M5344J9528
$$ 7471435 7506118 7504357 7511292 7490903 7454308 7530685 7560318 7593726 7637670 7732829 7778173 7797701
3960G797701M0149O2982L5273k918N0514Q3147Q0193k869J17852k720O773J16874
$$ 7797701 7837850 7900832 7936105 7933187 7983701 8066848 8147041 8144172 8262024 8259304 8266077 8382951
3948H382951N0714Q3205J45977J75107J70638J96832K15993K41642K65827L54405
$$ 8382951 8433665 8516870 8662847 8837954 9008592 9205424 9421417 9663059 9928886 10283291
3938A0283291L89112L37267M01932L68048L05274K62786J37353j3724j63012m51172
$$ 10283291 10672403 11009670 11411602 11779650 12084924 12347710 12485063 12471339 12308327 11857155
3928A1857155n28345n39491n49209m81522m15261l72741k90962l72289k33743
$$ 11857155 11328810 10789319 10240110 9758588 9343327 8970586 8679624 8307335 8073592
3919H073592k77666k41310k37223j80854j55348j70985j54996j54065j56784j70692
$$ 8073592 7795926 7554616 7317393 7136539 6981191 6810206 6655210 6501145 6344361 6173669
3909F173669q0003j04592p1193j01514p9621r6902j30232j37407j39063j61504
$$ 6173669 6093666 5989074 5917881 5816367 5736746 5639844 5509612 5372205 5233142 5071638
3899E071638j07712q8167j14578j04626o6685r4558m9021r9207p2320l4814m9948
$$ 5071638 4963926 4875759 4761181 4656555 4589870 4495312 4446291 4347084 4274764 4239950 4190002
3888D190002r4780j10723r52q1990p3264q5200q6260k5944N420m9684j01554r744
$$ 4190002 4095222 3984499 3983547 3901557 3828293 3743093 3656833 3630889 3636309 3586625 3485071 3475327
3876C475327o9578j057M206k7589m8831q1910m056m3283l0493n8821j29517q0117
$$ 3475327 3405749 3404692 3408898 3381309 3332478 3250568 3246512 3203229 3172736 3113915 2984398 2904281
3864B904281o3817o3018m9990k8565o8151J6532n9572m6579k5368J6870q6232
$$ 2904281 2840464 2777446 2727456 2698891 2630740 2647272 2587700 2541121 2515753 2532623 2446391
3853B446391J1869p2396m9685m1743j03057n7545l4975o729j80L7508j01276n5264
$$ 2446391 2458260 2385864 2336179 2294436 2191379 2133834 2098859 2092130 2091950 2129458 2028182 1972918
3841A972918O027m1530l7646K7654n5908j404k8930J4870j7230k1340n401K032
$$ 1972918 1978945 1937415 1899769 1927423 1871515 1870111 1841181 1856051 1838821 1817481 1812080 1814112
3829A814112o7504k1849q817p2254n1082l385o2190l1360J3736j5666J8075k0979
$$ 1814112 1746608 1724759 1715942 1643688 1592606 1589221 1527031 1495671 1509407 1493741 1511816 1490837
3817A490837o7208N125q553m5469j2297M150N508q4917k4468J6756m256p4370
$$ 1490837 1423629 1428754 1420201 1374732 1362435 1366585 1372093 1287176 1262708 1279464 1275208 1200838
3805A200838J9401m803M934q435l285K4662J2982n935p0752Q003l9901K2266k5571
$$ 1200838 1220239 1215436 1220370 1211935 1208650 1233312 1246294 1240359 1169607 1177610 1137709 1159975 1134404
3792A134404p9798K1888R687L8454j7228m875m5219o242k0639L8585k6174j0289
$$ 1134404 1054606 1076494 1086181 1124635 1107407 1102532 1057313 1051071 1030432 1069017 1042843 1032554
3780A032554k5083m0919L3230j1294j1245k017J0869l0697j505K160P5061l2465
$$ 1032554 1007471 966552 999782 988488 977243 975226 986095 955398 953893 956053 1031114 998649
3768I98649k9910k486R522L3102o0668K1283l2576M5851j1553j104O6310j7405
$$ 998649 968739 966253 975775 1008877 948209 969492 936916 982767 971214 970110 1036420 1019015
3756A019015K790R2677L345p6205m21K5582J6441o6003J3271P8940L567K6434
$$ 1019015 1021805 1114482 1117827 1041622 1041201 1066783 1083224 1017221 1030492 1109432 1112999 1139433
3744A139433R020k1825K1821J6838L756J0603M4616L6101M9900M0555j6294R632
$$ 1139433 1148453 1126628 1148449 1165287 1169043 1179646 1224262 1260363 1310263 1350818 1334524 1344156
3732A344156K9779O5223Q6168K1216R4909k8685k9128P527K4961m2773m7939n8389
$$ 1344156 1373935 1439158 1525326 1546542 1641451 1612766 1583638 1591165 1616126 1573353 1525414 1467025
3720A467025M059J2320N7628R815K3434p4861M4035R4568P2873L4546R5639P0817
$$ 1467025 1471084 1483404 1541032 1550847 1574281 1499420 1543455 1638023 1710896 1745442 1841081 1911898
3708A911898M1987P7716N4974R9875J47961M3323k9789l4310l7612l8790j03761
$$ 1911898 1953885 2031601 2086575 2186450 2334411 2377734 2347945 2313635 2276023 2237233 2133472
3697B133472L7784k7720k4858M2715L4573M4923K3062R51N2031J29j5277R5934
$$ 2133472 2171256 2143536 2118678 2161393 2195966 2240889 2263951 2264902 2316933 2317062 2301785 2397719
3685B397719J8632Q452J8014K735P0821K6867M4385N1691K0609N1607O94n7749
$$ 2397719 2416351 2424803 2442817 2445552 2516373 2543240 2587625 2639316 2659925 2711532 2712226 2654477
3673B654477l3494l7980o4400r7187m7991q7573J6723l2906K9218L8561k6363
$$ 2654477 2620983 2583003 2518603 2421416 2373425 2285852 2302575 2269669 2298887 2337448 2311085
3662B311085M8668m342l7497M2040l8513o3352J2592m705l3299M7239n7853p1841
$$ 2311085 2359753 2355411 2317914 2359954 2321441 2258089 2270681 2265976 2232677 2279916 2222063 2150222
3650B150222o3214j10602j2268q5634r8600m1449m8817J5815K4827j03684K639
$$ 2150222 2087008 1976406 1964138 1878504 1779904 1738455 1689638 1705453 1730280 1626596 1629235
3639A629235o5390l5167l2003q5125L0671m7853l4132q6801k9406m3756k5350
$$ 1629235 1563845 1528678 1496675 1411550 1442221 1394368 1360236 1273435 1244029 1200273 1174923
3628A174923l3420n5251L452m2880p9087j01593k3315Q6891k0854o3588j8808
$$ 1174923 1141503 1086252 1089704 1046824 967737 866144 842829 929720 908866 845278 826470
3617H26470n8890k7990K4039k8370k8646m9702k0580j0214R584k7991j364j8188
$$ 826470 767580 739590 763629 735259 706613 656911 636331 626117 635701 607710 606346 588158
3605E88158o6155J2835M8446L070r426p5291L3680j106m2915l2065l759N1977
$$ 588158 522003 534838 583284 586354 576928 501637 535317 534211 491296 459231 455472 507449
3593E07449m2903K8784l0980j5860N9775k6990k7309j0142K4899o3927n2874M9248
$$ 507449 464546 493330 462350 446490 506265 479275 451966 441824 466723 402796 349922 399170
3581C99170r941k6749k0898M1354Q744m9908J3897m4623L3167l4568J7049Q177
$$ 399170 389229 362480 341582 382936 391680 341772 355669 311046 344213 309645 326694 334871
3569C34871l3258m426m984j8297L9479k722k8565M1575J905l1232l7036k0342
$$ 334871 301613 297187 292203 273906 313385 310663 282098 323673 325578 294346 257310 236968
3557B36968j106L3509k9649K6023o2267J1253l2817N3647J2363n9520L9707j6198
$$ 236968 235862 269371 239722 265745 203478 214731 181914 235561 247924 188404 228111 211913
3545B11913l7616N9902l161j6769j3596L4287m9581L4894J4001l6367k8526K2819
$$ 211913 174297 234199 231038 214269 200673 234960 185379 220273 234274 197907 169381 192200
3533A92200J869m2586j9572M6994k4600O1011m6572K2541L936r051J6202j01577
$$ 192200 194069 151483 131911 178905 154305 215316 168744 191285 195221 186170 202372 100795
3521A00795j6292K3489k0970M3389l4242k8241K8543K8436j1638L2022K377k9932
$$ 100795 84503 107992 87022 130411 96169 67928 96471 124907 113269 145291 147668 117736
3509A17736J8652M57K1893j8666K9901K432K7103n6869j8687M806l3563J926R521
$$ 117736 136388 136845 158738 140072 169973 172405 199508 142639 123952 128758 95195 97121 106642
3496A06642K5007J2963l2475J9302L8739m9822K8017R147K6805l188O739K4031
$$ 106642 131649 144612 112137 131439 170178 120356 148373 157520 184325 181137 187876 211907
3484B11907l3742K2369p0176l163n559J9676P711m3192M1201j2116P138K6619
$$ 211907 178165 200534 130358 127195 121636 141312 149023 105831 147032 134916 142054 168673
3472A68673j5314J3413p1510L6518J904M2301j4152P8568n2579Q877Q628k0620
$$ 168673 153359 166772 95262 131780 133684 175985 161833 240401 187822 196699 205327 184707
3460A84707k7836K5337n638j5900L0807K6097m9821k3760l9103N1952L5060o027
$$ 184707 156871 182208 176570 160670 191477 217574 167753 143993 104890 156842 191902 185875
3448A85875k3673L1999J8625r091r993l1687n681o057k5989M818K4815j1028j6169
$$ 185875 162202 194201 212826 203735 193742 162055 156374 150317 124328 129146 153961 142933 126764
3435A26764j6375k6904J5663N1103M343k2376j48P607l9154k8754L207J1109L5207
$$ 126764 110389 83485 99148 150251 154594 132218 132070 139677 100523 71769 74976 86085 121292
3422A21292J9269n4027N4375J2129L3736n3095l9189M3677j4830n0960O0800m458
$$ 121292 140561 86534 140909 153038 186774 133679 94490 138167 123337 72377 133177 128719
3410A28719L1575m1273l7082O074N3284J6830l7435l6744j2547j3011J8765J9
$$ 128719 160294 119021 81939 88013 141297 158127 120692 83948 71401 58390 77155 77174
3398G7174m1421L5641k4795k5322N3084m0070m4665K481J9214J8722N9099M923
$$ 77174 35753 71394 46599 21277 74361 34291 -10374 -7893 11321 30043 89142 94065
3386I4065l1712J0638j7090l0486J7493R085K5262l4539n168l2586K6914j2518
$$ 94065 62353 72991 55901 25415 42908 51993 77255 42716 37548 4962 31876 19358
3374A9358l8131M6293N6582j5866m3249J3003J8527j9766L120k4541j384J6610
$$ 19358 -18773 27520 84102 68236 24987 37990 56517 36751 39871 15330 13946 30556
3362C0556k9111P053L925l694J2664K6266q895k26J2177k2283l3181J3984M316
$$ 30556 1445 8498 12423 8729 21393 47659 38764 38538 50715 28432 -4749 9235 13551
3349A3551l297P279J4373N8752n6637k7536j1854n3050K1304K2587J4879J739
$$ 13551 10254 17533 31906 90658 34021 6485 -5369 -58419 -37115 -14528 351 2090
3337B090L3510j2374o0590J9304j7865J7091K0708k1024L4949k1172P6814l4585
$$ 2090 35600 23226 -37364 -18060 -35925 -18834 1874 -19150 15799 -5373 71441 36856
3325C6856K5949K3562k5322k8182J2605m3973L5353j0206k491J1244l0450m698
$$ 36856 62805 86367 61045 32863 45468 1495 36848 26642 24151 35395 4945 247
3313B47k998L8663n1826M256J5563j48J6518k1049j1537M4542k7141N452j3518
$$ 247 -2751 35912 -15914 -11658 3905 3757 20275 -774 -12311 32231 5090 10542 -2976
3300b976k2569L3310k8966L0733J0522l7184J789Q168j1457j7255N8635K6476
$$ -2976 -25545 7765 -21201 9532 20054 -17130 -15341 -7173 -18630 -35885 22750 49226
3288D9226K251r025m0173L465k5967O0483j1784l8193j6969J6507O2814o867l7839
$$ 49226 51477 42452 2279 5744 -20223 40260 28476 -9717 -26686 -10179 52635 45768 7929
3275G929m0674N0929K474j7687K5462m4115K6022R594k7180k4773K7392K1079
$$ 7929 -32745 18184 20658 2971 28433 -15682 10340 19934 -7246 -32019 -4627 16452
3263A6452j132M4039J3756j1751j0258m2562N3784l4250k0314R141M162J1080
$$ 16452 15320 59359 73115 61364 51106 8544 62328 28078 7764 16905 21067 32147
3251C2147k3712N081j5133k1917M6649j962l6955L4929l09J5284j5678L3314m4011
$$ 32147 8435 13516 -1617 -23534 23115 21153 -15802 19127 18818 34102 18424 51738 7727
3238G727m0721M7639m434j3601j438m3047O323N5410J8001k1707k7075K3044K4967
$$ 7727 -32994 14645 10211 -3390 -4828 -47875 -41552 13858 31859 10152 -16923 6121 31088
3225C1088J4490j5352n7190r926l3686L8717J1218O7556J3207j6532n8535j036
$$ 31088 45578 30226 -26964 -36890 -70576 -31859 -20641 46915 60122 43590 -14945 -15981
3213a5981J2853K4273r144n6183P2271P1587k2892o9994l3305K2655J7674R558
$$ -15981 -3128 21145 12001 -44182 28089 99676 76784 6790 -26515 -3860 13814 23372
3201B3372k8262J2266K3030k5782R29K1181K3422j4767o2964L4648M6459j8168
$$ 23372 -4890 7376 30406 4624 5553 26734 50156 35389 -27575 7073 53532 35364
3189C5364J935j4524k2649J2944l4734L3217L2837m5239O954M323m1985k9716
$$ 35364 37299 22775 126 13070 -21664 11553 44390 -849 6105 10428 -31557 -61273
3177f1273Q9544k4063l56O307m2085P5261j1314l2603j5018J7864l6946M918O5680
$$ -61273 28271 4208 3852 10159 -31926 43335 32021 -582 -15600 2264 -34682 -29764 35916
3164C5916j2679k7650K9442L5718k6066R339o1128K0485P8997l6481k1594L2163
$$ 35916 23237 -4413 25029 60747 34681 44020 -17108 3377 82374 45893 24299 56462
3152E6462o826K4340k6729J4440k6278L5200O594J3645K4228p218p977j517j3446
$$ 56462 49636 73976 47247 61687 35409 70609 77203 90848 115076 107858 99881 98364 84918
3139H4918q293J1050j991J3814K196m149R852l0303L785M3101j0267j8910L2216
$$ 84918 76625 87675 85684 99498 101694 97545 107397 77094 80879 123980 113713 94803 127019
3126A27019M2567r958p41k2257M1364j5382K7249K6425R791K6982o3260N152L1864
$$ 127019 169586 159628 158887 136630 177994 162612 189861 216286 226077 253059 189799 194951 226815
3113B26815O3924P383j7696M5602j1584K7947L1378N5768M3918L5143J8246J4384
$$ 226815 290739 298122 280426 326028 314444 342391 373769 429537 473455 508598 526844 541228
3101E41228K2429K4186J8542m7363K7979L4144M0970N4332J16170K3395M4020
$$ 541228 563657 587843 606385 559022 587001 621145 662115 716447 832617 856012 900032
3090I00032P6204Q9822J00285J20882J90016O5191J09495J68015J76774L03390
$$ 900032 976236 1066058 1166343 1287225 1477241 1542432 1651927 1819942 1996716 2300106
3080B300106L13410N16128O86564Q26670Q18591J86782k70472p99423r46231o77951
$$ 2300106 2613516 3129644 3816208 4642878 5461469 5648251 5377779 4578356 3632125 2954174
3070B954174n65129l21517k89731k40640j24171j67216n0586j08967l9662q9344
$$ 2954174 2389045 2067528 1777797 1537157 1412986 1245770 1195184 1086217 1046555 957211
3060I57211r9031r3422l2823l9056q2778o228m8523n9285M6815m2667p1272J9333
$$ 957211 858180 764758 731935 692879 610101 603873 555350 496065 542880 500213 428941 448274
3048D48274n0417j9785l2438l8612o4297L3751j9528p177l1530k1733N9234n9152
$$ 448274 397857 378072 345634 307022 242725 276476 256948 249771 218241 196508 255742 196590
3036A96590K6640O934l6006k1731J4479m5692o087J7403o4990N2424k6072L7909
$$ 196590 223230 230164 194158 172427 186906 141214 135127 152530 87540 139964 113892 151801
3024A51801R402J8057k9830j3327j0217k1939J904K2649J357m7705J6974k0810
$$ 151801 161203 179260 149430 136103 125886 103947 105851 128500 129857 82152 99126 78316
3012G8316j758K2401p9l6946k0427N519K5519l3124j2651K8056K4662K5418K1886
$$ 78316 76558 98959 98880 61934 41507 47026 72545 39421 26770 54826 79488 104906 126792
2999A26792m719o5079J3233l7081l7264J5944K4089n0311J6157K3472n815P985
$$ 126792 122073 56994 70227 33146 -4118 11826 35915 -14396 1761 25233 19418 27403
2987B7403Q720k0661m833k0169j0572M2319p480L2211j6946k7539J8443j5457
$$ 27403 36123 15462 10629 -9540 -20112 22207 14727 46938 29992 2453 20896 5439
2975E439K1702j3224j9009L0203l3751j3369J9252k4263q381N0893j8600N9115
$$ 5439 27141 13917 -5092 25111 -8640 -22009 -2757 -27020 -35401 15492 -3108 56007
2963E6007o000n2418j5000M005K2972M9035j21824N7784M6220k3651l4332P21
$$ 56007 50007 -2411 -17411 -13406 9566 58601 -63223 -5439 40781 17130 -17202 -16481
2951a6481j6009J8024M3946o0424l3433k2767L3527M8930l4849M5437l7053j5910
$$ -16481 -32490 -14466 29480 -30944 -64377 -87144 -53617 -4687 -39536 5901 -31152 -47062
2939d7062K4707l4542N5266M9284m2178m8505L1251j4906P1967j3438l6900J6189
$$ -47062 -22355 -56897 -1631 47653 5475 -43030 -11779 -26685 45282 31844 -5056 11133
2927A1133J0678o8558m300M9195M5742J385q1515L0335J6974p063P3442l4067
$$ 11133 21811 -46747 -51047 -1852 43890 45275 -36240 -5905 11069 4006 77448 43381
2915D3381k2700k751K280O162n968l5497m246j5649L8108M582K0045l9645q861
$$ 43381 20681 17930 20210 26372 20404 -15093 -19339 -34988 3120 7702 27747 -11898 -20759
2902b0759K8064J0452K3686n5251o8413O6857L5654k5140l1454M0979j5006L9759
$$ -20759 7305 17757 41443 -13808 -82221 -15364 20290 -4850 -36304 4675 -10331 29428
2890B9428q9168K3765K6786k202l103k0125k658o540N5189k3694j0292J0033M309
$$ 29428 -59740 -35975 -9189 -11391 -14494 -34619 -37277 -43817 11372 -12322 -22614 -12581 -8272
2877h272l3612M720m9237K7006J0707K7014M915l148j8680Q969N3454l9624l1538
$$ -8272 -41884 -37164 -86401 -59395 -48688 -21674 -16759 -19907 -38587 -29618 23836 -15788 -47326
2864d7326M0220m3081K8968m299j8492L1445O1974l0984m6631J647K0661L5974
$$ -47326 -7106 -50187 -21219 -25518 -44010 -12565 49409 18425 -28206 -26559 -5898 30076
2852C0076m0029J662O376J6934J5151o2631k2223K422M6032P429M9435J0941n4992
$$ 30076 -9953 -8291 -1915 15019 30170 -32461 -54684 -52262 -6230 1199 50634 61575 6583
2839F583j1305l8087l3625L5507n833O3863O373j5896j3609M1784l2585n2352
$$ 6583 -4722 -42809 -76434 -40927 -46760 17103 23476 7580 -6029 35755 3170 -49182
2827d9182J6370L988K977M7052k8739K5710o645j981j9422m1996M6077l2615l999
$$ -49182 -32812 -28824 -25847 21205 -7534 18176 11531 9550 -9872 -51868 -5791 -38406 -42405
2814d2405O831k9105j2971k4980O177N6574J8372L9319m8725m5492M0937K2869
$$ -42405 -35574 -64679 -77650 -102630 -96453 -39879 -21507 17812 -30913 -76405 -35468 -12599
2802a2599k0607M0659l357r72M3829o7208l5755j4449K0224O70J3743K3292l7497
$$ -12599 -33206 7453 4096 3124 46953 -20255 -56010 -70459 -50235 -49565 -35822 -12530 -50027
2789e0027J4716J8900l0181n5058L1202K5641O6793K7N010OK2914j7258j8571
$$ -50027 -35311 -16411 -46592 -101650 -70448 -44807 21986 22013 27023 27029 49943 32685 14114
2776A4114o0209k9076J2116N1524m1120j3162L6514m793K5726j9374L2306k6392
$$ 14114 -46095 -75171 -63055 -11531 -52651 -65813 -29299 -34092 -8366 -27740 4566 -21826
2764b1826k392k3422L1215J5305m3440K7827k5950L982J9026M0032n1967l4926
$$ -21826 -24218 -47640 -16425 -1120 -44560 -16733 -42683 -38701 -19675 20357 -31610 -66536
2752f6536J0122L4008l5100J3988K9045M3710q945q9706L5515J3652k399K6864
$$ -66536 -56414 -22406 -57506 -43518 -14473 29237 20292 -69414 -33899 -20247 -22646 4218
2740D218K0480L266l2827l8253k7260K2941k1078K6024L3611J9750K8945m2119
$$ 4218 24698 27964 -4863 -43116 -70376 -47435 -68513 -42489 -8878 10872 39817 -2302
2728b302K6162m721k2965l5397L4544K2281J0118k246r893l9424O2811j1128k8504
$$ -2302 23860 19139 -3826 -39223 -4679 17602 27720 25474 15581 -23843 38968 27840 -664
2715f64M612K0769k4485j6066p702o225O1448o6271M220j3998p73P138j3722J0307
$$ -664 3948 24717 232 -15834 -23536 -29761 31687 -34584 -30364 -44362 -45135 -37997 -51719 -41412
2701d1412j1929M320J4992L5384q50k6718p793J8396k336j5521j7214R938j0867
$$ -41412 -53341 -49021 -34029 1355 505 -26213 -34006 -15610 -17946 -33467 -50681 -40743 -51610
2688e1610l0452M1175K9244k0713m1990K1886L0530m603K2797l5598N499O458
$$ -51610 -82062 -40887 -11643 -32356 -74346 -52460 -21930 -26533 -3736 -39334 -33835 -27377
2676b7377J2715m918q256M4828K3044j0544p1042K0778n574J5910m5933K6449
$$ -27377 -14662 -19580 -27836 16992 40036 29492 -41550 -20772 -26346 -10436 -56369 -29920
2664b9920j6336o45K1684m5966M3193n65j9175L6520M4041J0289o0715K0368L0593
$$ -29920 -46256 -46901 -25217 -71183 -27990 -28555 -47730 -11210 32831 43120 -17595 2773 33366
2651C3366k2317o8561Q224l949J009Q465o713L2586k6270r136j1312L6102N855
$$ 33366 11049 -57512 -49288 -53237 -52228 -43763 -50476 -17890 -44160 -53296 -64608 -28506 -22651
$$ [...]
##END NTUPLES=NMR SPECTRUM
##END=
