##TITLE=1H_CA-9297-4
 CDCl3
 8 sc, 
 1.11.2024
##JCAMPDX= 6.0         $$ Bruker NMR JCAMP-DX V2.0
##DATA TYPE= NMR SPECTRUM
##DATA CLASS= NTUPLES
##ORIGIN= UXNMR, Bruker Analytische Messtechnik GmbH
##OWNER= root
$$ XWIN-NMR		Version 3.5
$$ Fri Nov  1 13:51:24 2024 Russian Standard Time (UT+4h)  she@DPX200
##.OBSERVE FREQUENCY= 200.1318
##.OBSERVE NUCLEUS= ^1H
##.ACQUISITION MODE= SIMULTANEOUS
##.ACQUISITION SCHEME= undefined
##.AVERAGES= 8
##.DIGITISER RES= 18
##SPECTROMETER/DATA SYSTEM= spect
##.PULSE SEQUENCE= zg30
##.SOLVENT NAME= CDCl3
##.SHIFT REFERENCE= (INTERNAL, CDCl3, 0, 21.0076)
##AUDIT TRAIL= $$ (NUMBER, WHEN, WHO, WHERE, WHAT)
$$ ##TITLE= Audit trail, XWIN-NMR		Version 3.5
$$ ##JCAMPDX= 5.01
$$ ##ORIGIN= Bruker BioSpin GmbH
$$ ##OWNER= she
$$ F:/spectra/data/she/nmr/H-F/1/pdata/1/auditp.txt
$$ ##AUDIT TRAIL=  $$ (NUMBER, WHEN, WHO, WHERE, WHAT)
(   1,<2024-11-01 13:50:14.90 +0400>,<she>,<DPX200>,
      <created by zg, POWCHK disabled, PULCHK disabled
       configuration hash MD5:
       00 E9 B6 7A A2 85 ED C7 34 08 36 98 17 FE 4E 26
       data hash MD5: 16K
       3C 35 3A 81 F4 EB 45 40 92 26 B7 1A 31 F6 7E 85>)
(   2,<2024-11-01 13:50:17.01 +0400>,<she>,<DPX200>,
      <Start of raw data processing
       efp BC_mod = 2 LB = 0.24 FT_mod = 6 PKNL = 1 PHC0 = -26348.44 PHC1 = 15.98743 SI = 16K 
       data hash MD5: 16K
       03 1A B1 FD 88 A0 B2 91 29 51 BE 1D 93 37 EA 85>)
(   3,<2024-11-01 13:50:35.06 +0400>,<she>,<DPX200>,
      <pk PHC0 = 1.676225 PHC1 = -2 
       data hash MD5: 16K
       B3 FC B8 F6 7D 69 6B 19 E4 01 0B 29 74 9C 13 A7>)
(   4,<2024-11-01 13:50:38.39 +0400>,<she>,<DPX200>,
      <abs ABSG = 5 
       data hash MD5: 16K
       4B A9 56 44 BE 2E EE E6 DA B5 D4 2D 92 48 1D F0>)
$$ ##END=
$$ 
$$ hash MD5
$$ 90 7B 9F C7 09 E5 88 F6 F1 DA AA 45 CD 81 F8 AB
##$RELAX= 
##$RELAX= 
##$RELAX= 
##$RELAX= 
##$RELAX= 
##$RELAX= 
$$ Bruker specific parameters
$$ --------------------------
##$DU= <F:/spectra>
##$EXPNO= 1
##$NAME= <H-F>
##$PROCNO= 1
##$TYPE= <nmr>
##$USER= <she>
##$AMP= (0..31)
100 100 100 100 100 100 100 100 100 100 100 100 100 100 100 100 100 100 
100 100 100 100 100 100 100 100 100 100 100 100 100 100 
##$AQSEQ= 0
##$AQ_mod= 1
##$AUNM= <au_zg>
##$AUTOPOS= <>
##$BF1= 200.13
##$BF2= 200.13
##$BF3= 200.13
##$BF4= 200.13
##$BF5= 200.13
##$BF6= 200.13
##$BF7= 200.13
##$BF8= 200.13
##$BYTORDA= 1
##$CFDGTYP= 0
##$CFRGTYP= 5
##$CHEMSTR= <none>
##$CNST= (0..31)
1 1 145 1 1 1 1 1 1 1 1 1 1 1 1 1 1 1 1 1 1 1 1 1 1 1 1 1 1 1 1 1 
##$CPDPRG= <>
##$CPDPRG1= <>
##$CPDPRG2= <>
##$CPDPRG3= <>
##$CPDPRG4= <mlev>
##$CPDPRG5= <mlev>
##$CPDPRG6= <mlev>
##$CPDPRG7= <mlev>
##$CPDPRG8= <mlev>
##$CPDPRGB= <>
##$CPDPRGT= <>
##$D= (0..31)
0 1.2 0 0 0 0 0 0 0 0.06 0 0.03 0 0 0 0 0.0002 0 0 0 0 0 0 0 0 0 0 0 0 
0 0 0 
##$DATE= 1730454614
##$DBL= (0..7)
120 120 120 120 120 120 120 120 
##$DBP= (0..7)
150 150 150 150 150 150 150 150 
##$DBP07= 0
##$DBPNAM0= <>
##$DBPNAM1= <>
##$DBPNAM2= <>
##$DBPNAM3= <>
##$DBPNAM4= <>
##$DBPNAM5= <>
$$ [...]
##$SUBNAM3= <"">
##$SUBNAM4= <"">
##$SUBNAM5= <"">
##$SUBNAM6= <"">
##$SUBNAM7= <"">
##$SUBNAM8= <"">
##$SUBNAM9= <"">
##$SW= 24.0689170037331
##$SWIBOX= (0..15)
0 0 2 0 0 0 0 0 0 0 0 0 0 0 0 0 
##$SW_h= 4816.95568400771
##$TD= 16384
##$TD0= 1
##$TE= 0
##$TE2= 300
##$TE3= 300
##$TEG= 300
##$TL= (0..7)
0 120 120 120 120 120 120 120 
##$TP= (0..7)
150 150 150 150 150 150 150 150 
##$TP07= 0
##$TPNAME0= <>
##$TPNAME1= <>
##$TPNAME2= <>
##$TPNAME3= <>
##$TPNAME4= <>
##$TPNAME5= <>
##$TPNAME6= <>
##$TPNAME7= <>
##$TPOAL= (0..7)
0.5 0.5 0.5 0.5 0.5 0.5 0.5 0.5 
##$TPOFFS= (0..7)
0 0 0 0 0 0 0 0 
##$TUNHIN= 0
##$TUNHOUT= 0
##$TUNXOUT= 0
##$USERA1= <user>
##$USERA2= <user>
##$USERA3= <user>
##$USERA4= <user>
##$USERA5= <user>
##$V9= 5
##$VALIST= <valist>
##$VCLIST= <CCCCCCCCCCCCCCC>
##$VD= 0
##$VDLIST= <DDDDDDDDDDDDDDD>
##$VPLIST= <PPPPPPPPPPPPPPP>
##$VTLIST= <TTTTTTTTTTTTTTT>
##$WBST= 1024
##$WBSW= 4
##$XGAIN= (0..3)
0 0 0 0 
##$XL= 0
##$YL= 0
##$YMAX_a= 343815
##$YMIN_a= -205615
##$ZGOPTNS= <>
##$ZL1= 120
##$ZL2= 120
##$ZL3= 120
##$ZL4= 120
##$ABSF1= 21.0414
##$ABSF2= -3.027733
##$ABSG= 5
##$ABSL= 3
##$ALPHA= 0
##$AQORDER= 0
##$ASSFAC= 0
##$ASSFACI= 0
##$ASSFACX= 0
##$ASSWID= 0
##$AUNMP= <proc_1d>
##$AZFE= 0.1
##$AZFW= 0.1
##$BCFW= 0
##$BC_mod= 2
##$BYTORDP= 0
##$COROFFS= 0
##$CY= -3
##$DATMOD= 1
##$DC= 0
##$DFILT= <>
##$DTYPP= 0
##$F1P= 0
##$F2P= 0
##$FCOR= 1
##$FTSIZE= 16384
##$FT_mod= 6
##$GAMMA= 0
##$GB= 0
##$INTBC= 1
##$INTSCL= 3.70164e-10
##$ISEN= 128
##$LB= 0.24
##$LEV0= 0
##$LPBIN= 0
##$MAXI= 10000
##$MC2= 0
##$MEAN= 0
##$ME_mod= 0
##$MI= 1.114404
##$NCOEF= 0
##$NC_proc= -7
##$NLEV= 6
##$NOISF1= 3.799351
##$NOISF2= 2.8
##$NSP= 0
##$NTH_PI= 0
##$NZP= 0
##$OFFSET= 21.0076
##$PC= 1
##$PHC0= -26346.76
##$PHC1= 13.98743
##$PH_mod= 1
##$PKNL= yes
##$PPARMOD= 0
##$PSCAL= 0
##$PSIGN= 0
##$REVERSE= no
##$SF= 200.130004225954
##$SI= 16384
##$SIGF1= 3
##$SIGF2= 2
##$SINO= 5.538805
##$SIOLD= 16384
##$SREGLST= <1H.CDCl3>
##$SSB= 0
##$STSI= 16384
##$STSR= 0
##$SW_p= 4816.95568400771
##$SYMM= 0
##$S_DEV= 0
##$TDeff= 16384
##$TDoff= 0
##$TI= <>
##$TILT= no
##$TM1= 0
##$TM2= 0
##$TOPLEV= 0
##$USERP1= <user>
##$USERP2= <user>
##$USERP3= <user>
##$USERP4= <user>
##$USERP5= <user>
##$WDW= 1
##$XDIM= 16384
##$YMAX_p= 522067641
##$YMIN_p= -793310
$$ End of Bruker specific parameters
$$ ---------------------------------
##NTUPLES= NMR SPECTRUM
##VAR_NAME=  FREQUENCY,     SPECTRUM/REAL,   SPECTRUM/IMAG
##SYMBOL=    X,             R,               I
##VAR_TYPE=  INDEPENDENT,   DEPENDENT,       DEPENDENT
##VAR_FORM=  AFFN,          ASDF,            ASDF
##VAR_DIM=   16384,         16384,           16384
##UNITS=     HZ,            ARBITRARY UNITS, ARBITRARY UNITS
##FACTOR=    0.29402158847633, 1,            1
##FIRST=     4204.25123373947, 0,            0
##LAST=      -612.704450268245, 0,           0
##MIN=       -612.704450268245, -793310,     0
##MAX=       4204.25123373947, 522067641,    0
$$ Real data points
##PAGE= N=1
##DATA TABLE= (X++(R..R)), XYDATA
$$ [...]
7576C100743j02942R7447K81805J58970l2527j967r8415K82249L17499k0725J34526
7565D116663M0619l31188L65901N4061m0294L7153N5470j43872n0436J40136J38295
7554D382508K1480O9287J271J92087L47028J38797o0734K02107k3498J19235L40319
7543E729887l92963m058K89035j54871j01522k65735R1147J51825k98115l03596
7533D741034j99713j52197j60362K68166R707J90540K29484k66803l5091Q722
7523D633487K53505P0876k05902M1402n4311j72461l80738J54255k36982M4702
7513D147833l2515L2572k12771n520j81876K45168R3064J12326K96154k17993
7503D276442m3103J34412k0363K70526o0519k46729k2002J28552l7928K14514
$$ plain form
7576 3100743 2997801 3095248 3377053 3536023 3503496 3501529 3403114 3685363 4002862 3982137 4116663
7565 4116663 4157282 3826094 4191995 4246056 4205762 4242915 4298385 4154513 4104077 4244213 4382508
7554 4382508 4403988 4473275 4474546 4666633 5013661 5152458 5091724 5293831 5270333 5389568 5729887
7543 5729887 5336924 5332866 5621901 5467030 5365508 5099773 5190920 5342745 5044630 4741034
7533 4741034 4541321 4389124 4228762 4496928 4506635 4697175 4926659 4659856 4624765 4633487
7523 4633487 4886992 4957868 4751966 4793368 4739057 4566596 4185858 4340113 4103131 4147833
7513 4147833 4115318 4147890 3935119 3929599 3747723 3992891 4085955 4198281 4494435 4276442
7503 4276442 4233339 4367751 4347388 4617914 4557395 4310666 4288664 4417216 4379288 4593802
7493D593802j01574l87436L46509j41363l7048n3989j13089J278J28288o5685
7483D169693M77099l57695k379J8435k13316L1334r9561j81942l6438l46164J43295
7472C602361K90330l6007J76083j44611k45256k62313K40161J05922j77349j98497
7462C350824J16013p1912k22937K20576Q0067J47709L576k15367n2280n5283j17198
7451C183788j3312r7198J99431j85796j34393j20385P4028m6987l02976j6332
7441B539868J72159M27M7889P961j61718O5209M5930l33098p7458q8456J89928
7430B408641r6223o4156j0057j86815L59806j76306J21436M9831L932j51211j57259
7419B101619j6324O8481j8699j5277L6932L24161j54943k69659J57361K1400J14368
$$ plain form
7493 4593802 4492228 4104792 4451301 4309938 4272890 4218901 4105812 4107090 4235378 4169693
7483 4169693 4646792 4289097 4286718 4305153 4091837 4123171 4023610 3841668 3805230 3459066 3602361
7472 3602361 3892691 3856684 4032767 3888156 3642900 3380587 3620748 3726670 3549321 3350824
7462 3350824 3466837 3394925 3171988 3392564 3472631 3620340 3623916 3408549 3356269 3300986 3183788
7451 3183788 3170476 3073278 3272709 3086913 2952520 2832135 2906163 2859176 2556200 2539868
7441 2539868 2712027 2712454 2760343 2768304 2606586 2671795 2717725 2384627 2307169 2218713 2408641
7430 2408641 2312418 2248262 2238205 2051390 2411196 2234890 2356326 2406157 2410089 2258878 2101619
7419 2101619 2085295 2153776 2135077 2119800 2156732 2480893 2325950 2056291 2213652 2235052 2349420
7408B349420J09824K74214j39902j02454N2879j9526K79405K19227L07999k7429
7398C303657L12116L18219q7712l82003K57814j69529K14566K6150l28727J21553
7388C586104J92682K9475J56386p6048k08836R1613K60526K50925k38456Q0869
7378D125240j07666L58537J77736J92621J21244k05448J28180j50009q0469l49353
7368D210613m39233l9653L12515l01312J70705O2936k42612j45706j56085K77290
7358C709458n6467o4779R6075j68049k74725j54265j81146O3294m8755L1787J43236
7347C095664l64839l65004J90856p7077j22251k63278J21700q1071l07942K41954
7337B068712n4911J58624J22098k95488j97712j8833Q277j69726K00100K1364
$$ plain form
7408 2349420 2459244 2733458 2593556 2491102 2543981 2524455 2803860 3023087 3331086 3303657
7398 3303657 3615773 3933992 3846280 3464277 3722091 3552562 3767128 3793278 3464551 3586104
7388 3586104 3778786 3808261 3964647 3888599 3679763 3771376 4031902 4282827 4044371 4125240
7378 4125240 4017574 4376111 4553847 4746468 4867712 4662264 4790444 4640435 4559966 4210613
7368 4210613 3771380 3731727 4044242 3742930 3913635 3976571 3733959 3588253 3432168 3709458
7358 3709458 3652991 3588212 3684287 3516238 3241513 3087248 2906102 2969396 2920641 2952428 3095664
7347 3095664 2730825 2365821 2556677 2479600 2357349 2094071 2215771 2134700 1826758 2068712
7337 2068712 2013801 2172425 2294523 1999035 1801323 1782490 1790767 1621041 1821141 1842505
7327A842505Q6133j02465j25155j27299p1375L41468p3415k43438K35034k72496
7317A489497J01869M51768k4794j20285j37628m5516J87541q4370k56879k0726
7307A540477j51498K41861k0335p1225M22732j98640n0745k4404k20763O8804
7297A536264R0767m30472Q2893O55122M7602l99676J85345K04668k00711m7469
7287A724333M0017J6434j62977J59742k07019K77427L02979n08855j07325L10007
7277A844763j24132R5582K25452L39416q045k48508j78032K0454J180J3988Q2927
7266B065045k8256K3425P0733J46193r6844J30414M8681j134J20890M8637J13656
7255B641440M4506l86472l7281j44686L14154J77379k61276J67295l9218j00297
$$ plain form
7327 1842505 1928638 1826173 1701018 1573719 1502344 1843812 1770397 1526959 1761993 1489497
7317 1489497 1591366 2043134 2018340 1898055 1760427 1714911 1902452 1818082 1561203 1540477
7307 1540477 1388979 1630840 1610505 1539280 1962012 1763372 1712627 1688223 1467460 1536264
7297 1536264 1627031 1196559 1279452 1934574 1982176 1582500 1767845 1972513 1771802 1724333
7287 1724333 1764350 1780784 1617807 1777549 1570530 1847957 2150936 1642081 1534756 1844763
7277 1844763 1720631 1816213 2041665 2381081 2373036 2124528 1946496 1966950 1968130 1982118 2065045
7266 2065045 2036789 2060214 2130947 2277140 2180296 2310710 2359391 2358257 2479147 2527784 2641440
7255 2641440 2685946 2299474 2262193 2117507 2431661 2609040 2347764 2515059 2475841 2375544
7245B375544L34207l58888J07995P0042r0122K03884m03657K44082L37760K46683
7235C067530k73463J12113K09187j36193k75282J56901N2337M60269j47624q4548
7225C141227M9324L81644j80664l91758L97403j22751J32649n3413m5305K1256
7215C329612L11429J24584j02283n1412K87868m16247K04500J42081J45314l7096
7205C938350J08589r9035K29012K09830j42822L4857k85334J41456J33642O53305
7195D921850j65480J38011J04699J25518r3873l48964j64162l44477L72714J92106
7185D737942l00909J91505K68537k05307k23057J21823j46366J01978j70804J28165
7175D503507m23085M8104J81674j00456L0349R9356J13423k7650L0981l39219
$$ plain form
7245 2375544 2709751 2350863 2458858 2528900 2438778 2642662 2239005 2483087 2820847 3067530
7235 3067530 2794067 2906180 3115367 2979174 2703892 2860793 2913130 3373399 3225775 3141227
7225 3141227 3190551 3572195 3391531 2999773 3397176 3274425 3407074 3353661 3308356 3329612
7215 3329612 3641041 3765625 3663342 3611930 3899798 3483551 3688051 3830132 3975446 3938350
7205 3938350 4046939 3947904 4176916 4386746 4243924 4278781 3993447 4134903 4268545 4921850
7195 4921850 4756370 4894381 4999080 5124598 5030725 4681761 4517599 4173122 4545836 4737942
7185 4737942 4437033 4628538 4897075 4691768 4468711 4590534 4444168 4546146 4375342 4503507
7175 4503507 4080422 4128526 4310200 4209744 4240093 4339449 4452872 4425222 4456203 4116984
7165D116984K13939k98847J87140P3984j27919m27975N9770L5195k96953P4551
7155C609869j26369L22065K09053k40270J50835L0138L12935K6416M6389J47258
7145D488319k02935M60085K35245K14003K61041N63684Q7346n8151K06152J05080
7135F359869k89238K15941j64829l33940J85111m80844P9645j92047j22690m6416
7125E210562l04819n73452J05969j31k63525q1356N8178l60082k29507j9668j05267
7114C436902O0956j19433Q0520Q4324j33797k11005J53457N8459L82793L0866
7104C824042m926K8977n5693Q7220l61055M25396m9605q9589M22335k04593J38755
7093D161264m7377j5101J83001Q9115K43356K5947N17752J38408J50828K20584
$$ plain form
7165 4116984 4330923 4032076 4219216 4293200 4165281 3737306 3797076 3832271 3535318 3609869
7155 3609869 3483500 3805565 4014618 3774348 3925183 3955321 4268256 4294672 4341061 4488319
7145 4488319 4285384 4745469 4980714 5194717 5455758 6019442 6106788 6048637 6254789 6359869
7135 6359869 6070631 6286572 6121743 5787803 5972914 5492070 5571715 5379668 5256978 5210562
7125 5210562 4905743 4332291 4438260 4438129 4174604 4093248 4151426 3791344 3561837 3542169 3436902
7114 3436902 3497858 3378425 3458945 3543269 3409472 3198467 3351924 3410383 3793176 3824042
7104 3824042 3819116 3848093 3792400 3879620 3518565 3943961 3894356 3804767 4227102 4022509 4161264
7093 4161264 4113887 4098786 4281787 4370902 4614258 4640205 5157957 5296365 5447193 5667777
7083E667777p5509J98073K15559q3089J19291K72253k39482L64981L81591o5288
7073F756157N34980O34038K16160N27669J97308J49048O04726O17239M23805J98230
7063A0859360P52467O06121P75951P25259N25799J169392J164595N58493J285215
7054A8422652J491163J467121J642945K488188K632296K818336L844541M718018
7046C9525260N698580P736613J0870236J5126241J7563595M045192n784073o439362
7038H8342282j1154514j4266344j1042484p826392n350260m294219m532086l045808
7030B6830175k670805k485899j894842j211465q76003j056674j006113p35016
7022A4893358p03865r29856m22894p19610m73635k41878m36718n17657m11704
$$ plain form
7083 5667777 5592268 5790341 6005900 5922811 6042102 6314355 6074873 6439854 6821445 6756157
7073 6756157 7291137 7925175 8141335 8669004 8866312 9015360 9620086 10237325 10661130 10859360
7063 10859360 11611827 12217948 12993899 13719158 14244957 15414349 16578944 17137437 18422652
7054 18422652 19913815 21380936 23023881 25512069 28144365 30962701 34807242 39525260
7046 39525260 45223840 52960453 63830689 78956930 96520525 100565717 94781644 88342282
7038 88342282 77187768 62921424 51878940 44052548 38702288 34408069 29875983 26830175
7030 26830175 24159370 21673471 19778629 18567164 17691161 16634487 15628374 14893358
7022 14893358 14189493 13259637 12836743 12117133 11643498 11401620 10964902 10447245 10035541
7013A0035541l99156m32477l75960m61100q6594l0777k93244k91235l21785l29369
7003G013844j67271k80473K7949j72402j43865m5474K52223n00794l8096K42279
6993F187920k25856j9349J50730n24754M5337q5569j8785M53149L9507j48941
6983E853389l19660p2015j19261J25858j81356k11732M07334l09029j47154J68932
6973E195306J520J61330J77461j35752Q0576L9953j93927j86984L32722r8966
6963E373239j04370r379J37022K0048J125J81807o8064K19798L61312j65585n9956
6952E886997n2918N6589N98340k42023L83726P0860n9998K24273o1161J71022
6942F975707K74209M4675J5232n1816k5649r3628O71799k4238o2216j28550j69035
$$ plain form
7013 10035541 9636385 9203908 8827948 8366848 8280254 8249477 7956233 7664998 7343213 7013844
7003 7013844 6846573 6566100 6594049 6421647 6277782 6232308 6484531 5983737 5945641 6187920
6993 6187920 5962064 5942715 6093445 5568691 5614028 5528459 5509674 5962823 6002330 5853389
6983 5853389 5533729 5461714 5342453 5468311 5286955 5075223 5482557 5173528 5026374 5195306
6973 5195306 5196826 5358156 5535617 5399865 5480441 5520394 5326467 5139483 5472205 5373239
6963 5373239 5268869 5259490 5396512 5416560 5417685 5599492 5531428 5751226 6112538 5946953 5886997
6952 5886997 5834079 5890668 6489008 6246985 6630711 6701571 6641573 6865846 6804685 6975707
6942 6975707 7249916 7294591 7309823 7258007 7232358 7138730 7810529 7786291 7724075 7595525 7426490
6931G426490J39393m9131R5449j16116j65970L6365l4303m0228m39194j57869
6921F694886K39340k8729j03961l4147N5081l45132k4224k73391K97089O7266
6911F544078M0927n4491k66825J58250q8493L94847J3518k95489Q2240j16026
6901F412536J16056O9588m05188p6343K15836J9297Q974J07916K32359j62458
6891F538573J38981L8127K31695r0251j30847L01031j20463j45944J01336J40964
6881G003202J43811k81163O8940K88930j85223j18890J68020J28079q8405r0161
6871G037140J23177J35402N5641K64091n82119J81573Q0648l51584m3139j18748
6861F782082k03107j37075p2472J71598j70979k869j67534M0135J332k59291L7468
$$ plain form
6931 7426490 7565883 7516752 7612201 7496085 7330115 7366480 7332177 7291949 6852755 6694886
6921 6694886 6934226 6905497 6801536 6767389 6822470 6477338 6453114 6179723 6476812 6544078
6911 6544078 6585005 6530514 6263689 6421939 6333446 6728293 6741811 6446322 6528562 6412536
6901 6412536 6528592 6598180 6192992 6116649 6332485 6351782 6360756 6468672 6701031 6538573
6891 6538573 6677554 6715681 6947376 6857125 6726278 7027309 6906846 6760902 6862238 7003202
6881 7003202 7147013 6865850 6934790 7223720 7038497 6919607 7087627 7215706 7127301 7037140
6871 7037140 7160317 7295719 7351360 7615451 7033332 7214905 7295553 6943969 6900830 6782082
6861 6782082 6578975 6441900 6369428 6541026 6370047 6367178 6199644 6239779 6241111 5981820 6019288
6850F019288k03810K21506k58091J18890k11140k43928O1605j52170J17105M53347
6840E922602k556m98002o5301J98171j18825l26636p0650J3341J57001j19174
6830E089971q8563q9596k5304K45476J4664R3472j08498L47418j07826j39150
6820E232064K41401K345k40046J76652K63120m2817J07345J32789j61245J16356
6810E827964n4410J45918K89169N0281j58478j1841K44016J77938K05040K44763
6800F960360j02830L15957K70672J47709J0624q4174L21634j04699M82100l05721
6790G911632L49115J71555M1424K89712L92308L08854J47511Q7948K08320L09459
6780A0217838J68988K36156L32069N0755L64531o7267K12074J97190K91873K07519
$$ plain form
6850 6019288 5815478 6036984 5778893 5897783 5686643 5442715 5504320 5352150 5469255 5922602
6840 5922602 5920046 5422044 5356743 5554914 5436089 5109453 5038803 5052144 5209145 5089971
6830 5089971 5001408 4911812 4886508 5131984 5146648 5240120 5131622 5479040 5371214 5232064
6820 5232064 5473465 5475810 5235764 5412416 5675536 5632719 5740064 5872853 5711608 5827964
6810 5827964 5773554 5919472 6208641 6258922 6100444 6088603 6332619 6510557 6715597 6960360
6800 6960360 6857530 7173487 7444159 7591868 7602492 7518318 7839952 7735253 8217353 7911632
6790 7911632 8260747 8432302 8473726 8763438 9155746 9464600 9612111 9700059 9908379 10217838
6780 10217838 10386826 10622982 10955051 11005806 11370337 11303070 11515144 11712334 12004207 12211726
6770A2211726M62986R1621M31172O31525K38391M59586Q2421N84770P38387M06050
6760A6338635L31403M54100M85233M08088O69277O60026O67208J048539P97901
6751B1860410N02671Q59650J024010J049452J257315J325010J317622J497372
6743C0693512J753859J878591J795678J412395J360790J066115J714988J610511
6735D3286439J257252R43416J061395O68999N80775Q44442R01513Q77885P93945
6726E1216061Q70778J565729J330648J598296J820523J911547K252644K302452
6718F4868678K773804K707289L124197L550705L616640M280170L901289L129061
6710I1951833K907037K453683J817197K266463K179581K091163J987704J536603
$$ plain form
6770 12211726 12674712 12766333 13197505 13829030 14067421 14527007 14609428 15194198 15932585 16338635
6760 16338635 16670038 17124138 17609371 18017459 18686736 19346762 20013970 21062509 21860410
6751 21860410 22363081 23222731 24246741 25296193 26553508 27878518 29196140 30693512
6743 30693512 32447371 34325962 36121640 37534035 38894825 39960940 41675928 43286439
6735 43286439 44543691 45487107 46548502 47217501 47798276 48642718 49544231 50422116 51216061
6726 51216061 52086839 53652568 54983216 56581512 58402035 60313582 62566226 64868678
6718 64868678 67642482 70349771 73473968 77024673 80641313 84921483 88822772 91951833
6710 91951833 94858870 97312553 99129750 101396213 103575794 105666957 107654661 109191264
6702A09191264J455506J326082J160805L17683J56128L47369L15891J209292J203898
6693A16683918J976461K216859J875272K530009K307109K696096L241277L468583
6685A36995584L700830L603565L334948K829820J718746M41278J97112n8610n22999
6676A52240274n47320j331210j095051j520660j302486j065417p61798k00840
6668A44415492K35154J87450J47348O97283R81972J775623K465408K623233K845434
6659A56374397K942145K982757K675651J888359J895490o4947j519196l253280
6651A63921376m773308n631735o386275o714928o516547n762554n798405n176781
6643A17160843n141133n066531m673453m987526m349085m290700l959036l690767
$$ plain form
6702 109191264 110646770 111972852 113133657 113451340 113607468 113954837 114270728 115480020 116683918
6693 116683918 118660379 120877238 122752510 125282519 127589628 130285724 133527001 136995584
6685 136995584 140696414 144299979 147634927 150464747 152183493 152624771 152821883 152763273 152240274
6676 152240274 151692954 150361744 149266693 147746033 146443547 145378130 144616332 144415492
6668 144415492 144650646 144838096 144985444 145682727 146664699 148440322 150905730 153528963 156374397
6659 156374397 159316542 162299299 164974950 166863309 168758799 168693852 167174656 163921376
6651 163921376 159148068 153516333 147130058 140415130 133898583 128136029 122337624 117160843
6643 117160843 112019710 106953179 102279726 97292200 92943115 88652415 84693379 81002612
6635H1002612l432287l171487k827301l064295k584471k222481k126414k020972
6627E9552904j594369j366612j610715j376347j222820r59361q04525p88078j112034
6618D8718043p47601r94061j161786j100507l25476m19266l47443l76498j43509
6609D3101896K103J85337O63440Q20224Q52345L71258K57026J08586m11626j282526
6599D4668063j445589j635168j876837k035563j781630j919650j617876j222241
6591C1133509j425573j152860j223673j148154j065278p65724p92861m66230r56962
6582B2136194o86153o72126m71844n01984l50127n55415k71741m25899l90799
6573A7810106m08084k89413j79238k48861l96017l93792m61829l68392k59788
$$ plain form
6635 81002612 77570325 74398838 71571537 68507242 65922771 63700290 61573876 59552904
6627 59552904 57958535 56591923 54981208 53604861 52382041 51422680 50618155 49830077 48718043
6618 48718043 47970442 46976381 45814595 44714088 44388612 43969346 43621903 43245405 43101896
6609 43101896 43103999 43289336 43952776 44773000 45625345 45996603 46253629 46362215 45950589 44668063
6599 44668063 43222474 41587306 39710469 37674906 35893276 33973626 32355750 31133509
6591 31133509 29707936 28555076 27331403 26183249 25117971 24352247 23559386 23093156 22136194
6582 22136194 21450041 20777915 20306071 19804087 19453960 18898545 18626804 18200905 17810106
6573 17810106 17402022 17112609 16933371 16684510 16288493 15894701 15432872 15064480 14804692
6564A4804692n28138j77418k98120j98798K2018L3408l10794l32187m26599p4721
6554A2513343j15240j88965n8804m73798L05490L3631m09954k14727N5106J472
6544A1447554o55649P3111j81145j92510R6669o6059O0272o692l31461m5856k9295
6533A0168939j10904l04412J37296L34657j85788K7348o4347m5553o8135j4080
6523I875021k17773L9450K64407J77566J15827Q7728L50398J4010N3190q2463
6513A0677361L2344J69348J09196R1085Q5364n2033K70239k4988k4436R8282r2557
6502A1339205j74543M15472M50855J25929j69326l68422L18676M59760j02044
6493A2295562q9806J74973o2515J75666M41467R0834l9219r7178J43960R6947
$$ plain form
6564 14804692 14276554 14099136 13801016 13602218 13624236 13657644 13346850 13014663 12588064 12513343
6554 12513343 12398103 12209138 12150334 11676536 11982026 12015657 11605703 11390976 11446082 11447554
6544 11447554 10791905 10865016 10683871 10491361 10588030 10521971 10582243 10575551 10244090 10198234 10168939
6533 10168939 10058035 9753623 9890919 10225576 10039788 10067136 10002789 9957236 9889101 9875021
6523 9875021 9657248 9696698 9961105 10138671 10254498 10342226 10692624 10706634 10759824 10677361
6513 10677361 10709705 10879053 10988249 11079334 11164698 11112665 11382904 11357916 11333480 11431762 11339205
6502 11339205 11164662 11580134 12030989 12156918 11987592 11619170 11937846 12397606 12295562
6493 12295562 12205756 12380729 12318214 12493880 12935347 13026181 12986962 12889784 13033744 13130691
6483A3130691P8104r614J33908j08902O3203k97367M3006k50102j11762l70341
6473A2300824j23403J9426J35186j38972m40218L5072j15422M64212J73241m13428
6463A1896518k2217j64029o59793l5634n45674l61090j3760k83450n09440l3254
6453I268177k30677n14893j01197j83355k33191l05135l31203j18756m09782m1810
6443F798178l42935j99895j37074j3414j65985k18522k17200M6969O3067l26249
6433E286940l29155k61182k1595l12001J27152J32254O8963m48465N8127j50375
6423D150663q7849J09007m58414l7415L74374l01265j12192K59321m27851J87473
6413C655852J78417k09822m36221L27948K94561q2062l88416m4156l5879j92759
$$ plain form
6483 13130691 13208795 13199181 13333089 13224187 13287390 12990023 13033029 12782927 12671165 12300824
6473 12300824 12177421 12196847 12332033 12193061 11752843 11787915 11672493 12136705 12309946 11896518
6463 11896518 11874301 11710272 11050479 11014845 10469171 10108081 10094321 9810871 9301431 9268177
6453 9268177 9037500 8522607 8421410 8238055 8004864 7699729 7368526 7249770 6839988 6798178
6443 6798178 6455243 6255348 6118274 6104860 5938875 5720353 5503153 5550122 5613189 5286940
6433 5286940 4957785 4696603 4675008 4363007 4490159 4622413 4691376 4242911 4301038 4150663
6423 4150663 4062814 4171821 3713407 3675992 4050366 3749101 3636909 3896230 3468379 3655852
6413 3655852 3834269 3624447 3188226 3516174 3810735 3728673 3340257 3296101 3260222 3067463
6403C067463j85059K4143o3721L32565k32949O6767k014l23327j2989K22804O7574
6392B961257K37670k90148k13066J00144J60112J58763k07239M4832k32145m2030
6382B678150j17321r9256J80784k77253k83394J94440K09548j87013l02102J54969
6372B151552J99026j59092l37447k6630j09748q1780l0473K53526j79018q529
6362A671387K53476k69150J01211L1112O8893j69276P7333P5056j73918J18137
6352A784261L538o3454k486K72631q4575j37937o6373q1680J25884K5213K5046
6341A800068m6258l87837K52850k12407J01780R0244J91974J32254R2130n375
6331B009423J00250j25563k01873J22891j42142J19769P73o3087L15306m13985
$$ plain form
6403 3067463 2882404 2906547 2842826 3175391 2942442 3009209 3007195 2683868 2670879 2893683 2961257
6392 2961257 3198927 2908779 2695713 2795857 2955969 3114732 2907493 2952325 2720180 2678150
6382 2678150 2560829 2461573 2642357 2365104 2081710 2276150 2485698 2298685 1996583 2151552
6372 2151552 2350578 2191486 1854039 1827409 1717661 1635881 1605408 1858934 1679916 1671387
6362 1671387 1924863 1655713 1756924 1788036 1856929 1687653 1764986 1840042 1666124 1784261
6352 1784261 1787799 1724345 1721859 1994490 1909915 1771978 1705605 1623925 1749809 1775022 1800068
6341 1800068 1753810 1365973 1618823 1406416 1508196 1598440 1790414 1922668 2014798 2009423
6331 2009423 2109673 1984110 1782237 1905128 1762986 1882755 1883528 1820441 2135747 1721762
6321A721762L31501J63113r2088k8104J15176k07277J39216k2540j0272L05233
6311B415720l6271P4471j62538K29728L39350j23498N244K93428o15801N4671
6301B474504K16466m6834J1881p1599O1557k71956Q6305J21208q1890j92639k66011
6290B040992J53147j15008j37290j48658r2716K98744j12184O556O8720M4588
6280B006891l75739k38822N07930p2405m04303n3466J09272J17796r8980j97469
6270A300705L2468j52239k49467R0431J98933R4100P481p6220L1500J65946j37480
6259A306158m29267L01462K68939l40596k05878j3474L0906J77505J47011j55802
6249A086964P6785o0448q8001P0046j61024K22223p7220q7528n5273l1422O4189
$$ plain form
6321 1721762 2053263 2216376 2124288 2096184 2211360 2004083 2143299 2120759 2110487 2415720
6311 2415720 2379449 2453920 2291382 2521110 2860460 2736962 2742206 3035634 2419833 2474504
6301 2474504 2690970 2644136 2656017 2584418 2645975 2374019 2460324 2581532 2499642 2307003 2040992
6290 2040992 2194139 2079131 1941841 1793183 1700467 1999211 1887027 1893583 1962303 2006891
6280 2006891 1631152 1392330 1900260 1827855 1423552 1370086 1479358 1597154 1498174 1300705
6270 1300705 1333173 1180934 931467 1021898 1220831 1314931 1322412 1246192 1277692 1443638 1306158
6259 1306158 876891 1178353 1447292 1106696 900818 887344 918250 1095755 1242766 1086964
6249 1086964 1163749 1103301 1015300 1085346 924322 1146545 1069325 981797 926524 895102 959291
6238I59291n8058q3685K55222R5648P9822l96254O4873j85J6281j08601q6083
6227G38271J31082M58120k37683k47616L12837j33253J28503r8625j4046L1578
6217A069168o0059J17569M6590o4130n8603J89032j44761j38070j04280Q0963
6207I33419Q8413J06644Q9543K49993j92000R4423q7251L9285j65412j35334j9988
6196A001735L9973Q842n5685o6974k7454K32964j21324j67807J26058J4289o9811
6185I14806k45828K40667J21375j28172N9920j04104J42439k54085J65071l39160
6175E72929M16910K7147k57445J0377L65683j82192m34246k91043K58232l6500
6165D49852k42567K69147K05522n0125K4428J27951j78052M3696J78234n1027
$$ plain form
6238 959291 901233 817548 1072770 1168418 1248240 851986 916859 916674 932955 824354 738271
6227 738271 869353 1327473 1089790 842174 1155011 1021758 1150261 1051636 1037590 1069168
6217 1069168 1009109 1126678 1173268 1109138 1050535 1239567 1094806 956736 852456 933419
6207 933419 1021832 1128476 1218019 1468012 1276012 1370435 1283184 1322469 1157057 1021723 1001735
6196 1001735 1041708 1050550 994865 927891 900437 1133401 1012077 844270 970328 984617 914806
6185 914806 668978 909645 1031020 902848 962768 858664 1001103 747018 912089 572929
6175 572929 989839 1016986 759541 769918 1135601 953409 519163 228120 486352 449852
6165 449852 207285 476432 681954 631829 656257 784208 606156 649852 828086 777059
6155G77059k28011M52981j15970l15994J75221K00302J2479k94198J81894k06721
6145F39042Q4988j39441J55845k37526K27619j38019P8650K98555j08186K6007
6135H87534j48823K50495r3328j81874L1337J38791k78548Q5012l4613L6997R0394
6124G83374j8218O5573k30007m5052J36693l7354J95733k50313K62336L16760
6114A179525q169N9740k83002k05122Q7633J73356j42499j77424J65758J21810
6104I71606j22319J25477p3465j03678k03814K99505K41588k95277N8122O6812
6094I64557q8834J57301k06937L276J4178j89019j1714J84386j00984R5335Q1945
6083I03490j30741m5258P4726o5564K92048K07799m79807o2013J39623k40895
$$ plain form
6155 777059 549048 1002029 886059 570065 745286 945588 958067 663869 845763 639042
6145 639042 724030 584589 740434 502908 730527 592508 671158 969713 861527 887534
6135 887534 738711 989206 895878 714004 745341 884132 605584 690596 655983 692980 783374
6124 783374 765156 830729 600722 555670 692363 655009 850742 600429 862765 1179525
6114 1179525 1171356 1231096 948094 742972 830605 1003961 861462 684038 849796 971606
6104 971606 849287 974764 901299 797621 593807 893312 1134900 839623 897745 964557
6094 964557 875723 1033024 826087 829363 843541 654522 642808 827194 726210 821545 903490
6083 903490 772749 727491 802217 736653 1028701 1236500 756693 694680 834303 593408
6073E93408J69885J29388j33721j47152K0298M34494k57175o1903N1659J46382
6063I45563N1818j57130M5607Q2008k4381N45051P9212j05560l52864R391J17964
6052A236679q413j46241q2574L95355J72683m18373J60501R7847j77939J43261
6042A372786J0521l3034R870L68477r4004k17454M2244K41496r8140P4962J19081
6031A796805r0236K104M4588M12434m2745J61299J43550K71n9383j63288K72391
6020B477790j40926K49997L58253L054m8733J32688J37338J71806p2540j61307
6010C107420K79830J83332K35723Q4085j46699l82815L70921l1660k12999k48558
6000C238580K5473K31478k35164n5015j7349N5233j34436j44047n7245k36223
$$ plain form
6073 593408 763293 892681 758960 611808 632106 1066600 809425 747522 799181 945563
6063 945563 997381 840251 885858 967866 943485 1488536 1567748 1462188 1109324 1118715 1236679
6052 1236679 1228266 1082025 999451 1394806 1567489 1149116 1309617 1407464 1229525 1372786
6042 1372786 1383307 1350273 1360143 1728620 1634616 1417162 1459406 1700902 1602762 1677724 1796805
6031 1796805 1706569 1708673 1753261 2165695 2122950 2284249 2427799 2428070 2368687 2205399 2477790
6020 2477790 2336864 2586861 2945114 2948168 2899435 3032123 3169461 3341267 3268727 3107420
6010 3107420 3387250 3570582 3806305 3890390 3743691 3360876 3731797 3700137 3487138 3238580
6000 3238580 3264053 3495531 3260367 3205352 3188003 3243236 3108800 2964753 2907508 2671285
5990B671285l53383J19103Q2696j3989l48372N57688J1274o14426l23584j59239
5980A629053K33619l13231L1882q7014k12459J78095J84863m2236k74406k27465
5970A100701Q5665q2433J18311M571j38659K8394q942k4021M2275k9200r4808
5959A001854K51701O3090j38925o5883k18949q1478J92812p7457P7113n5049J32586
5948A081415m39961J29438J28796j62957M09107J32333l16880m41643J98524j27179
5938E90993K30328O8268J02345q6480Q6969R5004J04176j19070p8425k22368J90668
5927I62408k85175J83634j17012j88670K52779J31125j07919k45071J36087K1861
5917G44047k38561j5357K43518j26003Q8415r0915p5922K75102k89777m2669J69104
$$ plain form
5990 2671285 2317902 2437005 2519701 2505712 2157340 2715028 2726302 2111876 1788292 1629053
5980 1629053 1862672 1549441 1581323 1494309 1281850 1459945 1644808 1602572 1328166 1100701
5970 1100701 1186366 1103933 1222244 1226815 1088156 1116550 1107608 1083587 1125862 1096662 1001854
5959 1001854 1253555 1316645 1177720 1111837 892888 811410 1004222 926765 1003878 948829 1081415
5948 1081415 641454 770892 899688 736731 1145838 1278171 961291 519648 718172 590993
5938 590993 821321 889589 991934 905454 992423 1087427 1191603 1072533 994108 771740 962408
5927 962408 677233 860867 743855 555185 807964 939089 831170 586099 722186 744047
5917 744047 505486 490129 733647 607644 696059 605144 529222 804324 514547 471878 640982
5906F40982j07797K31914j8760k2651r7015M5175k95977q8996k12351L74269M1556
5895D90349J37400k600l76551Q925K44275L0386L4843N4763J74442q1535j38490
5884E76207k8069j41480L23846j98908k66686K66106K1806O8870j73429J8387
5874D66650L7808J61051J9575k91113r2954o7493Q5375J77675Q6777l7307l54426
5863A91618K09892J36030M6011o7462p9677k31416K15211r574L2353J6810L00847
5852G60643m44755J1133L6593j53536M0575P6865J0554j75949J44314n0811l04818
5841d9192L46722J81557j21625K80091o87337K69015R4491o9763r2081J59605
5831C11483J27653n3783k33005K88440J31374j67767k85956K26711Q4889K5811
$$ plain form
5906 640982 533185 765099 746339 723688 626673 671848 375871 286875 74524 448793 490349
5895 490349 627749 625149 248598 257523 501798 532184 567027 621790 796232 714697 576207
5884 576207 548138 406658 730504 531596 264910 531016 552822 621692 448263 466650
5874 466650 504458 665509 685084 393971 301017 233524 318899 496574 583351 546044 191618
5863 191618 401510 537540 583551 516089 436412 204996 420207 410633 442986 459796 760643
5852 760643 315888 327021 363614 210078 250653 327518 338072 162123 306437 255626 -49192
5841 -49192 297530 479087 357462 637553 -49784 219231 313722 243959 151878 311483
5831 311483 439136 385353 152348 440788 572162 404395 118439 345150 430039 455850
5821D55850j15614j39401J19516k40652K82921L11975k19129k34801j40237r3498
5811a3070J67632K1946K58932r8129k43968K63640k29052j8964j30075o7955Q8238
5800h25M34013k53335p3361O75658j33660j96880j08562M6775l76070K34513j62141
5789H6125p44L23958k14753j83104L18972q5568p846L62657j38918q9509j56994
5778B14276j01384r5683J50133n5583K11703q8525J50338k86408k58044K20709
5768F1532j47296L72891K16238k86157O0800j76012K19950N200R8535q5018J98543
5757E39206j09329k7685J05598j95208j27701j45615J11381Q3131J88797J65121
5747E87696k40824n3083K7872J8371n7047j88563K14984m9758J44225r6162k54180
$$ plain form
5821 455850 340236 200835 320351 79699 362620 674595 455466 220665 80428 -13070
5811 -13070 154562 176508 435440 337311 93343 356983 127931 108967 -21108 -89063 -825
5800 -825 433188 179853 106492 782150 648490 451610 343048 389823 13753 248266 86125
5789 86125 85381 409339 194586 11482 330454 244886 237040 599697 460779 371270 214276
5778 214276 112892 17209 167342 111759 323462 234937 385275 98867 -159177 61532
5768 61532 -85764 287127 503365 217208 278008 101996 321946 327146 425681 340663 539206
5757 539206 429877 402192 507790 312582 184881 39266 150647 233778 422575 587696
5747 587696 346872 293789 321661 340032 282985 94422 309406 259648 403873 307711 53531
5736E3531K01961J22791j11644j17402l1649k18562k8240K42146K14304j05639
5726B21597l1585K09530q4175j48178L1596K63217r4920N2655k94103l0138k53462
5715a57966K60255J43863j2541J17199K02440l10999m9983L34427j68746j44664
5705B13285K6145K34027P2104j46070m52931R5519Q2882K41223J40216j20285
5695C86115m8376p110k14514J73742J60237o9685L660k28243K0961J92001J58005
5684E26793P0044l51195L23632j88171l12974j01364K27971K01481j51111j1972
5674B33134J32438m77797L34193K25541m32698J28625Q1003q128j49536K74652
5664C41427k05753K39697j76097o4368Q9365L30631J2252r8451P5594j65552k4773
$$ plain form
5736 53531 255492 378283 266639 149237 117588 -100974 -129214 112932 327236 221597
5726 221597 190012 399542 315367 167189 198785 462002 367082 419737 125634 95496 -157966
5715 -157966 102289 246152 233611 350810 553250 242251 192268 526695 357949 213285
5705 213285 239430 473457 545561 399491 -53440 42079 124961 366184 506400 386115
5695 386115 337739 330629 116115 289857 450094 380409 384069 155826 176787 368788 526793
5684 526793 596837 245642 569274 381103 68129 -33235 194736 396217 245106 233134
5674 233134 365572 -112225 221968 447509 14811 143436 224439 216311 66775 341427
5664 341427 135674 375371 199274 134906 224271 554902 567154 468703 544297 378745 353972
5653C53972R4274k39221K98165O9224r4172K0914m63208O9047N09199m47756L5604
5642B06042M29270j84968K32840M4443m19001j22426K08758r2757J61581J13650
5632E77432j6414J73216k40796J13245j70847K69995O5306M704k73579n9815J46674
5621E89121j32482L15471l4074q5651j17740L13309J80967L11712j06584p0200
5611A163849J07240l3673M82315l5830j52215O0465p4504l00615k16127J34220
5601A135125l69538j18213j61030L57932J65433j28106j65839p8303M02252j03386
5591I36327N7477l35360P7747m4158L5315r829m21882j0143L34375R0707j01795
5580F08781j86011J16013J6437J59364q6655j07304J7469l38151K87124r3146
$$ plain form
5653 353972 448246 209025 507190 576414 482242 503156 39948 108995 618194 170438 206042
5642 206042 635312 450344 683184 727627 308626 186200 394958 302201 463782 577432
5632 577432 561018 734234 493438 606683 435836 705831 771137 775841 502262 442447 589121
5621 589121 456639 772110 738036 652385 534645 847954 1028921 1340633 1234049 1163849
5611 1163849 1271089 1237416 1719731 1683901 1531686 1592151 1517647 1217032 1000905 1135125
5601 1135125 765587 647374 486344 844276 1009709 881603 715764 637461 1039713 936327
5591 936327 993804 658444 736191 692033 727348 717519 295637 285494 619869 710576 608781
5580 608781 422770 538783 555220 714584 627929 520625 538094 199943 487067 393921
5570C93921J28184K8956N71086j17789j48297l78670J46533J00134M8049p1223
5560G00884j69487r5242P6264L19024j63049J17365L5731j8255L74470k05631
5550I72074k32981O5244O9098J46181j02476P1454j0266k02419K1368K63278l5860
5539A024695J39452j00825j87650n2531M84904J34250k17493r1295M5074K62661
5529A441242m9593j19249j54061K67507K30984M39325j06925K1663l47799L71155
5519A994249L77354k01217m0075K0510N0998J88344L69640j29018L44532n13641
5509B461676Q92621K41321l9487O04032P7288J54025K90797N96186P58671J71807
5499F208937O93002P82824P56274J134301P69215J45934q2205J14942n62754r83525
$$ plain form
5570 393921 522105 551061 1122147 1004358 856061 477391 623924 724058 772107 700884
5560 700884 531397 436155 512419 831443 668394 785759 821490 803235 1177705 972074
5550 972074 739093 804337 873435 1019616 917140 988594 978328 775909 797277 1060555 1024695
5539 1024695 1164147 1063322 875672 823141 1308045 1442295 1224802 1133507 1178581 1441242
5529 1441242 1391649 1272400 1118339 1385846 1616830 2056155 1949230 1970893 1623094 1994249
5519 1994249 2371603 2170386 2130311 2150821 2201819 2390163 2759803 2630785 2975317 2461676
5509 2461676 3354297 3595618 3556131 4160163 4237451 4391476 4682273 5278459 6037130 6208937
5499 6208937 6901939 7684763 8441037 9575338 10344553 10490487 10408282 10523224 9960470 8976945
5489H976945p64430r26986q00948p34094l75460n66956n66964j08853l37660k39223
5479C555371j56868k30348k92275k52437k23709j17097K18541j455n26246m6743
5469A926734l4494l38554J911K732m0262j84126Q3566J10427j15623k73586l4489
5458A104236R6263Q9714J38506l35675J71818m01423M9901R2918j91652R4136
5448I08742J94922p1674l9466j56143L08282N2996K0638J35926l43890M6381k75761
5437G80953J39373j41991J32260O2213o8672J8940n5143O1623j78922K30434J5530
5426I96598n0207j85258P2030p0484k69316J88737o3455j35809K61140R1609J52454
5415I88039J37916l2734J22268k2702J4317M4375O9670K74487K02550J95137j57771
$$ plain form
5489 8976945 8212515 7285529 6484581 5750487 5375027 4808071 4241107 4132254 3794594 3555371
5479 3555371 3398503 3168155 2875880 2623443 2399734 2282637 2501178 2499723 1973477 1926734
5469 1926734 1892240 1553686 1555597 1558329 1518067 1333941 1417507 1527934 1412311 1138725 1104236
5458 1104236 1200499 1290213 1428719 1093044 1264862 863439 913340 1006258 814606 908742
5448 908742 1103664 1031990 992524 836381 1144663 1197659 1218297 1354223 1010333 1056714 780953
5437 780953 920326 778335 910595 972808 904136 923076 867933 929556 750634 981068 996598
5426 996598 946391 761133 833163 762679 493363 682100 618645 482836 743976 835585 988039
5415 988039 1125955 1093221 1215489 1192787 1207104 1251479 1321149 1595636 1798186 1993323 1835552
5404A835552l12502k4804K97240k94731l53031J53468m6939k42225J33229l4696
5394A110561j36147J16166k57450J78668j11616j36718J94858j27673q1350k5714
5384G23585M07600k91907K41859J00080k08095j43666R5703Q3799k54863J04181
5374H58276j00760K87435j02097J0274J89267J45829j24786m83738K49360k13961
5364G15099K37085J08251n907Q1221q6801k75205n3866J63972Q1440j14250k7356
5353H23683K22487m39989J93311K30945M4576k83125l1440l03252L79016P7039
5343I13251j05415j81341J10432M6654p0559K86512r2823n1386m0266j02720J67051
5332H79390R2585l8983J96536M22427J15113l96431J92435j93944j05689j3504
$$ plain form
5404 1835552 1523050 1498246 1795486 1500755 1147724 1301192 1254253 1012028 1145257 1110561
5394 1110561 974414 1090580 833130 1011798 900182 763464 958322 830649 749299 723585
5384 723585 1131185 839278 1081137 1181217 973122 829456 925159 1008958 754095 858276
5374 858276 757516 1044951 942854 953128 1142395 1288224 1163438 679700 929060 715099
5364 715099 952184 1060435 1054528 1135749 1048948 773743 719877 883849 965289 851039 823683
5353 823683 1046170 606181 799492 1030437 1075013 791888 760448 457196 836212 913251
5343 913251 807836 626495 736927 783581 713022 999534 906711 855325 815059 712339 879390
5332 879390 971975 932992 1129528 1551955 1667068 1270637 1463072 1269128 1163439 1149935
5322A149935l5455L71776k98850J30551j11883k37849r7163K96987L6331J48194
5312A352574l52002J46487J31171j23084J4604k00793j20249j1454J27195J42406
5302A106855Q6960j75680p2802j46026P1040l40775K30257K9868o12J35561k53168
5291F71478J33328k30174o5589J40955Q1865k44335J16365J76182K80840j14733
5281I46182l1216L40916m16036j25485M9004J68088M7730k52510k18309m5096
5271D63268k1597j32881M24942Q8249l2936k70503J24518J61792L54072j83301
5261I75623m18184J60232J84856r0327r7220R7821j2373P4899k8968J98039p8238
5250I66160j88046j73756M41279Q2755k55850L05658k23390k98999M0212k41006
$$ plain form
5322 1149935 1114480 1486256 1187406 1317957 1206074 968225 871062 1168049 1204380 1352574
5312 1352574 1000572 1147059 1278230 1155146 1169750 968957 848708 837254 964449 1106855
5302 1106855 1193815 1018135 945333 799307 870347 529572 759829 789697 789085 924646 671478
5291 671478 804806 574632 509043 649998 731863 487528 603893 780075 1060915 946182
5281 946182 914966 1255882 839846 714361 763365 931453 979183 726673 508364 463268
5271 463268 441671 308790 733732 821981 789045 518542 643060 804852 1158924 975623
5261 975623 557439 717671 902527 812200 714980 812801 800428 875327 846359 1044398 966160
5250 966160 778114 604358 1045637 1128392 872542 1178200 954810 655811 696023 455017
5240D55017K81199L9994K36127j53151O1324M4146Q3571k85218K76022J24281
5230A163312O9998l7380m1394k34054J70125k20570O9127k0419j55477n4973K62435
5219I70730j9640o0450M61317N2318n44162k32856j4472J21541K22364J5761K980
5208I75431J37341n89N9571k13113N7656j52557K00218k59116R8547K16644k38985
5197H81048K07234P4563L0535j41921N8712k77874J55772k52245L5316l3880J33599
5186H70859J42778J2527N5442L1901k21793K22673r8976m727O8074L7698j48246
5175I68210j75441K30486l14306r0814J98930P3691J2548K17360k23099n2804
5165H44761P2141j10474N34640k51914n2232J8852j46700n3637Q1967O4530K3213
$$ plain form
5240 455017 736216 776210 1012337 859186 920510 964656 1048227 763009 1039031 1163312
5230 1163312 1233310 1195930 1154536 920482 1090607 870037 939164 918745 763268 708295 970730
5219 970730 951090 890640 1351957 1404275 860113 627257 612785 734326 956690 972451 975431
5208 975431 1112772 1112183 1171754 958641 1016297 863740 1063958 804842 903389 1120033 881048
5197 881048 1088282 1162845 1193380 1051459 1110171 832297 988069 735824 771140 737260 870859
5186 870859 1013637 1026164 1081606 1113507 891714 1114387 1015411 1010684 1078758 1116456 968210
5175 968210 792769 1023255 708949 618135 817065 890756 903304 1120664 897565 844761
5165 844761 916902 806428 1341068 1089154 1036922 1055774 909074 855437 937404 1001934 1025147
5154A025147j11603K30495r3044R3370L1914k20551J8595K03771Q2539j3799P86
5143A247620N4132j6602L35929l49980l31114K95815Q3728r9281J52719J48848
5133A521814q2838R1481k42464k9372J59660p2304k2292l6938j45086m7342M4675
5122A138994r2382k5035Q3554o7982o4517K16786l7920p310L1788j0857l8247
5111A126872P4975K68321p9542K1435m27407L35135K12495j21366Q8260J48694
5101A647872J35163l19117K10805p9561q8761K01894J00763n2089j05179M5893
5091A697683j0097L07092J9321j32729j43441J72510K0540P7463J31534P2856
5081B212732M2729J17607j13233K44578k12893l82125J93065J73236K26426J484
$$ plain form
5154 1025147 913544 1144039 1050995 1144365 1176279 955728 974323 1178094 1260633 1246834 1247620
5143 1247620 1301752 1285150 1621079 1271099 939985 1235800 1319528 1220247 1372966 1521814
5133 1521814 1438976 1530457 1287993 1258621 1418281 1345977 1323685 1286747 1141661 1094319 1138994
5122 1138994 1046612 1021577 1105131 1037149 972632 1189418 1151498 1144188 1175976 1165119 1126872
5111 1126872 1201847 1470168 1390626 1412061 984654 1319789 1532284 1410918 1499178 1647872
5101 1647872 1783035 1463918 1674723 1595162 1506401 1708295 1809058 1756969 1651790 1697683
5091 1697683 1687586 1994678 2013999 1881270 1737829 1910339 1930879 2008342 2139876 2212732
5081 2212732 2255461 2373068 2259835 2504413 2291520 1909395 2102460 2275696 2502122 2503606
5071B503606J10682P580j81412j52366N61628k29132P2963P582O5324j29324j75740
5060B461391J70505j4199J50388K17452k39989k35679M8731L4496J06591J82823
5050B882510m9935j25216k8651k89077J30885l2766o6509Q4617j91978K99181
5040B613061J48164k53856k529o7539r8152M5606J8561L15579k73919M35595m213
5029B876358K04062m8384J56820O8810j8552O8701j39912K83959m28632p0849
5019B952381J80194J52267m04813K31529K97944l58884K48491o2626K46924m4925
5009C438482k11223M14146m4376m1546J69510M04862j22573J62621k06133K54315
4999D218085K74580J21251o2224K58573Q0395K05584L77055p4431L7696N83164
$$ plain form
5071 2503606 2614288 2621868 2440456 2288090 2849718 2620586 2693549 2701131 2766455 2637131 2461391
5060 2461391 2631896 2617697 2768085 2985537 2745548 2509869 2558600 2593096 2699687 2882510
5050 2882510 2832575 2707359 2678708 2389631 2520516 2487750 2421241 2505858 2313880 2613061
5040 2613061 2761225 2507369 2504840 2437301 2339149 2384755 2403316 2718895 2444976 2880571 2876358
5029 2876358 3080420 3032036 3188856 3257666 3239114 3307815 3167903 3451862 3023230 2952381
5019 2952381 3132575 3284842 2880029 3111558 3409502 3050618 3299109 3236483 3483407 3438482
5009 3438482 3227259 3641405 3597029 3555483 3724993 4129855 4007282 4169903 3963770 4218085
4999 4218085 4492665 4613916 4551692 4810265 4890660 5096244 5473299 5398868 5436564 6019728
4989F019728L01292L80877O70139Q76433M92535P76493P23292R4810k88684N42
4979A0047457o10826n27737n35426m59054l91954n00606R2929n1565l62800N3759
4969F754177j9370j5553K71449J77088n634J38107P1207P7782p2711j37394N53581
4958G792729k60318N2298K33309m8318Q8592k45743R8572j25452J0981k00347
4948G396303K15684L76790j3604j56069j40527L42294L04072j0369l31180L1898
4938H015292J24132J18J96299R9420l07206N17690K51765l8896j3434N4498O13202
4927I512880k31648J97970M4251l727l2918K99848O2749p4097J22143J16290K733
4916A0016474p6639J16381R4485K58006L34384L63498M9931L0685O6732J93767
$$ plain form
4989 6019728 6321020 6701897 7372036 8248469 8741004 9517497 10240789 10335599 10046915 10047457
4979 10047457 9436631 8908894 8373468 7914414 7522460 7021854 7114783 7063218 6700418 6754177
4969 6754177 6734807 6719254 6990703 7167791 7162157 7300264 7371471 7449253 7376542 7239148 7792729
4958 7792729 7532411 7584709 7818018 7769700 7858292 7612549 7711121 7585669 7596650 7396303
4948 7396303 7611987 7988777 7975173 7819104 7678577 8020871 8324943 8314574 7983394 8015292
4938 8015292 8139424 8139542 8335841 8435261 8128055 8645745 8897510 8858614 8845180 8899678 9512880
4927 9512880 9281232 9479202 9523453 9519726 9486808 9786656 9849405 9775308 9897451 10013741 10016474
4916 10016474 9939835 10056216 10150701 10408707 10743091 11106589 11156520 11187205 11253937 11447704
4906A1447704j49690L62277J99515N39444J59023o5648L43512K53922J28401K04550
4896A3423010N24400J45572o2190J92077L59062N03742o728m14116l23192K20340
4886A4561977k35088n82190j62256K19061l06081k79465P317l26500l3514j27639
4876A2735622j80456J04945k02539j7737j96160j71002j09864J85727p1277J71048
4866A2248307M8026j56796K01095P2126r1332p8997m2030M78671J894L13032m3195
4855A2950801J35978P0562j6700j0523K99652R8816Q5191N94911J0619j94986
4845A4024321k47524N52039J55982O3102k9293r0357K58719N7553L63369J17605
4835A5225516J53789J83575J8691M333p1488j02110L80977K37790K14379K9881
$$ plain form
4906 11447704 11298014 11660291 11859806 12399250 12558273 12492625 12836137 13090059 13218460 13423010
4896 13423010 13947410 14092982 14030792 14222869 14581931 15085673 15078945 14664829 14341637 14561977
4886 14561977 14326889 13744699 13582443 13801504 13495423 13215958 13223275 12896775 12863261 12735622
4876 12735622 12555166 12660111 12457572 12439835 12243675 12072673 11962809 12148536 12077259 12248307
4866 12248307 12296333 12139537 12340632 12412758 12321426 12242429 12200399 12679070 12680964 12993996 12950801
4855 12950801 13086779 13157341 13140641 13130118 13429770 13528586 13613777 14208688 14219307 14024321
4845 14024321 13776797 14328836 14484818 14547920 14518627 14428270 14686989 14744542 15107911 15225516
4835 15225516 15379305 15562880 15581571 15585904 15514416 15412306 15793283 16031073 16245452 16275333
4825A6275333K60874M0264M67083Q8513M1142L45037J35506R8574K33258k16400
4815A7769184M92199L75253p074M26497Q5336q2941M48315M65427L29186N60493
4805B0861875L33135K02579K65269K66134J48737P46746J57728R7433N08648N36728
4795B4125012L16099O07424J59099M58970L86990K78971M02670L45718M14385
4786B7495338N28889N34606O71573M08250N09911L07087P45215Q05847R59240
4777C2965956Q00981Q60748Q00373O50350O31546J190118P45380J392287J016576
4768D1054315J240334J426258J418040J319021J425473R26771J669327J740238
4760E2219777J559585J534332J853713J845846J719321K277286K063889K057880
$$ plain form
4825 16275333 16536207 16576471 17043554 17132067 17173209 17518246 17653752 17752326 17985584 17769184
4815 17769184 18261383 18636636 18629562 19056059 19141395 19058454 19506769 19972196 20301382 20861875
4805 20861875 21195010 21397589 21662858 21928992 22077729 22824475 22982203 23079636 23588284 24125012
4795 24125012 24441111 25048535 25207634 25666604 26053594 26332565 26735235 27080953 27495338
4786 27495338 28024227 28558833 29230406 29638656 30148567 30455654 31200869 32006716 32965956
4777 32965956 33766937 34627685 35428058 36078408 36709954 37900072 38645452 40037739 41054315
4768 41054315 42294649 43720907 45138947 46457968 47883441 48810212 50479539 52219777
4760 52219777 53779362 55313694 57167407 59013253 60732574 63009860 65073749 67131629
4752F7131629K261351K235943K281253K606785K621077K918985L258996L164556
4744H8480575L715336M231813M472540N050109N323497N646458O102692O426477
4736A29449497P117560P729211Q534458R410803J0438140J1681756J2994474J4876065
4728B12231964J7026042J9627578K2142417K4903638K6313244K7200175K5977615
4721C75422673K0258519J5220465J2586579J0969517Q792245P634892Q894696
4714D59779586J1606165J4235512J6280398J4859334N306646n512172j0893205
4707E05662264j4179970j6665065j5836027j3052271j0345513j0015467r816815
4700D15751136r865110r985605j0689677j1325023j1524743j1631481j1420507
$$ plain form
4752 67131629 69392980 71628923 73910176 76516961 79138038 82057023 85316019 88480575
4744 88480575 92195911 96427724 100900264 105950373 111273870 116920328 123023020 129449497
4736 129449497 136567057 144296268 152830726 162241529 172679669 184361425 197355899 212231964
4728 212231964 229258006 248885584 271028001 295931639 322244883 349445058 375422673
4721 375422673 395681192 410901657 423488236 434457753 443249998 450884890 459779586
4714 459779586 471385751 485621263 501901661 516760995 522067641 516555469 505662264
4707 505662264 491482294 474817229 458981202 445928931 435583418 425567951 415751136
4700 415751136 405886026 395900421 385210744 373885721 362360978 350729497 339308990
4693C39308990j1849121j1153076j0559226r681853q155033o845486m589252l673623
4685B72802320k758742k535122j639983j573479j742643k781022l494458l108500
4677B53168371l839843m902527n410726n883335o264850o383062o405226n584891
4669B08493911m669142l567486k349109l086433m399810n583205o489427o553646
4661A71795653o509483o259661n020189m195763l344992k940352k283177j406436
4653A39835600q67025j434102n76160o80769p20212k52161j05843L65964N31750
4644A36097042R04975P52847L54163r9418j752768l036999l237586l658057m058626
4635A22265573l220387k544010k056818j645717r95273m93866K96929J014084
$$ plain form
4693 339308990 327459869 316306793 305747567 296065714 287910681 281065195 276475943 272802320
4685 272802320 270043578 267508456 265868473 264294994 262552351 259771329 256276871 253168371
4677 253168371 249328528 244426001 239015275 233131940 226867090 220484028 214078802 208493911
4669 208493911 203824769 200257283 197908174 194821741 190421931 184838726 178349299 171795653
4661 171795653 165286170 159026509 154006320 149810557 146465565 143525213 141242036 139835600
4653 139835600 138968575 137534473 136958313 136277544 135557332 135305171 135199328 135565292 136097042
4644 136097042 137002017 137754864 138109027 138009609 136256841 133219842 129982256 126324199 122265573
4635 122265573 119045186 116501176 114444358 112798641 111803368 111309502 111606431 112620515
4627A12620515J497301J772277N68349p82000k365739l402839m033251l912435
4619A01962178l927853l509907l368649k769441k408070k378311j900798j407434
4611H0291715j679378r42037p35074j040634j142427r01191p51709n61454m39207
4602G2098604n49078l60480N5371m3264q6108l66458J62000r6860l30364q7229
4592G0396134k76681j21006m87907K18516N9029o0849m3708K16419J82969J37162
4582G0220078K25024O2728l10841l39356j68529M27763K3588j20159K39611R6996
4572G0356903q9019K21316K57409P4451m8128K15488J41063J89934R2294l03069
4562G1108642K63446j02907l53793n89137l29133p02667q14606o86355n05025
$$ plain form
4627 112620515 114117816 115890093 116458442 115676442 113310703 109907864 105874613 101962178
4619 101962178 98034325 94524418 91155769 88386328 85978258 83599947 81699149 80291715
4611 80291715 78612337 77670300 76935226 75894592 74752165 73850974 73099265 72537811 72098604
4602 72098604 71549526 71189046 71244417 71201153 71115045 70748587 70910587 70813727 70483363 70396134
4592 70396134 70119453 69998447 69510540 69729056 69788085 69727236 69683528 69899947 70082916 70220078
4582 70220078 70445102 70507830 70196989 69857633 69689104 70116867 70140455 70020296 70259907 70356903
4572 70356903 70267884 70489200 70746609 70821060 70772932 70988420 71129483 71319417 71411711 71108642
4562 71108642 71372088 71269181 70915388 70326251 69997118 69294451 68479845 67793490 67288465
4553F7288465p85020n75563J27724O72251M55161N05330N19690Q67404N81590
4544F9657032P76388N43322R5244K41710j41012o37327k12070m43732l50673l97171
4534F9131711n24360l68717o39112k54206l47437n25329l3175n8277K55366J67427
4524F6803891N30666L41247M11095N63725J77583J74766J34977Q31j42428J04237
4514F9100590J80799j37917K23129o1721P08087L82196M48828J168828O78391
4505G2691210O37779P18607J135988P52111J140984P16748P33995Q52248J280033
4496H0659703Q58666L84223M56826k0412o4830k48700l49398N4398p9096J84990
4486H1836370j43426J68551K71496N80691J41749M20282J146537J321538O72360
$$ plain form
4553 67288465 66503445 65927882 66055606 66727857 67183018 67688348 68208038 69075442 69657032
4544 69657032 70433420 70976742 71071986 71313696 71172684 70535357 70323287 69879555 69528882 69131711
4534 69131711 68607351 68238634 67599522 67345316 66997879 66472550 66439375 66381098 66636464 66803891
4524 66803891 67334557 67675804 68086899 68650624 68828207 69002973 69137950 69138781 68996353 69100590
4514 69100590 69281389 69143472 69366601 69304880 70012967 70395163 70843991 72012819 72691210
4505 72691210 73328989 74047596 75183584 75935695 77076679 77793427 78527422 79379670 80659703
4496 80659703 81518369 81902592 82359418 82339006 82274176 82025476 81676078 81730476 81651380 81836370
4486 81836370 81692944 81861495 82132991 82713682 82855431 83275713 84422250 85743788 86416148
4477H6416148N88490O38280J034893N21911J35819M40524M47254J88686k48055
4468I0163950j01248j116065j004468j241455j344347j523545j378572j588080
4460H0866170j621949j169873r84421j023804n61688p41386r34957r07653r30466
4451G1989973l56232p74751j288172j321347q31886j107008j172852j233018j089760
4442F2814947j292178j352073j086989p07272p19897j259512r91543j089489j034012
4433E3281982o55842r02899r91307o38129q85589o68142q36727p29531o29349
4424D6344467q30723m22252p67723l32755p16412o35706l99383o31710q71733
4415D0736070m31339l00394k72930m46663l88033n49004n63809m09759k81941
$$ plain form
4477 86416148 87004638 87642918 88677811 89199722 89335541 89776065 90223319 90412005 90163950
4468 90163950 90062702 88946637 87942169 86700714 85356367 83832822 82454250 80866170
4460 80866170 79244221 78074348 77089927 76066123 75504435 74763049 73828092 72920439 71989973
4451 71989973 71633741 70858990 69570818 68249471 67417585 66310577 65137725 63904707 62814947
4442 62814947 61522769 60170696 59083707 58376435 57656538 56397026 55405483 54315994 53281982
4433 53281982 52626140 51723241 50731934 50093805 49208216 48540074 47703347 46973816 46344467
4424 46344467 45513744 45091492 44323769 43991014 43274602 42638896 42239513 41607803 40736070
4415 40736070 40304731 40004337 39731407 39284744 38896711 38347707 37783898 37374139 37092198
4406C7092198r2569l0131k6268k846r3302K34597J07013j25501L60848K79231
4396C7703270J74021r4218K04259K80093P24936L62829K69729N61614R88537M12880
4386D1587950J011472J035988J248834K113131J760238K306585K442151L127574
4378E6633923L971313M028296L984161K065252N84111j014330k054295k969040
4370F5229391l610303l526822l100878k538911k121623j710542j456642j004100
4362D6159570n96747o04610m94318q95286r55940o72033m73475m00768q93237
4353D0173156n34446o33653p72934j240220j025559r57937o72302j017140o89956
4344C2629009l78076k73256q01045k73777m91246N0159J97897j0129k74859j10245
$$ plain form
4406 37092198 36999629 36969498 36943230 36940384 36847082 37081679 37188692 37063191 37424039 37703270
4396 37703270 37877291 37783073 37987332 38267425 38992361 39355190 39624919 40186533 41175070 41587950
4386 41587950 42599422 43635410 44884244 46997375 48757613 51064198 53506349 56633923
4378 56633923 60605236 64633532 68617693 70682945 71267056 70252726 68198431 65229391
4370 65229391 61619088 58092266 54991388 52452477 50330854 48620312 47163670 46159570
4362 46159570 45562823 44958213 44463895 43568609 42612669 41940636 41467161 41066393 40173156
4353 40173156 39638710 39005057 38232123 36991903 35966344 35008407 34336105 33318965 32629009
4344 32629009 32250933 31977677 31176632 30902855 30411609 30461768 30659665 30649536 30374677 30264432
4334C0264432O04186p2210k7037K78582O51279P69919Q48133P91544Q74212O71437
4324C5654477P26950n2652q05562j103013j566582j651599j105562j445556q16504
4315B7834397r66045r45739n61831n39267o96942p20301n08349l69980k53504
4306B2272439k11321n45295k89231m6398n24779n11996l92033j48432K8666m75847
4296A9155773l36111j53992n39414l13205k52704R45J29103p42374k90841l8203
4286A6618977j62658j88019n60347l30078j05942k52994k70627J14174k37991
4277A4624495j065l51926k5783J11979j85453k37937j47981j82855K3818J41401
4267A3768693o45991J6151L64934k32637j21795K29681Q4405n25498Q6247J5233
$$ plain form
4334 30264432 30868618 30796408 30769371 31047953 31699232 32469151 33317284 34108828 34983040 35654477
4324 35654477 36381427 36328775 35523213 34420200 32853618 31202019 30096457 28650901 27834397
4315 27834397 26868352 25922613 25360782 24821515 24124573 23404272 22895923 22525943 22272439
4306 22272439 22061118 21515823 21226592 21180194 20655415 20143419 19751386 19602954 19631620 19155773
4296 19155773 18819662 18665670 18126256 17813051 17560347 17561292 17690395 16948021 16657180 16618977
4286 16618977 16456319 16268300 15707953 15377875 15271933 15018939 14748312 14862486 14624495
4277 14624495 14623430 14271504 14245721 14357700 14172247 13934310 13786329 13603474 13627292 13768693
4267 13768693 13122702 13138853 13503787 13271150 13149355 13379036 13463441 12937943 13024190 13039423
4257A3039423n2541N1675j30646N0092l97707l0041p8871Q0968J74838K35188
4247A2942378o0403k88497K87829o1520K33219K6439N40231l8348R367L86903
4237A3977598K85918N66218J38321M25007Q0570K97110J36923J52348K23959J55778
4227A6439750L08618L35095J05826P12071M29875N80598O84406L14126N15944
4218B0426309P91391R15900R88128J116622P37319o9966j62120k55441q36556
4209B3651586o59343r18669j049181p01730r28034l42074p91235j002751k37054
4200A7021515n42691m18580k54351n73411J85426m7368k47613l19127j78626k15889
4190A4409285m40949k35888k30151j54035j41167l50637K2810P8441l72692m5550
$$ plain form
4257 13039423 12986882 13038557 12907911 12958003 12560296 12530255 12451384 12532352 12707190 12942378
4247 12942378 12881975 12593478 12881307 12819787 13053006 13079445 13619676 13581328 13590695 13977598
4237 13977598 14263516 14829734 14968055 15393062 15473632 15770742 15907665 16060013 16283972 16439750
4227 16439750 16748368 17083463 17189289 17901360 18331235 18911833 19596239 19910365 20426309
4218 20426309 21217700 22133600 23121728 24238350 24975669 24905703 24743583 24488142 23651586
4209 23651586 22992243 22073574 21024393 20322663 19394629 19052555 18261320 17258569 17021515
4200 17021515 16478824 16060244 15805893 15232482 15417908 15370540 15122927 14803800 14625174 14409285
4190 14409285 13968336 13732448 13502297 13348262 13207095 12856458 12879268 12957709 12585017 12539467
4180A2539467k62509L3636P2338k07582j87024L8878j41768k9130j74772m81690
4170A1199844J03167j60273J25306q9032k14440j08446q3606k37142m5621M03434
4160A0893191p6529k16424j85861k01601j21994L59910k82412o3992J7323J91980
4150A0313591p7905k525j67798K77490o9502M57902r8748l17358q9538M49047
4140A0674656k3060l3807K4685M278l5092J29772K21787k8619n8075J61459q1886
4129A0956098K92740K00863O2826K85073L15940o504k03500L36242k11304J86806
4119A2215280J08809M54324L83689J11504L0129M55700M7558j63533N18774N74026
4109A4736260m9372L04841K30203K97365R8451M54296J90425L32136K44848J85716
$$ plain form
4180 12539467 12276958 12310594 12382932 12175350 11988326 12027204 11885436 11856306 11681534 11199844
4170 11199844 11303011 11142738 11268044 11179012 10964572 10856126 10772520 10535378 10489757 10893191
4160 10893191 10816662 10600238 10414377 10212776 10090782 10450692 10168280 10104288 10121611 10313591
4150 10313591 10235686 10233161 10065363 10342853 10273351 10731253 10632505 10315147 10225609 10674656
4140 10674656 10651596 10617789 10642474 10646752 10611660 10741432 10963219 10934600 10876525 11037984 10956098
4129 10956098 11248838 11449701 11512527 11797600 12113540 12107036 11903536 12239778 12028474 12215280
4119 12215280 12324089 12778413 13162102 13273606 13303735 13759435 13806993 13643460 14162234 14736260
4109 14736260 14686888 14991729 15221932 15519297 15617748 16072044 16262469 16594605 16839453 17025169
4099A7025169K64991N19164o4745K08715M94185R9954K61334M23555K30314K77667
4089A9740303O38005L18783P14386J56467K92611N42491N10489K14297N96460
4080B3724292O72761J30618P64825N26557K08036O76179N60350K55417L70967
4071B7890002M38297R06553L59028L37991P70709R55417O93279L18860L93287
4062C3063423O83595O70141O46757N81911O47538P67077O01919O25192M62059
4053C8749612M34678R13334J82186L88105M21618N15609O16513P41162M96144
4044D3458961K95926J073332N88907O96936N51010N49229R54414R83939N53965
4035D9706619O23380J035102P19487R50438Q48144Q23592N96859J007974R40385
$$ plain form
4099 17025169 17290160 17809324 17744579 17953294 18447479 18547433 18808767 19232322 19462636 19740303
4089 19740303 20378308 20697091 21411477 21567944 21860555 22403046 22913535 23127832 23724292
4080 23724292 24397053 24527671 25292496 25819053 26027089 26703268 27263618 27519035 27890002
4071 27890002 28328299 29234852 29593880 29931871 30702580 31657997 32351276 32670136 33063423
4062 33063423 33747018 34417159 35063916 35645827 36293365 37060442 37662361 38287553 38749612
4053 38749612 39184290 40097624 40279810 40667915 41089533 41605142 42221655 42962817 43458961
4044 43458961 43754887 44828219 45417126 46114062 46665072 47214301 48168715 49152654 49706619
4035 49706619 50329999 51365101 52084588 53035026 53883170 54706762 55303621 56311595 57251980
4026E7251980J43097M67885P06589P98600O57477R02143O69647Q40048J233714
4017F3671180J577796J369916J586227J937526J900582J665082J414360J400061
4009G6522730P82359K73379M6124n09226l32763r6120l09604L2925L31612M39781
3999G7181197M78589N44537M85784Q40121J156347J336195J275869J608446J854679
3990H6761764J645987J897783J248764P39141l85995q81031j146886j384077j579332
3981H6916118j377447q95507q87544l87191k76461j65068l0385J62852K01477
3972H3260844j61587j80071M0345J03166O4637K20640K73890M6570k39400p70032
3962H2659002j057353j421795k285068k140930k269002k074543j052585j676407
$$ plain form
4026 57251980 57395077 57862962 58569551 59368151 60025628 60927771 61597418 62437466 63671180
4017 63671180 65248976 66618892 68205119 70142645 72043227 73708309 75122669 76522730
4009 76522730 77305089 77578468 77624592 77115366 76782603 76686483 76376879 76409804 76741416 77181197
3999 77181197 77659786 78204323 78690107 79530228 80686575 82022770 83298639 84907085 86761764
3990 86761764 88407751 90305534 91554298 92293439 91907444 91026413 89879527 88495450 86916118
3981 86916118 85538671 84643164 83755620 83368429 83091968 82926900 82896515 83059367 83260844
3972 83260844 83099257 82919186 82959531 83062697 83127334 83347974 83621864 83668434 83429034 82659002
3962 82659002 81601649 80179854 77894786 75753856 73484854 71410311 70357726 68681319
3954F8681319j236885o63609j216523j035718q32393p16030j264794j114645j143584
3945E9457138q22537r34040j274978p00397j100131j233319j244463j112583j396762
3936D9637928j372292j514812j438704j293347j575834j043845q25474j070293
3928C9503327p51932n62184j067163q42113n27114q15352q03199r26932m84316
3919C2723022m69653q90037o71596l82904n48286p05493l13240j015215q25545
3910B6901053n71072m56145o67743m63756n19481n86676l83935l98279p20363
3901B2133603n79789n93271n37229m06569o16213k92151j36641o39066m88463
3892A7844211j92546m23133L6682j38104k57920k40895j64421k46078k16418J0575
$$ plain form
3954 68681319 67444434 66780825 65564302 64528584 63696191 62980161 61715367 60600722 59457138
3945 59457138 58634601 57700561 56425583 55725186 54625055 53391736 52147273 51034690 49637928
3936 49637928 48265636 46750824 45312120 44018773 42442939 41399094 40573620 39503327
3928 39503327 38751395 38189211 37122048 36279935 35752821 34937469 34134270 33207338 32723022
3919 32723022 32253369 31363332 30691736 30308832 29760546 29055053 28741813 27726598 26901053
3910 26901053 26329981 25873836 25206093 24742337 24222856 23636180 23252245 22853966 22133603
3901 22133603 21553814 20960543 20423314 20016745 19400532 19108381 18971740 18332674 17844211
3892 17844211 17651665 17228532 17265214 17127110 16869190 16628295 16463874 16217796 16001378 16011953
3882A6011953l27148k56747j40857l04720k73795M4982M3807o1123K412k66013
3872A4472751j91315j45864K70159j79144j94169j06734k1036L71429k40728L1097
3862A4066446r0028k68L14165p91M3824M10127Q5897R3327M19293K16523m54545
3851A5103970j67316k52208o64709n60357o08263k28492K0545j49549l14268P7309
3841A2256662m48558M2999j30510J0495o5443l01471J14726j26418k15586j42139
3831A0994757k11761Q7186k84744n0890P8845k0479J19446j9157l10242Q5559
3821A0468520j2853K75770k58035n6282p0072J96300j95551j36932L95126O481
3811A0612472J00780k88438o0489M75230K04827j80665j62263j07415m8484N772
$$ plain form
3882 16011953 15684805 15428058 15287201 14982481 14708686 14753668 14797475 14736352 14738764 14472751
3872 14472751 14281436 14135572 14405731 14226587 14032418 13925684 13904648 14276077 14035349 14066446
3862 14066446 13976418 13976150 14290315 14289524 14333348 14743475 14829372 14922699 15341992 15558515 15103970
3851 15103970 14936654 14684446 14019737 13459380 12851117 12622625 12643170 12493621 12179353 12256662
3841 12256662 11808104 11851103 11720593 11731088 11665645 11364174 11478900 11352482 11136896 10994757
3831 10994757 10782996 10870182 10585438 10534548 10613393 10592914 10712360 10693203 10382961 10468520
3821 10468520 10455667 10731437 10473402 10417120 10347048 10543348 10347797 10210865 10605991 10612472
3811 10612472 10713252 10424814 10364325 10839555 11044382 10863717 10701454 10594039 10545555 10551327
3801A0551327L77425k80915q9999R3884J40511n6769J26505P0081j43179p9024
3791A0709847L3536K54514L3387j88229J57649M4439P0471J31908j66014j44076
3781A0937432j47357K27752K72717l55080j17885K84209q3540r8012j72646j60308
3771A0587282R7640L23177J32102o0393N6997L30407o027k61927J27587j54952
3761A1171893J94958N6835j11002M0564j1459J90259k1869J79572M0523k83418
3751A1446856J16934K42272k88820k70802K04797J80751k56639j09764m3287J32273
3741A1354571j90527k59258L25824R9957k3073k66952j67087r3531K61252j75542
3731A0865634k37416j3539j52393O9893J36166m81622J19662j92246j58753j21469
$$ plain form
3801 10551327 10928752 10647837 10557838 10651722 10792233 10735464 10861969 10932050 10788871 10709847
3791 10709847 10743383 10997897 11031284 10843055 11000704 11045143 11115614 11247522 11081508 10937432
3781 10937432 10790075 11017827 11290544 10935464 10817579 11101788 11018248 10920236 10747590 10587282
3771 10587282 10684922 11008099 11140201 11079808 11136805 11467212 11461185 11199258 11326845 11171893
3761 11171893 11366851 11423686 11312684 11353248 11341789 11532048 11510179 11689751 11730274 11446856
3751 11446856 11563790 11806062 11517242 11246440 11451237 11631988 11375349 11265585 11222298 11354571
3741 11354571 11164044 10904786 11230610 11330567 11307494 11040542 10873455 10779924 11041176 10865634
3731 10865634 10628218 10614679 10462286 10532179 10668345 10186723 10306385 10114139 9955386 9833917
3721I833917K90067k01943J22326R2611J04066n3318O71K31513m71365K85261
3711A0233806J56152j78914O2088K47609J71063J8215J08574M10513J23927J08812
3701A1461845o9276K3865K1371L02996k52292J86143J46013M70689L20201p1880
3691A2539675Q1937J58K22100K28377K95770k7773J08824m47014L33592K61267
3681A3596913J01032j43674K95753n0435l3752K9253k6666j7099m2389l03702
3671A3405234j65452l0237j90224O9881j88171n7897q6731q0358n3907N8029j98706
3660A2481461j76586l2584l4634l98040J68406K8691m52830l1164K34330l79927
3650A1407123j14058J13837m99379j85341K44840Q5496j74775m43613o2572M4764
$$ plain form
3721 9833917 10123984 9922041 10044367 10136978 10241044 10187726 10188397 10419910 9948545 10233806
3711 10233806 10389958 10211044 10273132 10520741 10691804 10710019 10818593 11229106 11353033 11461845
3701 11461845 11392569 11416434 11437805 11740801 11488509 11674652 11820665 12291354 12611555 12539675
3691 12539675 12621612 12621770 12843870 13072247 13368017 13340244 13449068 13002054 13335646 13596913
3681 13596913 13697945 13554271 13850024 13799589 13765837 13795090 13768424 13751325 13708936 13405234
3671 13405234 13239782 13209545 13019321 13089202 12901031 12843134 12756403 12676045 12622138 12680167 12481461
3660 12481461 12304875 12272291 12237657 11839617 12008023 12036714 11583884 11552720 11787050 11407123
3650 11407123 11293065 11406902 10907523 10722182 10967022 11052518 10877743 10434130 10371558 10416322
3640A0416322N8178Q4890L7409j824L13481k48431L5042M2561K73217q8282J27719
3629A1050282k10593q0905K91155l6995k30074J99736l94847m71173K49464j74656
3619A0191394j05757l10137m49276K23476n9416m38878n757R0047o68946m39591
3609H027159L68575l44528M6781l25773j95767m859k22968L36171k13045R357
3599G481103k30528j52856P804o7654J93494k28881j61052K9805P9085o5840j83104
3588F701376j16882k35854k08645K14075L646j43599K04197P9542q5140N5991
3578F468707l68134J07214j68539K08263Q7670k85174N6285L22988q5565k22180
3568F121535j1787n3542k26110K54295R1211p3216L66697k57310p5726J56974
$$ plain form
3640 10416322 10474500 10559390 10596799 10594975 10908456 10660025 10695067 10737628 11010845 10922563 11050282
3629 11050282 10839689 10758784 11049939 11012944 10782870 10982606 10587759 10116586 10366050 10191394
3619 10191394 10085637 9775500 9326224 9549700 9490284 9051406 9045649 9135696 8466750 8027159
3609 8027159 8395734 8051206 8097987 7772214 7576447 7571588 7348620 7684791 7471746 7481103
3599 7481103 7250575 7097719 7105523 7037869 7231363 7002482 6841430 6871235 6950320 6884480 6701376
3588 6701376 6584494 6348640 6139995 6354070 6357716 6214117 6418314 6497856 6412716 6468707
3578 6468707 6100573 6207787 6039248 6247511 6335181 6050007 6106292 6429280 6343715 6121535
3568 6121535 6109748 6056206 5830096 6084391 6175602 6102386 6469083 6211773 6136047 6293021
3558F293021Q4076l60760K33158j12127J08543K5852j09088k1095J171l50905
3548E791846J61500K36418q0809Q230J3128k6476k49678L6172J16569J87967q2077
3537F112790O348j9860J35407J58743n1036m38212K82365l78309L15076j48484
3527E974828Q2111M1695J53177P9597j32717J91494j86715Q9181j34475L31109
3517F489285k70562P9727K49592j54183K38570m4910l05437m9208o2177L43596
3507F514293L8792J41968n7325K66721J57561l1217J7228k17612k8978m62889
3497F338542N95083N134P6533M9453K3037P9255l17653l7533K61707j36580J56157
3486G093135J24798K44788m9027j08279J51566J4835m8943P2440J21663k05178
$$ plain form
3558 6293021 6377097 6016337 6249495 6137368 6245911 6271763 6162675 6141580 6142751 5791846
3548 5791846 5953346 6189764 6108955 6117185 6130313 6103837 5854159 5890331 6006900 6194867 6112790
3537 6112790 6119138 6099278 6234685 6393428 6342392 5904180 6186545 5808236 6123312 5974828
3527 5974828 6056939 6098634 6251811 6331408 6198691 6390185 6203470 6292651 6158176 6489285
3517 6489285 6218723 6298450 6548042 6393859 6632429 6587519 6282082 6232874 6170697 6514293
3507 6514293 6553085 6695053 6637728 6904449 7062010 7030793 7048021 6830409 6801431 6338542
3497 6338542 6933625 6938759 7015292 7064745 7087782 7167037 6849384 6811851 7073558 6936978 7093135
3486 7093135 7217933 7462721 7413694 7305415 7456981 7471816 7422873 7495313 7616976 7411798
3476G411798J97494L9819j65395k64562n2949p1770K76473k64883K39258m06549
3466F938734K02164N0370j99504M7607j43053J20809J88613L03444q4508l58903
3456G065773q5715K6598J19949N0262k27648j70650O5515J62176M9218J82101
3446G237579k99914k9693j9722l1581R1143N399n8969l1295j80532J01087N7203
3435F840705K89772l17495k90780J18652k27339J70133L29222k54389q3039K88965
3425F864407j66549j54128J07900n8186J03157p2217R1541L7490j13208M38122
3415G078329k44267j66915J810J90769J44780j52858q1276j42094K36555R3272
3405F958105P9474j7812j76429j06163K75560l2355k6114R7021j37930J99312
$$ plain form
3476 7411798 7609292 7649111 7483716 7219154 7166205 7094435 7370908 7106025 7345283 6938734
3466 6938734 7140898 7191268 6991764 7039371 6896318 7017127 7205740 7509184 7424676 7065773
3456 7065773 6980058 7006656 7126605 7176867 6949219 6778569 6844084 7006260 7055478 7237579
3446 7237579 6937665 6907972 6888250 6856669 6947812 6953211 6894242 6862947 6682415 6783502 6840705
3435 6840705 7130477 6812982 6522202 6640854 6413515 6583648 6912870 6658481 6575442 6864407
3425 6864407 6697858 6543730 6651630 6593444 6696601 6624384 6715925 6753415 6640207 7078329
3415 7078329 6834062 6667147 6668957 6859726 7004506 6851648 6770372 6628278 6864833 6958105
3405 6958105 7037579 7019767 6843338 6737175 7012735 6980380 6954266 7051287 6913357 7112669
3395G112669l4511q1741k87700K60044K26369l91847L22583K00132J50613K12755
3385G689366k19816k57738K52685k12746K69627N6689J48165P3313R1107J19922
3375H010574P2913K35585k41172L37712K66190j20574k06254L9377R3836J07501
3365H595688q0634L54649Q9002k1219l7597p7596l70218J19205J24889L48172
3355I044341j63419j52725J96551M6821K98437N8203m6534K46045K4531M0805
3345I593056J1963m9479k3898M47793P29N1068M22607M3468k4169o2729J42431
3334A0552840K62898N8655K11296J02180J69578n9885K85292m8072J98595J30951
3324A1864328K616K97295k34203n2924N16261J32263J49191K68671Q0487n0619
$$ plain form
3395 7112669 7078158 6996417 6708717 6968761 7195130 6803283 7125866 7325998 7476611 7689366
3385 7689366 7469550 7211812 7464497 7251751 7521378 7578067 7726232 7799545 7890652 8010574
3375 8010574 8083487 8319072 8077900 8415612 8681802 8561228 8354974 8394351 8488187 8595688
3365 8595688 8515054 8869703 8958705 8937486 8899889 8822293 8452075 8571280 8696169 9044341
3355 9044341 8880922 8728197 8924748 8971569 9270006 9328209 9281675 9527720 9552251 9593056
3345 9593056 9605019 9555540 9531642 9979435 9980164 10031232 10453839 10497307 10473138 10410409 10552840
3334 10552840 10815738 10874393 11085689 11187869 11357447 11297562 11582854 11534782 11733377 11864328
3324 11864328 11866944 12164239 11930036 11877112 12393373 12525636 12674827 12943498 13023985 12973366
3314A2973366j44489J45814P8298p2828j33717L29292m1666m2137k0059L03514
3304A3375388k10913J75230K29620K66653M3565P581m191Q434l09P1539J06956
3293A4069553L68705M90946L00802m7550k09095J69608J2025l6220J06032L65748
3283A5590554M39011J95834k72341O85531K60071k52866M36254J39628J00435
3274A7322111J17694J33615K62846J44884J0098J08728K45537K95242l24K02904
3264A8843335M9076L20524N38361j97072L09598M63661k38944J80840L54562R6545
3254B0720486m710o1796L07290L01657J06092J84634r781M46415M20298q151o4391
3243B2338043M25321N92951O33329K97641J0884K14189L93328K03951M02333N15973
$$ plain form
3314 12973366 12828877 12974691 13052989 12980161 12846444 13175736 13134070 13091933 13071874 13375388
3304 13375388 13164475 13339705 13569325 13835978 13879543 13887124 13882933 13891367 13891058 13962597 14069553
3293 14069553 14438258 14929204 15230006 15182456 14973361 15142969 15154994 15118774 15224806 15590554
3283 15590554 16029565 16225399 15953058 16638589 16898660 16645794 17082048 17221676 17322111
3274 17322111 17439805 17573420 17836266 17981150 17991248 18099976 18345513 18640755 18640431 18843335
3264 18843335 18892411 19212935 19751296 19554224 19863822 20327483 20088539 20269379 20623941 20720486
3254 20720486 20715776 20653980 20961270 21262927 21369019 21553653 21543872 21990287 22410585 22402434 22338043
3243 22338043 22763364 23356315 23989644 24287285 24298169 24512358 24905686 25109637 25511970 26027943
3233B6027943K3140L41460J88560P7816J81615L98367K40512k1732J43188J03613
3223B7704482L3586K72884p1405K47764J45141n724R2671j8741O53750r1112r5457
3212B8867839K07476N52932j82995j64133J48480J2829p5377M13871K73411L10421
3202C0364754j10041K28680L85403j69294K6729J20244N8282o4803j43549J56086
3192C0852491J50201q0795k5991q8963r282k37609l1479O6900j19276m20856J38254
3181C0193595k45800j63609j11498L6728k20077l64476l742K09993j42799l0240
3171B9158075K42928j46550J17441K13202m58439j78912J62965K42454J23539
3162B9476703k0223L06420j03228J4883j57558K14555K90515j23381l78354J19369
$$ plain form
3233 26027943 26051083 26392543 26581103 26658919 26840534 27238901 27479413 27457681 27600869 27704482
3223 27704482 27738068 28010952 27939547 28187311 28332452 28326728 28419399 28400658 29054408 28963296 28867839
3212 28867839 29075315 29628247 29445252 29281119 29429599 29442428 29367051 29780922 30054333 30364754
3202 30364754 30254713 30483393 30868796 30699502 30726231 30846475 30904757 30839954 30696405 30852491
3192 30852491 31002692 30921897 30895906 30806943 30797661 30560052 30528573 30595473 30476197 30055341 30193595
3181 30193595 29947795 29784186 29672688 29709416 29489339 29124863 29121121 29331114 29188315 29158075
3171 29158075 29401003 29254453 29371894 29585096 29126657 28947745 29110710 29353164 29476703
3162 29476703 29456480 29762900 29659672 29674555 29516997 29731552 30022067 29898686 29520332 29639701
3152B9639701N056k21438L29100m9374k49996K36440J58618J28035O3725l30484
3142B9709383m9771K21767J08490j87690K0033j89699k04771K2690K46650k98624
3132B9398458k52265j89091m21898K69873J46185j58400P9338l4289J5884k43632
3122B8610163j35629J65631j83772j82914J3635n0400n9610K5927j50748o7187
3112B7985096K85105k23247M228j61227M14474k04012J09304k41843o5298K70399
3102B8172979j80194j34874K24873j37847m33382r408L01159j21777j94807l8265
3092B7448457L6626K136k02369l7269r1334j47366j37998J0268J4093K47287l83507
3081B6759024n4508Q0963j79636m5801Q1426L9449m50909m5013J58786l80951
$$ plain form
3152 29639701 29644757 29423319 29752419 29703045 29453049 29689489 29848107 29976142 30039867 29709383
3142 29709383 29659612 29881379 29989869 29802179 29822212 29632513 29427742 29450432 29697082 29398458
3132 29398458 29146193 28957102 28535204 28805077 28951262 28792862 28872200 28837911 28853795 28610163
3122 28610163 28474534 28640165 28456393 28273479 28287114 28236714 28177104 28203031 28052283 27985096
3112 27985096 28270201 28046954 28051182 27889955 28304429 28100417 28209721 27967878 27902580 28172979
3102 28172979 27992785 27857911 28082784 27944937 27511555 27502147 27803306 27681529 27486722 27448457
3092 27448457 27485083 27487219 27284850 27247581 27156247 27008881 26870883 26881151 26895244 27142531 26759024
3081 26759024 26704516 26785479 26605843 26560042 26641468 26680917 26230008 26184995 26343781 25962830
3071B5962830L1864J70088K0975k4072j02206k03292j74429j68657p9464J91672
3061B5625309J32832k75539L9649J68204J44119j44816m32189J08804k13444o1930
3051B5090999K79761q1776O3548K11535k5654M6815k71342k01639k21358J7320
3041B4908209M03120j77481m48366m8117q5561J09171P1664j82882j35147m56886
3031B3957724M32925q2473l2241j49460J18994m09551j44574J8009J75576N6547
3021B3941476p8266j67579L7682L15135k02186q3035m3408J17091R5307J40315
3011B4072532j08661R4108j89309L0786j57882K217r5680Q598J59116o6385Q4635
3000B3834075l2889J45395l56481q8816k72718L53904k24765j91972l40941k1829
$$ plain form
3071 25962830 25994694 26164782 26185757 26161685 26059479 25856187 25681758 25513101 25433637 25625309
3061 25625309 25758141 25482602 25522251 25690455 25834574 25689758 25257569 25366373 25152929 25090999
3051 25090999 25370760 25288984 25352532 25564067 25538413 25585228 25313886 25112247 24890889 24908209
3041 24908209 25311329 25133848 24685482 24637365 24551804 24660975 24732639 24549757 24414610 23957724
3031 23957724 24390649 24308176 24275935 24126475 24245469 23835918 23691344 23709353 23884929 23941476
3021 23941476 23863210 23695631 23733313 24048448 23846262 23763227 23719819 23836910 23932217 24072532
3011 24072532 23963871 24057979 23868670 23899456 23741574 23743791 23648111 23656709 23815825 23749440 23834075
3000 23834075 23801186 23946581 23590100 23501284 23228566 23582470 23357705 23165733 22824792 22802963
2990B2802963k6959m30175k01569r6491m17821l32839N8842N93l40595J224k61964
2979B0755209Q0636q5626m22908Q8518J07035J27733k00994j7579P1954j45118
2969B0358860J16620J72308j60505p8168j92119J65112L24082Q4304K76737K81473
2959B1348704o0916J33482J47077L19871o3745j54312k34896M94293L75424P2370
2949B2377352O35851J01389l14075K86463M0548l3091K56615K37346L34094K13380
2939B4135872K19858O5552k13221n235m21847m89558p36045n24911q7162m73297
2929B1470006m00243l50454l62307J08501J38900n5329m17846k93185k85797k46812
2919A9305434n48671l10391K6822l36809k93905j09492k12782J21565J99215l34091
$$ plain form
2990 22802963 22776004 22345829 22144260 22047769 21629948 21297109 21355951 21356544 21015949 21017173 20755209
2979 20755209 20835845 20750219 20327311 20415829 20522864 20650597 20449603 20432024 20503978 20358860
2969 20358860 20475480 20647788 20487283 20409115 20216996 20382108 20706190 20790494 21067231 21348704
2959 21348704 21287788 21421270 21568347 21888218 21824473 21670161 21435265 21929558 22304982 22377352
2949 22377352 23013203 23114592 22800517 23086980 23127528 23094437 23351052 23588398 23922492 24135872
2939 24135872 24355730 24421282 24208061 24202826 23780979 23291421 22555376 22030465 21943303 21470006
2929 21470006 21069763 20719309 20357002 20465503 20604403 20549074 20131228 19838043 19552246 19305434
2919 19305434 18756763 18446372 18473194 18136385 17842480 17732988 17520206 17641771 17840986 17506895
2909A7506895k02439M0473J86559J84578K87440J18228J12623L50014L69938M78256
2899A9432565j60991j18037r8949r211j07379K15102n8654L37616j97737o5247
2889A9169078o2109j99926L06040K7147N37375J36776Q8355M15271K0161L24286
2879B0762454L34163K58184K41622K82517L47247R4571J00799Q2381j02756m78613
2869B1922569n71709n43777o56475p24370m93288o33909k09608j14916n55900
2860A7418617j77467k87308k80625q4824j92213l49329p5084j04279j20097K22804
2850A5970195N4098L18538l22755Q086L55344l81417l13554L55722j19569j49787
2840A5774901p8712Q6764j29113J61910p88k10713L72343r9523k45896j89364
$$ plain form
2909 17506895 17304456 17344929 17531488 17716066 18003506 18121734 18234357 18584371 18954309 19432565
2899 19432565 19271574 19153537 19054588 19045377 18937998 19153100 19094446 19432062 19234325 19169078
2889 19169078 19106969 18907043 19213083 19240230 19777605 19914381 20002736 20418007 20438168 20762454
2879 20762454 21096617 21354801 21596423 21878940 22226187 22320758 22421557 22503938 22401182 21922569
2869 21922569 21350860 20807083 20150608 19426238 18932950 18299041 18089433 17974517 17418617
2860 17418617 17241150 16953842 16673217 16588393 16396180 16046851 15971767 15867488 15747391 15970195
2850 15970195 16024293 16342831 16020076 16028162 16383506 16002089 15688535 16044257 15924688 15774901
2840 15774901 15696189 15782953 15653840 15815750 15814962 15604249 15976592 15877069 15631173 15441809
2830A5441809k09743j59088l11651k948K96041l66773n02763l66500k25813J12440
2820A3705011k20353m58579n3668k01721l30863o18676K12023k7333k34323l25754
2810A1445764p8035l89046j525N19118l65906J28298p7119j29865j69319J39300
2800A1021665k75657P9628j28565j91788J55967M11740k75867O8883j04355j01572
2790A0660079q6864J71119j3581k17224J98046J0799o4415k34315J56202K8163
2780A0608009j3324j80034L553Q1100k14614J23411K31914l97250m08384Q0914
2770I915295J53211k93276J59394J09498o7446n5261l3365o5721l4696j21779
2760I665854k32850l62870j8743J3895N3064m27465Q0439Q6553J596p4508k84612
$$ plain form
2830 15441809 15232066 15072978 14761327 14758379 15054420 14687647 14184884 13818384 13592571 13705011
2820 13705011 13484658 13026079 12972411 12770690 12439827 11821151 12033174 12005841 11771518 11445764
2810 11445764 11367729 10978683 10977158 11496276 11130370 11258668 11181549 11051684 10882365 11021665
2800 11021665 10746008 10825636 10697071 10505283 10661250 11072990 10797123 10866006 10761651 10660079
2790 10660079 10573215 10744334 10730753 10513529 10711575 10722374 10657959 10423644 10579846 10608009
2780 10608009 10594685 10414651 10418204 10499304 10284690 10408101 10640015 10242765 9834381 9915295
2770 9915295 10068506 9775230 9934624 10044122 9976676 9921415 9888050 9822329 9787633 9665854
2760 9665854 9433004 9070134 9051391 9065286 9118350 8690885 8771324 8857877 8859473 8784965 8500353
2749H500353J85858j58102l48461J35933J70951k41825K46949K5124k7298J31582
2739H621064Q8512r0020R3478j1396j03910j9348M7191j88381j69913R6830j98301
2728H165806q4540J59966j34615K43985N1508m467m8889j79628j69090O7210J68292
2717H235538J92924j21698o1404k6683l9903k03786k12119q5888l20826o06813
2707F749342j24846k8653J45756o51929k37758n852j22741l7636k13673j6298
2697E455712J66204m46068n2981k46485m02341M16919m983l7114m33780j62786
2687D252297j6563J65727K43956j87811j0663j92077J2711K06102m16911j64436
2677C892332k76244N7185l1597k0094j73260J11972J7740j86525J38649j38595
$$ plain form
2749 8500353 8686211 8528109 8179648 8315581 8486532 8244707 8491656 8516780 8489482 8621064
2739 8621064 8709576 8619556 8713034 8701638 8597728 8578380 8625571 8437190 8267277 8364107 8165806
2728 8165806 8081266 8241232 8106617 8350602 8402110 8397643 8348754 8169126 8000036 8067246 8235538
2717 8235538 8428462 8306764 8245360 8218677 8178774 7974988 7762869 7676981 7356155 6749342
2707 6749342 6624496 6595843 6741599 6089670 5851912 5846060 5723319 5685683 5472010 5455712
2697 5455712 5621916 5175848 5122867 4876382 4474041 4890960 4885977 4848863 4415083 4252297
2687 4252297 4235734 4401461 4645417 4457606 4446943 4254866 4267577 4473679 4056768 3892332
2677 3892332 3616088 3673273 3641676 3621582 3448322 3560294 3578034 3391509 3530158 3391563
2667C391563l16940J57390j24175L79447J47744P946l44013J38286k70718K1682
2657C188212N8856j05723l99529K9023L6774K64859l63798l1191k5567q6168R3170
2646B658918j70388o1398L5622j51484j89203j87310M3704j6866j84611K84856
2636B061840J42771J16907j99330k73496n5529K845Q9258M0567q6319m5403q556
2625A785555J45261m19283R4486N1927K3633q4728M3269l95348J81585k41198
2615A185159m5395K59367j89836Q068N7407K95938l31931l53134K69229K39408
2605A394280P4120k08374j15253n7047k3498m8260j72460n3430L04729J47153
2595A241960j45729j55571K54765n1825q491k08632k90644L40354k4180R2995
$$ plain form
2667 3391563 3074623 3232013 3107838 3487285 3635029 3642975 3298962 3437248 3166530 3188212
2657 3188212 3247068 3141345 2741816 2770839 2807613 3072472 2708674 2677483 2651916 2565748 2658918
2646 2658918 2488530 2427132 2462754 2311270 2122067 1934757 1978461 1961595 1776984 2061840
2636 2061840 2204611 2321518 2122188 1848692 1793163 1796008 1885266 1925833 1839514 1794111 1785555
2625 1785555 1930816 1511533 1606019 1657946 1681579 1596851 1640120 1244772 1426357 1185159
2615 1185159 1139764 1399131 1209295 1217363 1274770 1570708 1238777 885643 1154872 1394280
2605 1394280 1468400 1260026 1144773 1087726 1064228 1015968 843508 790078 1094807 1241960
2595 1241960 1096231 940660 1195425 1143600 1135109 926477 635833 976187 952007 1045002
2585A045002K30804k05700l9847k05769K80636j95991J89390k76547k82495N5212
2575E94695K42155J52366K23278j48343j41748Q9313m48018M3352p2457o1895
2565D72698J66686o0358J13065K71320k96289O4695J07067j52231Q4631J66045
2555I37329l11893K0767p3780P954J79438q2772j76180J77146P0608j53513o5538
2544E29566J54439q3485N2351m6920M3181j98637N1266m5051J08441r5897j00225
2533C69029J81341L8155Q0922j5810n8598J09405J09583l24468j89214o6721J63714
2522C97338l51014M1471m6957J83228J00432J95358L58299l02913J5677j96471
2512C94448l44994L20149Q7260j31227P5298j06762R5219J41604l529K674J97680
$$ plain form
2585 1045002 1275806 1070106 1030259 824490 1105126 909135 1098525 821978 539483 594695
2575 594695 836850 989216 1212494 1064151 922403 1011716 563698 607050 534593 472698
2565 472698 639384 579026 692091 963411 667122 731817 838884 686653 771284 937329
2555 937329 625436 646203 572423 580377 759815 677043 500863 678009 748617 595104 529566
2544 529566 684005 600520 652871 605951 649132 450495 501761 456710 565151 469254 369029
2533 369029 550370 588525 669447 653637 595039 704444 814027 489559 300345 233624 397338
2522 397338 46324 87795 40838 224066 324498 519856 878155 575242 590919 394448
2512 394448 49454 369603 456863 325636 400934 294172 389391 530995 527466 530140 727820
2501G27820M1607l96061Q7914k09740q9084K63497k5597j21278J17949O0420j83482
2490B73965J68405o5213k24586L04160j24578P3601J35255k43757q735K84353
2480E72870n7991j47906j55989j05962K66608K99127K7250k44806k02265l21217
2470g0281l1915K42132M1722M37161J7187l76313J43900q2072j70043J11574L24775
2459E87827K1573K0264k23995J16839j61974N6204l30382R9022q5787J40731k3222
2448B17100J77709j26707j71445K48178j53214j21054N2290K72990k53922O9260
2438B11185k76565K44171K53521j83087n6969j24224J39362L06922k47191k50597
2428A6528K72645L0376K47778j01930k48276K6316k68612j26836J38449J38528
$$ plain form
2501 727820 769427 373366 461280 251540 162456 425953 400356 279078 397027 457447 273965
2490 273965 442370 377157 152571 456731 332153 405754 541009 297252 288517 572870
2480 572870 514879 366973 210984 105022 371630 670757 698007 453201 250936 -70281
2470 -70281 -102196 139936 181658 618819 636006 259693 403593 321521 151478 263052 587827
2459 587827 609400 629664 405669 522508 360534 416738 86356 185378 99591 240322 217100
2448 217100 394809 268102 96657 344835 191621 70567 122857 395847 141925 211185
2438 211185 -65380 178791 432312 249225 192256 68032 207394 514316 267125 16528
2428 16528 289173 319549 567327 465397 217121 243437 -25175 -152011 -13562 124966
2418A24966K75485j36549q1613o4937J7383K68778j46916r8698K9129J7240j62194
2407D2074J60095q7450K12094j5378Q3054j56000k29794Q6265n5467L14647k2054
2396C32086j38657k51848k69124L89436J57076J33820j87806J75052K46450j13977
2386D72508l61659J8999N7696J2890M4263k38831n5736M59568l6026r0166J08797
2375C92303k40406p762N1140O8526r7105J33881k57731j74131J50416K49529r8066
2364A70594k76568J01752l7346j9309M5412j06611J57092j98270M7570j1757L22768
2353A95327J29899l82128K70032k11162j29468L0992j83729M32929R6952j66673
2343H2971p2507J47535K28051r9444j3429R2535l35036R1708k44904k39440N04968
$$ plain form
2418 124966 400451 263902 182289 117352 134735 403513 256597 157899 187028 204268 42074
2407 42074 202169 114719 326813 311435 394489 238489 8695 94960 39493 354140 332086
2396 332086 193429 -58419 -327543 61893 218969 352789 164983 340035 586485 472508
2386 472508 110849 129848 187544 200434 244697 5866 -49870 409698 373672 283506 392303
2375 392303 151897 144135 195275 263801 166696 300577 42846 -131285 19131 268660 170594
2364 170594 -105974 -4222 -41568 -60877 -15465 -122076 35016 -163254 -115684 -127441 195327
2353 195327 325226 -56902 213130 1968 -127500 -96508 -280237 152692 249644 82971
2343 82971 10464 157999 386050 286606 273177 365712 30676 122384 -122520 -361960 143008
2332A43008M8201J01360j98234m8363L35364l01799j46767L03139L19211m31333
2322A23787l10759j09617K13100K62404J4292K50569j43419r9565L751j81888
2312B2655j30203J59037O6290j69677Q0689K37805p1036J48962j01155l8820L4462
2301B39009K79643j33166m00647K41076P5195j30929J54695m86676R6120N4705
2291a0975K82914R7594k34495L45384O4259k61354j08776K02348O7413n2094J0565
2280D02783L21469j22070j90750j38100J44443m31034j4830L28041j79322j68329
2270d7699N5060J86303J53211m4935L5259l6718k29738Q7644n2986j2535P2605
2259A65471o9394k19424J10160l0244m2698p3841O8284M52938N1552l3836k10010
$$ plain form
2332 143008 191209 292569 94335 45972 381336 79537 -67230 235909 555120 123787
2322 123787 -186972 -296589 -83489 178915 193207 443776 300357 200792 204543 22655
2312 22655 -107548 51489 117779 -51898 28791 266596 195560 344522 243367 204547 239009
2301 239009 518652 385486 -15161 225915 301110 170181 324876 -161800 -65680 -10975
2291 -10975 271939 369533 135038 480422 544681 283327 174551 376899 444312 392218 402783
2280 402783 724252 602182 411432 273332 417775 -13259 -28089 299952 120630 -47699
2270 -47699 7361 193664 346875 301940 337199 300481 70743 158387 105401 92866 165471
2259 165471 96077 -123347 -13187 -43431 -86129 -159970 -91686 361252 412804 378968 168958
2248A68958k36189J30141J00488K52325k05857R0895r137p6367m2442k41923P6470
2237G362J44986j33724p7439J13961o1954R5698O0708J65208j45388l06722m3714
2226a81018L13040L25821k61249p887K73937j87940j45183k4351K13462j74837
2216A43795J1478J08938J98701j39034J4033k60596K47663k91410m5488L77699
2206C65779R1412K257k57086K66834k35439n465K20813j90817J91406k00628j70870
2195G8196l693K57841m0190j44852J56347p7453J52505k42352J88979m9586J9085
2184B94827j64419J51690j64625K17130P0642J00952K6097j44365O4735n9835
2174C92829O6554j36036R6569K00935J91701k00276m8859K30163k08347j84783
$$ plain form
2248 168958 -67231 62910 163398 415723 209866 300761 291624 215257 172815 -69108 7362
2237 7362 152348 18624 -58815 55146 -6808 88890 149598 314806 169418 -137304 -181018
2226 -181018 132022 457843 196594 188707 462644 274704 129521 105170 318632 143795
2216 143795 155273 264211 462912 323878 337911 77315 324978 33568 -11920 365779
2206 365779 457191 459448 202362 469196 233757 228292 449105 258288 449694 249066 78196
2195 78196 74503 332344 292154 147302 303649 226196 378701 136349 325328 275742 294827
2184 294827 130408 282098 117473 334603 405245 506197 532294 387929 452664 392829
2174 392829 459383 323347 419916 620851 812552 612276 563417 793580 585233 400450
2164D00450N5165J44081k99502j28878K85977k02221o118J22518J95060j90537
2154C75995J91740O1009K67513j11758K50175j63510k98160M70106r0852j02432
2144H49826m8108L12458j1523J25112q7769N014J7784n3918O451L96332n9761
2133A451898j30177K64056K62547K77364P7115j28511r2961K63041P9016j56218
2123B167170J99627j9808J08492K37182L00496q3813M7517L29421J93812J49963
2113C630059L82487J68070J07702O22955P14691k41653O8154P46524O3974K85733
2103F548696O58482P29917L33103O48274J062257P98245J116020Q15036J136004
2094A3846034J204323J273019J981138J864876K857316L518848M511564N878372
$$ plain form
2164 400450 455615 599696 300194 171316 457293 255072 248954 371472 566532 375995
2154 375995 567735 628744 896257 784499 1034674 871164 573004 1043110 952258 849826
2144 849826 801718 1114176 1102653 1227765 1139996 1145010 1162794 1108876 1115327 1511659 1451898
2133 1451898 1321721 1585777 1848324 2125688 2202803 2074292 1981331 2244372 2323388 2167170
2123 2167170 2366797 2346989 2455481 2692663 2993159 2909346 2956863 3286284 3480096 3630059
2113 3630059 4012546 4180616 4288318 4911273 5625964 5384311 5452465 6198989 6262963 6548696
2103 6548696 7207178 7937095 8270198 8918472 9980729 10778974 11894994 12710030 13846034
2094 13846034 15050357 16323376 18304514 20169390 23026706 26545554 31057118 36935490
2086C6935490R048316J0435272J919295l448337l589355o505898q426361n855791
2078C0512631m174083l492441k593374k323622j705567j507581j399549j408445
2070A1907969q69970r18619o96776p17538p66572l69550l97915p04203k15318
2061F251508o93702J89411l19425k70010l43488j73243r0544l98543k31804m98981
2051C421179m04900K37502j06400j27108r8947k08289m27429j59471K14966m4705
2041B296398J07631l04954j30950p7319k69885P8329K22178l39933q0322J71222
2031A672395j58370l0942j5774l4706N519j36815l1662J54671k76570j98342J0085
2020I59489K17908k0863j20199J00772K20718l88630j59767k11169K40344J39570
$$ plain form
2086 36935490 45983806 56419078 58338373 54890036 51300681 44794783 36368422 30512631
2078 30512631 26338548 22846107 20252733 17929111 16223544 14715963 13316414 11907969
2070 11907969 11037999 10119380 9422604 8705066 7938494 7568944 7171029 6466826 6251508
2061 6251508 5557806 5747217 5427792 5157782 4814294 4641051 4550507 4151964 3920160 3421179
2051 3421179 3016279 3253781 3147381 3020273 2921326 2713037 2285608 2126137 2341103 2296398
2041 2296398 2404029 2099075 1968125 1890806 1620921 1699250 1921428 1581495 1501173 1672395
2031 1672395 1514025 1483083 1467309 1432603 1438122 1301307 1269645 1424316 1147746 949404 959489
2020 959489 1177397 1156534 1036335 1137107 1357825 969195 809428 598259 838603 978173
2010I78173j01634q1901k36896K37265j45946n5454k4149L10655J43211k63008
2000G60316O2419j24059K5622j96776k48691Q6614K23924J45966m23530K88035
1990E99840J39263j12415m78153N7868j54268j44391J03929L10842P1355J38101
1980E31971k66405n0885J03038J29296l75061M5670L4980K872L2091o5232J36081
1969B58416r9152O3102q0839R9739O9385K29466j75215j04482k57318K92932J29676
1958D25710k464k47217k0888o2455j50564J27148M5654q2655K83764j7111K5740
1947C24662J16315j25150J57596k78222K83062l09293l2582J53813J4434k9661
1937B74974l05134K95501k5294l6876k21136r2105O9026K06499J08288n8527J34334
$$ plain form
2010 978173 876539 794638 557742 795007 649061 593607 569458 880113 1023324 760316
2000 760316 822735 698676 724298 527522 278831 365445 589369 735335 311805 599840
1990 599840 739103 626688 148535 206403 52135 -92256 11673 322515 393870 531971
1980 531971 265566 214681 317719 447015 71954 117624 152604 155476 187567 122335 258416
1969 258416 159264 222366 141527 241266 310651 540117 364902 260420 3102 296034 425710
1958 425710 423246 176029 155141 92686 -57878 69270 114924 32269 316033 298922 324662
1947 324662 440977 315827 473423 195201 478263 168970 136388 290201 304635 274974
1937 274974 -30160 265341 240047 203171 -17965 -110070 -41044 165455 273743 215216 349550
1926C49550j31820J16640k52970o0609r3706J77404j13990K12492L31595j57089
1916C77497j21235n0118J167k20639L29814J7163l83054M4626K5380Q4028m3641
1905F0988j54426J86232Q8966k5331j93487o3192K39476J9138K78674j23905k01729
1894A11404J6989j98449M69446M24353n52308j95643N9503k01086K14995K80146
1884D29350J21006r3233J7429J66237j08457k37742j13934J38900K2645n5328
$$ plain form
1926 349550 217730 334370 81400 20791 -72915 104489 -9501 202991 534586 377497
1916 377497 256262 206144 207311 -13328 316486 333649 -49405 -4779 20601 104629 60988
1905 60988 -93438 92794 181760 156429 -37058 -100250 139226 158364 437038 313133 111404
1894 111404 128393 -70056 399390 823743 271435 75792 135295 -65791 149204 429350
1884 429350 550356 457123 474552 640789 532332 294590 180656 319556 342201 286873
$$ [...]
##END NTUPLES=NMR SPECTRUM
##END=
