##TITLE=1H_CA-9297-3
 CDCl3
 8 sc, 
 1.11.2024
##JCAMPDX= 6.0         $$ Bruker NMR JCAMP-DX V2.0
##DATA TYPE= NMR SPECTRUM
##DATA CLASS= NTUPLES
##ORIGIN= UXNMR, Bruker Analytische Messtechnik GmbH
##OWNER= root
$$ XWIN-NMR		Version 3.5
$$ Fri Nov  1 13:46:53 2024 Russian Standard Time (UT+4h)  she@DPX200
##.OBSERVE FREQUENCY= 200.1318
##.OBSERVE NUCLEUS= ^1H
##.ACQUISITION MODE= SIMULTANEOUS
##.ACQUISITION SCHEME= undefined
##.AVERAGES= 8
##.DIGITISER RES= 18
##SPECTROMETER/DATA SYSTEM= spect
##.PULSE SEQUENCE= zg30
##.SOLVENT NAME= CDCl3
##.SHIFT REFERENCE= (INTERNAL, CDCl3, 0, 21.0414)
##AUDIT TRAIL= $$ (NUMBER, WHEN, WHO, WHERE, WHAT)
$$ ##TITLE= Audit trail, XWIN-NMR		Version 3.5
$$ ##JCAMPDX= 5.01
$$ ##ORIGIN= Bruker BioSpin GmbH
$$ ##OWNER= she
$$ F:/spectra/data/she/nmr/H-F/1/pdata/1/auditp.txt
$$ ##AUDIT TRAIL=  $$ (NUMBER, WHEN, WHO, WHERE, WHAT)
(   1,<2024-11-01 13:44:12.26 +0400>,<she>,<DPX200>,
      <created by zg, POWCHK disabled, PULCHK disabled
       configuration hash MD5:
       00 E9 B6 7A A2 85 ED C7 34 08 36 98 17 FE 4E 26
       data hash MD5: 16K
       5F 8F AC 81 0E 99 C5 17 74 A7 2F 20 8C 2E A9 A1>)
(   2,<2024-11-01 13:44:14.71 +0400>,<she>,<DPX200>,
      <Start of raw data processing
       efp BC_mod = 2 LB = 0.24 FT_mod = 6 PKNL = 1 PHC0 = -26351.7 PHC1 = 18.18743 SI = 16K 
       data hash MD5: 16K
       5B DE C2 CA 0E CF C1 E6 3B D8 F6 00 41 0F E0 BF>)
(   3,<2024-11-01 13:44:32.32 +0400>,<she>,<DPX200>,
      <pk PHC0 = 3.263573 PHC1 = -2.2 
       data hash MD5: 16K
       87 23 DD BB 27 B5 47 E0 AC 80 BA FD 3E 74 DA D1>)
(   4,<2024-11-01 13:44:36.25 +0400>,<she>,<DPX200>,
      <abs ABSG = 5 
       data hash MD5: 16K
       4A 36 4B 65 DA 92 1B 49 84 4E 00 F6 16 8D 8B E0>)
$$ ##END=
$$ 
$$ hash MD5
$$ 34 B5 ED B2 C5 C9 B1 57 7B E9 0E D3 A2 CE 0F DA
##$RELAX= 
##$RELAX= 
##$RELAX= 
##$RELAX= 
##$RELAX= 
##$RELAX= 
$$ Bruker specific parameters
$$ --------------------------
##$DU= <F:/spectra>
##$EXPNO= 1
##$NAME= <H-F>
##$PROCNO= 1
##$TYPE= <nmr>
##$USER= <she>
##$AMP= (0..31)
100 100 100 100 100 100 100 100 100 100 100 100 100 100 100 100 100 100 
100 100 100 100 100 100 100 100 100 100 100 100 100 100 
##$AQSEQ= 0
##$AQ_mod= 1
##$AUNM= <au_zg>
##$AUTOPOS= <>
##$BF1= 200.13
##$BF2= 200.13
##$BF3= 200.13
##$BF4= 200.13
##$BF5= 200.13
##$BF6= 200.13
##$BF7= 200.13
##$BF8= 200.13
##$BYTORDA= 1
##$CFDGTYP= 0
##$CFRGTYP= 5
##$CHEMSTR= <none>
##$CNST= (0..31)
1 1 145 1 1 1 1 1 1 1 1 1 1 1 1 1 1 1 1 1 1 1 1 1 1 1 1 1 1 1 1 1 
##$CPDPRG= <>
##$CPDPRG1= <>
##$CPDPRG2= <>
##$CPDPRG3= <>
##$CPDPRG4= <mlev>
##$CPDPRG5= <mlev>
##$CPDPRG6= <mlev>
##$CPDPRG7= <mlev>
##$CPDPRG8= <mlev>
##$CPDPRGB= <>
##$CPDPRGT= <>
##$D= (0..31)
0 1.2 0 0 0 0 0 0 0 0.06 0 0.03 0 0 0 0 0.0002 0 0 0 0 0 0 0 0 0 0 0 0 
0 0 0 
##$DATE= 1730454251
##$DBL= (0..7)
120 120 120 120 120 120 120 120 
##$DBP= (0..7)
150 150 150 150 150 150 150 150 
##$DBP07= 0
##$DBPNAM0= <>
##$DBPNAM1= <>
##$DBPNAM2= <>
##$DBPNAM3= <>
##$DBPNAM4= <>
$$ [...]
##$SUBNAM3= <"">
##$SUBNAM4= <"">
##$SUBNAM5= <"">
##$SUBNAM6= <"">
##$SUBNAM7= <"">
##$SUBNAM8= <"">
##$SUBNAM9= <"">
##$SW= 24.0689170037331
##$SWIBOX= (0..15)
0 0 2 0 0 0 0 0 0 0 0 0 0 0 0 0 
##$SW_h= 4816.95568400771
##$TD= 16384
##$TD0= 1
##$TE= 0
##$TE2= 300
##$TE3= 300
##$TEG= 300
##$TL= (0..7)
0 120 120 120 120 120 120 120 
##$TP= (0..7)
150 150 150 150 150 150 150 150 
##$TP07= 0
##$TPNAME0= <>
##$TPNAME1= <>
##$TPNAME2= <>
##$TPNAME3= <>
##$TPNAME4= <>
##$TPNAME5= <>
##$TPNAME6= <>
##$TPNAME7= <>
##$TPOAL= (0..7)
0.5 0.5 0.5 0.5 0.5 0.5 0.5 0.5 
##$TPOFFS= (0..7)
0 0 0 0 0 0 0 0 
##$TUNHIN= 0
##$TUNHOUT= 0
##$TUNXOUT= 0
##$USERA1= <user>
##$USERA2= <user>
##$USERA3= <user>
##$USERA4= <user>
##$USERA5= <user>
##$V9= 5
##$VALIST= <valist>
##$VCLIST= <CCCCCCCCCCCCCCC>
##$VD= 0
##$VDLIST= <DDDDDDDDDDDDDDD>
##$VPLIST= <PPPPPPPPPPPPPPP>
##$VTLIST= <TTTTTTTTTTTTTTT>
##$WBST= 1024
##$WBSW= 4
##$XGAIN= (0..3)
0 0 0 0 
##$XL= 0
##$YL= 0
##$YMAX_a= 846232
##$YMIN_a= -512415
##$ZGOPTNS= <>
##$ZL1= 120
##$ZL2= 120
##$ZL3= 120
##$ZL4= 120
##$ABSF1= 20.98997
##$ABSF2= -3.079163
##$ABSG= 5
##$ABSL= 3
##$ALPHA= 0
##$AQORDER= 0
##$ASSFAC= 0
##$ASSFACI= 0
##$ASSFACX= 0
##$ASSWID= 0
##$AUNMP= <proc_1d>
##$AZFE= 0.1
##$AZFW= 0.1
##$BCFW= 0
##$BC_mod= 2
##$BYTORDP= 0
##$COROFFS= 0
##$CY= -3
##$DATMOD= 1
##$DC= 0
##$DFILT= <>
##$DTYPP= 0
##$F1P= 0
##$F2P= 0
##$FCOR= 1
##$FTSIZE= 16384
##$FT_mod= 6
##$GAMMA= 0
##$GB= 0
##$INTBC= 1
##$INTSCL= 3.70164e-10
##$ISEN= 128
##$LB= 0.24
##$LEV0= 0
##$LPBIN= 0
##$MAXI= 10000
##$MC2= 0
##$MEAN= 0
##$ME_mod= 0
##$MI= 1.114404
##$NCOEF= 0
##$NC_proc= -5
##$NLEV= 6
##$NOISF1= 3.799351
##$NOISF2= 2.8
##$NSP= 0
##$NTH_PI= 0
##$NZP= 0
##$OFFSET= 21.0414
##$PC= 1
##$PHC0= -26348.44
##$PHC1= 15.98743
##$PH_mod= 1
##$PKNL= yes
##$PPARMOD= 0
##$PSCAL= 0
##$PSIGN= 0
##$REVERSE= no
##$SF= 200.129997462536
##$SI= 16384
##$SIGF1= 3
##$SIGF2= 2
##$SINO= 5.538805
##$SIOLD= 16384
##$SREGLST= <1H.CDCl3>
##$SSB= 0
##$STSI= 16384
##$STSR= 0
##$SW_p= 4816.95568400771
##$SYMM= 0
##$S_DEV= 0
##$TDeff= 16384
##$TDoff= 0
##$TI= <>
##$TILT= no
##$TM1= 0
##$TM2= 0
##$TOPLEV= 0
##$USERP1= <user>
##$USERP2= <user>
##$USERP3= <user>
##$USERP4= <user>
##$USERP5= <user>
##$WDW= 1
##$XDIM= 16384
##$YMAX_p= 404970635
##$YMIN_p= -394132
$$ End of Bruker specific parameters
$$ ---------------------------------
##NTUPLES= NMR SPECTRUM
##VAR_NAME=  FREQUENCY,     SPECTRUM/REAL,   SPECTRUM/IMAG
##SYMBOL=    X,             R,               I
##VAR_TYPE=  INDEPENDENT,   DEPENDENT,       DEPENDENT
##VAR_FORM=  AFFN,          ASDF,            ASDF
##VAR_DIM=   16384,         16384,           16384
##UNITS=     HZ,            ARBITRARY UNITS, ARBITRARY UNITS
##FACTOR=    0.29402158847633, 1,            1
##FIRST=     4211.01551061119, 0,            0
##LAST=      -605.940173396517, 0,           0
##MIN=       -605.940173396517, -394132,     0
##MAX=       4211.01551061119, 404970635,    0
$$ Real data points
##PAGE= N=1
##DATA TABLE= (X++(R..R)), XYDATA
$$ [...]
$$ plain form
7825 2841 9830 57082 30238 42744 15651 -38060 10336 57078 73031 85714 5558 -1179
7813 -1179 35760 -38066 -18746 15908 48482 -19406 25331 72890 27580 41404 -10235 -20769
7801 -20769 -64917 -21550 -4335 15604 58495 -22004 11804 37924 43119 31910 36399 -9054
7789 -9054 -39909 5132 22260 8606 63645 31096 7785 -7019 9863 5761 -26281 41654
7777 41654 -14512 377 26291 2695 27186 70388 65798 44049 3824 -14367 28063 28800
7765 28800 -16375 31830 67234 7946 -32662 -12928 40423 30093 16309 -18434 34855 33471
7753 33471 -13620 -26492 -11455 -37146 11488 20135 -45074 -745 49948 70688 -25936 -32544
7741 -32544 9969 19533 91006 -19413 -84962 -17505 6748 -82963 -9351 -8791 -30408 -51029
$$ packed form
7825B841O989M7252k6844J2506k7093n3711M8396M6742J5953J2683q0156o737
7813a179L6939p3826J9320L4654L2574o7888M4737M7559m5310J3824n1639j0534
7801b0769m4148M3367J7215J9939M2891q0499L3808K6120N195j1209M489m5453
7789i054l0855M5041J7128j3654N5039l2549k3311j4804J6882m102l2042O7935
7777D1654n6166J4889K5914k3596K4491M3202m590k1749m0225j8191M2430P37
7765B8800m5175M8205L5404n9288m0608J9734N3351j0330j3784l4743N3289j384
7753C3471m7091j2872J5037k5691M8634Q647o5209M4329N0693K0740r6624o608
7741c2544M2513R564P1473j10419o5549O7457K4253q9711P3612N60k1617k0621
$$ plain form
7729 -51029 16750 45204 40592 23279 1754 -33167 -15738 32776 49773 -27844 54639 43286
7717 43286 -19316 10771 -9206 24916 53744 86605 67384 45455 46475 128832 39841 45454
7705 45454 -16738 -56476 -24556 -20925 27854 70617 6895 -8943 -13699 51161 8783 -18617
7693 -18617 17846 88140 93308 20447 73061 -4757 -42588 39545 24873 -38226 32333 -56528
7681 -56528 -34524 24170 45425 32206 49004 -38005 28866 77558 108269 101358 44461 73353
7669 73353 -21358 33425 30939 15381 11671 19529 25103 107098 124950 74845 65915 70783 22101
7656 22101 2330 -811 126441 125345 40930 52081 149845 120659 72781 -30641 83443 109506
7644 109506 40382 42139 42793 42833 56987 56379 -13294 77222 58960 130587 57167 33693 66564
$$ packed form
7729e1029O7779K8454m612j7313k1525l4921J7429M8514J6997p7617Q2483j1353
7717D3286o2602L0087j9977L4122K8828L2861j9221k1929J020Q2357q8991N613
7705D5454o2192l9738L1920L631M8779M2763o3722j5838m756O4860m2378k7400
7693a8617L6463P0294N168p2861N2614p7818l7831Q2133j4672o3099P0559q8861
7681e6528K2004N8694K1255j3219J6798q7009O6871M8692L0711o911n6897K8892
7669G3353r4711N4783k486j5558l710P858N574Q1995J7852n0105q930M868m8682
7656B2101j9771l141J27252j096q4415J1151R7764k9186m7878j03422J14084K6063
7644A09506o9124J757O54M0J4154o08o9673R0516j8262P1627p3420k3474L2871
$$ plain form
7631 66564 59046 102412 76670 111151 -2086 -12915 7188 22656 107839 125227 26767 19132
7619 19132 110474 68000 73719 115437 69944 -10757 19257 31160 53894 -16374 5926 105183
7607 105183 113437 73414 29694 76474 61055 40520 34672 83004 47131 57947 113785 124918
7595 124918 132995 88978 32786 62321 19898 18109 100254 44255 35314 89293 73705 19039
7583 19039 -3910 -35947 -31520 -9240 -33492 -49942 -132 -148 -8738 42162 41152 21761 139856
7570 139856 119541 125389 126894 99330 113258 97113 -12952 15887 -12701 54418 980 49525
7558 49525 104872 46135 137887 81719 29992 32864 59206 44693 68580 60841 65071 32728
7546 32728 20573 91323 106669 38040 71290 29302 39593 66188 78214 67109 33824 17629
$$ packed form
7631F6564p518M3366k5742L4481j13237j0829K0103J5468Q5183J7388r8460p635
7619A9132R1342m2474N719M1718m5493q0701L0014J1903K2734p0268K2300R9257
7607A05183Q254m0023m3720M6780j5419k0535n848M8332l5873J0816N5838J1133
7595A24918Q077m4017n6192K9535m2423j789Q2145n5999q941N3979j5588n4666
7583A9039k2949l2037M427K2280k4252j6450M9810j6q590N0900j010j9391J18095
7570A39856k0315N848J505k7564J3928j6145j10065K8839k8588O7119n3438M8545
7558D9525N5347n8737R1752n6168n1727K872K6342j4513K3887p739M230l2343
7546C2728j2155P0750J5346o8629L3250m1988J0291K6595J2026j1105l3285j6195
$$ plain form
7534 17629 -3843 -5663 106888 144670 122075 123127 123919 73105 64833 33915 75539 7350 76795
7521 76795 76040 14213 115680 177185 95951 84363 108679 111798 141586 101541 100963 139784 159513
7508 159513 118103 131393 67706 25503 147210 127387 123170 98908 79117 121483 159445 154785
7496 154785 120104 74848 83547 67996 109498 146698 149740 162998 93740 71129 72283 95482
7484 95482 82433 99496 188637 138293 148365 128306 54008 125275 107955 102525 154709 90329
7472 90329 126804 212064 154301 135518 95743 122425 123918 66113 48578 61310 164897 167164
7460 167164 144914 156769 152056 129648 62229 39897 31887 131640 82586 82865 128501 158580
7448 158580 145221 127526 124278 209992 147720 190484 151506 174781 191333 135780 177081 184799
$$ packed form
7534A7629k1472j820J12551L7782k2595J052P92n0814q272l0918M1624o8189O9445
7521G6795p55o1827J01467O1505q1234j1588K4316L119K9788m0045n78L8821J9729
7508A59513m1410J3290o3687m2203J21707j9823m217k4262j9791M2366L7962m660
7496A54785l4681m5256Q699j5551M1502L7200L042J3258o9258k2611J154K3199
7484I5482j3049J7063Q9141n0344J0072k0059p4298P1267j7320n430N2184o4380
7472I0329L6475Q5260n7763j8783l9775K6682J493n7805j7535J2732J03587K267
7460A67164k2250J1855m713k2408o7419k2332q010R9753m9054K79M5636L0079
7448A58580j3359j7695l248Q5714o2272M2764l8978K3275J6552n5553M1301P718
$$ plain form
7436 184799 173470 204684 259996 285144 192062 235805 280356 298948 254985 195167 285554 351225
7424 351225 334957 253601 315601 368120 329921 366843 373632 382826 291317 307251 385427 453358
7412 453358 400812 368714 453009 490171 516071 505108 452567 496722 531228 580433 725021
7401 725021 809712 856509 937199 1009039 1077759 1088199 1144310 1019329 875748 813083 863133
7390 863133 817261 712208 753583 725345 638966 694924 681421 668489 704691 739925 650916
7379 650916 664688 737009 719689 733629 736431 812611 776594 826417 793706 761761 787509 871641
7367 871641 887193 926582 941529 959384 1097361 1189935 1144520 1125908 1286483 1310124 1363563
7356 1363563 1438619 1478408 1559813 1584049 1692575 1668913 1704125 1745989 1735779 1837897 1823744
$$ packed form
7436A84799j1329L1214N5312K5148r3082M3743M4551J8592m3963n9818R0387O5671
7424C51225j6268q1356O2000N2519l8199L6922O789R194r1509J5934P8176O7931
7412D53358n2546l2098Q4295L7162K5900j0963n2541M4155L4506M9205J44588
7401G25021Q4691M6797Q0690P1840O8720J0440N6111j24981j43581o2665N0050
7390H63133m5872j05053M1375k8238q6379N5958j3503j2932L6202L5234q9009
7379F50916J3772P2321j7320J3940K802P6180l6017M9823l2711l1945K5748Q4132
7367H71641J5552L9389J4947J7855J37977R2574m5415j8612J60575K3641N3439
7356A363563P5056L9789Q1405K4236J08526k3662L5212M1864j0210J02118j4153
$$ plain form
7345 1823744 1859771 1959790 1979520 2096048 2056790 2074977 2178985 2193807 2234142 2250450 2304109
7334 2304109 2382333 2407940 2404885 2318321 2387308 2267168 2259599 2292113 2145171 2097522 2039150
7323 2039150 2024363 1958047 1964001 2016386 1951529 1910703 1931322 1941626 1925867 1919988 1794336 1791697
7311 1791697 1724786 1686806 1581341 1504222 1450457 1457847 1398774 1354203 1248235 1191985 1103941
7300 1103941 1087539 1075622 1094484 1014392 980021 859083 900957 941095 994061 867102 746942
7289 746942 761645 752682 819582 822939 675238 600925 606073 684913 669190 605280 738562 766263
7277 766263 640160 555171 573050 559126 601965 534108 617270 682228 569447 526051 487512
7266 487512 533711 617799 597764 601907 615823 569487 579809 632728 599038 524907 609378 667981
$$ packed form
7345A823744L6027J00019J9730J16528l9258J8187J04008J4822M0335J6308N3659
7334B304109P8224K5607l055q6564O8987j20140p569L2514j46942m7649n8372
7323B039150j4787o6316N954N2385o4857m0826K0619J0304j5759n879j25652k639
7311A791697o6911l7980j05465p7119n3765P390n9073m4571j05968n6250q8044
7300A103941j6402j1917J8862q0092l4371j20938M1874M0138N2966j26959j20160
7289G46942J4703q963O6900L357j47701p4313N148P8840j5723o3910J33282K7701
7277G66263j26103q4989J7879j3924M2839o7857Q3162O4958j12781m3396l8539
7266D87512M6199Q4088k0035M143J3916m6336J0322N2919l3690p4131Q4471N8603
$$ plain form
7254 667981 624278 592550 644391 639945 634995 616592 617715 647720 627328 622093 624667 675895 757438
7241 757438 785369 766319 773670 754500 795578 789860 764129 760504 775980 704181 692016 750299
7229 750299 666981 592555 601181 655803 612717 570847 556804 557767 547693 523520 614639 584077
7217 584077 704641 672763 684888 664573 694383 605993 566108 539138 569096 618985 564123
7206 564123 498270 549904 590277 565680 483119 535327 543973 529639 483772 496111 447346 529478
7194 529478 509193 500529 487721 530459 433618 408337 418318 458529 415182 453296 463800 514251
7182 514251 466220 422478 419361 443263 414323 414102 474301 445604 434595 555573 511176 477303
7170 477303 502056 566941 587834 519180 518480 475807 540613 581130 592758 585327 596789 604177
$$ packed form
7254F67981m3703l1728N1841m446m950j8403J123L0005k0392n235K574N1228Q1543
7241G57438K7931j9050P351j9170M1078n718k5731l625J5476p1799j2165N8283
7229G50299q3318p4426Q626N4622m3086m1870j4043R63j0074k4173R1119l0562
7217E84077J20564l1878J2125k0315K9810q8390l9885k6970K9958M9889n4862
7206E64123o5853N1634M0373k4597q2561N2208Q646j4334m5867J2339m8765Q2132
7194E29478k0285q664j2808M2738r6841k5281R981M0211m3347L8114J0504N0451
7182E14251m8031m3742l117K3902k8940k21O0199k8697j1009J20978m4397l3873
7170D77303K4753O4885K0893o8654p00m2673O4806M0517J1628p431J1462P388
$$ plain form
7158 604177 566838 692666 666263 596090 608473 650122 640535 624929 588215 561505 665531
7147 665531 650565 650575 661585 728145 717140 773728 803590 747433 786867 738565 705169 735875
7135 735875 778005 801743 822451 879212 960926 969756 1076015 1003951 1047699 1123299 1117041 1073717
7123 1073717 1123149 1193052 1207836 1168832 1121664 1102908 1205830 1214706 1261167 1265202 1324883 1376540
7111 1376540 1376160 1485735 1492725 1521549 1519722 1654298 1621585 1684460 1749481 1758016 1783370 1863853
7099 1863853 1861809 1920326 1975650 2133145 2207545 2311229 2372283 2465828 2510928 2731574 2723994
7088 2723994 2777310 2877425 3047611 3123942 3362804 3534041 3725515 3886294 4143464 4280162
7078 4280162 4632555 4874353 5139846 5310375 5615518 5735895 6005151 6323439 6649286 6910451
$$ packed form
7158F04177l7339J25828k6403p0173J2383M1649r587j5606l6714k6710J04026
7147F65531j4966J0J1010O6560j1005N6588K9862n6157L9434m8302l3396L0706
7135G35875M2130K3738K0708N6761Q1714Q830J06259p2064M3748P5600o258m3324
7123A073717M9432O9903J4784l9004m7168j8756J02922Q876M6461M035N9681N1657
7111A376540l80J09575O990K8824j827J34576l2713O2875O5021Q535K5354Q0483
7099A863853k044N8517N5324J57495P4400J03684O1054R3545M5100K20646p580
7088B723994N3316J00115J70186P6331K38862J71237J91474J60779K57170J36698
7078D280162L52393K41798K65493J70529L05143J20377K69256L18288L25847K61165
$$ plain form
7068 6910451 7338809 7760363 8277377 8712245 9326794 9876751 10663974 11313292 12108003 12858036
7058 12858036 13876267 14933658 16332456 17671602 19557035 21523347 24139570 26752411
7050 26752411 29934055 33646075 38810024 45002081 53376693 63763796 78250731 90087114
7042 90087114 100208976 108152757 114728202 109337643 88468803 74648415 64672241 56518421
7034 56518421 48960557 43587453 39246664 35994667 33194331 31016308 29023573 27675913
7026 27675913 26402423 25415841 24082306 22515354 20725425 19453917 18150847 17118955
7018 17118955 16129979 15432249 14736738 13857870 13066794 12488951 11941097 11526020 11077223
7009 11077223 10590415 10154024 9863728 9556016 9229010 8824055 8586005 8315248 8067849
$$ packed form
7068F910451M28358M21554N17014M34868O14549N49957P87223O49318P94711P50033
7058A2858036J018231J057391J398798J339146J885433J966312K616223K612841
7050B6752411L181644L712020N163949O192057Q374612J0387103J4486935J1836383
7042I0087114J0121862P943781O575445n390559k0868840j3820388r976174q153820
7034E6518421p557864n373104m340789l251997k800336k178023j992735j347660
7026B7675913j273490r86582j333535j566952j789929j271508j303070j031892
7018A7118955r88976o97730o95511q78868p91076n77843n47854m15077m48797
7009A1077223m86808m36391k90296l07712l27006m04955k38050k70757k47399
$$ plain form
7000 8067849 7880711 7655976 7386887 7090942 6939504 6821744 6654612 6461082 6290499 6104010
6990 6104010 5889006 5730469 5610061 5563322 5475526 5382474 5307670 5139831 5022401 4891367
6980 4891367 4848284 4781828 4765415 4660434 4689836 4600205 4518217 4451195 4383385 4332425 4286359
6969 4286359 4323011 4222177 4020624 4005546 4050469 4002179 3824586 3722405 3561546 3626252
6959 3626252 3506782 3430354 3413181 3377317 3351754 3326648 3246576 3234781 3101466 3097654 3107516
6948 3107516 3090575 3021362 2924320 2867633 2771864 2697310 2652461 2453160 2423690 2373951 2294840
6937 2294840 2268649 2165071 2197293 2189297 2114567 2123158 2020899 1939114 1937225 1907630 1837804 1898906
6925 1898906 1907196 1898965 1842078 1888520 1932967 1886455 1883801 1864776 1874696 1859014 1840616 1783965
$$ packed form
7000H067849j87138k24735k69089k95945j51438j17760j67132j93530j70583j86489
6990F104010k15004j58537j20408m6739q7796r3052p4804j67839j17430j31034
6980D891367m3083o6456j6413j04981K9402q9631q1988o7022o7810n0960m6066
6969D286359L6652j00834k01553j5078M4923m8290j77593j02181j60859O4706
6959C626252j19470p6428j7173l5864k5563k5106q0072j1795j33315l812R862
6948C107516j6941o9213r7042n6687r5769p4554m4849j99301k9470m9739p9111
6937B294840k6191j03578L2222p996p4730Q591j02259q1785j889k9595o9826O1102
6925A898906Q290q231n6887M6442M4447m6512k654j9025R920j5682j8398n6651
$$ plain form
6913 1783965 1797332 1758650 1682101 1726736 1651843 1603197 1616074 1682212 1696995 1634085 1594516
6902 1594516 1647607 1648677 1677889 1592938 1569011 1544589 1622732 1560934 1423782 1417002 1404824 1343794
6890 1343794 1423425 1481120 1425459 1341459 1292686 1291825 1326044 1356104 1347421 1326022 1326342 1254159
6878 1254159 1313958 1298464 1288231 1292550 1258483 1240246 1253004 1329622 1260482 1297539 1297203 1344262
6866 1344262 1386578 1375095 1342884 1295497 1279670 1238757 1362491 1406842 1367963 1395851 1412580
6855 1412580 1333933 1391223 1390174 1436949 1455109 1449730 1441997 1403611 1459189 1402004 1351512 1382020
6843 1382020 1315906 1279429 1325404 1383011 1333746 1406059 1390368 1350699 1371379 1377374 1427004 1430509
6831 1430509 1482395 1450567 1416507 1421178 1403920 1485710 1495328 1472283 1473176 1466551 1547821 1540286 1550117
$$ packed form
6913A783965J3367l8682p6549M4635p4893m8646J2877O6138J4783o2910l9569
6902A594516N3091J070K9212q4951k3927k4422P8143o1798j37152o780j2178o1030
6890A343794P9631N7695n5661q4000m8773q61L4219L0060q683k1399L20p2183
6878A254159N9799j5494j0233M319l4067j8237J2758P6618o9140L7057l36M7059
6866A344262M2316j1483l2211m7387j5827m0913J23734M4351l8879K7888J6729
6855A412580p8647N7290j049M6775J8160n379p733l8386N5578n7185n0492L0508
6843A382020o6114l6477M5975N7607m9265P2313j5691l9669K0680N995M9630L505
6831A430509N1886l1828l4060M671j7258Q1790R618k3045Q93o625Q1270p535R831
$$ plain form
6818 1550117 1519550 1537112 1646694 1652021 1602670 1599074 1656057 1609704 1642414 1651792 1742406 1779318
6806 1779318 1792751 1846745 1844172 1858769 1809028 1864554 1881956 2036807 1985566 2054790 2050484 2170436
6794 2170436 2354512 2365837 2350307 2453981 2516090 2552578 2534222 2734240 2787889 2816521 2876596
6783 2876596 2969900 2972144 2935820 3053909 3054881 3161791 3254339 3252834 3298594 3396078 3436586 3518661
6771 3518661 3677158 3778356 3874184 3943733 4081062 4173212 4223013 4291444 4367665 4433899 4549447
6760 4549447 4691149 4851065 4832324 4913135 4954551 5011097 5032614 5172396 5300882 5283346 5430275
6749 5430275 5628040 5893860 6015453 6141373 6363165 6588405 6778626 7028385 7272463 7617084
6739 7617084 7863150 8135392 8520112 8947163 9320969 9801506 10461920 11035063 11771261 12599688
$$ packed form
6818A550117l0567J7562J09582N327m9351l596N6983m6353L2710R378R0614L6912
6806A779318J3433N3994k573J4597m9741N5526J7402J54851n1241O9224m306J19952
6794B170436J84076J1325j5530J03674O2109L6488j8356K00018N3649K8632O0075
6783B876596R3304K244l6324J18089R72J06910R2548j505M5760R7484M0508Q2075
6771C518661J58497J01198R5828O9549J37329R2150M9801O8431P6221O6234J15548
6760D549447J41702J59916j8741Q0811M1416N6546K1517J39782J28486j7536J46929
6749E430275J97765K65820J21593J25920K21792K25240J90221K49759K44078L44621
6739G617084K46066K72242L84720M27051L73806M80537O60414N73143P36198Q28427
$$ plain form
6729 12599688 13550614 14716861 16092819 17540894 19154569 20773698 22248708 23640976
6721 23640976 24419435 24786982 24771812 24873961 25318156 25817521 26548774 27620006 28798554
6712 28798554 29915223 31044791 32115675 33227018 34233984 35269307 36309529 37540742
6704 37540742 39051667 40771687 42824316 45115450 47890996 51231233 55206346 59906039
6696 59906039 65205770 70584752 75569436 79863305 82884710 83797058 82777645 81213522
6688 81213522 80284021 80189941 80902297 82345357 84543768 87133390 89986049 92935936 95714026
6679 95714026 97767749 98734405 98473827 97723764 96998087 95976111 94606059 92706294 90760123
6670 90760123 88998003 87637968 86498606 85446591 84396755 83853024 84210300 85501298
$$ packed form
6729A2599688R50926J166247J375958J448075J613675J619129J475010J392268
6721B3640976P78459L67547j5170J02149M44195M99365P31253J071232J178548
6712B8798554J116669J129568J070884J111343J006966J035323J040222J231213
6704C7540742J510925J720020K052629K291134K775546L340237L975113M699693
6696E9906039N299731N378982M984684M293869L021405R12348j019413j564123
6688H1213522r29501r4080P12356J443060K198411K589622K852659K949887K778090
6679I5714026K053723R66656k60578p50063p25677j021976j370052j899765j946171
6670I0760123j762120j360035j139362j052015j049836n43731L57276J290998
$$ plain form
6662 85501298 87563713 90363381 93744946 97283973 100877295 104046138 106643694 108902867
6654 108902867 110556798 111742292 112402933 112578677 112043022 110482774 107856512 104471600
6646 104471600 100741753 97187463 94042354 91247208 88891232 86969777 85279402 83531597
6638 83531597 81675514 79450965 77134545 74921123 72841035 70722558 68381013 65677441
6630 65677441 62736214 59828762 57039759 54467126 51876136 49413440 47019695 44761432
6622 44761432 42854042 41120804 39465804 37974275 36614717 35318236 34130656 32845539
6614 32845539 31587385 30355086 29205406 28110365 27046006 25951246 24970672 23898981
6606 23898981 22929194 21989736 21047068 20273109 19554450 18818784 18165729 17432983 16768346
$$ packed form
6662H5501298K062415K799668L381565L539027L593322L168843K597556K259173
6654A08902867J653931J185494O60641J75744n35655j560248k626262l384912
6646A04471600l729847l554290l145109k795146k355976j921455j690375j747805
6638H3531597j856083k224549k316420k213422k080088k118477k341545k703572
6630F5677441k941227k907452k789003k572633k590990k462696k393745k258263
6622D4761432j907390j733238j655000j491529j359558j296481j187580j285117
6614C2845539j258154j232299j149680j095041j064359j094760r80574j071691
6606B3898981r69787r39458r42668p73959p18659p35666o53055p32746o64637
$$ plain form
6597 16768346 16189631 15681973 15170395 14734461 14227605 13811541 13355738 12970519 12636715
6588 12636715 12223550 11871091 11549467 11191367 10893111 10547135 10230617 9983463 9750792
6579 9750792 9412128 9185237 8883933 8659313 8393549 8178468 8025544 7809535 7600620 7356720
6569 7356720 7175258 7001802 6883305 6731861 6589432 6413110 6307776 6107889 5952876 5835087
6559 5835087 5756582 5639550 5509197 5366967 5260572 5123524 5010741 4895129 4819952 4697890
6549 4697890 4621392 4520692 4436577 4265458 4246786 4146233 4044142 3959832 3906524 3811367 3830921
6538 3830921 3726845 3527582 3520305 3438071 3335835 3333816 3359431 3245219 3139296 3080157 3018283
6527 3018283 3028024 2991563 2883450 2895165 2850338 2816364 2805388 2696135 2691515 2679331 2626233
$$ packed form
6597A6768346n78715n07658n11578m35934n06856m16064m55803l85219l33804
6588A2636715m13165l52459l21624l58100k98256l45976l16518k47154k32671
6579I750792l38664k26891l01304k24620k65764k15081j52924k16009k08915k43900
6569G356720j81462j73456j18497j51444j42429j76322j05334j99887j55013j17789
6559E835087p8505j17032j30353j42230j06395j37048j12783j15612p5177j22062
6549D697890p6498j00700q4115j71119j8672j00553j02091q4310n3308r5157J9554
6538C830921j04076j99263p277q2234j02236k019K5615j14212j05923n9139o1874
6527C018283R741l6461j08113J1715m4827l3974j0976j09253m620j2184n3098
$$ plain form
6516 2626233 2610593 2547429 2524534 2448558 2419461 2414389 2383257 2306604 2223266 2226377 2197342 2163428
6504 2163428 2114168 2142106 2154702 2060174 2112522 2126835 2112988 1983855 1960217 1932145 1938628
6493 1938628 1933658 1962940 1960291 1909797 1893593 1787532 1888803 1931004 1942033 1908866 1925532
6482 1925532 1915770 1843181 1893414 1907637 1889018 1866790 1880762 1832347 1878823 1923567 1922451 1930946
6470 1930946 1918899 1964911 1965740 1951839 2063593 2097276 2139186 2205182 2216432 2202894 2224203 2339833
6458 2339833 2323124 2462668 2459960 2597744 2619916 2630203 2828494 2959825 3049498 3185035 3305458
6447 3305458 3372246 3526180 3718767 3836807 4091654 4262594 4403144 4550039 4752176 5034159
6437 5034159 5385440 5578725 5896791 6158880 6532350 6798864 7062576 7343318 7598685 7829237
$$ packed form
6516B626233j5640o3164k2895p5976k9097n072l1132p6653q3338L111k9035l3914
6504B163428m9260K7938J2596r4528N2348J4313j3847j29133k3638k8072O483
6493A938628m970K9282k649n0494j6204j06061J01271M2201J1029l3167J6666
6482A925532r762p2589N0233J4223j8619k2228J3972m8415M6476M4744j116Q495
6470A930946j2047M6012Q29j3901J11754L3683M1910O5996J1250j3538K1309J15630
6458B339833j6709J39544k708J37784K2172J0287J98291J31331Q9673J35537J20423
6447C305458O6788J53934J92587J18040K54847J70940J40550J46895K02137K81983
6437E034159L51281J93285L18066K62089L73470K66514K63712K80742K55367K30552
$$ plain form
6427 7829237 7854728 7976911 8171433 8348539 8415064 8580771 8723196 8909124 9214979 9552675
6417 9552675 9803104 10118407 10433174 10821320 11127298 11401985 11634591 11849721 12019547 12103516
6407 12103516 11982107 11878703 11674783 11442263 11149958 10824366 10604945 10297768 10111594
6398 10111594 10019362 9819480 9703315 9616295 9518923 9448992 9398472 9300523 9178559 9141885 8856816
6387 8856816 8563166 8391703 8103949 7816197 7445999 7171754 6855428 6473518 6230347 5979702
6377 5979702 5734013 5524344 5321165 5083570 4892428 4679006 4585585 4382429 4236334 4027767
6367 4027767 3954353 3931568 3717740 3667375 3508125 3359838 3245048 3152736 2945770 2928594
6357 2928594 2862781 2814023 2719668 2617872 2651631 2624703 2537856 2479686 2458474 2413278 2329176
$$ packed form
6427G829237K5491J22183J94522J77106O6525J65707J42425J85928L05855L37696
6417I552675K50429L15303L14767L88146L05978K74687K32606K15130J69826Q3969
6407A2103516j21409j03404k03920k32520k92305l25592k19421l07177j86174
6398A0111594r2232j99882j16165q7020r7372o9931n0520r7949j21964l6674k85069
6387H856816k93650j71463k87754k87752l70198k74245l16326l81910k43171k50645
6377E979702k45689k09669k03179k37595j91142k13422r3421k03156j46095k08567
6367D027767p3414k2785k13828n0365j59250j48287j14790r2312k06966j7176
6357B928594o5813m8758r4355j01796L3759k6928q6847n8170k1212m5196q4102
$$ plain form
6346 2329176 2283749 2341532 2349747 2248153 2198942 2144786 2065904 2029944 1972870 1907911 1912358 1844564
6334 1844564 1786711 1783178 1761255 1711633 1675915 1616147 1669056 1634447 1585707 1520269 1570374 1573047
6322 1573047 1535224 1531702 1539775 1484223 1438918 1349758 1319633 1320043 1219867 1221157 1250910 1236013
6310 1236013 1206276 1146761 1124215 1145447 1041232 1067595 1079393 1043820 1040955 1037190 1040449 1087541
6298 1087541 1064204 1021879 961211 980306 984227 961971 1029659 904781 857623 941243 1005849
6287 1005849 979813 966900 942877 926818 916463 932987 932496 966076 1015635 944948 942100 963997
6275 963997 1007478 1020592 990515 1019679 964066 984590 1013216 1028151 1061661 1098782 1071017 1077348
6263 1077348 1154944 1138040 1187876 1180211 1222473 1242355 1285178 1315733 1312341 1385103 1458354 1442827
$$ packed form
6346B329176m5427N7783Q215j01594m9211n4156p8882l5960n7074o4959M447o7794
6334A844564n7853l533k1923m9622l5718n9768N2909l4609m8740o5438N0105K673
6322A573047l7823l522Q073n5552m5305q9160l0125M10j00176J290K9753j4897
6310A236013k9737n9515k2546K1232j04215K6363J1798l5573k865l765L259M7092
6298A087541k3337m2325o0668J9095L921k2256O7688j24878m7158Q3620O4606
6287A005849k6036j2913k4023j6059j0355J6524m91L3580M9559p0687k848K1897
6275I63997M3481J3114l0077K9164n5613K0524K8626J4935L3510L7121k7765O331
6263A077348P7596j6904M9836p665M2262J9882M2823L0555l392P2762P3251j5527
$$ plain form
6251 1442827 1478671 1474005 1509073 1531847 1532589 1532897 1554793 1571084 1669041 1780414 1754295 1724591
6239 1724591 1721750 1784486 1910384 2009433 2082473 2059759 2104408 2189333 2269621 2274077 2385812
6228 2385812 2537367 2635707 2640491 2719496 2783254 2928153 3025346 3241667 3309004 3362399 3369740
6217 3369740 3481209 3683794 3832253 3983650 4120405 4225742 4335081 4515597 4718909 4901326
6207 4901326 5083936 5315629 5523424 5709014 6022399 6199812 6525147 6797098 7058757 7417785
6197 7417785 7785506 8238204 8640293 9065736 9469536 9905478 10402164 10987853 11517704 12084496
6187 12084496 12740121 13446894 14077825 14784101 15562660 16395722 17221431 17980813 18754835
6178 18754835 19559556 20252602 20856247 21396927 21984727 22446641 22727970 22832695 22808047 22597379
$$ packed form
6251A442827L5844m666L5068K2774P42L08K1896J6291R7957J11373k6119k9704
6239A724591k841O2736J25898R9049P3040k2714M4649Q4925Q0288M456J11735
6228B385812J51555R8340M784P9005O3758J44899R7193K16321O7337N3395P341
6217C369740J11469K02585J48459J51397J36755J05337J09339J80516K03312J82417
6207D901326J82610K31693K07795J85590L13385J77413L25335K71951K61659L59028
6197G417785L67721M52698M02089M25443M03800M35942M96686N85689N29851N66792
6187A2084496O55625P06773O30931P06276P78559Q33062Q25709P59382P74022
6178A8754835Q04721O93046O03645N40680N87800M61914K81329J04725k4648k10668
$$ plain form
6168 22597379 22285764 21795526 21196086 20588030 20007304 19431602 18952468 18450366 18017418
6159 18017418 17566137 17203700 16888176 16606570 16205797 15754043 15290138 14568806 13916218
6150 13916218 13218463 12499683 11975527 11468942 11106185 10708021 10396832 10080813 9830802
6141 9830802 9648960 9356788 9049322 8760919 8450021 8125980 7721125 7322170 7036551 6769632
6131 6769632 6484166 6151601 5878632 5662784 5497524 5263275 5060641 4934472 4790365 4644118
6121 4644118 4453649 4327142 4195015 4044723 3931258 3797108 3625080 3555625 3576904 3351028
6111 3351028 3198347 3113251 3089332 2989062 2867987 2856655 2809263 2702739 2587065 2563649
6101 2563649 2454277 2390233 2337842 2281448 2328479 2230007 2159280 2129846 2077493 2044696 2017618
$$ packed form
6168B2597379l11615m90238n99440o08056n80726n75702m79134n02102m32948
6159A8017418m51281l62437l15524k81606m00773m51754m63905p21332o52588
6150A3916218o97755p18780n24156n06585l62757l98164l11189l16019k50011
6141I830802j81842k92172l07466k88403l10898l24041m04855l98955k85619k66919
6131F769632k85466l32565k72969k15848j65260k34249k02634j26169j44107j46247
6121D644118j90469j26507j32127j50292j13465j34150j72028o9455K1279k25876
6111C351028j52681q5096k3919j00270j21075j1332m7392j06524j15674k3416
6101B563649j09372o4044n2391n6394M7031r8472p0727k9434n2353l2797k7078
$$ plain form
6090 2017618 1966202 1928647 1914805 1809480 1812146 1793783 1815728 1820657 1700889 1672769 1713480
6079 1713480 1680025 1628283 1591025 1643991 1615831 1647575 1680220 1649502 1653574 1712164 1696439 1697602
6067 1697602 1709797 1780474 1725291 1758655 1741840 1761943 1670413 1724709 1739490 1698602 1707426 1643525
6055 1643525 1656541 1586259 1558570 1561961 1559020 1522492 1483157 1438757 1415838 1441596 1440094 1379368
6043 1379368 1455991 1332191 1327896 1287142 1301980 1278133 1264970 1308067 1296331 1281902 1244303
6032 1244303 1206605 1166518 1089427 1100925 1140026 1122685 1120238 1157926 1117223 1139620 1084595 1108198
6020 1108198 1063139 1025298 992426 974903 1074034 1061049 988819 1011175 960756 1018120 1070314
6009 1070314 927380 1013525 1011600 991311 1011513 957408 976609 995539 1000574 1055179 1047507 1081518
$$ packed form
6090B017618n1416l7555j3842j05325K666j8363K1945M929j19768k8120M0711
6079A713480l3455n1742l7258N2966k8160L1744L2645l0718M072N8590j5725J163
6067A697602J2195P0677n5183L3364j6815K0103r1530N4296J4781m0888Q824o3901
6055A643525J3016p0282k7689L391k941l6528l9335m4400k2919K5758j502o0726
6043A379368P6623j23800m295m0754J4838k3847j3163M3097j1736j4429l7599
6032A244303l7698m0087p7091J1498L9101j7341k447L7688m0703K2397n5025K3603
6020A108198m5059l7841l2872j7523R9131j2985p2230K2356n0419N7364N2194
6009A070314j42934Q6145j925k0289K0202n4105J9201J8930N035N4605p672L4011
$$ plain form
5997 1081518 1026906 1038940 1050161 1094996 1134275 1130770 1147621 1083260 1074230 1125624 1154753 1139842
5985 1139842 1166769 1233976 1262327 1254660 1258515 1275437 1340380 1430133 1515405 1546183 1615752 1656453
5973 1656453 1738614 1788508 1905005 1949008 2104235 2176193 2228870 2309031 2343095 2497478 2696055
5962 2696055 2900290 3066814 3174480 3408238 3652731 3853234 4052751 4280216 4611697 4921815
5952 4921815 5246293 5599016 5916488 6119518 6357615 6539505 6689614 6865043 7017825 7119703
5942 7119703 7153755 7294970 7486699 7682251 7891820 8189126 8492034 8870191 9232579 9582644
5932 9582644 10014355 10279178 10456876 10647098 10746456 10629663 10481318 10172424 9815278 9599899
5922 9599899 9348361 9093946 8856123 8668291 8473646 8237943 8151760 8134588 8129368 8051147
$$ packed form
5997A081518n4612J2034J1221M4835L9279l505J6851o4361r030N1394K9129j4911
5985A139842K6927O7207K8351p667L855J6922O4943Q9753Q5272L0778O9569M0701
5973A656453Q2161M9894J16497M4003J55227P1958N2677Q0161L4064J54383J98577
5962B696055K04235J66524J07666K33758K44493K00503J99517K27465L31481L10118
5952D921815L24478L52723L17472K03030K38097J81890J50109J75429J52782J01878
5942G119703L4052J41215J91729J95552K09569K97306L02908L78157L62388L50065
5932I582644M31711K64823J77698J90222R9358j16793j48345l08894l57146k15379
5922I599899k51538k54415k37823j87832j94645k35703q6183j7172n220p8221
$$ plain form
5912 8051147 7965192 7806448 7651791 7507342 7338164 7026693 6695259 6433333 6019122 5698118
5902 5698118 5436284 5216002 4972847 4676614 4439157 4235988 4017815 3831956 3675141 3495233
5892 3495233 3342505 3138470 2971560 2858138 2724508 2701668 2577271 2463116 2384567 2246454
5882 2246454 2150763 2079845 2003637 1928757 1943765 1873119 1819199 1750396 1709386 1611992 1603588 1547167
5870 1547167 1501464 1465741 1500468 1440920 1411517 1379831 1309676 1264006 1287329 1270881 1231499
5859 1231499 1080348 1011084 977795 870352 881215 871563 777917 831671 880705 778439 764872
5848 764872 811795 688970 710761 692108 642945 598139 605932 646790 580836 593770 508569 527254
5836 527254 562025 498512 441259 411914 400723 510625 387091 406989 463963 354760 355493
$$ packed form
5912H051147q5955j58744j54657j44449j69178l11471l31434k61926m14211l21004
5902E698118k61834k20282k43155k96233k37457k03169k18173j85859j56815j79908
5892C495233j52728k04035j66910j13422j33630k2840j24397j14155p8549j38113
5882B246454r5691p0918p6208p4880J5008p0646n3920o8803m1010r7394q404n6421
5870A547167m5703l5723L4727n9548k9403l1686p0155m5670K3323j6448l9382
5859A231499j51151o9264l3289j07443J0863r652r3646N3754M9034j02266j3567
5848G64872M6923j22825K1791j8653m9163m4806P793M0858o5954J2934q5201J8685
5836E27254L4771o3513n7253k9345j1191J09902j23534J9898N6974j09203P33
$$ plain form
5825 355493 394319 298644 318046 267671 307824 357893 333051 243164 266942 252282 303744 267106
5813 267106 224896 269869 261576 258339 275858 240387 197679 200893 180186 297232 348025 332763
5801 332763 241486 163803 195269 239214 196552 163778 141681 211179 201212 111110 155813 167496
5789 167496 189293 224710 261332 183627 119427 179837 188277 155811 115063 89624 91166 98878
5777 98878 56839 32587 98281 134023 94991 75506 135998 141939 136356 116208 39990 20479
5765 20479 13295 26807 76338 74794 51594 82598 107614 127000 62736 155684 145536 36477
5753 36477 11223 -10327 46438 12343 -6665 30452 27989 71421 -7281 -39946 -34810 32053
5741 32053 4279 -7143 20126 -30518 17423 26711 63369 49866 3072 40321 100577 98617
$$ packed form
5825C55493L8826r5675J9402n0375M0153N0069k4842q9887K3778j4660N1462l6638
5813B67106m2210M4973q293l237J7519l5471m2708L214k0707J17046N0793j5262
5801C32763r1277p7683L1466M3945m2662l2774k2097O9498r967r0102M4703J1683
5789A67496K1797L5417L6622p7705o4200O0410Q440l2466m0748k5439J542P712
5777I8878m2039k4252O5694L5742l9032j9485O0492N941n583k0148p6218j9511
5765B0479p184J3512M9531j544k3200L1004K5016J9386o4264R2948j0148j09059
5753C6477k5254k1550N6765l4095j9008L7117k463M3432p8702l2665N136O6863
5741C2053k7774j1422K7269n0644M7941R288L6658j3503m6794L7249O0256j960
$$ plain form
5729 98617 27727 -1499 25153 66977 27016 14798 -17023 -22680 -34458 -56469 21197 -4071
5717 -4071 -99597 -103003 -44891 9045 -76310 -107213 -98870 -91794 -105754 -123640 -105992 -27035 -2461
5704 -2461 -70798 -13722 -96001 -43272 24266 -60398 -104011 -98596 -1230 -62056 2694 55413
5692 55413 -74768 -64570 -11446 6309 -5673 -89648 -113897 -10522 -61528 -11033 -30669
5681 -30669 -61091 -71305 -33395 56768 71975 4212 -21654 -27237 -11980 12315 -55521 -102471
5669 -102471 -73313 -113096 -66079 10858 -84697 -65704 -45107 -49556 -44894 -104829 -108283 -176891
5657 -176891 -84369 -53127 -8631 53303 -104248 -104386 -62827 15959 -1489 -86822 -92776 -105206
5645 -105206 -123832 -70200 -58352 -24602 -23009 25779 11882 -47855 4978 -18037 -8491 50143
$$ packed form
5729I8617p0890k9226K6652M1824l9961j2218l1821n657j1778k2011P7666k5268
5717d071r5526l406N8112N3936q5355l0903Q343P076j3960j7886J7648P8957K4574
5704b461o8337N7076q2279N2729O7538q4664m3613N415R7366o0826O4750N2719
5692E5413j30181J0198N3124J7755j1982q3975k4249J03375n1006N0495j9636
5681c0669l0422j0214L7910R0163J5207o7763k5866n583J5257K4295o7836m6950
5669a02471K9158l9783M7017P6937r5555J8993K0597m449M662n9935l454o8608
5657a76891R2522L1242M4496O1934j57551j38M1559P8786j7448q5333n954j2430
5645a05206j8626N3632J1848L3750J593M8788j3897n9737N2833k3015R546N8634
$$ plain form
5633 50143 -2985 -92798 15812 52917 29500 49389 2728 -39321 -28397 -29935 -21550 14332
5621 14332 -36160 -6767 71110 44892 87522 114679 135632 153341 247023 190984 189202 197817
5609 197817 199127 185639 295450 281745 121273 175205 78465 130918 82399 69695 36158
5598 36158 44817 80463 11096 28925 49376 102923 20977 7690 35852 -10512 27959 -12291
5586 -12291 5703 48056 -15397 26040 10375 -28603 5441 2994 42730 24528 165989 203429
5574 203429 126133 79704 127818 71877 50340 51715 36808 9248 91488 26905 13822 6605
5562 6605 36439 14131 -25485 4094 -23717 17762 -20121 4413 -83532 -18177 -44869 -35181
5550 -35181 -65449 -88579 -82715 -51941 -43881 -28728 -27262 -17230 -86149 -70279 -127229 -109752
$$ packed form
5633E0143n3128q9813J08610L7105k3417J9889m6661m2049J0924j538Q385L5882
5621A4332n0492K9393P7877k6218M2630K7157K0953J7709R3682n6039j782Q615
5609A97817J310j3488J09811j3705j60472N3932r6740N2453m8519j2704l3537
5598C6158Q659L5646o9367J7829K0451N3547q1946j3287K8162m6364L8471m0250
5586a2291J7994M2353o3453M1437j5665l8978L4044k447L9736j8202J41461L7440
5574B03429p7296m6429M8114n5941k1537J375j4907k7560Q2240o4583j3083p217
5562F605K9834k2308l9616K9579k7811M1479l7883K4534q7945O5355k6692R688
5550c5181l0268k3130N864L0774Q060J5153J466J0032o8919J5870n6950J7477
$$ plain form
5538 -109752 -14935 -67423 -124823 -84293 -18288 -151850 -96957 -83668 -68882 -128473 -78801
5527 -78801 6670 -112095 -93846 -37238 -105566 -89686 -71246 -34133 -51697 -106364 -155154 -151934
5515 -151934 -46420 -79356 -32686 13975 15991 -23828 -57438 -47034 -57356 -86724 -150693 -59339
5503 -59339 -77230 -92426 -81274 -116458 -7164 -36823 -56435 -71147 -101610 -97321 -79214 -96257
5491 -96257 -163350 -160337 -66233 -50639 -56870 -57952 -82713 -60753 -84629 -105442 -68334 -52042
5479 -52042 -25329 15560 -6454 -127690 -136781 -144166 -101708 -87769 -61141 -91528 -93783 -65601
5467 -65601 -143635 -81454 -67789 -65803 6867 -2990 -72911 -24281 -34630 -43805 -57972 -24766
5455 -24766 -75359 -68306 -10162 -34251 -54419 12115 -23897 -42167 -97099 -82341 -85305 -136522
$$ packed form
5538a09752R4817n2488n7400M0530O6005j33562N4893J3289J4786n9591M9672
5527g8801Q5471j18765J8249N6608o8328J5880J8440L7113j7564n4667m8790L220
5515a51934J05514l2936M6670M6661K016l9819l3610J0404j0322k9368o3969R1354
5503e9339j7891j5196J1152l5184J09294k9659j9612j4712l0463M289J8107j7043
5491i6257o7093L013R4104J5594o231j082k4761K1960k3876k0813L7108J6292
5479e2042K6713M0889k2014j21236r091p385M2458J3939K6628l0387k255K8182
5467f5601p8034O2181J3665J986P2670r857o9921M8630j0349r175j4167L3206
5455b4766n0593P053N8144k4089k0168O6534l6012j8270n4932J4758k964n1217
$$ plain form
5443 -136522 -48695 -51754 38944 -20398 -57713 -11208 -56275 15418 -34504 -5810 64293 -55098
5431 -55098 -82172 -15506 -44889 15103 9893 -21862 -15836 -33429 -10439 -10450 11560 -14954 -104242
5418 -104242 -97467 2217 -7778 -19200 -52745 -77536 -45429 -15041 -21 80176 58624 83445
5406 83445 84409 -23089 18964 82527 39846 36116 72988 166039 206027 204319 133512 44077
5394 44077 72316 63121 33128 -3498 98394 67386 111465 102588 103868 195285 118262 161818
5382 161818 140730 120066 154885 192258 254927 219887 209232 218091 194581 199754 159447 108540
5370 108540 69640 125551 128844 62401 103015 168994 199338 218581 182821 194979 155728 203441
5358 203441 129334 187118 140830 109786 111500 125733 135364 72114 109879 106775 105373 47079
$$ packed form
5443a36522Q7827l059R0698n9342l7315M6505m5067P1693m9922K8694P0103j19391
5431e5098k7074O6666k9383N9992n210l1755O026j7593K2990j1K2010k6514q9288
5418a04242O775R9684r995j1422l3545k4791L2107L0388J5020Q0197k1552K4821
5406H3445R64j07498M2053O3563m2681l730L6872R3051L9988j708p0807q9435
5394D4077K8239r195k9993l6626J01892l1008M4079q877J280R1417p7023M3556
5382A61818k1088k0664L4819L7373O2669l5040j0655Q859k3510N173m0307n0907
5370A08540l8900N5911L293o6443M0614O5979L0344J9243l5760J2158l9251M7713
5358B03441p4107N7784m6288l1044J714J4233R631o3250L7765l104j402n8294
$$ plain form
5346 47079 37568 84059 130208 114116 46558 44485 -14606 7326 6523 42418 -41226 15400 -9462
5333 -9462 -38964 13328 -61901 11136 17389 29244 -2796 43208 102095 14631 17249 1357
5321 1357 49822 117694 53310 -16564 -55411 16113 -19531 -60356 -59584 25775 29951 -33314 -53365
5308 -53365 -17694 -3221 1321 -90068 -12412 46969 40095 -16751 20715 31865 38571 46025 -35739
5295 -35739 -49854 7535 12993 31520 78134 108127 153360 148663 14069 -6494 98896 89295
5283 89295 132871 60975 7393 -10168 1729 82186 76149 73361 91766 47742 122961 103297
5271 103297 -10632 48363 33002 63690 102993 53577 66156 43541 19144 50296 109982
5260 109982 109220 146481 169855 84551 127007 113921 171609 148903 166735 99159 169034 192667
$$ packed form
5346D7079r511M6491M6149j6092o7558k073n9091K1932q03L5895q3644N6626k4862
5333i462k9502N2292p5229P3037O253J1855l2040M6004N8887q7464K618j5892
5321A357M8465O7872o4384o9874l8847P1524l5644m0825P72Q5359M176o3265k0051
5308e3365L5671J4473M542r1389P7656N9381o874n6846L7466J1150O706P454q1764
5295c5739j4115N7389N458J8527M6614K9993M5233m697j34594k0563J05390r601
5283H9295M3576p1896n3582j7561J1897Q0457o037k788J8405m4024P5219j9664
5271A03297j13929N8995j5361L0688L9303m9416J2579k2615k4397L1152N9686
5260A09982p62L7261K3374q5304M2456j3086N7688k2706J7832o7576O9875K3633
$$ plain form
5248 192667 146704 174395 164360 152755 231217 191784 135824 111302 193879 129417 65449 92188
5236 92188 90374 92385 97557 144831 135560 122866 65107 56010 137169 169399 132035 182840 91156
5223 91156 70271 117682 99928 63830 54139 39475 55850 104288 120756 162869 149339 70134
5211 70134 85019 46605 85836 107686 175401 85015 106089 91699 186184 231719 221099 172314
5199 172314 77169 146887 110349 179074 141782 185234 195919 150240 94691 79821 94003 149902
5187 149902 122918 129281 136429 125560 151623 136506 156333 77327 -2002 55170 124435 146902
5175 146902 162067 161713 205282 191541 221115 178002 250599 188399 222805 231215 220039 219749 218564
5162 218564 174743 181089 162902 100918 126971 82523 105620 143832 133358 162047 157504 170799
$$ packed form
5248A92667m5963K7691j0035j1605P8462l9433n5960k4522Q2577o4462o3968K6739
5236I2188j814K011N172M7274r271j2694n7759r097Q1159L2230l7364N0805r1684
5223I1156k0885M7411j7754l6098r691j4664J6375M8438J6468M2113j3530p9205
5211G0134J4885l8414L9231K1850O7715r0386K1074j4390R4485M5535j0620m8785
5199A72314r5145O9718l6538O8725l7292M3452J0685m5679n5549j4870J4182N5899
5187A49902k6984O363P148j0869K6063j5117J9827p9006p9329N7172O9265K2467
5175A46902J5165l54M3569j3741K9574m3113P2597o2200L4406Q410j1176k90j185
5162B18564m3821O346j8187o1984K6053m4448K3097L8212j0474K8689m543J3295
$$ plain form
5150 170799 143536 198341 258017 254620 268338 270175 320213 316819 337655 372039 284711 244082
5138 244082 332651 368172 370175 420340 386252 380736 326083 395785 361570 382958 452794 471601
5126 471601 527614 541903 495361 493518 500151 480017 464581 478982 455592 454392 453670 389396 389980
5113 389980 448676 481281 411082 424660 361547 393781 421114 490037 476394 473507 481787 476393
5101 476393 376979 389013 425233 441147 499224 488088 424374 388544 389022 425625 392696 339934
5089 339934 357058 366307 369233 378337 444437 431432 424464 457653 487679 452404 500945 483025
5077 483025 418261 458109 531354 459810 464972 484944 417459 373016 403924 516074 452438 502584
5065 502584 491146 557446 597952 502676 510388 507146 436026 474978 492110 544868 511804 482850
$$ packed form
5150A70799k7263N4805N9676l397J3718J837N0038l394K0836L4384q7328m0629
5138B44082Q8569L5521K003N0165l4088n516n4653O9702l4215K1388O9836J8807
5126D71601N6013J4289m6542j843O633k0134j5436J4401k3390j200p22o4274N84
5113C89980N8696L2605p0199J3578o3113L2234K7333O8923j3643k887Q280n394
5101D76393r9414J2034L6220J5914N8077j1136o3714l5830M78L6603l2929n2762
5089C39934J7124R249K926R104O6100j3005o968L3189L0026l5275M8541j7920
5077D83025o4764L9848P3245p1544N162J9972o7485m4443L0908J12150o3636N0146
5065E02584j1438O6300M0506r5276P712l242p1120L8952J7132N2758l3064k8954
$$ plain form
5053 482850 490602 532492 532349 549855 506298 503549 601230 645586 633169 599609 553465 576743
5041 576743 575036 584065 657615 603353 607582 682987 630639 605600 620589 669903 714195 770986
5029 770986 760973 694069 663119 707382 693023 674683 681161 637792 590608 648027 695136 723017
5017 723017 715727 709996 778066 669920 692092 685881 710177 751980 790582 709096 763228 818626
5005 818626 766685 770669 693357 739959 743197 781446 743096 702604 746540 761168 752753 806488
4993 806488 817145 804236 837956 775842 861256 910102 951640 991858 1012886 1093161 1074943 1122098
4981 1122098 1150431 1148494 1053377 1033784 1095079 1163805 1178093 1267950 1362276 1431548 1491481 1495530
4969 1495530 1569767 1646480 1661359 1669598 1723153 1758495 1817238 1777641 1916764 2048387 2081745
$$ packed form
5053D82850P752M1890j43J7506m3557k749R7681M4356j2417l3560m6144K3278
5041E76743j707R029P3550n4262M229P5405n2348k5039J4989M9314M4292N6791
5029G70986j0013o6904l0950M4263j4359j8340O478m3369m7184N7419M7109K7881
5017G23017p290n731O8070j08146K2172o211K4296M1803L8602q1486N4132N5398
5005H18626n1941L984p7312M6602L238L8249l8350m0492M3936J4628q415N3735
4993H06488J0657j2909L3720o2114Q5414M8846M1538M0218K1028Q0275j8218M7155
4981A122098K8333j937r5117j9593O1295O8726J4288Q9857R4326O9272N9933M049
4969A495530P4237P6713J4879Q239N3555L5342N8743l9597J39123J31623L3358
$$ plain form
4958 2081745 2207507 2331365 2342284 2380776 2513288 2608042 2651995 2726414 2776145 2812482 2943390
4947 2943390 3046582 3102237 3180332 3320375 3465935 3568349 3650981 3645528 3808166 3911215
4937 3911215 4072498 4284199 4519174 4582888 4751504 4928798 5067156 5169897 5228705 5345295
4927 5345295 5533453 5725214 5937664 6123195 6273873 6495276 6730726 7011607 7093780 7064852
4917 7064852 6996611 6687228 6383222 6043931 5738860 5678750 5563432 5528737 5442169 5447550 5484232
4906 5484232 5648887 5774222 5914741 6115362 6379992 6664427 6930150 7211656 7480127 7658084
4896 7658084 7603067 7617946 7590476 7591485 7599084 7697719 7806595 8015836 8226186 8489835 8831285
4885 8831285 9236308 9554842 9862633 10098411 10208386 10090250 9954058 9753801 9543371 9465813
$$ packed form
4958B081745J25762J23858J0919L8492J32512R4754M3953P4419M9731L6337J30908
4947B943390J03192N5655P8095J40043J45560J02414Q2632n453J62638J03049
4937C911215J61283K11701K34975O3714J68616J77294J38358J02741N8808J16590
4927E345295J88158J91761K12450J85531J50678K21403K35450K80881Q2173k8928
4917G064852o8241l09383l04006l39291l05071o0110j15318l4695q6568N381L6682
4906E484232J64655J25335J40519K00621K64630K84435K65723K81506K68471J77957
4896G658084n5017J4879k7470J009P599R8635J08876K09241K10350K63649L41450
4885H831285M05023L18534L07791K35778J09975j18136j36192k00257k10430p7558
$$ plain form
4875 9465813 9246386 9014471 8878233 8837691 8832881 8870004 8886888 8915430 9147516 9310567 9379641
4864 9379641 9389934 9181803 8851025 8461956 8062765 7631969 7281644 6946764 6625295 6405795
4854 6405795 6257007 6085819 5906984 5824899 5743584 5638481 5573291 5503957 5544153 5484919 5427907
4843 5427907 5427904 5295992 5184928 5097240 4907092 4907616 4862748 4872951 4834658 4833314 4753229 4770447
4831 4770447 4810558 4703938 4801204 4933504 4928799 4956657 4957862 4951758 4994252 4878923 4739691
4820 4739691 4747359 4700139 4689957 4663294 4641674 4750740 4728702 4683995 4747303 4775794 4832980
4809 4832980 4904475 4956951 4975094 5079545 5113804 5098302 4998782 4988990 5001045 5054578 5045939 5072992
4797 5072992 5036168 4977378 5013502 4992252 5074955 5105623 5191557 5206735 5238278 5244318 5307999 5354663
$$ packed form
4875I465813k19427k31915j36238m0542m810L7123J6884K8542K32086J63051O9074
4864I379641J0293k08131l30778l89069l99191m30796l50325l34880l21469k19500
4854F405795j48788j71188j78835q2085q1315j05103o5190o9334M0196n9234n7012
4843E427907lj31912j11064q7688j90148N24m4868J0203l8293j344q0085J7218
4831D770447M0111j06620R7266J32300m705K7858J205o104M2494j15329j39232
4820D739691P668m7220j0182k6663k1620J09066k2038m4707O3308K8491N7186
4809D832980P1495N2476J8143J04451L4259j5502r9520r792J2055N3533q639K7053
4797E072992l6824n8790L6124k1250Q2703L0668Q5934J5178L1543O040O3681M6664
$$ plain form
4785 5354663 5396127 5469933 5529108 5655161 5755666 5817871 5884321 5925281 6104887 6222811 6217746
4774 6217746 6339800 6514337 6663704 6812803 6922697 7068658 7264356 7433882 7641179 7785384
4764 7785384 7982957 8165740 8440304 8799770 9084591 9438674 9846096 10107889 10490515 10935653
4754 10935653 11411096 11792048 12230907 12641008 12935398 13372016 13901515 14403347 14939789
4745 14939789 15518019 16180654 16946532 17772029 18755992 19627110 20641566 21609808 22622654
4736 22622654 23660155 24687702 25691278 26501131 27444413 28377212 29516648 30786904 32022891
4727 32022891 33452865 35070710 36856719 38821283 40924875 43311808 45988799 48787761
4719 48787761 51992233 55440435 59260906 63672800 68800945 74635275 81248042 88758533
$$ packed form
4785E354663M1464P3806N9175J26053J00505O2205O6450M0960J79606J17924n065
4774F217746J22054J74537J49367J49099J09894J45961J95698J69526K07297J44205
4764G785384J97573J82783K74564L59466K84821L54083M07422K61793L82626M45138
4754A0935653M75443L80952M38859M10101K94390M36618N29499N01832N36442
4745A4939789N78230O62635P65878Q25497R83963Q71118J014456R68242J012846
4736B2622654J037501J027547J003576Q09853R43282R32799J139436J270256J235987
4727C2022891J429974J617845J786009J964564K103592K386933K676991K798962
4719D8787761L204472L448202L820471M411894N128145N834330O612767P510491
$$ plain form
4711 88758533 96837642 105199614 113996802 123336429 132551606 141716428 152648452 166364879
4703 166364879 181384476 195994347 210208183 223662686 233300660 237549468 241904369
4696 241904369 250447230 262467914 277940753 296409688 315784190 333915533 350706367
4689 350706367 365515907 376429504 382894244 387283228 393953127 400910021 404970635 401991429
4681 401991429 391768596 375328367 352722387 329711659 306792268 282999910 261818177
4674 261818177 244358940 229380340 216122933 204053077 192308474 180627266 169752279
4667 169752279 160241223 151645345 143713535 136335400 129603785 123565278 117965182 112962133
4659 112962133 108277272 103878410 99600898 95533164 91753554 88378075 85357309 82569403
$$ packed form
4711H8758533Q079109Q361972Q797188R339627R215177R164822J0932024J3716427
4703A66364879J5019597J4609871J4213836J3454503R637974M248808M354901
4696B41904369Q542861J2020684J5472839J8468935J9374502J8131343J6790834
4689C50706367J4809540J0913597O464740M388984O669899O956894M060614k979206
4681D01991429j0222833j6440229k2605980k3010728k2919391k3792358k1181733
4674B61818177j7459237j4978600j3257407j2069856j1744603j1681208j0874987
4667A69752279r511056q595878p931810p378135o731615o038507n600096n003049
4659A12962133m684861m398862m277512m067734l779610l375479l020766k787906
$$ plain form
4651 82569403 80171637 78140023 76305490 74750979 73296365 71925198 70639885 69529447
4643 69529447 68344989 67100214 65870798 64540730 63078533 61614925 60228237 58918930
4635 58918930 57645573 56603162 55706846 55047423 54617022 54276751 54065688 54040185 53888526
4626 53888526 53648345 53155947 52394815 51572640 50655479 49562862 48304358 47016640 45930494
4617 45930494 44875424 43994300 43448336 43063863 42880432 42818117 42836476 42890558 42915965 42866679
4607 42866679 42665571 42172152 41589215 40816767 39854530 38973737 38059948 37272409 36445371
4598 36445371 35706440 35084707 34588891 34079651 33867981 33756610 33563075 33458939 33256302
4589 33256302 32907750 32399575 31663324 30878092 30079493 29389817 28771508 28141931 27703570
$$ packed form
4651H2569403k397766k031614j834533j554511j454614j371167j285313j110438
4643F9529447j184458j244775j229416j330068j462197j463608j386688j309307
4635E8918930j273357j042411q96316o59423m30401l40271k11063k5503j51659
4626E3888526k40181m92398p61132q22175r17161j092617j258504j287718j086146
4617D5930494j055070q81124n45964l84473j83431o2315J8359N4082K5407m9286
4607D2866679k01108m93419n82937p72448r62237q80793r13789p87539q27038
4598C6445371p38931o21733m95816n09240k11670j11371j93535j04136k02637
4589C3256302l48552n08175p36251p85232p98599o89676o18309o29577m38361
$$ plain form
4580 27703570 27282568 26952782 26703011 26515240 26386731 26348186 26294098 26287624 26292546 26397057
4570 26397057 26475681 26615881 26942790 27265354 27514294 27950223 28518598 29246421 30013208 30904719
4560 30904719 31969921 33195149 34485106 35972835 37527867 39250448 41225970 43506342
4552 43506342 46196557 49143583 51839528 54212044 55941260 56782397 56207707 54424930
4544 54424930 52218553 50329026 48930119 47918434 47413065 47123548 47111568 47210005 47273393
4535 47273393 47305918 47294974 46918725 46287030 45456595 44473767 43349389 42544173 41943753 41509359
4525 41509359 41362195 41430751 41769695 42229864 42987127 44000017 45175112 46616284 47974429
4516 47974429 49300450 50484415 51156179 51482920 51358009 50680221 49752316 48608026 47365535
$$ packed form
4580B7703570m21002l29786k49771j87771j28509l8545n4088o474M922J04511
4570B6397057P8624J40200L26909L22564K48940M35929N68375P27823P66787Q91511
4560C0904719J065202J225228J289957J487729J555032J722581J975522K280372
4552D3506342K690215K947026K695945K372516J729216Q41137n74690j782777
4544E4424930k206377j889527j398907j011685n05369k89517j1980R8437O3388
4535D7273393L2525j0944l76249o31695q30435r82828j124378q05216o00420m34394
4525D1509359j47164O8556L38944M60169P57263J012890J175095J441172J358145
4516D7974429J326021J183965O71764L26741j24911o77788r27905j144290j242491
$$ plain form
4507 47365535 46168783 45055459 44109691 43406134 42949462 42783450 42787842 43012556 43522647
4498 43522647 44289937 45325183 46463721 47776737 49118079 50324179 51443223 52384440
4490 52384440 52930663 53123099 52969623 52622154 51779944 50521693 49018139 47369738 45840991
4481 45840991 44460626 43415039 42604706 42064733 41725588 41809799 42175473 42769498 43595154
4472 43595154 44748385 46007850 47355347 48729468 49985928 50967254 51634965 51945314 51742797
4463 51742797 51179352 50328158 49239170 47921866 46491003 44923379 43546109 42174821
4455 42174821 41012209 39998915 39243125 38690061 38298503 38179602 38270213 38522857 39015247
4446 39015247 39670845 40285214 40909673 41325435 41532115 41271869 40706840 39915015 38855451
$$ packed form
4507D7365535j196752j113324r45768p03557m56672j66012M392K24714N10091
4498D3522647P67290J035246J138538J313016J341342J206100J119044R41217
4490E2384440N46223J92436j53476l47469q42210j258251j503554j648401j528747
4481D5840991j380365j045587q10333n39973l39145Q4211L65674N94025Q25656
4472D3595154J153231J259465J347497J374121J256460R81326O67711L10349k02517
4463E1742797n63445q51194j088988j317304j430863j567624j377270j371288
4455D2174821j162612j013294p55790n53064l91558j18901R0611K52644M92390
4446C9015247O55598O14369O24459M15762K06680k60246n65029p91825j059564
$$ plain form
4437 38855451 37685069 36459763 35161612 33839302 32513916 31160417 29938612 28906265
4429 28906265 27849526 26829179 26106844 25338915 24657174 24104180 23614081 23280800 23015342
4420 23015342 22712887 22421416 22175739 21897824 21566678 21036274 20368910 19671761 19018565
4411 19018565 18394129 17700555 17169395 16647222 15979944 15567144 15189146 14745324 14312802
4402 14312802 13919913 13552577 13278943 12977356 12753952 12473922 12186343 11964185 11649857
4393 11649857 11445167 11343426 11210429 11036482 10881334 10688476 10652577 10474170 10387450 10286257
4383 10286257 10152384 10173558 10185028 10182291 10166903 10210988 10309291 10331030 10395080 10437059 10427128
4372 10427128 10516149 10645453 10826908 10919162 11047801 11155976 11358826 11695308 12136265 12502631
$$ packed form
4437C8855451j170382j225306j298151j322310j325386j353499j221805j032347
4429B8906265j056739j020347p22335p67929o81741n52994m90099l33281k65458
4420B3015342l02455k91471k45677k77915l31146n30404o67364o97149o53196
4411A9018565o24436o93574n31160n22173o67278m12800l77998m43822m32522
4402A4312802l92889l67336k73634l01587k23404k80030k87579k22158l14328
4393A1649857k04690j01741j32997j73947j55148j92858l5899j78407q6720j01193
4383A0286257j33873K1174J1470k737j5388M4085R8303K1739O4050M1979r931
4372A0427128Q9021J29304J81455R2254J28639J08175K02850L36482M40957L66366
$$ plain form
4362 12502631 13007707 13601524 14135388 14825072 15495630 16068363 16588388 17245632 17960864
4353 17960864 18848795 20045098 21604640 23560120 26136587 29497516 33571661 37830889
4345 37830889 41529400 44452153 46145226 45886577 42678273 37945347 33524055 29835218
4337 29835218 26722442 24035656 22001657 20234236 18802838 17661109 16674411 15855525
4329 15855525 15281583 14603628 14007028 13352144 12612237 11944599 11404340 10859180 10298643
4320 10298643 9877786 9493736 9155714 8689374 8314517 7979496 7663815 7420915 7183722
4311 7183722 6960044 6711007 6506597 6356251 6221910 6072535 5950314 5787036 5610145 5499790
4301 5499790 5345939 5218719 5116070 5002355 4907734 4775764 4593730 4533582 4412656 4266226
$$ packed form
4362A2502631N05076N93817N33864O89684O70558N72733N20025O57244P15232
4353A7960864Q87931J196303J559542J955480K576467L360929M074145M259228
4345C7830889L698511K922753J693073k58649l208304m732926m421292l688837
4337B9835218l112776k686786k033999j767421j431398j141729r86698q18886
4329A5855525n73942o77955n96600o54884p39907o67638n40259n45160n60537
4320A0298643m20857l84050l38022m66340l74857l35021l15681k42900k37193
4311G183722k23678k49037k04410j50346j34341j49375j22221j63278j76891j10355
4301E499790j53851j27220j02649j13715r4621j31970j82034o0148j20926j46430
$$ plain form
4291 4266226 4141668 4100420 4101684 4035991 3923456 3880815 3901769 3823637 3755928 3705361 3645176
4280 3645176 3467217 3389438 3379389 3243298 3177170 3199031 3082260 2931796 2898169 2850556 2825346
4269 2825346 2754134 2733953 2656675 2635891 2651293 2533980 2454961 2529089 2506462 2432182 2366135
4258 2366135 2336286 2319338 2297038 2250855 2292822 2261869 2283354 2290184 2182324 2189148 2209536 2198055
4246 2198055 2097060 2203069 2225489 2162392 2085563 2060656 2083126 2019705 2002249 2048232 2048303 2156156
4234 2156156 2167279 2101673 2141484 2082130 2140847 2218086 2180926 2180632 2191166 2185054 2180146 2249703
4222 2249703 2270866 2220605 2235953 2234766 2177751 2282541 2283887 2291629 2278941 2206610 2226966 2156931
4210 2156931 2143155 2164359 2195911 2187545 2228101 2275096 2302138 2224708 2205897 2280927 2334096 2256993
$$ packed form
4291D266226j24558m1248J264o5693j12535m2641K0954p8132o7709n0567o0185
4280C645176j77959p7779j0049j36091o6128K1861j16771j50464l3627m7613k5210
4269B825346p1212k0181p7278k0784J5402j17313p9019P4128k2627p4280o6047
4258B366135k9849j6948k2300m6183M1967l0953K1485O830j07860O824K0388j1481
4246B198055j00995J06009K2420o3097p6829k4907K2470o3421j7456M5983P1J07853
4234B156156J1123o5606L9811n9354N8717P7239l7160k94J0534o112m908O9557
4222B249703K1163n0261J5348j187n7015J04790J346P742j2688p2331K0356p0035
4210B156931j3776K1204L1552q366M0556M6995K7042p7430j8811P5030N3169p7103
$$ plain form
4198 2256993 2172345 2087863 2114840 2098309 2048505 2090662 2008256 1960280 1898474 1899722 1837673 1877559
4186 1877559 1828347 1804064 1887136 1865388 1913781 1868944 1850740 1849109 1858002 1854412 1839410 1856174
4174 1856174 1829950 1919997 1797680 1749504 1677579 1673500 1728104 1606209 1567200 1648402 1719076
4163 1719076 1711331 1634696 1643750 1638582 1670876 1694850 1679760 1721223 1699151 1747714 1777864 1844704
4151 1844704 1956466 1892974 1828084 1943873 1997489 2082790 2122420 1981963 1843910 1964965
4141 1964965 1895396 1804529 1833664 1926690 1937228 1900117 1920721 2060840 2108748 2023195 2097984
4130 2097984 2121352 2141751 2142575 2206337 2217297 2209557 2312993 2419521 2468844 2507792 2604537 2723081
4118 2723081 2745972 2842278 2933346 3116944 3299518 3437212 3591104 3650368 3699246 3685546 3738150
$$ packed form
4198B256993q4648q4482K6977j6531m9804M2157q2406m7976o1806J248o2049L9886
4186A877559m9212k4283Q3072k1748M8393m4837j8204j631Q893l590j5002J6764
4174A856174k6224R0047j22317m8176p1925m079N4604j21895l9009Q1202P0674
4163A719076p745p6635R054n168L2294K3974j5090M1463k2072M8563L0150O6840
4151A844704J11762o3492o4890J15789N3616Q5301L9630j40457j38053J21055
4141A964965o9569r0867K9135R3026J0538l7111K0604J40119M7908q5553P4789
4130B097984K3368K0399Q24O3762J0960p740J03436J06528M9323L8948R6745J18544
4118B723081K2891R6306R1068J83598J82574J37694J53892N9264M8878j3700N2604
$$ plain form
4107 3738150 3736949 3797514 3824988 3895017 3932309 3929515 4132301 4225848 4253347 4332971 4352644 4351211
4095 4351211 4403249 4435927 4465990 4473663 4452496 4421928 4345561 4386822 4390307 4385314 4417204 4508384
4083 4508384 4584445 4594050 4709361 4668438 4699621 4703160 4662689 4634313 4618804 4675540 4583234 4583305
4071 4583305 4619804 4704111 4698775 4759668 4729483 4693312 4816757 4873272 5020221 5052092 5138020
4060 5138020 5241327 5330730 5489578 5621295 5745102 5910008 6067674 6264028 6445700 6690678
4050 6690678 6870683 7079246 7260112 7399371 7655821 7818297 7933936 8171416 8452313 8746468
4040 8746468 9093902 9405831 9744132 10170937 10558498 10959034 11433929 11962146 12484811 12968009
4030 12968009 13613788 14213851 14861245 15554623 16417764 17316296 18200323 19205639 20306711
$$ packed form
4107C738150j201O0565K7474P0029L7292k794K02786R3547K7499P9624J9673j433
4095D351211N2038L2678L0063P673k1167l0568p6367M1261L485m993L1890R1180
4083D508384P6061R605J15311m0923L1183L539m0471k8376j5509N6736r2306P1
4071D583305L6499Q4307n336O0893l0185l6171J23445N6515J46949L1871Q5928
4060E138020J03307Q9403J58848J31717J23807J64906J57666J96354J81672K44978
4050F690678J80005K08563J80866J39259K56450J62476J15639K37480K80897K94155
4040H746468L47434L11929L38301M26805L87561M00536M74895N28217N22665M83198
4030A2968009O45779O00063O47394O93378Q63141Q98532Q84027J005316J101072
$$ plain form
4021 20306711 21489150 22809830 24330346 25897422 27667583 29670292 31828312 34011524
4013 34011524 36262415 38451790 40384093 42152776 43752444 45269594 46975399 48921075
4005 48921075 51033686 53384035 55962660 58420129 60774058 62840987 64614195 66075482
3997 66075482 67469348 68877952 70639160 72784876 75446648 78702592 82221411 85827504
3989 85827504 89348188 92370153 94959864 96977472 98636827 100354870 102232626 104293437
3981 104293437 106281363 108182859 109390931 109984273 109846782 108886392 107133520 104893354
3973 104893354 102349456 99735504 97350849 95244613 93493165 92186772 91191834 90480252
3965 90480252 89942860 89594636 89266849 89064979 89062152 89313367 89430205 89419559 89102867 88147815
$$ packed form
4021B0306711J182439J320680J520516J567076J770161K002709K158020K183212
4013C4011524K250891K189375J932303J768683J599668J517150J705805J945676
4005D8921075K112611K350349K578625K457469K353929K066929J773208J461287
3997F6075482J393866J408604J761208K145716K661772L255944L518819L606093
3989H5827504L520684L021965K589711K017608J659355J718043J877756K060811
3981A04293437J987926J901496J208072N93342j37491r60390j752872k240166
3973A04893354k543898k613952k384655k106236j751448j306393r94938p11582
3965I0480252n37392l48224l27787k01870k827K51215J16838j0646l16692r55052
$$ plain form
3955 88147815 86379945 83745210 80507968 76666769 72590802 68602540 64774279 61210626
3947 61210626 57984167 55074316 52539320 50406487 48457941 46745565 45182914 43925445
3939 43925445 42771649 41657720 40788809 40011274 39347140 38740827 38074187 37341173 36305968
3930 36305968 35043347 33611775 32145550 30762066 29364481 28176007 27041421 26049393
3922 26049393 25125630 24230254 23419488 22728849 21936201 21298149 20631021 19915096 19267540
3913 19267540 18623458 18063714 17506975 16968718 16422783 15983397 15615712 15149811 14828855
3904 14828855 14529850 14172570 13872542 13532227 13233521 13027963 12845229 12606043 12464672
3895 12464672 12339188 12188793 12060661 11887978 11750731 11736738 11653129 11508000 11515124 11531130
$$ packed form
3955H8147815j767870k634735l237242l841199m075967l988262l828261l563653
3947F1210626l226459k909851k534996k132833j948546j712376j562651j257469
3939D3925445j153796j113929q68911p77535o64134o06313o66640p33014j035205
3930C6305968j262621j431572j466225j383484j397585j188474j134586r92028
3922B6049393r23763q95376q10766o90639p92648o38052o67128p15925o47556
3913A9267540o44082n59744n56739n38257n45935m39386l67685m65901l20956
3904A4828855k99005l57280l00028l40315k98706k05558j82734k39186j41371
3895A2464672j25484j50395j28132j72683j37247j3993q3609j45129P124J6006
$$ plain form
3885 11531130 11598284 11578600 11670945 11939857 12130417 12379302 12721957 12972824 13373555 13948224
3875 13948224 14474429 15022944 15477553 15851927 16061207 16106591 16024892 15900570 15904130 15959546
3865 15959546 16121070 16287500 16504073 16812245 17162094 17510626 17760179 18074688 18348389
3856 18348389 18411344 18542381 18458009 18279054 17844060 17537782 17418243 17134957 16974086 16813924
3846 16813924 16711734 16667477 16732897 16847750 17036323 17107954 17207881 17209047 16966837 16707728
3836 16707728 16366394 16084395 15841758 15814087 15715458 15810248 16073462 16373150 16883706 17348261
3826 17348261 17913533 18606970 19491741 20360571 21204290 21861758 22497935 22899030 23219366
3817 23219366 23311163 23277999 23333684 23392559 23603181 23962943 24390892 24978129 25791406 26677315
$$ packed form
3885A1531130O7154j9684R2345K68912J90560K48885L42655K50867M00731N74669
3875A3948224N26205N48515M54609L74374K09280M5384q1699j24322L560N5416
3865A5959546J61524J66430K16573L08172L49849L48532K49553L14509K73701
3856A8348389O2955J31037q4372j78955m34994l06278j19539k83286j60871j60162
3846A6813924j02190m4257O5420J14853J88573P1631R9927J166k42210k59109
3836A6707728l41334k81999k42637k7671r8629R4790K63214K99688N10556M64555
3826A7348261N65272O93437Q84771Q68830Q43719O57468O36177M01095L20336
3817B3219366R1797l3164N5685N8875K10622L59762M27949N87237Q13277Q85909
$$ plain form
3807 26677315 27638429 28723690 29906170 30942184 31893648 32646390 33244119 33561085 33725228
3798 33725228 33734300 33533060 33216265 32980605 32798249 32580903 32337588 32095552 32012381 31967538
3788 31967538 32048177 32443446 32838129 33480450 34417534 35520352 36808606 38060044 39095159
3779 39095159 39953375 40515211 40635173 40420204 39913495 39461016 38849117 38357290 37960878
3770 37960878 37852350 37861815 37932151 38152452 38461633 38842477 39135577 39494016 39642815 39772128
3760 39772128 39926444 40041669 39998971 39836365 39468498 39055659 38496884 37792678 37086976 36351254
3750 36351254 35594356 34922415 34319360 33924697 33696992 33506826 33472460 33393932 33218340 32997342
3740 32997342 32606577 32050447 31468409 30661660 29880307 28994989 28108858 27237842 26464337
$$ packed form
3807B6677315R61114J085261J182480J036014R51464P52742N97729L16966J64143
3798C3725228R072k01240l16795k35660j82356k17346k43315k42036q3171m4843
3788C1967538Q0639L95269L94683O42321R37084J102818J288254J251438J035115
3779C9095159Q58216N61836J19962k14969n06709m52479o11899m91827l96412
3770C7960878j08528R465P0336K20301L09181L80844K93100L58439J48799J29313
3760C9772128J54316J15225m2698j62606l67867m12839n58775p04206p05702p35722
3750C6351254p56898o71941o03055l94663k27705j90166l4366p8528j75592k20998
3740C2997342l90765n56130n82038q06749p81353q85318q86131q71016p73505
$$ plain form
3731 26464337 25692790 24997328 24342144 23764111 23307738 22902348 22543722 22309612 22113941
3722 22113941 21886324 21719603 21452261 21081810 20575823 19958910 19302919 18607517 17873170
3713 17873170 17358749 16888400 16498496 16402705 16163628 16005491 15920608 15862191 15714251 15544170
3703 15544170 15297257 15041073 14660928 14411481 14006341 13638052 13331677 12984393 12743576
3694 12743576 12493730 12396497 12354091 12293405 12269117 12417854 12445539 12611684 12752279 12919305
3684 12919305 12908414 12945431 13033117 13066834 13049970 13175137 13417175 13694762 14054514 14473364
3674 14473364 14891951 15443308 16069190 16861875 17780741 18607442 19465552 20324316 21006225
3665 21006225 21622724 22066712 22542396 23131073 23465165 23877296 24447060 24956272 25552357
$$ packed form
3731B6464337p71547o95462o55184n78033m56373m05390l58626k34110j95671
3722B2113941k27617j66721k67342l70451n05987o16913o55991o95402p34347
3713A7873170n14421m70349l89904r5791k39077j58137q4883n8417j47940j70081
3703A5544170k46913k56184l80145k49447m05140l68289l06375l47284k40817
3694A2743576k49846r7233m2406o0686k4288J48737K7685J66145J40595J67026
3684A2919305j0891L7017Q7686L3717j6864J25167K42038K77587L59752M18850
3674A4473364M18587N51357O25882P92685R18866Q26701Q58110Q58764O81909
3665B1006225O16499M43988M75684N88677L34092M12131N69764N09212N96085
$$ plain form
3656 25552357 26348350 27223610 28211340 29225540 30309554 31543833 32872863 34328412 35747737
3647 35747737 37123386 38364929 39460480 40374286 40911902 40952531 40955540 40876636 40694814 40425835
3637 40425835 40213642 39840543 39568811 39317459 38903936 38581611 38144316 37833994 37624415
3628 37624415 37486210 37576466 37578205 37581254 37589481 37476856 37177821 36671335 35897598 34860049
3618 34860049 33587753 32139195 30814356 29421276 28079906 26756590 25453880 24305903
3610 24305903 23217698 22123638 21217599 20383038 19554425 18823664 18136317 17449881 16871639
3601 16871639 16384314 15805743 15300345 14810297 14463400 14064384 13609166 13301608 12857981
3592 12857981 12636267 12344562 12077449 11803548 11579278 11411377 11268613 11136575 10996911
$$ packed form
3656B5552357P95993Q75260R87730J014200J084014J234279J329030J455549J419325
3647C5747737J375649J241543J095551R13806N37616M0629L009p8904j81822k68979
3637D0425835k12193l73099k71732k51352m13523l22325m37295l10322k09579
3628C7624415j38205R0256J739L049Q227j12625k99035n06486p73737j037549
3618C4860049j272296j448558j324839j393080j341370j323316j302710j147977
3610B4305903j088205j094060r06039q34561q28613p30761o87347o86436n78242
3601A6871639m87325n78571n05398m90048l46897l99016m55218l07558m43627
3592A2857981k21714k91705k67113k73901k24270j67901j42764j32038j39664
$$ plain form
3583 10996911 10836002 10721509 10561772 10457622 10440025 10429000 10337489 10202053 10182563 10142155
3573 10142155 10075694 10111249 10107870 10200404 10328390 10399150 10447303 10524268 10556007 10314628 10103973
3562 10103973 9879626 9674533 9556655 9359619 9206644 9086310 9003478 8897209 8768947 8657006
3552 8657006 8578493 8491236 8365842 8292387 8204813 8159081 8058383 7989621 7894041 7880434 7878782
3541 7878782 7814227 7882528 7941730 7848743 7792339 7826893 7776294 7748804 7802007 7773923 7850283
3530 7850283 7856179 7863736 7877927 7956854 8045413 8073065 8149963 8224808 8342823 8297617 8232936 8223821
3518 8223821 8276187 8266856 8284640 8314779 8359930 8430509 8400915 8579929 8708582 8717770 8844746
3507 8844746 8918223 9025321 9048323 8988528 9080727 9097963 9051743 9043326 9075828 9050592 9044522 9025868
$$ packed form
3583A0996911j60909j14493j59737j04150j7597j1025r1511j35436j9490m0408
3573A0142155o6461L5555l379R2534J27986P0760M8153P6965L1739k41379k10655
3562A0103973k24347k05093j17878j97036j52975j20334q2832j06269j28262j11941
3552H657006p8513q7257j25394p3455q7574m5732j00698o8762r5580j3607j652
3541G878782o4555O8301N9202r2987n6404L4554n0599k7490N3203k8084P6360
3530G850283N896P557J4191P8927Q8559K7652P6898P4845J18015m5206o4681r115
3518H223821N2366r331J7784L0139M5151P0579k9594J79014J28653R188J26976
3507H844746P3477J07098K3002n9795R2199J7236m6220q417L2502k5236o070j8654
$$ plain form
3495 9025868 9073716 9108588 9168973 9319436 9374064 9484710 9488676 9520843 9532462 9429197 9327196
3484 9327196 9337425 9278626 9169159 9096792 9068931 9069265 9116922 9180715 9204176 9365129 9461418
3473 9461418 9582196 9581520 9617348 9621495 9595197 9674883 9678276 9737307 9771437 9711975 9749810 9746512
3461 9746512 9775929 9717148 9610974 9620181 9561564 9483243 9388030 9228458 9194625 9227745 9187411
3450 9187411 9143759 9097017 9066942 8966533 8965462 8881132 8892853 8771783 8743440 8660791 8554486
3439 8554486 8556831 8497914 8424896 8371355 8322423 8311673 8316444 8344438 8418852 8421335 8457457 8509339
3427 8509339 8573562 8477306 8494596 8560741 8611584 8624493 8673055 8788515 8830670 8874220 8953501
3416 8953501 9013693 9052463 9143233 9282868 9306026 9425858 9632464 9825616 10023837 10119881
$$ packed form
3495I025868M7848L4872O0385J50463N4628J10646L966L2167J1619j03265j02001
3484I327196J0229n8799j09467p2367k7861L34M7657O3793K3461J60953R6289
3473I461418J20778o76L5828M147k6298P9686L393N9031L4130n9462L7835l298
3461I746512K9417n8781j06174R207n8617p8321r5213j59572l3833L3120m0334
3450I187411m3652m6742l0075j00409j071q4330J1721j21070k8343q2649j06305
3439H554486K345n8917p3018n3541m8932j0750M771K7994P4414K483L6122N1882
3427H509339O4223r6256J7290O6145N0843J2909M8562J15460M2155M3550P9281
3416H953501O0192L8770R0770J39635K3158J19832K06606J93152J98221R6044
$$ plain form
3406 10119881 10098799 10039972 9895634 9692734 9486224 9231448 9082428 8888860 8805975 8677567
3396 8677567 8600743 8632004 8671119 8746813 8785230 9022906 9210492 9374391 9553795 9830861
3386 9830861 9999600 10255775 10417236 10445951 10613067 10668920 10635088 10487503 10433495 10424363 10452479
3375 10452479 10534519 10590155 10570836 10707006 10881174 11145701 11449065 11660670 11961102 12191532
3365 12191532 12413640 12480918 12593629 12573171 12690868 12712637 12668212 12781538 12814243 13022829
3355 13022829 13295956 13562647 13840642 14165513 14477056 14881966 15195965 15534365 15917290
3346 15917290 16229015 16492989 16739657 17120687 17408318 17589374 17965505 18248450 18540243
3337 18540243 18921341 19185674 19554348 19944739 20329290 20835935 21285692 21775382 22240752
$$ packed form
3406A0119881k1082n8827j44338k02900k06510k54776j49020j93568q2885j28408
3396H677567p6824L1261L9115P5694L8417K37676J87586J63899J79404K77066
3386I830861J68739K56175J61461K8715J67116N5853l3832j47585n4008r132K8116
3375A0452479Q2040N5636j9319J36170J74168K64527L03364K11605L00432K30430
3365A2191532K22108O7278J12711k0458J17697K1769m4425J13326L2705K08586
3355A3022829K73127K66691K77995L24871L11543M04910L13999L38400L82925
3346A5917290L11725K63974K46668L81030K87631J81056L76131K82945K91793
3337A8540243L81098K64333L68674L90391L84551N06645M49757M89690M65370
$$ plain form
3328 22240752 22580051 23063645 23409302 23664454 23848296 23956278 24130235 24180658 24288339 24496266
3318 24496266 24675530 24844449 25029211 25336110 25550872 25862232 26215018 26598852 26970599
3309 26970599 27338404 27665306 27865832 28105265 28222878 28380032 28444692 28521101 28544685 28546888
3299 28546888 28591183 28563806 28577544 28638872 28764088 28919152 29095382 29247079 29433087 29650334
3289 29650334 29993779 30317219 30687153 31220459 31718593 32325447 32824803 33314661 33744884
3280 33744884 34325995 34912889 35459978 36151938 36877486 37604530 38333995 39044039 39824058
3271 39824058 40543816 41226123 41989651 42729226 43483484 44243347 44995266 45797623 46669009
3262 46669009 47523024 48458376 49432329 50403298 51455074 52418898 53306314 54159653 54858321
$$ packed form
3328B2240752L39299M83594L45657K55152J83842J07982J73957N0423J07681K07927
3318B4496266J79264J68919J84762L06899K14762L11360L52786L83834L71747
3309B6970599L67805L26902K00526K39433J17613J57154O4660P6409K3584K203
3299B8546888M4295k7377J3738O1328J25216J55064J76230J51697J86008K17247
3289B9650334L43445L23440L69934N33306M98134O06854M99356M89858M30223
3280C3744884N81111N86894N47089O91960P25548P27044P29465P10044P80019
3271C9824058P19758O82307P63528P39575P54258P59863P51919Q02357Q71386
3262D6669009Q54015R35352R73953R70969J051776R63824Q87416Q53339O98668
$$ plain form
3253 54858321 55636012 56243972 56782801 57511624 58225900 59066417 59889070 60812299 61913926
3244 61913926 62938086 64215047 65468426 66703693 67939992 69156149 70507468 71742812
3236 71742812 72766087 73583080 74229724 74600500 74921381 75125521 75310201 75512379 75643736
3227 75643736 75804910 75949312 76042998 76076075 76083704 76058469 76106838 76175726 76228203 76298101 76214194
3216 76214194 76025906 75783598 75365125 74598272 73720301 72807665 72048652 71273089 70542893
3207 70542893 69912706 69415642 69183947 68832819 68664991 68695389 68790132 68841195 69045703 69346358
3197 69346358 69744074 70095830 70515861 71055853 71509436 71839305 72094651 72278434 72246411 72022985
3187 72022985 71663680 71321415 70975995 70579829 70247491 69986211 69532376 68973091 68383383
$$ packed form
3253E4858321P77691O07960N38829P28823P14276Q40517Q22653R23229J101627
3244F1913926J024160J276961J253379J235267J236299J216157J351319J235344
3236G1742812J023275Q16993O46644L70776L20881K04140J84680K02178J31357
3227G5643736J61174J44402R3686L3077P629k5235M8369O8888N2477O9898q3907
3216G6214194j88288k42308m18473p66853q77971r12636p59013p75563p30196
3207G0542893o30187m97064k31695l51128j67828L0398R4743N1063K04508L00655
3197F9346358L97716L51756M20031N39992M53583L29869K55346J83783l2023k23426
3187G2022985l59305l42265l45420l96166l32338k61280m53835n59285n89708
$$ plain form
3178 68383383 67587213 66784580 65896225 64915730 63872209 62860035 61770617 60544349 59251588
3169 59251588 57845527 56508005 55117883 53668174 52345077 51202115 50042601 48865390
3161 48865390 47821647 46828606 45855294 44917843 43980377 43112820 42174959 41373851 40623573
3152 40623573 39835064 39015844 38337657 37756937 37046394 36316521 35691240 35040283 34552163
3143 34552163 34131391 33592748 33156370 32724695 32290594 31911487 31691469 31306821 30965543
3134 30965543 30628110 30271449 29896387 29611133 29331799 28957599 28704939 28506908 28340801
3125 28340801 28145351 28014822 27984783 27970868 28054061 28106365 28284514 28523171 28706060 28876649
3115 28876649 29116773 29206342 29201976 29098030 28876326 28645131 28402174 28065717 27775774 27533359
$$ packed form
3178F8383383p96170q02633q88355r80495j043521j012174j089418j226268j292761
3169E9251588j406061j337522j390122j449709j323097j142962j159514j177211
3161D8865390j043743r93041r73312r37451r37466q67557r37861q01108p50278
3152D0623573p88509q19220o78187n80720p10543p29873o25281o50957m88120
3143C4552163m20772n38643m36378m31675m34101l79107k20018l84648l41278
3134C0965543l37433l56661l75062k85254k79334l74200k52660j98031j66107
3125B8340801j95450j30529l0039j3915Q3193N2304J78149K38657J82889J70589
3115B8876649K40124Q9569m366j03946k21704k31195k42957l36457k89943k42415
$$ plain form
3105 27533359 27289639 27184010 26935214 26685194 26432107 26245998 26094199 25926185 25689445
3096 25689445 25642421 25501999 25292649 25213974 25005238 24831117 24706208 24672621 24641178 24571478
3086 24571478 24542089 24486261 24376072 24233289 24056115 23949558 23633114 23227358 22909145 22437213
3076 22437213 21996143 21529224 20976241 20466782 20066104 19647229 19140898 18647117 18278044
3067 18278044 18007699 17675396 17330971 17050457 16768013 16618459 16372427 16151461 15975504
3058 15975504 15759076 15645328 15535950 15415280 15204841 15067849 14979098 14900194 14786603 14698769
3048 14698769 14594286 14379647 14322791 14241760 14167181 13983917 13791859 13716236 13579943 13482735
3038 13482735 13438493 13394989 13321421 13270134 13193918 13126507 13085853 13038005 13045230 12950507 12910601
$$ packed form
3105B7533359k43720j05629k48796k50020k53087j86109j51799j68014k36740
3096B5689445m7024j40422k09350p8675k08736j74121j24909l3587l1443o9700
3086B4571478k9389n5828j10189j42783j77174j06557l16444m05756l18213m71932
3076B2437213m41070m66919n52983n09459m00678m18875n06331m93781l69073
3067A8278044k70345l32303l44425k80514k82444j49554k46032k20966j75957
3058A5975504k16428j13748j09378j20670k10439j36992q8751p8904j13591q7834
3048A4698769j04483k14639n6856q1031p4579j83264j92058p5623j36293r7208
3038A3482735m4242m3504p3568n1287p6216o7411m0654m7848P225r4723l9906
$$ plain form
3027 12910601 12909117 12872279 12773463 12661535 12561134 12531046 12443528 12321112 12186990 12231782 12160358
3016 12160358 11936682 11887532 11717248 11578720 11521753 11458655 11255373 11086534 10979144 10863671
3006 10863671 10830365 10703790 10537211 10536452 10357294 10210827 10128775 9900012 9768577 9656765
2996 9656765 9474227 9294077 9200420 9117724 9000778 8961544 8860402 8697846 8600978 8463237
2986 8463237 8348470 8177840 8029037 7996801 7880627 7726247 7680275 7527391 7495089 7492423
2976 7492423 7481560 7439585 7341496 7346870 7351629 7365253 7332582 7406305 7492893 7493578 7466629 7545340
2964 7545340 7633881 7614232 7439989 7349889 7327771 7281646 7136132 7098292 7060476 7093118 7103827
2953 7103827 7077949 7050386 7064854 7118769 7073128 7045655 7093290 7178447 7182231 7133683 7149237 7144556
$$ packed form
3027A2910601j484l6838r8816j11928j00401l0088q7518j22416j34122M4792p1424
3016A2160358k23676m9150j70284j38528n6967o3098k03282j68839j07390j15473
3006A0863671l3306j26575j66579p59j79158j46467q2052k28763j31435j11812
2996I656765j82538j80150r3657q2696j16946l9234j01142j62556r6868j37741
2986H463237j14767j70630j48803l2236j16174j54380m5972j52884l2302k666
2976G492423j0863m1975r8089N374M759J3624l2671P3723Q6588O85k6949P8711
2964G545340Q8541j9649j74243r0100k2118m6125j45514l7840l7816L2642J0709
2953G103827k5878k7563J4468N3915m5641k7473M7635Q5157L784m8548J5554m681
$$ plain form
2941 7144556 7190681 7278890 7365305 7399876 7459374 7542067 7567281 7626074 7790458 7883087 7950953
2930 7950953 8069855 8166052 8318390 8467301 8608376 8696212 8939304 9096848 9297556 9556354
2920 9556354 9747141 9767292 9797443 9846852 9762617 9565694 9310538 8982896 8640903 8471668
2910 8471668 8156169 7964852 7750277 7477016 7283470 6986235 6887740 6764110 6685741 6581287
2900 6581287 6461891 6350214 6196778 6145649 6144293 6057300 6056701 6101669 6044440 6014062 5973116
2889 5973116 5900893 5840896 5721972 5660498 5501910 5528539 5563423 5441397 5533598 5518207 5366007
2878 5366007 5330244 5287760 5295238 5331382 5285135 5340243 5334589 5340754 5382907 5432519 5523578 5584950
2866 5584950 5705386 5785848 5960993 6175356 6537862 6878277 7222612 7666464 8133515 8596132
$$ packed form
2941G144556M6125Q8209Q6415L4571N9498Q2693K5214N8793J64384R2629O7866
2930G950953J18902R6197J52338J48911J41075Q7836K43092J57544K00708K58798
2920I556354J90787K0151L0151M9409q4235j96923k55156l27642l41993j69235
2910H471668l15499j91317k14575k73261j93546k97235r8495j23630p8369j04454
2900F581287j19396j11677j53436n1129j356q6993n99M4968n7229l0378m0946
2889E973116p2223n9997j18924o1474j58588K6629L4884j22026R2201j5391j52200
2878E366007l5763m2484P478L6144m6247N5108n654O165M2153M9612R1059O1372
2866E584950J20436Q0462J75145K14363L62506L40415L44335M43852M67051M62617
$$ plain form
2856 8596132 9017478 9344894 9442568 9457036 9228015 8871594 8334296 7825483 7321954 6946866
2846 6946866 6580529 6241535 5888588 5671176 5367379 5106684 4891381 4717089 4603515 4409653
2836 4409653 4271249 4098255 3933945 3780027 3613132 3480787 3332952 3260634 3144403 3105121
2826 3105121 3024038 2934313 2827596 2773702 2709648 2646698 2596563 2521408 2441433 2443088 2424603
2815 2424603 2384348 2306927 2233793 2203762 2180589 2076371 1992084 2043595 1928811 1926624 1850421
2804 1850421 1806775 1742722 1702068 1709614 1611441 1592209 1671144 1560081 1497490 1509677 1487597
2793 1487597 1394858 1378509 1361104 1335107 1298605 1274078 1190531 1219262 1233207 1206935 1149612
2782 1149612 1173665 1088926 1122405 1119303 1067816 1048958 1064921 1022281 1043527 1017477 1019454 1005839
$$ packed form
2856H596132M21346L27416R7674J4468k29021l56421n37298n08813n03529l75088
2846F946866l66337l38994l52947k17412l03797k60695k15303j74292j13574j93862
2836D409653j38404j72994j64310j53918j66895j32345j47835p2318j16231l9282
2826C105121q1083q9725j06717n3894o4054o2950n0135p5155p9975J655j8485
2815B424603m0255p7421p3134l0031k3173j04218q4287N1511j14784k187p6203
2804A850421m3646o4053m0654P546r8173j9232P8935j11063o2591J2187k2080
2793A487597r2739j6349j7405k5997l6502k4527q3547K8731J3945k6272n7323
2782A149612K4053q4739L3479l102n1487j8858J5963m2640K1246k6050J977j3615
$$ plain form
2770 1005839 898794 900629 960366 1022986 967283 951240 908293 944458 911203 874052 870132 835381
2758 835381 795356 804483 789819 792582 793661 770805 798151 776626 694935 774802 741948 826127
2746 826127 783868 700353 770653 781957 714908 738898 755360 797923 684393 599590 745556
2735 745556 688186 706466 711367 765876 725967 724326 723848 707579 691263 756023 799917 710100
2723 710100 752296 763510 790267 799403 789726 853688 846770 809551 845680 898268 879474 885626
2711 885626 847474 755243 731009 856194 805274 725011 756937 751332 697960 746251 856583
2700 856583 873602 846750 934869 912105 915432 957260 983462 1047127 1019104 1017788 995726 1090044
2688 1090044 1138287 1099177 1051866 1015990 974826 1015153 953200 942318 989921 1018596 966161
$$ packed form
2770A005839j07045J835N9737O2620n5703j6043m2947L6165l3255l7151l920l4751
2758H35381m0025R127j4664K763J079k2856K7346k1525q1691P9867l2854Q4179
2746H26127m2259q3515P0300J1304o7049K3990J6462M2563j13530q4803J45966
2735G45556n7370J8280M901N4509l9909j641m78j6269j6316O4760M3894q9817
2723G10100M2196J1214K6757R136r677O3962o918l7219L6129N2588j8794O152
2711H85626l8152r2231k4234J25185n0920q0263L1926n605n3372M8291J10332
2700H56583J7019k6852Q8119k2764L327M1828K6202O3665k8023j316k2062R4318
2688A090044M8243l9110m7311l5876m1164M0327o1953j0882M7603K8675n2435
$$ plain form
2677 966161 1012523 1048214 1106048 1099598 1096845 1070770 1091415 1176670 1248006 1190745 1179271 1162645
2665 1162645 1124979 1134093 1145883 1168164 1133475 1159153 1155923 1122799 1149549 1150564 1152938 1050846
2653 1050846 937762 1015365 1067289 1029613 1050894 991308 973028 992455 957269 999439 1006436
2642 1006436 1080506 1007436 977508 960949 971558 1009946 977491 930403 968330 934600 858526
2631 858526 813703 801730 853975 802243 754497 760230 741610 776765 746190 678468 609774 571759
2619 571759 706528 605504 595902 566414 509033 563990 540411 476035 444547 435986 447304 482305
2607 482305 425504 364932 380259 346745 322503 346649 368127 296414 383790 391523 329216 257320
2595 257320 184415 265973 268309 182066 183288 206257 196061 260684 275046 210227 215449 228424
$$ packed form
2677I66161M6362L5691N7834o450k753k6075K0645Q5255P1336n7261j1474j6626
2665A162645l7666R114J1790K2281l4689K5678l230l3124K6750J015K374j02092
2653A050846j13084P7603N1924l7676K1281n9586j8280J9427l5186M2170O997
2642A006436P4070p3070k9928j6559J0609L8388l2455m7088L7927l3730p6074
2631H58526m4823j1973N2245n1732m7746N733j8620L5155l0575o7722o8694l8015
2619E71759J34769j01024r602k9488n7381N4957k3579o4376l1488q561J1318L5001
2607D82305n6801o0572J5327l3514k4242K4146K1478p1713Q7376P733o2307p1896
2595B57320p2905Q1558K336q6243J222K2969j0196O4623J4362o4819N222J2975
$$ plain form
2583 228424 193547 278989 267329 143569 169555 191839 133049 59107 80451 152686 131480
2572 131480 151596 157346 96645 99610 185201 163992 146119 131654 150101 54993 66515 66830
2560 66830 69578 35210 89635 84610 172392 67930 81149 129117 158763 73502 48357 56733
2548 56733 43688 106776 134162 150637 78401 69105 86547 115751 35022 44710 15271 43875
2536 43875 3328 -10537 -25488 -11221 33287 46144 28362 84881 78674 67913 110251 80023
2524 80023 110042 106157 9934 -3732 21479 6864 -26601 -30640 -1031 40467 35671 -966
2512 -966 40906 68014 51631 85129 150323 87609 54222 64387 10614 39560 14965 12404
2500 12404 -11191 31397 92406 114807 36663 -139808 -17640 3671 -3194 5862 -47609 -48065
$$ packed form
2583B28424l4877Q5442j1660j23760K5986K2284n8790p3942K1344P2235k1206
2572A31480K0116N750o0701K965Q5591k1209j7873j4465J8447r5108J1522L15
2560F6830K748l4368N4425n025Q7782j04462J3219M7968K9646q5261k5145Q376
2548E6733j3045O3088K7386J6475p2236r296J7442K9204q0729R688k9439K8604
2536D3875m0547j3865j4951J4267M4508J2857j7782N6519o207j0761M2338l0228
2524H0023L0019l885r6223j3666K5211j4615l3465m039K9609M1498m796l6637
2512i66M1872K7108j6383L3498O5194o2714l3387J0165n3773K8946k4595k561
2500A2404k3595M2588O1009K2401p8144j76471J22168K1311o865R056n3471m56
$$ plain form
2488 -48065 -11795 -63401 4994 -19703 21880 25123 -13562 -20095 -20534 81264 15090 155136
2476 155136 94431 46027 61024 10429 22069 -32151 -10190 4880 19070 62553 -35078 -86170
2464 -86170 7460 80802 320 -14564 39707 19490 -2621 17499 -2359 6544 5141 -2000
2452 -2000 -3046 -17672 -61111 -53820 -78963 -17197 41375 65756 60768 -33921 -34484 -10026 1889
2439 1889 -14114 22172 18979 59479 62987 -39737 -41918 -12618 99380 91540 13556 12623 55140
2426 55140 102011 99406 48699 81396 1161 -31819 -49026 -67433 29088 95892 69650 41414
2414 41414 68054 89291 62851 97254 80633 58262 57567 76654 22634 10651 1414 -14918
2402 -14918 37926 44058 87448 57195 -42208 -48853 7779 -17625 3329 25144 14003 -89664
$$ packed form
2488d8065L6270n1606O8395k4697M1583L243l8685o533m39J01798o6174J40046
2476A55136o0705m8404J4997n0595J1640n4220K1961J5070J4190M3483r7631n1092
2464h6170R3630P3342q0482j4884N4271k0217k2111K0120j9858Q903j403p141
2452b000j046j4626m3439P291k5143O1766N8572K4381m988r4689n63K4458J1915
2439A889j6003L6286l193M0500L508j02724k181K9300J11998p840p7984r33M2517
2426E5140M6871k605n0707L2697q0235l2980j7207j8407R6521O6804k6242k8236
2414D1414K6640K1237k6440L4403j6621k2371o95J9087n4020j1983r237j6332
2402a4918N2844O132M3390l0253r9403o645N6632k5404K0954K1815j1141j03667
$$ plain form
2390 -89664 -103609 -82940 -62432 -95753 11602 18642 -48408 -25261 13797 -87336 -133773 -89923
2378 -89923 -89697 -44397 -37801 -61907 -43576 -31540 -94498 -39611 -10379 -20536 -6690 45192
2366 45192 76965 47819 -62750 -50927 -934 -29857 -19655 -32513 -75938 -38862 -20372 -93711
2354 -93711 -52625 -100424 -61594 -60502 -31672 28899 -66334 -41193 -36656 -69925 -91053 -104634
2342 -104634 -21505 -43886 -60606 -89535 -72693 -60956 -639 12640 -43601 -6702 8743 3268
2330 3268 -45051 -59678 -69325 -25249 25303 55868 -12721 -45744 -60806 -61478 -76099 -88515 -77926
2317 -77926 -88245 -80685 -57432 -59809 -79196 -111356 -136740 -19221 -85496 -138242 -144591 -91750
2305 -91750 -90574 -29934 -13519 -42676 -46434 -34482 -37766 -10588 -2906 -36451 -82831 -77302 -27726
$$ packed form
2390h9664j3945K0669K0508l3321J07355P040o7050K3147L9058j01133m6437M3850
2378h9923K26M5300O596k4106J8331J2036o2958N4887K9232j0157J3846N1882
2366D5192L1773k9146j10569J1823M9993k8923J0202j2858m3425L7076J8490p3339
2354i3711M1086m7799L8830J092K8830O0571r5233K5141M537l3269k1128j3581
2342a04634Q3129k2381j6720k8929J6842J1737O0317J3279n6241L6899J5445n475
2330C268m8319j4627r647M4076N0552L0565o8589l3023j5062o72j4621j2416J0589
2317g7926j0319P560K3253k377j9387l2160k5384J17519o6275n2746o349N2841
2305i1750J176O0640J6415k9157l758J1952l284K7178P682l3545m6380N529M9576
$$ plain form
2292 -27726 -117638 -15935 -77014 -90336 -67672 -42439 -57420 -87329 -105742 -38714 -9866 -64865
2280 -64865 -53829 -47337 -14239 -61004 -129792 -63645 -110563 -118741 -78131 -134469 -147148 -90510
2268 -90510 -81189 -101311 -40826 -42569 -60993 -83830 -55233 -12645 36413 -28038 -11231 3397
2256 3397 -56687 -65747 -74333 -119797 -106775 -31900 -66457 -61269 -115295 -157742 -117709 -116434 -121346
2243 -121346 -86260 -5836 -4359 -103072 -80324 69336 -17394 -28215 -77599 -98681 -86552 -83611
2231 -83611 -55522 -97429 -87755 -156097 -70168 13972 28945 6064 -17753 -60218 -70739 -41543
2219 -41543 -63229 -33886 -56863 33601 27890 -77262 -83090 -70609 -85457 -54100 -81061 -37541
2207 -37541 19853 -58986 -74499 -182027 -149453 -30627 -57236 -87300 -112096 -52367 -77225
$$ packed form
2292b7726q9912J01703o1079j3322K2664K5233j4981k9909j8413O7028K8848n4999
2280f4865J1036O492L3098m6765o8788O6147m6918q178M0610n6338j2679N6638
2268i0510R321k0122O0485j743j8424k2837K8597M2588M9058o4451J6807J4628
2256C397o0084r060q586m5464J3022P4875l4557N188n4026m2447M0033J275m912
2243a21346L5086Q0424J477r8713K2748J49660q6730j0821m9384k1082J2129K941
2231h3611K8089m1907R674o8342Q5929Q4140J4973k2881k3817m2465j0521K9196
2219d1543k1686K9343k2977R0464n711j05152n828J2481j4848L1357k6961M3520
2207c7541N7394p8839j5513j07528L2574J18826k6609l0064k4796N9729k4858
$$ plain form
2196 -77225 -99350 -29529 -1172 -22243 -32815 -50612 -122572 -112740 -28530 -56971 -144649 -121084
2184 -121084 -133810 -102356 -27666 -7202 -13575 -33108 -25966 51514 -53661 -45596 -71495 -88494
2172 -88494 -51139 -37259 -60215 -75122 -92042 -110510 -156306 -21697 -2309 -65717 -28165 -92394
2160 -92394 -122027 -49510 37652 92354 30268 -85297 -5725 -51286 -49243 -77195 -5730 19851
2148 19851 -13492 -73209 -50692 6383 18601 21533 5682 -58815 -67392 2128 13924 35915
2136 35915 34358 -1449 -15947 10581 -52875 -22160 -18947 8575 -10376 -22948 -52557 -29732
2124 -29732 -5751 41873 41714 30540 42271 20374 -14267 -1111 43730 89447 61335 42428
2112 42428 71760 54738 70530 36732 129986 100099 70950 94918 59859 223941 253388 161459
$$ packed form
2196g7225k2125O9821K8357k1071j0572j7797p1960R832Q4210k8441q7678K3565
2184a21084j2726L1454P4690K0464o373j9533P142P7480j05175Q065k5899j6999
2172h8494L7355J3880k2956j4907j6920j8468m5796J34609J9388o3408L7552o4229
2160i2394k9633P2517Q7162N4702o2086j15565P9572m5561K043k7952P1465K5581
2148A9851l3343n9717K2517N7075J2218K932j5851o4497q577O9520J1796K1991
2136C5915j557l5807j4498K6528o3456L0715L213K7522j8951j2572k9609K2825
2124b9732K3981M7624j59j1174J1731k1897l4641J3156M4841M5717k8112j8907
2112D2428K9332j7022J5792l3798R3254k9887k9149K3968l5059J64082K9447r1929
$$ plain form
2100 161459 236022 223293 277187 246409 266313 381717 345987 325092 308089 362648 416953
2089 416953 383217 448436 467802 554168 602866 703059 749352 810997 887123 925840 1038865
2078 1038865 1142765 1384529 1451056 1513959 1667576 1917962 2137337 2428513 2700646 3082036
2068 3082036 3665212 4196186 5068634 6255001 7243374 8055886 8600995 9192592 8738957
2059 8738957 7115485 6046968 5304261 4694875 4138532 3689523 3297534 2923765 2737953
2050 2737953 2623541 2582220 2364884 2198291 2108383 1971617 1826572 1667389 1593307 1474699
2040 1474699 1402345 1265802 1150794 1123689 1055545 994801 983678 992125 927223 835423 767038
2029 767038 799713 744003 673492 769980 677231 656963 603280 622083 620275 576336 472065 490086
$$ packed form
2100A61459P4563j2729N3894l0778J9904J15404l5730k0895j7003N4559N4305
2089D16953l3736O5219J9366Q6366M8698J00193M6293O1645P6126L8717J13025
2078A038865J03900K41764O6527O2903J53617K50386K19375K91176K72133L81390
2068C082036N83176N30974Q72448J186367R88373Q12512N45109N91597m53635
2059H738957j623472j068517p42707o09386n56343m49009l91989l73769j85812
2050B737953j14412m1321k17336j66593q9908j36766j45045j59183p4082j18608
2040A474699p2354j36543j15008k7105o8144o0744j1123Q447o4902r1800o8385
2029G67038L2675n5710p0511R6488r2749k0268n3683J8803j808m3939j04271J8021
$$ plain form
2017 490086 429579 359268 389451 423975 461291 363237 366646 412094 425936 343910 344724 335134
2005 335134 235795 246628 184995 241952 166634 254178 235127 255262 217118 182930 148727 90340
1993 90340 191282 124689 140337 111009 160028 114039 101364 94379 159887 129771 136107 153699
1981 153699 141398 78939 82202 153394 171811 93064 82710 69309 69752 91720 66969 105886
1969 105886 124220 94806 85251 566 11122 89668 72467 99005 29728 -34276 24374 -44141
1957 -44141 20272 87282 141586 76485 49218 10718 -11064 52053 10175 24670 24133 -19264
1945 -19264 14775 56503 -531 -20378 -28992 -39061 -73572 -78551 -75293 30908 36804 23489
1933 23489 -29219 13484 42250 60684 19298 -47907 -90465 -37026 -21446 -95905 7861 45540
$$ packed form
2017D90086o0507p0311L0183L4524L7316r8054L409M5448J3842q2026Q14r590
2005C35134r9339J0833o1633N6957p5318Q7544j9051K0135l8144l4188l4203n8387
1993I0340J00942o6593J5648k9328M9019m5989j2675o985O5508l0116O336J7592
1981A53699j2301o2459L263P1192J8417p8747j0354j3401M43K1968k4751L8917
1969A05886J8334k9414r555q4685J0556P8546j7201K6538o9277o4004N8650o8515
1957d4141O4413O7010N4304o5101k7267l8500k1782O3117m1878J4495n37m3397
1945a9264L4039M1728n7034j9847q614j0069l4511m979L258J06201N896j3315
1933B3489n2708M2703K8766J8434m1386o7205m2558N3439J5580p4459J03766L7679
$$ plain form
1921 45540 28981 21670 -827 17695 25256 16766 33797 -27776 12311 -4466 -91316 -63010
1909 -63010 14965 -10783 -3026 -32475 21599 -5707 -41311 -14152 -10730 -76696 32611 -25963
1897 -25963 -21447 -36891 -78683 -35677 -24698 36059 -16633 -30831 -52072 -114505 -152889 -63418
1885 -63418 -57346 15499 24766 964 -14091 -57598 -56748 -55784 -54514 -34015 15536 81564 47288
1872 47288 31287 -43348 -71972 -62907 -79646 19375 -86243 -56374 -22618 -96903 -78735 -8565
1860 -8565 8136 -82305 2968 11845 -29465 1072 -41074 -30332 -19221 -52173 -2469 78410
1848 78410 39415 -45982 2673 -56615 -78135 -153788 -82933 -24945 14501 -71140 -66395 -37616
1836 -37616 -133681 -128854 -66440 -63871 -96359 -42311 -48196 -51624 -73525 -31928 -40383 -67801 -123016
$$ packed form
1921D5540j6559p311k2497J8522P561q490J7031o1573M0087j6777q6850K8306
1909f3010P7975k5748P757k9449N4074k7306l5604K7159L422o5966J09307n8574
1897b5963M516j5444m1792M3006J0979O0757n2692j4198k1241o2433l8384Q9471
1885f3418O072P2845R267k3802j5055m3507Q50R64J270K0499M9551O6028l4276
1872D7288j6001p4635k8624R065j6739R9021j05618K9869L3756p4285J8168P0170
1860h565J6701r0441Q5273Q877m1310L0537m2146J0742J1111l2952M9704Q0879
1848G8410l8995q5397M8655n9288k1520p5653P0855N7988L9446q5641M745K8779
1836c7616r6065M827O2414K569l2488N4048n885l428k1901M1597q455k7418n5215
$$ plain form
1823 -123016 -138405 -149243 -140482 -151650 -140566 -80853 -63437 -72408 -4337 -56707 -142325 -91107
1811 -91107 -94423 -63030 -70811 -76791 -118913 -84162 -20371 64486 4783 49283 60741 37137
1799 37137 13628 -47032 -35986 -66623 -92045 -100563 -19544 20087 1113 13297 11973 -91339
1787 -91339 -34282 -21466 -64315 -57450 -64026 -89434 -52678 -118657 -49775 10357 -54139 -28590
1775 -28590 -122703 -80346 -2406 -27669 -74191 -37413 -27490 -11618 -52449 -26151 -64583 -130291
1763 -130291 -38334 -94123 -64821 -49611 -89180 -124342 -113646 -26058 -1153 -89583 -24030 -29085
1751 -29085 -55537 -68076 -62256 -62807 -104723 -124346 -35931 -38479 -70996 -62949 -67938 -67046 -69123 -81828
1737 -81828 -90190 -52808 -122444 -35876 -62238 -130945 -75330 -36088 -51362 -67820 -139539 -124245
$$ packed form
1823a23016j5389j0838Q761j1168J1084N9713J7416q971O8071n2370q5618N1218
1811i1107l316L1393p781n980m2122L4751O3791Q4857n9703M4500J1458k3604
1799C7137k3509o0660J1046l0637k5422q518Q1019L9631j8974J2184j324j03312
1787i1339N7057J2816m2849O865o576k5408L6756o5979O8882O0132o4496K5549
1775b8590r4113M2357P7940k5263m6522L6778R923J5872m0831K6298l8432o5708
1763a30291R1957n5789K9302J5210l9569l5162J0696Q7588K4905q8430O5553n055
1751b9085k6452j2539N820n51m1916j9623Q8415k548l2517Q047m989Q92k077j2705
1737h1828q362L7382o9636Q6568k6362o8707N5615L9242j5274j6458p1719J5294
$$ plain form
1725 -124245 -90755 -111055 -148853 -54738 -972 6495 -108621 -81282 -49200 -73363 -67846 -46035
1713 -46035 -114929 -153199 -63222 -48461 -124347 -65644 -44306 -38807 -50275 -48959 -63275 -69105
$$ packed form
1725a24245L3490k0300l7798R4115N3766P467j15116K7339L2082k4163N517K1811
1713d6035o8894l8270Q9977J4761p5886N8703K1338N499j1468J316j4316n830
$$ [...]
##END NTUPLES=NMR SPECTRUM
##END=
