##TITLE=1H_CA-9293-2
 CDCl3
 8 sc, 
 9.10.2024
##JCAMPDX= 6.0         $$ Bruker NMR JCAMP-DX V2.0
##DATA TYPE= NMR SPECTRUM
##DATA CLASS= NTUPLES
##ORIGIN= UXNMR, Bruker Analytische Messtechnik GmbH
##OWNER= root
$$ XWIN-NMR		Version 3.5
$$ Wed Oct  9 14:01:28 2024 Russian Standard Time (UT+4h)  she@DPX200
##.OBSERVE FREQUENCY= 200.1318
##.OBSERVE NUCLEUS= ^1H
##.ACQUISITION MODE= SIMULTANEOUS
##.ACQUISITION SCHEME= undefined
##.AVERAGES= 8
##.DIGITISER RES= 18
##SPECTROMETER/DATA SYSTEM= spect
##.PULSE SEQUENCE= zg30
##.SOLVENT NAME= CDCl3
##.SHIFT REFERENCE= (INTERNAL, CDCl3, 0, 21.0928)
##AUDIT TRAIL= $$ (NUMBER, WHEN, WHO, WHERE, WHAT)
$$ ##TITLE= Audit trail, XWIN-NMR		Version 3.5
$$ ##JCAMPDX= 5.01
$$ ##ORIGIN= Bruker BioSpin GmbH
$$ ##OWNER= she
$$ F:/spectra/data/she/nmr/H-F/1/pdata/1/auditp.txt
$$ ##AUDIT TRAIL=  $$ (NUMBER, WHEN, WHO, WHERE, WHAT)
(   1,<2024-10-09 14:00:00.25 +0400>,<she>,<DPX200>,
      <created by zg, POWCHK disabled, PULCHK disabled
       configuration hash MD5:
       00 E9 B6 7A A2 85 ED C7 34 08 36 98 17 FE 4E 26
       data hash MD5: 16K
       D0 25 19 FA 16 71 E7 2B E3 7B D5 18 F7 BE 86 0D>)
(   2,<2024-10-09 14:00:03.29 +0400>,<she>,<DPX200>,
      <Start of raw data processing
       efp BC_mod = 2 LB = 0.24 FT_mod = 6 PKNL = 1 PHC0 = -26350.85 PHC1 = 24.58743 SI = 16K 
       data hash MD5: 16K
       AD B6 FA B1 DF 24 A0 E2 5B 80 D6 7F 5C 81 E9 9E>)
(   3,<2024-10-09 14:00:25.51 +0400>,<she>,<DPX200>,
      <pk PHC0 = -160.4627 PHC1 = 0 
       data hash MD5: 16K
       D3 63 3F 70 0D EB 36 33 B3 97 6E 97 A0 44 69 B8>)
(   4,<2024-10-09 14:00:29.37 +0400>,<she>,<DPX200>,
      <abs ABSG = 5 
       data hash MD5: 16K
       E5 BC 6A 0A A3 FA 7F D3 0A CD 97 E5 BF EA AB B3>)
(   5,<2024-10-09 14:00:51.68 +0400>,<she>,<DPX200>,
      <abs ABSG = 5 
       data hash MD5: 16K
       DA 6B B0 8A A4 DC 32 96 D3 52 F5 7E 46 0C 78 D4>)
$$ ##END=
$$ 
$$ hash MD5
$$ 6D DF 8E AD F1 58 47 F8 14 5A 09 1F 25 48 72 63
##$RELAX= 
##$RELAX= 
##$RELAX= 
##$RELAX= 
##$RELAX= 
##$RELAX= 
$$ Bruker specific parameters
$$ --------------------------
##$DU= <F:/spectra>
##$EXPNO= 1
##$NAME= <H-F>
##$PROCNO= 1
##$TYPE= <nmr>
##$USER= <she>
##$AMP= (0..31)
100 100 100 100 100 100 100 100 100 100 100 100 100 100 100 100 100 100 
100 100 100 100 100 100 100 100 100 100 100 100 100 100 
##$AQSEQ= 0
##$AQ_mod= 1
##$AUNM= <au_zg>
##$AUTOPOS= <>
##$BF1= 200.13
##$BF2= 200.13
##$BF3= 200.13
##$BF4= 200.13
##$BF5= 200.13
##$BF6= 200.13
##$BF7= 200.13
##$BF8= 200.13
##$BYTORDA= 1
##$CFDGTYP= 0
##$CFRGTYP= 5
##$CHEMSTR= <none>
##$CNST= (0..31)
1 1 145 1 1 1 1 1 1 1 1 1 1 1 1 1 1 1 1 1 1 1 1 1 1 1 1 1 1 1 1 1 
##$CPDPRG= <>
##$CPDPRG1= <>
##$CPDPRG2= <>
##$CPDPRG3= <>
##$CPDPRG4= <mlev>
##$CPDPRG5= <mlev>
##$CPDPRG6= <mlev>
##$CPDPRG7= <mlev>
##$CPDPRG8= <mlev>
##$CPDPRGB= <>
##$CPDPRGT= <>
##$D= (0..31)
0 1.2 0 0 0 0 0 0 0 0.06 0 0.03 0 0 0 0 0.0002 0 0 0 0 0 0 0 0 0 0 0 0 
0 0 0 
##$DATE= 1728467999
##$DBL= (0..7)
$$ [...]
##$SUBNAM3= <"">
##$SUBNAM4= <"">
##$SUBNAM5= <"">
##$SUBNAM6= <"">
##$SUBNAM7= <"">
##$SUBNAM8= <"">
##$SUBNAM9= <"">
##$SW= 24.0689170037331
##$SWIBOX= (0..15)
0 0 2 0 0 0 0 0 0 0 0 0 0 0 0 0 
##$SW_h= 4816.95568400771
##$TD= 16384
##$TD0= 1
##$TE= 0
##$TE2= 300
##$TE3= 300
##$TEG= 300
##$TL= (0..7)
0 120 120 120 120 120 120 120 
##$TP= (0..7)
150 150 150 150 150 150 150 150 
##$TP07= 0
##$TPNAME0= <>
##$TPNAME1= <>
##$TPNAME2= <>
##$TPNAME3= <>
##$TPNAME4= <>
##$TPNAME5= <>
##$TPNAME6= <>
##$TPNAME7= <>
##$TPOAL= (0..7)
0.5 0.5 0.5 0.5 0.5 0.5 0.5 0.5 
##$TPOFFS= (0..7)
0 0 0 0 0 0 0 0 
##$TUNHIN= 0
##$TUNHOUT= 0
##$TUNXOUT= 0
##$USERA1= <user>
##$USERA2= <user>
##$USERA3= <user>
##$USERA4= <user>
##$USERA5= <user>
##$V9= 5
##$VALIST= <valist>
##$VCLIST= <CCCCCCCCCCCCCCC>
##$VD= 0
##$VDLIST= <DDDDDDDDDDDDDDD>
##$VPLIST= <PPPPPPPPPPPPPPP>
##$VTLIST= <TTTTTTTTTTTTTTT>
##$WBST= 1024
##$WBSW= 4
##$XGAIN= (0..3)
0 0 0 0 
##$XL= 0
##$YL= 0
##$YMAX_a= 446855
##$YMIN_a= -889945
##$ZGOPTNS= <>
##$ZL1= 120
##$ZL2= 120
##$ZL3= 120
##$ZL4= 120
##$ABSF1= 21.09281
##$ABSF2= -2.976326
##$ABSG= 5
##$ABSL= 3
##$ALPHA= 0
##$AQORDER= 0
##$ASSFAC= 0
##$ASSFACI= 0
##$ASSFACX= 0
##$ASSWID= 0
##$AUNMP= <proc_1d>
##$AZFE= 0.1
##$AZFW= 0.1
##$BCFW= 0
##$BC_mod= 2
##$BYTORDP= 0
##$COROFFS= 0
##$CY= -3
##$DATMOD= 1
##$DC= 0
##$DFILT= <>
##$DTYPP= 0
##$F1P= 0
##$F2P= 0
##$FCOR= 1
##$FTSIZE= 16384
##$FT_mod= 6
##$GAMMA= 0
##$GB= 0
##$INTBC= 1
##$INTSCL= 3.70164e-10
##$ISEN= 128
##$LB= 0.24
##$LEV0= 0
##$LPBIN= 0
##$MAXI= 10000
##$MC2= 0
##$MEAN= 0
##$ME_mod= 0
##$MI= 1.114404
##$NCOEF= 0
##$NC_proc= -5
##$NLEV= 6
##$NOISF1= 3.799351
##$NOISF2= 2.8
##$NSP= 0
##$NTH_PI= 0
##$NZP= 0
##$OFFSET= 21.09281
##$PC= 1
##$PHC0= -26511.31
##$PHC1= 24.58743
##$PH_mod= 1
##$PKNL= yes
##$PPARMOD= 0
##$PSCAL= 0
##$PSIGN= 0
##$REVERSE= no
##$SF= 200.129987172975
##$SI= 16384
##$SIGF1= 3
##$SIGF2= 2
##$SINO= 5.538805
##$SIOLD= 16384
##$SREGLST= <1H.CDCl3>
##$SSB= 0
##$STSI= 16384
##$STSR= 0
##$SW_p= 4816.95568400771
##$SYMM= 0
##$S_DEV= 0
##$TDeff= 16384
##$TDoff= 0
##$TI= <>
##$TILT= no
##$TM1= 0
##$TM2= 0
##$TOPLEV= 0
##$USERP1= <user>
##$USERP2= <user>
##$USERP3= <user>
##$USERP4= <user>
##$USERP5= <user>
##$WDW= 1
##$XDIM= 16384
##$YMAX_p= 295187069
##$YMIN_p= -110293
$$ End of Bruker specific parameters
$$ ---------------------------------
##NTUPLES= NMR SPECTRUM
##VAR_NAME=  FREQUENCY,     SPECTRUM/REAL,   SPECTRUM/IMAG
##SYMBOL=    X,             R,               I
##VAR_TYPE=  INDEPENDENT,   DEPENDENT,       DEPENDENT
##VAR_FORM=  AFFN,          ASDF,            ASDF
##VAR_DIM=   16384,         16384,           16384
##UNITS=     HZ,            ARBITRARY UNITS, ARBITRARY UNITS
##FACTOR=    0.29402158847633, 1,            1
##FIRST=     4221.30373012483, 0,            0
##LAST=      -595.651953882876, 0,           0
##MIN=       -595.651953882876, -110293,     0
##MAX=       4221.30373012483, 295187069,    0
$$ Real data points
##PAGE= N=1
##DATA TABLE= (X++(R..R)), XYDATA
$$ [...]
7874A10206r516p0747J07139K0755l9243l2815J726k5019J3924P3223J9457M0631
7862B09721m4756J1490k2803j5493K0915r329j5335J6167o03l5791j5385O5998
7850A64796N1774l6223L4772k4220l3658J3980J2271j9411k6223m867J009L7365
7838A71365O929k0989k6730k9739P5309K0677l5219J9428k5840J8943p016j3844
7826A53274K3247P429l2442m0502j1345J4590M6276J9774m2809J8377K9506k2498
7814A62877M3270k3533K5009J3169l4056R494j2478j5719M0406q830K5098K6979
7802B51686k1523J309n4926J9691k847N9391p703o1092N1811K6147m4672k5680
7790A91592l453j1303m0105M1587K3727j1534K1715L1583M7149l6540q578j3181
$$ y = [110206, 100690, 29943, 137082, 157837, 118594, 85779, 87505, 62486, 76410, 149633, 169090, 209721, 164965, 176455, 153652, 138159, 159074, 149745, 134410, 150577, 149974, 114183, 98798, 164796, 216570, 180347, 215119, 190899, 157241, 171221, 183492, 164081, 137858, 132991, 134000, 171365, 178294, 157305, 130575, 100836, 176145, 196822, 161603, 181031, 155191, 174134, 167118, 153274, 176521, 183950, 151508, 111006, 99661, 114251, 160527, 180301, 137492, 155869, 185375, 162877, 206147, 182614, 207623, 220792, 186736, 196230, 183752, 168033, 208439, 199609, 224707, 251686, 230163, 231472, 176546, 196237, 193390, 252781, 245078, 183986, 235797, 261944, 217272, 191592, 188139, 176836, 136731, 178318, 202045, 190511, 212226, 243809, 290958, 254418, 245840, 232659]
7778B32659m806N056k6770K0955K0293j9746l5774N8629N395j3334J1896k6093
7766B28360K9072K2418j7544p208j6371k8530L7677J1199o093j52P477k1147k7061
7753B12097L6976J8072k3546R365J7517k8200k4638k7290Q3300K5429l8024l2526
7741B28532k6356K8344J0027J0300n0467j8914O4110n8048R004k1944l0952O9662
7729B13298L2657O641l9546q845r424J9950N4746R598q8548L3706L0805k4608
7717B30430P181k1796q718j4783K5412J1166M6134j4082m0497q641K8971P838
7705B48615p1386K7180L2409J7329n1124L3849m2693L2000k3195j2303P3017k7076
7693B36622K5821j4192J2385o3106K7266l4359M7644j5338J980L8457q97o9665
$$ y = [232659, 227853, 232909, 206139, 227094, 247387, 227641, 191867, 250496, 255891, 242557, 254453, 228360, 257432, 279850, 262306, 255098, 238727, 210197, 247874, 259073, 252980, 252828, 260305, 239158, 212097, 249073, 267145, 243599, 252964, 270481, 242281, 217643, 190353, 273653, 299082, 261058, 228532, 202176, 230520, 240547, 250847, 200380, 181466, 245576, 187528, 196532, 174588, 143636, 213298, 245955, 252596, 213050, 204205, 194781, 214731, 269477, 279075, 190527, 224233, 255038, 230430, 237611, 215815, 207097, 192314, 217726, 228892, 275026, 260944, 220447, 211806, 240777, 248615, 177229, 204409, 236818, 254147, 203023, 236872, 194179, 226179, 202984, 190681, 263698, 236622, 262443, 248251, 260636, 197530, 224796, 190437, 238081, 222743, 224723, 263180, 262283, 192618]
7681A92618n617M0252j4802L0442j5697p774P177l605n991K0681K0572K776j2072
7668B48960m5244j3493l98k1548L1349J10150n0326n3788J3720m012M2623O290
7656B64283j7082K0913K5412j3852p3661J1037L3674k3366k2878J5740N842k8934
7644A97128j5365o580M2761L9674k572m201J7845m3604N6181j7268q592k4936
7632B30471k460J6546M260K0168l109M4295n972j0642J7655j6176j542m801J0515
7619B99208P105k3486N076k0120R594M2959O358m32j4769j02N2501k4821j8737
7606C20334R722L0418l4530L9270O1197l0496n7972j3181M5316m5268M7934l9615
7594C33129M239L8219Q64M777K3747K5173r502J4036K3320q7938R0124k6344M5132
$$ y = [192618, 187001, 227253, 212451, 242893, 227196, 219422, 226599, 222994, 217003, 237684, 258256, 261032, 248960, 203716, 190223, 189825, 168277, 199626, 309776, 259450, 205662, 219382, 215370, 257993, 264283, 247201, 268114, 293526, 279674, 206013, 217050, 250724, 227358, 204480, 220220, 226062, 197128, 181763, 175183, 217944, 257618, 255046, 250845, 268690, 225086, 281267, 263999, 255407, 230471, 228011, 244557, 248817, 268985, 265876, 310171, 304199, 293557, 311212, 295036, 293494, 288693, 299208, 306313, 282827, 287903, 267783, 277377, 320336, 326694, 326262, 311493, 311391, 363892, 339071, 320334, 330056, 360474, 325944, 365214, 426411, 395915, 337943, 324762, 370078, 324810, 372744, 333129, 337368, 375587, 376451, 381228, 404975, 430148, 420646, 434682, 458002, 370064, 460188, 433844, 478976]
7581D78976K1410l489j46k1943l4235J9339k562P030O3400m4799m7542j0635N6685
7568D81489k752o114L4376K9238L9545r701J0017k8539M147j2333k2345M7506
7556E64534k5173K4204m094J0517j9622j4327L450m138j0434M4246r103j7748
7544E42312Q465L4278k1160L5705q345j8046K7897J5967l6745l2897L3502K0682
7532F01615N4490j2529O884L0346J7371J8341K011Q347j2606O8776m2387j4596
7520G26063l1808n7829m8065m0771J9208n1487j5674J0354K4490l4563J0197p424
7508E02691o790k3007M184J5917r51o146m1085K7146k2119K5047J6607j5452m3749
7495D32293J2515j8417Q2264J2218l1886j8121M2727M7845n4227Q102L2991L7667
$$ y = [478976, 500386, 496897, 496751, 474808, 440573, 459912, 457350, 464380, 527780, 482981, 435439, 424804, 481489, 478737, 472623, 506999, 536237, 575782, 566081, 576098, 547559, 551706, 539373, 517028, 564534, 539361, 563565, 559471, 569988, 550366, 536039, 539489, 535351, 524917, 569163, 560060, 542312, 550777, 585055, 563895, 599600, 591255, 573209, 601106, 617073, 580328, 547431, 580933, 601615, 656105, 643576, 650460, 680806, 698177, 716518, 718529, 726876, 714270, 783046, 740659, 726063, 694255, 636426, 588361, 547590, 566798, 515311, 499637, 509991, 534481, 499918, 510115, 502691, 495901, 472894, 477078, 492995, 492044, 485898, 444813, 471959, 449840, 474887, 491494, 476042, 432293, 444808, 426391, 508655, 520873, 488987, 470866, 513593, 561438, 507211, 515313, 548304, 585971]
7483E85971o102o7694M3386m7160J4319L2875j1415J6453o227J632Q278q345J656
7470E57627N51k124M1609N5354l0564m1456q773M3127L128J6239j572K0953L1527
7457F85626m0716j0554q134J1014L010Q637N2317l7503l3889O2709J0728l8266
7445F64979j5402Q0885O807J7539j3948M935l3870k5298J15770k1056n6904r068
7433G15369J0463L9302l0271R911M7964k0034j6743K8745j0951j0642o1683j5694
7421F85736L6050M5202Q776l19j559N8441m2050p5210L8222J2564j4996k1778
7409G29079P493O4793j2532k2303N858J2641m8638M6985k435R974k1906N253o392
7396G67870m0982k0452L5693o2578K5030J8438m7407n0496L4674k2882k5897L6244
$$ y = [585971, 579869, 512175, 555561, 508401, 522720, 555595, 544180, 560633, 554406, 556038, 564316, 555971, 557627, 558178, 556054, 597663, 653017, 622453, 580997, 572224, 615351, 618479, 634718, 633146, 654099, 685626, 644910, 634356, 626222, 637236, 640246, 648883, 701200, 663697, 629808, 692517, 703245, 664979, 649577, 730462, 737269, 754808, 740860, 745795, 711925, 686627, 802397, 781341, 724437, 715369, 725832, 765134, 734863, 744774, 792738, 772704, 755961, 784706, 773755, 763113, 701430, 685736, 721786, 766988, 775764, 775445, 773886, 832327, 790277, 715067, 753289, 765853, 750857, 729079, 736572, 801365, 788833, 766530, 772388, 785029, 736391, 783376, 780941, 790915, 769009, 774262, 767870, 726888, 706436, 742129, 679551, 704581, 723019, 675612, 625116, 659790, 636908, 611011, 647255]
7384F47255l3533L9658j8141p474L6342p1038n2047M996K9009j9552k1357J3428
7372E47546j5703N307k5419J8372k232J3342L28J9772j5994j3687l8974M4008
7360E36666J7681K011J1305L2357n6307p687K5167k864O1433J278o9802L767N8190
7347F13195m1656K8066N7856K195N22P43L7243n1176j4385k2520J6391l6019l4927
7334E55528j0935P377j8784j3922O0461K2566k1715l8309K4334k3846M6755o801
7322E82709j1754N1626m1723p797J9873K0112K9447n9382k2079J0352K4834L5240
7310F31458l6059j8122M0556J5201K9257K0661m3165o098K7230L709M9483L7853
7298G51964J2270n2191L922L9913j3175n988J5253J0516M7874P306l41N411L513
$$ y = [647255, 613722, 653380, 635239, 627765, 664107, 593069, 541022, 546018, 575027, 555475, 534118, 547546, 531843, 537150, 511731, 530103, 527871, 541213, 541541, 561313, 545319, 531632, 492658, 536666, 554347, 556358, 567663, 600020, 543713, 536026, 561193, 558329, 619762, 621040, 551238, 555005, 613195, 571539, 599605, 657461, 659656, 660178, 660921, 698164, 646988, 632603, 610083, 626474, 590455, 555528, 544593, 551970, 533186, 519264, 579725, 602291, 580576, 542267, 566601, 542755, 589510, 582709, 570955, 622581, 580858, 573061, 592934, 613046, 642493, 583111, 561032, 571384, 596218, 631458, 595399, 577277, 617833, 633034, 662291, 682952, 639787, 633689, 660919, 664628, 714111, 751964, 764234, 712043, 715965, 755878, 742703, 736715, 751968, 762484, 810358, 817664, 817323, 822734, 826247]
7285H26247M3233k6431M9013Q0022o1682k7619K8735l2545j4844m384M000J8364
7273H82109m3529k0243j6840o0164L3219N974l0754N7676P2387p9125J9657l1911
7261G88456J2142j7101n7244j7669P818p207n391O482k9911l7222N3580p2292
7249F24441j1478M4614Q303j7234J2437Q680n7028j5848k0888q799n447M484j4207
7236E52030r440M094O655P907l9337J6530K9121q1394j3700K337K1588k8084O2310
7223E30617j3544o997K0307n0458J7640J8741k8487j7455P161P9865l113o2668
7211D91609q097M4676n924j8165N6173o334j0435J0424J7402q423Q078Q097K2407
7198F01488K1830m5544N6517J5512l9216K718R011m855N1062K5807j0557l8522
$$ y = [826247, 869480, 843049, 892062, 972084, 910402, 882783, 911518, 878973, 864129, 859745, 863745, 882109, 838580, 818337, 801497, 741333, 774552, 780526, 749772, 807448, 879835, 800710, 820367, 788456, 800598, 783497, 726253, 708584, 716402, 709195, 703804, 710286, 680375, 643153, 696733, 624441, 612963, 657577, 665880, 648646, 661083, 669763, 612735, 596887, 575999, 567200, 561753, 566237, 552030, 542590, 546684, 553339, 561246, 521909, 538439, 567560, 486166, 472466, 474803, 496391, 468307, 530617, 517073, 510076, 530383, 479925, 497565, 516306, 487819, 470364, 477525, 557390, 554277, 491609, 483512, 528188, 522264, 504099, 560272, 553938, 543503, 553927, 571329, 562906, 570984, 579081, 601488, 623318, 577774, 634291, 649803, 610587, 613305, 622316, 617461, 668523, 694330, 683773, 645251]
7186F45251K6376M4875J6220m3503l0561P2093j3757N1357O141K1304L4941k3759
7174H06978j1823L817O0953k9418K461L00N060m3143j7076M7263P428k3901k4393
7161G84506j2016K2606j7799K2925o4627J5908J4291L145K6609n6552j6204m1270
7149F81522K5657j087J449k0394M4739l3311j8898M6318J9175j46n1096k1418
7137F72510l9136n7421L4004O1979m3913j5212J0343j4984j3888M1117J8987q652
7125F45734o9468L6991l5529L2945q533j4806K3188N18L3214p930j5351p858K6670
7112F39785Q0m268k470L5439k6404j6905L5J6509r84j0803L58M5209J8844k7374
7098F67051j9726K6657J4945J4262J7876k0929J7497K8261j4770l469n3876M7179
$$ y = [645251, 671627, 716502, 732722, 689219, 658658, 730751, 716994, 768351, 774492, 795796, 830737, 806978, 795155, 798972, 859925, 830507, 832968, 833268, 838328, 795185, 778109, 825372, 832800, 808899, 784506, 772490, 795096, 777297, 800222, 735595, 751503, 765794, 768939, 795548, 738996, 722792, 681522, 707179, 706092, 707541, 687147, 731886, 698575, 679677, 725995, 745170, 745024, 693928, 672510, 633374, 575953, 609957, 671936, 628023, 612811, 623154, 608170, 594282, 635399, 654386, 645734, 576266, 613257, 577728, 610673, 602140, 587334, 610522, 611040, 644254, 636324, 620973, 613115, 639785, 639865, 635597, 633127, 668566, 642162, 625257, 625292, 641801, 640817, 630014, 630372, 675581, 694425, 667051, 647325, 673982, 688927, 703189, 721065, 700136, 717633, 745894, 731124, 727655, 673779, 720958]
7086G20958M9820N9874K1314m4938L73P928J7556N0095J9588R031l7755J4148
7074H87992M8418j2355J4276L0913j6532J14387j8539m1652N5695N4515O1772
7063A178890J278k8267P7787P3490L8942K3423K8573N8765Q0726j118N2084J07190
7051A691763N9795L2545P0258J30643O1593J52390J80673J15408L19533L74299
7041C188900N16647M13775q4177m78308n48744m44036l04776j78959j84119j13319
7031A782884q8876j39608q353m9989m1419o9610k4017K2632Q254j8306j08802
7020A264790M1780K1560p503k8164J9887j3530K5622r8802J1012L3370o4503n1051
7008A154468k648j8801J0857J4216k681k4587m1314K0042R5000k3198N838k2468
$$ y = [720958, 770778, 830652, 851966, 807028, 807401, 815329, 832885, 882980, 902568, 911599, 873844, 887992, 936410, 924055, 938331, 969244, 952712, 1067099, 1048560, 1006908, 1062603, 1117118, 1178890, 1180168, 1151901, 1229688, 1303178, 1342120, 1365543, 1394116, 1452881, 1533607, 1532489, 1584573, 1691763, 1751558, 1784103, 1854361, 1985004, 2046597, 2198987, 2379660, 2495068, 2814601, 3188900, 3705547, 4119322, 4035145, 3556837, 3008093, 2564057, 2259281, 2080322, 1896203, 1782884, 1694008, 1554400, 1546047, 1496058, 1454639, 1385029, 1361012, 1383644, 1391898, 1373592, 1264790, 1306570, 1328130, 1320627, 1292463, 1312350, 1298820, 1324442, 1225640, 1236652, 1270022, 1205519, 1154468, 1151820, 1133019, 1143876, 1158092, 1155411, 1130824, 1089510, 1109552, 1204552, 1181354, 1187192, 1164724]
6996A164724R117Q132n9710N6062P786j1678k1680j9196K6693k3915J0405j6995
6984A129745L1796K1461q221k0112P1380q642J0313k3371O038j0994k8745K2111
6972A192759O3711l94k5645P7756O317J609p053J8917o251P0236k6854K7881J1908
6959A404897J5156p44M3605L0570R281L7236l5834L7780J2665k5103J5318L2227
6947A577054N575K5257J6286M9895K8410j1706j8466J4830O2954L8142M4486P6747
6935A909464K5342K3882L6726J2000J514J6787K9435O9904M8830M7600J9154R1571
6923B332209N3309P2342O1981P4641P9894K8860P0035M4778J26454M4107J20983
6912C109593R5902Q8162J32093M5479J03499J35134J22793Q8787J24967J56292
$$ y = [1164724, 1173841, 1181973, 1122263, 1178325, 1186111, 1174433, 1152753, 1133557, 1160250, 1136335, 1146740, 1129745, 1161541, 1183002, 1174781, 1154669, 1226049, 1217407, 1227720, 1204349, 1210387, 1199393, 1170648, 1192759, 1256470, 1256076, 1230431, 1308187, 1314504, 1316113, 1309060, 1327977, 1321726, 1391962, 1365108, 1392989, 1404897, 1420053, 1419309, 1462914, 1493484, 1502765, 1540001, 1504167, 1541947, 1554612, 1529509, 1544827, 1577054, 1582629, 1607886, 1624172, 1674067, 1702477, 1690771, 1672305, 1687135, 1750089, 1788231, 1832717, 1909464, 1934806, 1958688, 1995414, 2007414, 2008928, 2025715, 2055150, 2125054, 2173884, 2221484, 2240638, 2332209, 2385518, 2457860, 2519841, 2594482, 2674376, 2703236, 2773271, 2818049, 2944503, 2988610, 3109593, 3205495, 3293657, 3425750, 3471229, 3574728, 3709862, 3832655, 3921442, 4046409, 4202701]
6902D202701P6333J49442Q0015J21017J80380J69745J42051K14323J56711J92921
6892E685639K17128K07979J90939K42830K41713K25823K60695K99694L17892L15266
6882H205598L45491M18282L97231M05479M04717M67325M93022N11626N25980N18162
6872A2692913N73933M83020M46273M33474L87637L45594L18125L20572L21994
6863A6323535K65211K15051K42034K17234K25625L72648M24800L90086L04883
6854A8981107K21272J96344P0672J3303k2656k11395k58579l80779n01181n27179
6844A7580929n50238n22900n09140n11074m46324l81798l10738k16836k55790
6835A3876091k04490j87401k11321k63035k18502k54124l13059l53343m18519
$$ y = [4202701, 4279034, 4428476, 4508491, 4629508, 4809888, 4979633, 5121684, 5336007, 5492718, 5685639, 5902767, 6110746, 6301685, 6544515, 6786228, 7012051, 7272746, 7572440, 7890332, 8205598, 8551089, 8969371, 9366602, 9772081, 10176798, 10644123, 11137145, 11648771, 12174751, 12692913, 13266846, 13749866, 14196139, 14629613, 15017250, 15362844, 15680969, 16001541, 16323535, 16588746, 16803797, 17045831, 17263065, 17488690, 17861338, 18286138, 18676224, 18981107, 19202379, 19398723, 19469395, 19482698, 19460042, 19248647, 18990068, 18609289, 18108108, 17580929, 17030691, 16507791, 15998651, 15487577, 15041253, 14659455, 14348717, 14131881, 13876091, 13671601, 13484200, 13272879, 13009844, 12791342, 12537218, 12224159, 11870816, 11452297]
6826A1452297m11789n14316m74803m46115m27303m24739l77140l72642l12339
6817G691111l22176l85363k93820k35820k26339k76289j91588k30102k19633j07567
6807E202414j85208j31139j13760r3333j22157o5016p9371n5060r1750j34077
6797D131543p3817q8937o4062r9434q8288m9438p9822j3381l7628p8923p7590
6786C380223r1767K3016p1924q1792l2815l8069n0590o799l1130m1553m544j2760
6774B939496j406q0019P494k5900R992m7655k330m7294m9465p3640j3290P5840
6762B691823r329j1666J493O891L4K4559O4192J1974m5726L0899N3162j5709k3197
6749B779400J9952p352M8104K9344l1869L8222Q0916M0923M5436K8783J6086O4605
$$ y = [11452297, 11040508, 10526192, 10051389, 9605274, 9177971, 8753232, 8376092, 8003450, 7691111, 7368935, 6983572, 6689752, 6453932, 6227593, 5951304, 5759716, 5529614, 5309981, 5202414, 5017206, 4886067, 4772307, 4678974, 4556817, 4491801, 4412430, 4357370, 4265620, 4131543, 4057726, 3968789, 3904727, 3805293, 3717005, 3667567, 3587745, 3574364, 3536736, 3457813, 3380223, 3288456, 3311472, 3239548, 3157756, 3124941, 3086872, 3036282, 3029483, 2998353, 2956800, 2952256, 2939496, 2938090, 2858071, 2865565, 2839665, 2849657, 2802002, 2799672, 2752378, 2702913, 2629273, 2615983, 2691823, 2682494, 2670828, 2672321, 2679212, 2679246, 2703805, 2767997, 2779971, 2734245, 2765144, 2818306, 2802597, 2779400, 2799352, 2792000, 2840104, 2869448, 2837579, 2875801, 2956717, 2997640, 3043076, 3071859, 3087945, 3152550]
6737C152550O7513J6296O7722P0262N330P6183Q4018R3199K5662L4327N0832L6783
6725C780677L2527Q3789J05380Q2734P6984J36691Q4160J04129J37350J36492
6715D760913Q9628R9589J73117J55274J86472J91245J46241K26902K38199J80096
6705F447676K57966K56912K32918K49867K52974K87685L15301K94188L25948M10154
6695I331589M72895M23671N14683N78336O08810P12057Q36868Q57686Q32155O94303
6685A5863053N34854L74909M08430L71425N04353O57787P95630R38666J104359
6676B1553466J242113J589987J783314J899543J689558J074734M73434m218k79554
6667C1022377k41096O2989L46477O83708J052915J413885J857564K273519K429624
$$ y = [3152550, 3220063, 3236359, 3304081, 3374343, 3379673, 3455856, 3539874, 3633073, 3658735, 3693062, 3743894, 3780677, 3813204, 3896993, 4002373, 4085107, 4162091, 4298782, 4382942, 4487071, 4624421, 4760913, 4850541, 4950130, 5123247, 5278521, 5464993, 5656238, 5802479, 6029381, 6267580, 6447676, 6705642, 6962554, 7195472, 7445339, 7698313, 7985998, 8301299, 8595487, 8921435, 9331589, 9804484, 10228155, 10742838, 11321174, 11929984, 12642041, 13478909, 14336595, 15168750, 15863053, 16397907, 16772816, 17181246, 17552671, 18057024, 18714811, 19510441, 20449107, 21553466, 22795579, 24385566, 26168880, 28068423, 29757981, 30832715, 31306149, 31301931, 31022377, 30781281, 30844270, 31190747, 31874455, 32927370, 34341255, 36198819, 38472338, 40901962]
6658D0901962K423630J972060J025551K68914j16996j24416K79470P73844J303632
6649D8707651J886022K386845K941089L561163M196005M590374M222938K489660
6641G4981747P3197j980136l320046l697989l146994k265480j603609j243986
6633E7796704j047776p13282k97698K35045Q48714J561113K070763K503535K756253
6624F5713371K569956K242812J747463J446159J454246J635117J668693J496753
6616G9974570R96785P9635o75436j034907r67289n31509r2O7395n92288j557366
6606G5759498k395217k678633k499858k289596k293246k846367l377060l665994
6598E3713527l615086l171277k468451j802195j450225j421867j607495j846493
$$ y = [40901962, 43325592, 45297652, 46323203, 46592117, 46475121, 46350705, 46630175, 47404019, 48707651, 50593673, 52980518, 55921607, 59482770, 63678775, 68269149, 72492087, 74981747, 75054944, 73074808, 69754762, 66056773, 62909779, 60644299, 59040690, 57796704, 56748928, 56035646, 55737948, 55972993, 56821707, 58382820, 60453583, 62957118, 65713371, 68283327, 70526139, 72273602, 73719761, 75174007, 76809124, 78477817, 79974570, 80971355, 81050990, 80375554, 79340647, 78373358, 77841849, 77841757, 77909152, 77316864, 75759498, 73364281, 70685648, 68185790, 65896194, 63602948, 60756581, 57379521, 53713527, 50098441, 46927164, 44458713, 42656518, 41206293, 39784426, 38176931, 36330438]
6590C6330438j987085j907934j710409j569398j442273j402489j418563j365080
6582B3527207j237409j147903j055839q84129p34870o35123o63926n84525n65028
6573A6018455m88216l91521l79540l34187l07399j99268j47551j67181j52651
6564A3450941r5588r1693p7564q8651l9990j18981j91144k60674k92981l87355
6554A1806320m05342m20507m37281m26148l58086k92012k96599k29824k24440
6545H716081j83224j66789j63403j45638j40000j90116k20905j68601k04394k39235
6535F893776k28671k15688k77792l21511k71055j94153k16166k59268j88598j53671
6525D567203j94430j01970j26423j36292j44608j30528j05183j38995j60910j48413
$$ y = [36330438, 34343353, 32435419, 30725010, 29155612, 27713339, 26310850, 24892287, 23527207, 22289798, 21141895, 20086056, 19201927, 18467057, 17831934, 17168008, 16583483, 16018455, 15530239, 15138718, 14759178, 14424991, 14117592, 13918324, 13770773, 13603592, 13450941, 13355353, 13263660, 13186096, 13097445, 13057455, 12938474, 12747330, 12486656, 12193675, 11806320, 11400978, 10980471, 10543190, 10117042, 9758956, 9466944, 9170345, 8940521, 8716081, 8532857, 8366068, 8202665, 8057027, 7917027, 7726911, 7506006, 7337405, 7133011, 6893776, 6665105, 6449417, 6171625, 5850114, 5579059, 5384906, 5168740, 4909472, 4720874, 4567203, 4372773, 4270803, 4144380, 4008088, 3863480, 3732952, 3627769, 3488774, 3327864, 3179451]
6515C179451j85349j25718j30613j33807r5889q5850p3334r3131o5609n7684n0191
6504B082276r1145q6751m4287l6616l4877p1028L8261j18257o8385J4532o4525
6493A519198p790m3381o7176l3641j1875j4220l9831J4890l738n9546n3223n5144
6481A144523q254p4860k1802L9417l3666o0234J2213R188k5689k4049l8127L7445
6469I56105k3469m8856k2606j9096N231j8244K7975n5454q755N572j7326l2344
6457G48733M0161k496K1912n4039L14j9836m7968L5304J5035n3600J0386l9504
6445F54402J9111l2445j5996k2696n0576l0159K796J8929p642M1385J4995l9633
6433E52471j1860k2022J2982N097K3023n8933q5133N0409M6197Q394J5999p1839
$$ y = [3179451, 2994102, 2868384, 2737771, 2603964, 2508075, 2422225, 2348891, 2255760, 2190151, 2132467, 2082276, 1991131, 1904380, 1860093, 1823477, 1788600, 1717572, 1755833, 1637576, 1569191, 1583723, 1519198, 1511408, 1468027, 1400851, 1367210, 1355335, 1341115, 1301284, 1316174, 1312436, 1252890, 1199667, 1144523, 1136269, 1061409, 1039607, 1079024, 1045358, 985124, 997337, 1006525, 980836, 956787, 918660, 956105, 932636, 883780, 861174, 842078, 847309, 829065, 857040, 801586, 792831, 798403, 781077, 748733, 788894, 786398, 808310, 754271, 754585, 734749, 686781, 722085, 737120, 683520, 693906, 654402, 673513, 641068, 625072, 602376, 551800, 521641, 524437, 543366, 535724, 577109, 592104, 552471, 540611, 518589, 531571, 536668, 559691, 500758, 415625, 466034, 512231, 520625, 536624, 464785]
6421D64785m809M2976R221q701k1966P070j0478N1622m92R981l9840K6812j6466
6408E09715m3949q786K6513K1575K0212N4465k4846K0567K6842l0609N2074r577
6396F14196l0561j2246n229O9264n5865J5648K819k2864j075n17K730o2485L117
6383E16932J7719j6456N376P357l5374J5602N4904n8125j5395P7765J2567j3297
6371E69575M2842J0846K5528M0743j0995J2280n860m66K9311k4104P154J2037
6359G08891L1500M3551o079q489m9660J8882k4598L0168L8938k1989j398j2956
6347G46761L2413Q246o3574M0796m1333R984M1112k1744n2932l8731K7865J2261
6335G01124o7280l4999l0930k242k0442P649O426l464r2312R691J2394n3635L2878
$$ y = [464785, 459976, 502952, 512173, 503472, 481506, 488576, 478098, 529720, 529228, 539209, 499369, 526181, 509715, 465766, 456980, 483493, 505068, 525280, 579745, 554899, 575466, 602308, 571699, 623773, 614196, 583635, 571389, 566160, 635424, 579559, 595207, 598026, 575162, 574087, 573570, 576300, 513815, 516932, 534651, 518195, 523571, 530928, 495554, 511156, 566060, 507935, 492540, 570305, 582872, 569575, 612417, 623263, 648791, 689534, 678539, 690819, 684959, 684493, 713804, 689700, 696854, 708891, 740391, 783942, 777863, 769374, 719714, 738596, 713998, 744166, 783104, 761115, 759717, 746761, 779174, 787420, 723846, 764642, 723309, 733293, 774405, 752661, 699729, 660998, 688863, 701124, 633844, 598845, 567915, 565673, 545231, 552880, 559306, 555842, 463530, 473221, 485615, 431980, 464858]
6322D64858N7075l3459l0873j5303l2529k4569Q475j3916k4225j2099k3616j6297
6310C03522M127j3986k7571j8888j5896K2883m3494N471L7337k4451P269L952
6298B40275k848j1502L576L743n6656P1858l3491k4040K7642K0082j4285k0746
6286B03608M5189j431j1937R968J2304Q911j1971J156L2213k9983k2272N3467
6274B89222J4668k2304l2101M2M9740j1139K0104q3202l0706L4201r755J8234
6262B37004j0811J1294j3186l652M7225J3444n1168k3209J7240M2236L064M2488
6250C11969l1077j923p718m3895J4196L4720k1109j2170L5379r891K9013j6926
6238B80568J6642J1011j1853k3637M1710k3969N939K4247p929l99k1517L9273
$$ y = [464858, 521933, 488474, 457601, 442298, 409769, 385200, 393675, 379759, 355534, 343435, 319819, 303522, 307649, 293663, 266092, 247204, 231308, 254191, 210697, 216168, 253505, 229054, 236323, 240275, 237427, 225925, 229501, 233244, 176588, 248446, 214955, 190915, 218557, 238639, 224354, 203608, 248797, 247366, 235429, 245397, 257701, 266612, 254641, 255797, 288010, 258027, 235755, 289222, 303890, 281586, 249485, 249527, 299267, 288128, 308232, 225030, 194324, 228525, 218770, 237004, 226193, 237487, 224301, 220649, 267874, 281318, 230150, 206941, 224181, 266417, 269481, 311969, 280892, 278969, 271251, 227356, 241552, 276272, 255163, 242993, 278372, 268481, 297494, 280568, 297210, 308221, 296368, 272731, 314441, 290472, 296411, 320658, 312729, 312330, 290813, 330086]
6226C30086q569L7020O779K9382j528J0662k666l0454k4898P0293K4840p290M7455
6213D81112l854k0715l6154K6993L3614M7808k974r211L009J7504O9414j451l4821
6200E70274J0517l1723K8N4357K0636m553L8931J3145k9948N3344q885L5279J3758
6187G35160K4966j4401J190m062k5332M5193J4538l0476M6752m3734K6669N5991
6175H32454K2338j047J8785J0549M8169K042j7286Q015Q893K5991m1327J4169
6163I31745O3230K7535R900P649l7437N0931Q3529L1613N0783O7271L9975O4187
6151A390911J26582J7256J19961J23163R7799J50172J85793K35301J94268J73443
6141B814649Q5583k2466q2013r0333q5498l4825P645K1085Q7975J60193J73876
$$ y = [330086, 321517, 358537, 365316, 394698, 393170, 403832, 401166, 370712, 345814, 416107, 440947, 433657, 481112, 477258, 456543, 420389, 447382, 480996, 528804, 525830, 516619, 519628, 537132, 606546, 605095, 570274, 580791, 549068, 549096, 603453, 624089, 619536, 658467, 671612, 641664, 695008, 686123, 721402, 735160, 760126, 745725, 746915, 742853, 717521, 762714, 777252, 746776, 793528, 749794, 776463, 832454, 854792, 853745, 872530, 883079, 931248, 933290, 916004, 924019, 932912, 958903, 917576, 931745, 994975, 1022510, 1032410, 1040059, 1002622, 1053553, 1137082, 1168695, 1219478, 1286749, 1326724, 1390911, 1517493, 1534749, 1654710, 1777873, 1875672, 2025844, 2211637, 2446938, 2641206, 2814649, 2900232, 2877766, 2795753, 2705420, 2619922, 2585097, 2592742, 2613827, 2701802, 2861995, 3035871]
6130C035871L03368L31874L59714J82913J01028n2765k53091l29138l60609l82524
6120B936641k75262j84609q4851j07115k1979M7203N5761M6243J12737M1478q3189
6109B483058j68924k74029j79485j90078j98508j48151j56679j10198o8122j13546
6099H75338r1910j1090m542q0520l7338K2589n0907m167n2351n1999o5340q315
6087D39448J8284m5590l519k0427L7606k3702o5000O728l7106k9051J8567J2045
6075C08283j3832m941J2020o625k9289K6011K1634p1101j0795N4408n9657j2124
6063B13992N3436j6611M5044p764j8169N171L0007k0711l6519j9980K7434L8026
6051B93356l0644L1038O8476n6148J484K4466L32K6052l6332J400k5148J3952
$$ y = [3035871, 3339239, 3671113, 4030827, 4213740, 4314768, 4262003, 4008912, 3679774, 3319165, 2936641, 2661379, 2476770, 2391919, 2284804, 2262825, 2310028, 2365789, 2412032, 2524769, 2566247, 2483058, 2314134, 2040105, 1860620, 1670542, 1472034, 1323883, 1167204, 1057006, 988884, 875338, 783428, 772338, 767796, 687276, 649938, 672527, 621620, 617453, 565102, 513103, 447763, 439448, 457732, 412142, 408623, 388196, 425802, 402100, 337100, 343828, 306722, 277671, 296238, 308283, 294451, 289510, 301530, 294905, 265616, 291627, 313261, 242160, 231365, 285773, 226116, 213992, 267428, 250817, 295861, 288097, 269928, 275099, 305106, 284395, 247876, 227896, 255330, 293356, 262712, 293750, 362226, 306078, 307562, 332028, 332360, 358412, 322080, 323480, 298332, 312284]
6039C12284K3674R381m9710p50M8407K7106k5049L1315o3768o56K1342p3860j5332
6026B44384K2881N680L5083K5742k9116k4484k7318N428m5415j8818N2293m0794
6014B05546j4180K7039k4561L447L3847l3907J0667l7706k0655K6797r268R327
6002A76393k2429k9500K2785L9377k8401j4836m4302J2663K4821l4075J3171L2421
5990A48088J023J0622L1648k935o1881m642K132K2059l2028K2086K704j1827j0236
5977A16813L6479K5942j7288k3145N303L3967M097M3637m031o5708L3643L0322
5965B20031k5433L4393l487m68J2104L2378M2455j7180O448K3890J2822r777Q1094
5952D09270M6757R7698k7427m1352l400Q6963m8690J4044j6137J6629R9145L9460
$$ y = [312284, 335958, 345339, 295629, 294879, 343286, 370392, 345343, 376658, 312890, 312234, 333576, 259716, 244384, 267265, 272945, 308028, 333770, 304654, 280170, 252852, 258280, 212865, 194047, 246340, 205546, 191366, 218405, 193844, 197291, 231138, 197231, 207898, 170192, 149537, 176334, 167066, 176393, 153964, 124464, 147249, 186626, 158225, 143389, 99087, 111750, 136571, 102496, 115667, 148088, 149111, 159733, 191381, 188446, 126565, 121923, 124055, 146114, 114086, 136172, 138876, 127049, 116813, 153292, 179234, 161946, 138801, 144104, 178071, 182168, 225805, 221774, 156066, 189709, 220031, 194598, 228991, 225504, 225036, 237140, 269518, 311973, 294793, 301241, 325131, 337953, 328176, 409270, 456027, 553725, 526298, 484946, 481546, 568509, 519819, 533863, 517726, 534355, 633500, 672960]
5940F72960p8691k8667P4428k3254q44j0520K198Q622P3258l395m4910k1301J6705
5927F36589N040K457l9995l1427l0204N382J9828p3587k9454l5459M2932M8677
5915E20779l4096l9541L1810J790m5743q472l9796O257m1439L082J2644n5018
5903C12257j5869J1711j6805k1439j0785j8774j4780k8864q273l524n3624M5299
5891A76530j0692j1457O1168K1008o1335l3399J5677J7550p82k0552J4037L005
5879A70758k7074j0270J7802J0006k092k2319L8161m7318k3412O5151k3089K0812
5867A67116o470n0203J3349Q967m1038n345L6233q897n2786Q6539j8493K1548
5855A50520K602j6274M869j3650p947L9959k5220j8018q445K6693j4337J8448
$$ y = [672960, 594269, 565602, 640030, 616776, 615932, 605412, 607610, 616232, 689490, 686095, 641185, 619884, 636589, 641629, 644086, 604091, 572664, 542460, 547842, 567670, 494083, 464629, 429170, 472102, 520779, 486683, 447142, 478952, 480742, 434999, 426527, 386731, 392988, 351549, 354631, 367275, 312257, 296388, 308099, 291294, 269855, 259070, 240296, 225516, 196652, 188379, 184855, 131231, 176530, 165838, 154381, 215549, 236557, 175222, 141823, 157500, 175050, 174268, 153716, 167753, 170758, 143684, 133414, 151216, 161222, 159130, 136811, 174972, 127654, 104242, 169393, 146304, 167116, 160646, 110443, 123792, 132759, 91721, 86376, 122609, 113712, 60926, 147465, 128972, 150520, 153122, 136848, 141717, 128067, 120120, 160079, 134859, 116841, 108396, 135089, 120752, 139200]
5843A39200r65m0652J4988j1570j412k0470K1223j7954J2191L8341L5260l8977
5831A29203k2101K3783N697P378n7323L3325J7368K511m2471L0033k1081L7661
5819A43983k4230j8506l2291m652L6764O081o725j3959j5832j9266K6189K0015
5807I7571L3578j5993L5290o748R174k897k2235J0580j6349J0877J2837k8989
5795A16696k507L4370J0967L3159N1412m1369J3955k4504n5197k4526J1005r052
5783A14409M6314K1714J9718N6277k9073m0245J3383j3277O7872k949j5560N3017
5771B91600J3047m6883Q936Q283k6516J7388N876J3875K6659O585J0583p127K2856
5758C45162J5413J3833J1356l711j4709l6581J0139J0419q628k8690K8778l542
$$ y = [139200, 138235, 97583, 112571, 101001, 99589, 79119, 100342, 82388, 94579, 132920, 168180, 129203, 107102, 130885, 136582, 143960, 86637, 119962, 137330, 139841, 97370, 127403, 106322, 143983, 119753, 101247, 68956, 64304, 101068, 107149, 100424, 86465, 70633, 51367, 77556, 97571, 131149, 115156, 150446, 143698, 152872, 149975, 127740, 138320, 121971, 132848, 145685, 116696, 114189, 148559, 159526, 192685, 244097, 202728, 216683, 192179, 136982, 112456, 123461, 114409, 160723, 182437, 202155, 258432, 229359, 189114, 202497, 189220, 257092, 254143, 238583, 291600, 304647, 257764, 266700, 274983, 248467, 265855, 271731, 285606, 312265, 318850, 329433, 322306, 345162, 360575, 374408, 385764, 382053, 367344, 330763, 340902, 351321, 342693, 314003, 342781, 339239]
5746C39239l7643K6014j7972M4002k0965L4147L3075n6163M5613l3312l8677J4967
5734C32325r171n665k3852N5513r478L302j8761M2661L8596j5710p1199N6305
5722C74866L2054k2694M3105J1731p457l8672J7340J1633j6872R409M6180L9696
5710E00319j8758M6847M2138Q5199l981o911K1682L1878j9050J1506M6665L0174
5698G67708K9889K7562J04565k7223j0439N6932M9607R0550N0429R6612J01027
5687A337219P4536L6287M5295q07N3550Q9165O5114R3428O9355N1705K3093J23500
5675B061440J17455M7830J33299J64198J45093J91590J41379J25841K10873K02654
5665C541652K02476K09111K13085K15341J71141J89768K02209K82582L59645M14298
$$ y = [339239, 301596, 327610, 309638, 353640, 332675, 366822, 399897, 343734, 389347, 356035, 317358, 332325, 323154, 317489, 293637, 349150, 339672, 342974, 324213, 366874, 405470, 389760, 318561, 374866, 406920, 384226, 427331, 439062, 431605, 392933, 410273, 421906, 405034, 414443, 460623, 500319, 481561, 528408, 570546, 655745, 651764, 644853, 666535, 698413, 679363, 690869, 737534, 767708, 797597, 825159, 929724, 902501, 892062, 948994, 998601, 1089151, 1139580, 1236192, 1337219, 1411755, 1448042, 1493337, 1492530, 1546080, 1635245, 1700359, 1793787, 1863142, 1914847, 1937940, 2061440, 2178895, 2226725, 2360024, 2524222, 2669315, 2860905, 3002284, 3128125, 3338998, 3541652, 3744128, 3953239, 4166324, 4381665, 4552806, 4742574, 4944783, 5227365, 5587010, 6001308]
5655F001308M52553N46932O73847P43649Q65979R43714J062518J398004J660343
5646A4348847K006864K835132L843456M471541N475756J502816k003699l870219
5638B8610494n211355m676180l372972k410162k016650j484941j215475q60975
5630G361784q48258n83057n78277l83629l62228k75509k72842k20291k73723k47207
5620C316763k18899j85480k10522j61194j25554p9723j63079q1893j49581o1901
5610A878937j33309p5861q7546o9584k1511o6376j9803k7137r6839p8727k6324
5599A175920p5358l4642k658n0693p1696k3129j6889q968n0063j7662M450J1625
5587H40237m1707r3117J3790j7803J5370o1379m801m1051j6146K0774n1924L0090
$$ y = [6001308, 6453861, 7000793, 7674640, 8418289, 9284268, 10227982, 11290500, 12688504, 14348847, 16355711, 19190843, 23034299, 27505840, 32981596, 34484412, 32480713, 28610494, 23399139, 18722959, 15349987, 12939825, 10923175, 9438234, 8222759, 7361784, 6513526, 5930469, 5352192, 4968563, 4606335, 4330826, 4057984, 3837693, 3563970, 3316763, 3097864, 2912384, 2701862, 2540668, 2415114, 2335391, 2172312, 2090419, 1940838, 1878937, 1745628, 1669767, 1582221, 1512637, 1491126, 1424750, 1404947, 1377810, 1280971, 1202244, 1175920, 1100562, 1065920, 1063262, 1012569, 940873, 917744, 900855, 891887, 841824, 824162, 828612, 840237, 798530, 705413, 719203, 701400, 716770, 655391, 650590, 609539, 593393, 614167, 562243, 592333]
5575E92333m5450l5949K005J1163K5103l7559j0286l9145l1113l179l520q0291
5563C44112k353P3154J179l1909m5471m5985M6650p311l130m3446R595J9053m9170
5550B64968k7976J1111J7944m3989L169L3289K1899J8694l5603o1236j0513j5670
5538A76087M849j0626m571N0553J1995k165o1469l911M0276l5060N6590k9466
5526A93082P186j0726j9449M854Q592J8712j2644J1597K6088m9491M964m4830
5514A37935j41K3667K2156m0494L6142K9174q05N523J4478j9093k273K1927p5027
5501A53169J7567M25J3326k511J1242K6227m501K5190n4130k7255J0641K3919
5489A93309L196R851k1960l777K3466j551P770J591J6861P969o5287K06J2431
$$ y = [592333, 546883, 510934, 512939, 524102, 549205, 511646, 501360, 462215, 431102, 427923, 424403, 344112, 341759, 414913, 416092, 384183, 338712, 292727, 339377, 332066, 328936, 285490, 295085, 314138, 264968, 236992, 248103, 266047, 222058, 225227, 258516, 280415, 299109, 263506, 202270, 191757, 176087, 180936, 170310, 165739, 216292, 228287, 226122, 164653, 160742, 201018, 165958, 222548, 193082, 200268, 189542, 170093, 174947, 183539, 202251, 189607, 201204, 227292, 177801, 182765, 137935, 137794, 161461, 183617, 143123, 179265, 208439, 207634, 213157, 227635, 208542, 206269, 228196, 153169, 170736, 171161, 184487, 181976, 193218, 219445, 214944, 240134, 186004, 158749, 169390, 193309, 196505, 206356, 184396, 180619, 204085, 202534, 210304, 211895, 228756, 236725, 171438, 171644, 184075]
5476A84075K451K245L5180k2729k4987M1386K1798J7299k3226M230j3521M0433
5464B64634l6424k1512j51o605l1170K8244K6382k6133l6944Q5671j0197k6279
5452B09516K7816j2183l0777k0567L9482m5182o67M6282Q580j581m2477N0334
5440B28576j1566N815j7621J5730N862k2744P8028o0497K4143R445J9068m2837
5428B31402L9777K5725n8644n834N7895k8861N832J6523j5539Q3244Q214j4138
5416C45596j6454M4598K6756N4726K1731K0574J609L3024L8058M549J0082L1584
5404F16433J4121K5924k3086j7614M3975p931R016K675L4852O7156j6368L5856
5392G85009O5238k262L2593J0414K6244J39315K9851K4287P4748K4561J8029p8305
$$ y = [184075, 186526, 188771, 223951, 201222, 176235, 217621, 239419, 256718, 233492, 237722, 224201, 264634, 228210, 206698, 206547, 199942, 168772, 197016, 223398, 197265, 160321, 245992, 235795, 209516, 237332, 225149, 194372, 173805, 213287, 168105, 167438, 213720, 222300, 220719, 178242, 228576, 217010, 222825, 205204, 220934, 226796, 204052, 282080, 221583, 245726, 255171, 274239, 231402, 271179, 296904, 238260, 232426, 290321, 261460, 267292, 283815, 268276, 351520, 359734, 345596, 329142, 373740, 400496, 455222, 476953, 497527, 499136, 532160, 570218, 574767, 584849, 616433, 630554, 656478, 633392, 615778, 659753, 651822, 660838, 663513, 698365, 765521, 749153, 785009, 850247, 847985, 880578, 890992, 917236, 1056551, 1086402, 1110689, 1185437, 1209998, 1228027, 1149722]
5380A149722q6159q6234j19111p7182o5582l8065o4029j0804m2349l5412j3837
5369E10958j6387n3319l5714j6836R653k509n784M206l0047Q752m5759L3668j4886
5356C45996o808J9067k8805j1871J8232j7279o920r178O0093M368l0866p7270
5344B58759M9546J0960J0207K9153k2292J1057P8350J7885k8829J1695j4439k6439
5332C85613n4103m0101k1651J1474O416l3520K5977j535r5113O3440J7144j7244
5320B46797P596k7460k0145J2994k5024N716Q991J3494J9786m4616l1686M5456
5308B11899P164l502L4094q9246l6706M4319M2943K9999j2885j69j6644J4296
5296B25562j0276q246l6687J2880M4966k5106K1940m890m7039M186j9166j1638
$$ y = [1149722, 1063563, 977329, 858218, 781036, 715454, 677389, 613360, 602556, 560207, 524795, 510958, 494571, 441252, 405538, 388702, 398355, 395846, 390062, 394268, 364221, 372973, 327214, 360882, 345996, 339188, 358255, 329450, 317579, 335811, 318532, 311612, 302434, 362527, 366895, 336029, 258759, 308305, 319265, 329472, 358625, 336333, 347390, 425740, 443625, 414796, 426491, 412052, 385613, 331510, 291409, 269758, 281232, 287648, 254128, 280105, 278570, 183457, 246897, 264041, 246797, 254393, 226933, 206788, 219782, 194758, 200474, 209465, 222959, 242745, 198129, 166443, 211899, 219063, 215561, 249655, 160409, 123703, 168022, 210965, 240964, 228079, 227910, 211266, 225562, 215286, 207040, 170353, 183233, 228199, 203093, 225033, 220143, 173104, 177290, 158124, 146486]
5284A46486N6223Q006k1115M0452m3910k3029M2602n924k1286l2071J514K5672
5272A73620N6841k3169n3481L4498q87N292K2540m1751k3238N2157N416j1919
5260A95919J9723l1505r814L154N505K2436l713L3852m2440k2194J4857k8955
5248A56825j290M4501M4256l2934J5262r354l8425J9438L61M1884j179k2588l1510
5235A85247k154M3772j7567J8145N818m340K6334P214R686J8443m0378M8314k0473
5222B78061j4820L4572L810k226L369j1311J8991k7943J4448K9073n5547l457
5210B67020M0086r258N269K3763N4330M1462k7698k7822q277m2600L4218k2100
5198C28393m2310J7512j3891J1614k2037j0680m4913r066j159N4093R074n5343
$$ y = [146486, 202709, 210715, 189600, 230052, 186142, 163113, 205715, 199791, 178505, 146434, 147948, 173620, 230461, 207292, 153811, 188309, 187422, 192714, 215254, 173503, 150265, 202422, 207838, 195919, 215642, 184137, 174323, 177477, 182982, 205418, 201705, 235557, 193117, 170923, 185780, 156825, 155535, 200036, 244292, 211358, 226620, 217266, 178841, 198279, 198640, 240524, 239345, 216757, 185247, 183093, 226865, 209298, 227443, 233261, 228921, 255255, 262469, 272155, 290598, 250220, 298534, 278061, 263241, 297813, 301623, 299397, 302766, 291455, 310446, 282503, 296951, 326024, 270477, 267020, 307106, 297848, 303117, 326880, 381210, 422672, 394974, 367152, 358875, 316275, 350493, 328393, 286083, 303595, 289704, 301318, 279281, 268601, 223688, 214622, 213463, 267556, 276630, 221287]
5186B21287K5628j1495P862Q439k8343J4011J0538K5788m0932l2713N8892m1068
5174B17894p335M9472k2806L5150q053m0690j433L6124j9439l4584L2966J8211
5162B55477L1476J5808k5383L3006n988o066o158Q550n1624m692k4850J6804J7875
5149B54235l1411L2406j1753k7887J9780J3336Q094j3336Q515r434l8199O8696
5137B73042J8299n7044J809N479j3592l8751J1711L5328N6461j0289q967j8045
5125B55441k0991K0796k7693k481J4277Q0612l3242o460l0765M707M8616k2911
5113B79906m862l6427J5140J8742K9354J8130p700k4554J4027k5287M2459n0017
5101B68911K7827M1763k3182Q521p05K9815p863P502m5307l7539k3613L7733J5417
$$ y = [221287, 246915, 235420, 243282, 251721, 223378, 237389, 247927, 273715, 232783, 200070, 258962, 217894, 210559, 260031, 237225, 272375, 264322, 223632, 222199, 258323, 238884, 204300, 237266, 255477, 286953, 302761, 277378, 310384, 304396, 298330, 292172, 300722, 249098, 244406, 219556, 236360, 254235, 222824, 255230, 243477, 215590, 235370, 248706, 256800, 243464, 251979, 242545, 204346, 273042, 291341, 234297, 236106, 241585, 227993, 189242, 200953, 236281, 292742, 282453, 273486, 255441, 234450, 255246, 227553, 225072, 239349, 319961, 286719, 280259, 249494, 254201, 302817, 279906, 275044, 238617, 253757, 272499, 301853, 319983, 312283, 287729, 301756, 276469, 318928, 268911, 296738, 338501, 315319, 323840, 323135, 352950, 345087, 352589, 307282, 269743, 246130, 283863, 299280]
5088B99280l0891l059K5444M7172R725j3899J5388l2196j9147L6557L19J0021
5076C44714j4002K0521j7156M7529J2279j5627K1556l9074L8057K4112k9879J2831
5064D05861K7999l7249l794N9031M9308n6968J520k3835M7058J3895k5909l7354
5052D19563R4893Q562o272Q489l7800J2979j1008k1047l819k5766m1787J2851
5040D09838O1665j582j8871j6683K4251k3691l4993M0809K7184m1850R787O7956
5028E03820K3370l7063o665m4574j0066L2558r989K3734K5081k625J7186l8246
5016D76521L755j6531r653K239J9497L1894j5859K2022k0277k1020M0162n8420
5004D54330k2395K9515n057K1954k2235l077o3215Q1667K6829J8775J2351k8349
$$ y = [299280, 268389, 265330, 290774, 337946, 347671, 333772, 349160, 316964, 297817, 334374, 334693, 344714, 330712, 351233, 334077, 381606, 393885, 378258, 399814, 360740, 398797, 422909, 393030, 405861, 433860, 396611, 392817, 451848, 501156, 444188, 445708, 421873, 468931, 482826, 456917, 419563, 514456, 523018, 516746, 525235, 487435, 500414, 489406, 468359, 464540, 438774, 396987, 409838, 471503, 469921, 451050, 434367, 458618, 434927, 399934, 440743, 467927, 426077, 435864, 503820, 527190, 490127, 483462, 438888, 428822, 461380, 451391, 475125, 500206, 497581, 514767, 476521, 480276, 463745, 454092, 456331, 475828, 507722, 491863, 513885, 493608, 472588, 512750, 454330, 431935, 461450, 456393, 478347, 456112, 453035, 389820, 471487, 498316, 517091, 529442, 501093]
4992E01093K1040L0941K864J4130l1395J4615P4256L4118M658J8406j576J6882
4980G00032P944j5741N9046k3605N1380J4790Q975R6029J2248K2143J0871k4806
4968I19306j2595l7412l3146M8130R415M5790L8548K6146k1637L2797L5704J5641
4956A066687L6663M4467k1297L9296O3191L8795O6309M147k424L1026R589k2695
4944A353754p2346j28j0101O6004K8060M042K4717J9043N340K8309R008J9601
4932A475303P8048O8332J05646L1452R5758O7568K6401O7476J22190J26820J65840
4921B430834J35900J96005K40106J55508O3705l4996j05455j09309j43096p5895
4911B753307n5152j16261j1023o2884o984m2670L2541m0014o9087O5087l1071
$$ y = [501093, 522133, 553074, 555938, 570068, 538673, 553288, 627544, 661662, 666320, 684726, 683150, 700032, 707976, 692235, 751281, 727676, 779056, 793846, 802821, 898850, 911098, 933241, 944112, 919306, 906711, 869299, 836153, 884283, 893698, 939488, 978036, 1004182, 982545, 1015342, 1051046, 1066687, 1103350, 1147817, 1126520, 1165816, 1229007, 1267802, 1334111, 1338258, 1335834, 1366860, 1376449, 1353754, 1281408, 1281280, 1271179, 1337183, 1365243, 1369285, 1394002, 1413045, 1418385, 1446694, 1455702, 1475303, 1553351, 1621683, 1727329, 1758781, 1854539, 1922107, 1948508, 2015984, 2138174, 2264994, 2430834, 2566734, 2762739, 3002845, 3158353, 3222058, 3187062, 3081607, 2972298, 2829202, 2753307, 2698155, 2581894, 2570871, 2507987, 2501003, 2458333, 2490874, 2450860, 2381773, 2446860, 2415789]
4900B415789J5997M4530J9071R7611P0452K9498J49705R6263J66139K1487m916
4889C121626k3723l5913K3315k3351j9822n5062K0895J409J9339r6829o1686l5769
4877B834429r5779j09989q5620j00258j1842l2439j2705l285J5630L5962j2366
4866B421738k2307k1799K2222O816N5495k5958M2214l477P241Q8391J0764J7783
4854B599123K4254K8987K8190N930K4632K0524O2501K1998N9552J8007M8519L1436
4842B973653K3705O6936M8520J9733N342j3519k2776n9180M6729j6222J4037n5318
4830C031640j9462J8287k0828J1495J5095J6729K3969M0098k3878o6410r7712
4819B929023m3842k1983Q780l9829R713l5252m850m375k9666K2151j7473N739
$$ y = [2415789, 2431786, 2476316, 2495387, 2592998, 2663450, 2692948, 2842653, 2938916, 3105055, 3126542, 3121626, 3097903, 3061990, 3085305, 3061954, 3042132, 2987070, 3007965, 3009374, 3028713, 2931884, 2870198, 2834429, 2738650, 2628661, 2543041, 2442783, 2430941, 2398502, 2385797, 2382512, 2398142, 2434104, 2421738, 2399431, 2377632, 2399854, 2406670, 2462165, 2436207, 2478421, 2474944, 2482185, 2570576, 2581340, 2599123, 2623377, 2652364, 2680554, 2686484, 2711116, 2731640, 2794141, 2816139, 2875691, 2893698, 2942217, 2973653, 2997358, 3064294, 3112814, 3132547, 3137889, 3124370, 3101594, 3042414, 3089143, 3072921, 3086958, 3031640, 3012178, 3030465, 3009637, 3021132, 3036227, 3052956, 3076925, 3117023, 3093145, 3026735, 2929023, 2885181, 2863198, 2871978, 2832149, 2841862, 2806610, 2801760, 2797385, 2767719, 2789870, 2772397, 2778136]
4807B778136j7091K8269J1711M6255J03398Q9686M3633M3818K0029L0439L0449
4796C208732m6504j1961J9166Q7214l9263P890Q4238L2217J0489J4429k2431q138
4784C336078N6465M5603N3431J12760P9888L9898N9317L9335K9849J9291R9222
4773C971137J2997L3765Q8327M4415N4200P5935M987K9781J12558J3549O3392
4762D505043L7440M2690l672K3164P1279P7660Q6606Q0615M2469P0652L9005J27497
4750E200448O7286O72N0640J59233K4037j5759M2533Q8518K9728M276Q2485P1759
4738E805856M2918J15542Q3246M9859R1879K159J49956R7057J43510J52130R7153
4727F831265J36544J63254J80526J87632J93945K41837J70879K48799K16271K30975
$$ y = [2778136, 2761045, 2789314, 2801025, 2847280, 2950678, 3040364, 3083997, 3127815, 3147844, 3178283, 3208732, 3162228, 3150267, 3169433, 3256647, 3217384, 3225274, 3309512, 3341729, 3352218, 3366647, 3344216, 3336078, 3392543, 3438146, 3491577, 3604337, 3684225, 3724123, 3783440, 3822775, 3852624, 3871915, 3971137, 3984134, 4017899, 4106226, 4150641, 4204841, 4280776, 4285763, 4315544, 4428102, 4441651, 4505043, 4542483, 4585173, 4581501, 4604665, 4675944, 4753604, 4840210, 4920825, 4963294, 5033946, 5072951, 5200448, 5267734, 5268406, 5319046, 5478279, 5502316, 5486557, 5529090, 5617608, 5647336, 5651612, 5734097, 5805856, 5848774, 5964316, 6047562, 6097421, 6189300, 6191459, 6341415, 6438472, 6581982, 6734112, 6831265, 6967809, 7131063, 7311589, 7499221, 7693166, 7935003, 8105882, 8354681, 8570952, 8801927]
4717H801927K58496K87093L01109L83703L56676M12132L55588M33864M84132M57968
4707A2532688N03372N69642N42135N97117O19208O25688P23371O86181P51343
4698A8150745Q43323Q32212R49737J012836J028260J114840J115998J053464J189787
4689B7291202J296281J325521J493397J556544J695625J797764J945641K094027
4681D0496002K044015K120299K224983K384541K593683K872417L156963L431771
4673F1324674L730065L928663M246529M479462M720639N028979N572363O332796
4665I9364170P476347Q978304J0493983J1394793J0500871P731877N650540M469773
4657A66060658M514018N571711P288993R139023J1253143J4217990J7915802K0612413
$$ y = [8801927, 9060423, 9347516, 9648625, 10032328, 10389004, 10801136, 11156724, 11590588, 12074720, 12532688, 13036060, 13605702, 14147837, 14744954, 15364162, 15989850, 16713221, 17399402, 18150745, 18994068, 19826280, 20776017, 21788853, 22817113, 23931953, 25047951, 26101415, 27291202, 28587483, 29913004, 31406401, 32962945, 34658570, 36456334, 38401975, 40496002, 42540017, 44660316, 46885299, 49269840, 51863523, 54735940, 57892903, 61324674, 65054739, 68983402, 73229931, 77709393, 82430032, 87459011, 93031374, 99364170, 106840517, 115818821, 126312804, 137707597, 148208468, 155940345, 161590885, 166060658, 170574676, 176146387, 183435380, 192574403, 203827546, 218045536, 235961338, 256573751]
4649B56573751K0433968J3497220M682130j367570m888537o815877p283865n744853
4641B69086367l292022l62592K837888K851630m595698j3125558j9185563k2849350
4633B11365102k3186516k0185961j6516165j3846311j1771387r993708q501408
4626A07363646p208868o081670n066264m040664l193941k573543k154626k110915
4618G4933155k312956k566336k869345l028098k887053k694103k399359k049522
4610E4126383j812987j576919j280724j099976j007277r19370p95475o86407o12627
4601D4334621o73898p23035q36253q66715q76665p81529p29376o44518o03892
4592C7598740m77733l93165l22698l42899k26459j62221j64715l38498o36363
$$ y = [256573751, 277007719, 290504939, 295187069, 293819499, 288930962, 282115085, 274831220, 269086367, 265794345, 265431753, 268269641, 271121271, 266525573, 253400015, 234214452, 211365102, 188178586, 167992625, 151476460, 137630149, 125858762, 115865054, 107363646, 100154778, 94073108, 89006844, 84966180, 81772239, 79198696, 77044070, 74933155, 72620199, 70053863, 67184518, 64156420, 61269367, 58575264, 56175905, 54126383, 52313396, 50736477, 49455753, 48355777, 47348500, 46429130, 45633655, 44947248, 44334621, 43660723, 42937688, 42101435, 41234720, 40358055, 39576526, 38847150, 38202632, 37598740, 37121007, 36727842, 36405144, 36062245, 35835786, 35673565, 35508850, 35170352, 34533989]
4583C4533989q55263j069545j137178j111252j000300q03308o74967m58120l68592
4574B7055464k95820k12308k34431k16538k33890j76360j25313o0712k3410Q0350
4564B5557032Q4468K29005K99892L13168L82218L03943K29821J68846J14251J40838
4554B7823482N1418J76469K31244J62855Q7128K22038L37847M72388O30244P93402
4544C0988515J038154J195605J411297J516224J621987J807820K181019K567219
4536D4327840L016316L121021K940893K381810J369363M14211l97500o54845o32712
4527E5886397k30853L09127Q40729J225120J609865J762098J794503J803378J537388
4518F6537752J204860P38599K02566k83102o90990q68392r38371j272224j507950
$$ y = [34533989, 33678726, 32609181, 31472003, 30360751, 29360451, 28557143, 27882176, 27424056, 27055464, 26759644, 26547336, 26312905, 26096367, 25862477, 25686117, 25560804, 25500092, 25476682, 25557032, 25641500, 25870505, 26170397, 26483565, 26865783, 27169726, 27399547, 27568393, 27682644, 27823482, 27874900, 28051369, 28282613, 28445468, 28532596, 28754634, 29092481, 29564869, 30195113, 30988515, 32026669, 33222274, 34633571, 36149795, 37771782, 39579602, 41760621, 44327840, 47344156, 50465177, 53406070, 55787880, 57157243, 57571454, 57173954, 56519109, 55886397, 55655544, 55964671, 56805400, 58030520, 59640385, 61402483, 63196986, 65000364, 66537752, 67742612, 68481211, 68683777, 68400675, 67709685, 66841293, 65902922, 64630698, 63122748]
4509F3122748j603566j573389j335167q63004l71455K02631N74125N62716n3769
4500E8661870j097572k121932k901557l299236l240560k910064k542362k136175
4492C8412412j785186j482269j249421j101283q56486q62167p91419o37405o09463
4483B9037313n27999m35553m17644l63491k25470k07824j40689o2056L2795k7313
4473B6662069m9134j42373k23645l04249k98277j95930j49718j60054k9882K6120
4463B5134927P2744K07765K68592L34690M63497N44348O19217P27050Q26688Q56576
4453C0056094Q10105Q29433P68779N48450L61702K16722J33429J33964J75677
4444C4034355K71947K90405K88222K35828J30299K2075l4502O5512K23974K82074
$$ y = [63122748, 61519182, 59945793, 58610626, 57747622, 57376167, 57578798, 58152923, 58715639, 58661870, 57564298, 55442366, 52540809, 49241573, 46001013, 43090949, 40548587, 38412412, 36627226, 35144957, 33895536, 32794253, 31937767, 31075600, 30284181, 29646776, 29037313, 28509314, 28073761, 27656117, 27292626, 27067156, 26859332, 26718643, 26656587, 26689382, 26662069, 26612935, 26470562, 26246917, 25942668, 25644391, 25448461, 25298743, 25138689, 25108807, 25134927, 25207671, 25415436, 25684028, 26018718, 26482215, 27026563, 27645780, 28372830, 29199518, 30056094, 30866199, 31695632, 32464411, 33012861, 33374563, 33591285, 33724714, 33858678, 34034355, 34306302, 34596707, 34884929, 35120757, 35251056, 35273131, 35238629, 35304141, 35528115, 35810189]
4434C5810189N47005O98072Q22444R68067R61962R13277Q50568Q30684P48270
4425D3150538P70448Q46964Q67036Q64578Q29141O91842N22205K04098j52216
4416D8594634n50891r96715j155765j263300j263143j126285r46801n54857k86008
4407D0450869k2639J61385K99759M81513O50856R16004R94351J061603R57314
4398D5951015O57061K80376j56491o13410r99553j344701j611374j841999j882183
4389C8438741j861532j842948j673956j402532j140464r44111o28052m76667l12887
4380B8155592j87985J0575J01013J63183K57060K05640R5947q1689k80955n47235
4370B7891146q02052r14331q85102q89440q25631o46647n08919m20195l05956
$$ y = [35810189, 36357194, 37055266, 37877710, 38845777, 39807739, 40721016, 41571584, 42402268, 43150538, 43920986, 44767950, 45634986, 46499564, 47328705, 48020547, 48542752, 48746850, 48594634, 48043743, 47047028, 45891263, 44627963, 43364820, 42238535, 41291734, 40736877, 40450869, 40428230, 40589615, 40889374, 41370887, 42021743, 42937747, 43932098, 44993701, 45951015, 46608076, 46888452, 46731961, 46118551, 45118998, 43774297, 42162923, 40320924, 38438741, 36577209, 34734261, 33060305, 31657773, 30517309, 29573198, 28945146, 28468479, 28155592, 27967607, 27978182, 28079195, 28242378, 28499438, 28705078, 28801025, 28719336, 28438381, 27891146, 27089094, 26174763, 25289661, 24400221, 23574590, 22927943, 22419024, 21998829, 21692873]
4361B1692873j37564p1752L278R6987K24437K40366L35128L74428M87124M83691
4351B3728996N02164N84684O87844Q25187R20551J205729J377848J681042J974578
4342C3488623K226936K632199K934156L416483M042004M838238N949289P406444
4334F6934372Q909543R724079Q919514M730937j689768p303941j0400266j0717466
4326F9107004r332127p734199o368922n159849m264677l463497k868170k358164
4318B7557399k008983j726148j503436j279273j131680j082385j025627r97918
4310A6801949r03466q44018p52028p17935o30753n82332m89653m70581m41131
4301A0970052m48796l70456m34550l68681k88938k77292j61517j95594k01437
$$ y = [21692873, 21555309, 21483557, 21486835, 21583822, 21808259, 22048625, 22383753, 22758181, 23245305, 23728996, 24231160, 24815844, 25503688, 26328875, 27249426, 28455155, 29833003, 31514045, 33488623, 35715559, 38347758, 41281914, 44698397, 48740401, 53578639, 59527928, 66934372, 75843915, 85567994, 94487508, 99218445, 97528677, 90224736, 79824470, 69107004, 59774877, 52040678, 45671756, 40511907, 36247230, 32783733, 29915563, 27557399, 25548416, 23822268, 22318832, 21039559, 19907879, 18825494, 17799867, 16801949, 15898483, 15054465, 14302437, 13584502, 12953749, 12371417, 11881764, 11411183, 10970052, 10521256, 10150800, 9716250, 9347569, 9058631, 8781339, 8619822, 8424228, 8222791]
4292H222791j80812k59437k01021j84962k35107j52969j76138k28216j41504j90514
4282F272111j41987r5292j35986j07160j23337j47030j2347l6254j33312q1919
4272E257487o6835o9741j43481m3254l1723j3253k0404o3773m2975K7124K4033
4261D813205r4923L4384Q7185L7922j02842q5855k10721j66606j58348j66379
4251C987022j23951j13425j31186j29938r2759j20298q1792m1180p9633o5065
4241C007795m6006p0289j16583m2826k356n4134m2p4802m7242j5732l2568n9004
4229B446211l6198k9888k3154k1349J7984o2824J5411K7167m8186j3471J6013
4218B287716m9723N6655N0965k3756k4113N6018P2968M763K7910K1955N9979J8085
$$ y = [8222791, 8041979, 7782542, 7581521, 7396559, 7161452, 7008483, 6832345, 6604129, 6462625, 6272111, 6130124, 6034832, 5898846, 5791686, 5668349, 5521319, 5508972, 5472718, 5339406, 5257487, 5190652, 5120911, 4977430, 4934176, 4902453, 4889200, 4868796, 4805023, 4762048, 4789172, 4813205, 4718282, 4752666, 4839851, 4877773, 4774931, 4689076, 4478355, 4311749, 4153401, 3987022, 3863071, 3749646, 3618460, 3488522, 3395763, 3275465, 3193673, 3152493, 3072860, 3007795, 2961789, 2891500, 2774917, 2732091, 2729735, 2675601, 2675559, 2600757, 2553515, 2537783, 2505215, 2446211, 2410013, 2380125, 2356971, 2335622, 2353606, 2290782, 2306193, 2333360, 2285174, 2271703, 2287716, 2237993, 2294648, 2345613, 2321857, 2297744, 2353762, 2426730, 2431493, 2459403, 2481358, 2541337, 2559422]
4206B559422M0334L4928o9902l3972m4946o4041l905L8418K209j9546J0655K0158
4194B469812k7019J8031q677K6191R429m8717L8426Q911p892M7706k1482K0511
4182B525230K196k5675l5674N5532K1140J8666j7257m5711j254l1182Q08M3799
4170B510618l559L2525N7057j1326L5481J5982Q4326N1248N357K5623N638j2255
4158B796715N8420O2532K2013M7101K4019M423p64k2886k0368o4352l5933j4632
4146B856288j5562k020m864k505J177j9477N428N72n260J2941K64O954j8402j9438
4132B796096J2776m5339j6834J9908k4924J7L3415L2076M612M5945O6005k4033
4120B899720j2381N1596n180j05121k7652R918J3528j485J886k3146P9695J3508
$$ y = [2559422, 2599756, 2634684, 2564782, 2530810, 2485864, 2421823, 2417918, 2456336, 2458545, 2438999, 2449654, 2469812, 2442793, 2460824, 2452147, 2478338, 2487767, 2439050, 2477476, 2486387, 2478495, 2526201, 2504719, 2525230, 2527426, 2501751, 2466077, 2521609, 2542749, 2561415, 2544158, 2498447, 2497193, 2466011, 2466819, 2510618, 2507059, 2539584, 2596641, 2585315, 2620796, 2636778, 2721104, 2772352, 2777709, 2803332, 2808970, 2796715, 2855135, 2917667, 2939680, 2986781, 3010800, 3015223, 3014459, 2991573, 2971205, 2906853, 2870920, 2856288, 2840726, 2838706, 2833842, 2831337, 2832514, 2813037, 2818465, 2819037, 2813777, 2826718, 2826982, 2833936, 2815534, 2796096, 2808872, 2763533, 2746699, 2766607, 2741683, 2741700, 2775115, 2807191, 2811803, 2857748, 2923753, 2899720, 2887339, 2938935, 2933755, 2828634, 2800982, 2810900, 2824428, 2822943, 2824829, 2801683, 2881378, 2894886]
4108B894886j9168J2405M0138L4656k6331L6870q541Q1428N9556R0282K4594K8247
4096C249022M0657m0192k9299n02m1580M9729K7519J3890P5583M1799K4727K1334
4084C432687P1089K4087O158K7622O2007L7402L2036N0304J03656O6758O4367
4073C978173K3955n667K9256O591N2061M78J30397L9407P2416J74454J06318K3075
4061D630914P5715O4749O1025Q0583L7528R1865L5020M0238J3126P9658J28041
4050E338462R7087O2933J44146O2928J36949J16772J04946J40482M1148M2054
4040F287907P0245N1915R7742J08451P6593J81508J32759J92750J28115J69987
4030G497972J62094J12236J68519J44188J77811J78209J95162K16825K54111K23082
$$ y = [2894886, 2875718, 2888123, 2928261, 2962917, 2936586, 2973456, 2964915, 3046343, 3105899, 3196181, 3220775, 3249022, 3289679, 3249487, 3220188, 3219686, 3178106, 3227835, 3255354, 3269244, 3344827, 3386626, 3411353, 3432687, 3503776, 3527863, 3534021, 3561643, 3623650, 3661052, 3693088, 3743392, 3847048, 3913806, 3978173, 4002128, 3996461, 4025717, 4032308, 4084369, 4084847, 4215244, 4254651, 4327067, 4501521, 4607839, 4630914, 4706629, 4771378, 4832403, 4912986, 4950514, 5042379, 5077399, 5117637, 5130763, 5210421, 5338462, 5435549, 5498482, 5642628, 5705556, 5842505, 5959277, 6064223, 6204705, 6245853, 6287907, 6358152, 6410067, 6507809, 6616260, 6692853, 6874361, 7007120, 7199870, 7327985, 7497972, 7660066, 7772302, 7940821, 8085009, 8262820, 8441029, 8636191, 8853016, 9107127, 9330209]
4020I330209K88279L07305K72523L16874L25760L46994M05289L71753M78687M42569
4010A2886242M80954M95354M77529N25902M80870N28078O31470N66384O97643
4001A7770426O54366P73265P80886Q36200R50176J010759J070604J175130J342584
3992B6364396J509499J628827J807172K010303K172695K456835K773909L244263
3984D3967899L459255L702210L482066K904812J993903J053680M08311K18428
3976F1190564L87706P63210J263141J632021J942666K201104K259197K236721
3968G3876330K137436J895137J501317R75088L42839k26444p05626r67473r99286
3959G7829318q15435n37623k13230K41432Q46171J459120K094296K848238L427567
$$ y = [9330209, 9618488, 9925793, 10198316, 10515190, 10840950, 11187944, 11593233, 11964986, 12443673, 12886242, 13367196, 13862550, 14340079, 14865981, 15346851, 15874929, 16506399, 17072783, 17770426, 18424792, 19198057, 19978943, 20815143, 21765319, 22776078, 23846682, 25021812, 26364396, 27873895, 29502722, 31309894, 33320197, 35492892, 37949727, 40723636, 43967899, 47427154, 51129364, 54611430, 57516242, 59510145, 60563825, 60972136, 61190564, 61578270, 62341480, 63604621, 65236642, 67179308, 69380412, 71639609, 73876330, 76013766, 77908903, 79410220, 80385308, 80728147, 80501703, 79796077, 78828604, 77829318, 77013883, 76476260, 76263030, 76504462, 77350633, 78809753, 80904049, 83752287, 87179854]
3950H7179854L506149K981727K104989Q99155k84634j424383k338584l196876
3942H9427397l650129l742032l629838l249141k741266k139054j525200r29060
3934F7821677m25802J5021K44544M56672O11457Q70049J261680J630838J999925
3925G4486061K303051K476093K342512K013338J254114J06803j126064k218364
3917H1637544l200688l872459m021169l919632l594906l106375k558515k153575
3909E5210225j673797j371630j110453r29171p06994n79523n45137l86063k34778
3900D7672679j03764o40o7903k91559o71028j181767j615029j903848k160460
3891C9676681k119141j965870j773849j571359j433854j177858j188506j112835
$$ y = [87179854, 90686003, 93667730, 95772719, 96671874, 96387240, 94962857, 92624273, 89427397, 85777268, 82035236, 78405398, 75156257, 72414991, 70275937, 68750737, 67821677, 67395875, 67410896, 67655440, 68112112, 68723569, 69593618, 70855298, 72486136, 74486061, 76789112, 79265205, 81607717, 83621055, 84875169, 84981972, 83855908, 81637544, 78436856, 74564397, 70543228, 66623596, 63028690, 59922315, 57363800, 55210225, 53536428, 52164798, 51054345, 50125174, 49418180, 48838657, 48293520, 47907457, 47672679, 47568915, 47568275, 47500372, 47208813, 46537785, 45356018, 43740989, 41837141, 39676681, 37557540, 35591670, 33817821, 32246462, 30812608, 29634750, 28446244, 27333409]
3883B7333409j026438j075228j102745j112238j069821j048430j025736r26046
3875A8946727p79493q03363o37056o61984o01526n22077m94293m42357m07120
3866A3597458m25436l45450l12584k68143k90034k67203k17067k12798j90321
3857A1068422j56728k06784j45946j36975j83197j92641j46956j28776j63901
3848I606518r6572j17378l4459k9150m2414r5641J7866K2036m1650n6857K477
3837I134776K602l4373R207k4064J314N540j737M264r30l5609K0690O9703R711
3824I161094M7610P0534P1057N5681O6244N2343O9321N9143k7838q015j4301o1084
3812I541789l6305q4568o3022n1012O3814K6480O0474J03358Q9097J49097K12497
$$ y = [27333409, 26306971, 25231743, 24128998, 23016760, 21946939, 20898509, 19872773, 18946727, 18167234, 17363871, 16726815, 16064831, 15463305, 14941228, 14446935, 14004578, 13597458, 13172022, 12826572, 12513988, 12245845, 11955811, 11688608, 11471541, 11258743, 11068422, 10911694, 10704910, 10558964, 10421989, 10238792, 10046151, 9899195, 9770419, 9606518, 9509946, 9392568, 9358109, 9328959, 9286545, 9190904, 9208770, 9230806, 9189156, 9132299, 9134776, 9137378, 9103005, 9112212, 9088148, 9089462, 9095002, 9093265, 9097529, 9096599, 9060990, 9081680, 9151383, 9161094, 9208704, 9279238, 9350295, 9405976, 9472220, 9524563, 9593884, 9653027, 9625189, 9617174, 9602873, 9541789, 9505484, 9420916, 9357894, 9306882, 9370696, 9397176, 9457650, 9561008, 9650105, 9799202, 10011699]
3801A0011699J83878J34850R5757N0053K0190k6052k1047O2156L3075N6610J45071
3790A0746240J88827K61730K63761L25043M21103M13712N11642N99111N06667
3781A4237836M63785M18949K91165K34816J01622J3319J9779l8874O4872M5992
3771A5853261J54000K16890K56324M42395M53122N53016O05962N75432N26949
3762A9637351N34716L22250K11124J25136J9093j75544j54221j89352k59711k76588
3752A9794254k99638k88138k75172k88283j87055j14874j6447M7807J50867K48639
3742A8771960L05389L50855M14365L19129K09274L2370k25648l00645m45443m83695
3732A8947911l90851l32619j86222j81807q0259L6931J42644K23811J52353J38814
$$ y = [10011699, 10195577, 10330427, 10426184, 10476237, 10496427, 10470375, 10449328, 10511484, 10544559, 10601169, 10746240, 10935067, 11196797, 11460558, 11785601, 12206704, 12620416, 13132058, 13731169, 14237836, 14701621, 15120570, 15411735, 15646551, 15748173, 15761492, 15781271, 15742397, 15807269, 15853261, 16007261, 16224151, 16480475, 16922870, 17375992, 17929008, 18534970, 19110402, 19637351, 20172067, 20494317, 20705441, 20830577, 20849670, 20674126, 20519905, 20330553, 20070842, 19794254, 19494616, 19206478, 18931306, 18643023, 18455968, 18341094, 18324647, 18372454, 18523321, 18771960, 19077349, 19428204, 19842569, 20161698, 20370972, 20403342, 20177694, 19877049, 19431606, 18947911, 18557060, 18224441, 18038219, 17856412, 17776153, 17813084, 17955728, 18179539, 18331892, 18470706]
3722A8470706n1212p5290j95263k44384j91480j49036n8660r6983n2373n952M5154
3711A7395227J24875J72126K40492K46874K52470K45289L99898M02477L29741
3702A9809469K85405J49050J8955q7587p2098j16694j21097j303j07682q4790
3692A9671628n7401l5772m0166j3555q7212o0972j33874j87752j63939r5959K7066
3681A8822092J33392K23365L48363L09857K27064J49164L9816q2962r8505j85056
3671A9886590k10365j59795k86269l30906l14481k59577k65965k85485j52061
3662A7621686j66109j14128l2487O5044J06037K55459L13653L74068M39673N10953
3652A9373849M36074L95248M46313L09567K32553L03137M18714M53952N91468
$$ y = [18470706, 18419494, 18344204, 18148941, 17904557, 17713077, 17564041, 17505381, 17408398, 17356025, 17350073, 17395227, 17520102, 17692228, 17932720, 18179594, 18432064, 18677353, 19077251, 19479728, 19809469, 20094874, 20243924, 20262879, 20175292, 20103194, 19986500, 19865403, 19864100, 19756418, 19671628, 19614227, 19578455, 19538289, 19524734, 19437522, 19376550, 19242676, 19054924, 18890985, 18795026, 18822092, 18955484, 19178849, 19527212, 19837069, 20064133, 20213297, 20253113, 20170151, 20071646, 19886590, 19676225, 19516430, 19230161, 18899255, 18584774, 18325197, 18059232, 17773747, 17621686, 17455577, 17341449, 17308962, 17374006, 17480043, 17735502, 18049155, 18423223, 18862896, 19373849, 19809923, 20205171, 20651484, 20961051, 21193604, 21496741, 21915455, 22369407, 22960875]
3643B2960875O25999P22303R06556J011353J212084J337753J539481J794288J894135
3634C4004827K132926K465990K775858L156962L497002L866457L855140L505409
3626E9260571K779583J908798Q84165o6008o18537r54756j029719r17127m86428
3617F0760542L9720O17918J247741J908680K550372L287865L956273M607246N100640
3608H4076997N383646N257110M647327L555350J873493j22806j964619l482858
3600I9223640m438764m947243m965140m819886m473661m024624l541221k862218
3592F5150883k224990j452634o82531J39548R12474J725828K309883K670436K596058
3583G1144955K246828J618092M38323j035645k815737m385529n352946n570580
$$ y = [22960875, 23586874, 24309177, 25215733, 26227086, 27439170, 28776923, 30316404, 32110692, 34004827, 36137753, 38603743, 41379601, 44536563, 48033565, 51900022, 55755162, 59260571, 62040154, 63948952, 64833117, 64767109, 64148572, 63193816, 62164097, 61246970, 60760542, 60800262, 61418180, 62665921, 64574601, 67124973, 70412838, 74369111, 78976357, 84076997, 89460643, 94717753, 99365080, 102920430, 104793923, 104671117, 102706498, 99223640, 94784876, 89837633, 84872493, 80052607, 75578946, 71554322, 68013101, 65150883, 62925893, 61473259, 60790728, 60930276, 61842750, 63568578, 65878461, 68548897, 71144955, 73391783, 75009875, 75448198, 74412553, 71596816, 67211287, 61858341, 56287761]
3575E6287761n417650m828503m065127l393012k950893k493822j994445j656155
3567B9488154j319272j079099p49277l47897j07156J87135J20138n52050j107298
3558B4533378j420614j770285j575617j309152j114980r02084q02275o83302o07901
3549A4347168n45650n05074m60850l65229l36146l23808l11406l34869k62551
3540A0901585l21195k80739k23412k42967k23717k50966j61806j84927j97196
3531H814660j70022j49656j32254j96698k03316r6708j42726r5296j32532p6632
3521G418820j28590r6172j03570q6655r8704m2566p6942j07944r0874o0848q8484
3510F437471j19627q6048r0575j28527o4326r2863j10419l7243p2780o6833l8749
$$ y = [56287761, 50870111, 46041608, 41976481, 38583469, 35632576, 33138754, 31144309, 29488154, 28168882, 27089783, 26340506, 25992609, 25885453, 26072588, 26192726, 25640676, 24533378, 23112764, 21342479, 19766862, 18457710, 17342730, 16440646, 15638371, 14955069, 14347168, 13801518, 13296444, 12835594, 12470365, 12134219, 11810411, 11499005, 11164136, 10901585, 10580390, 10299651, 10076239, 9833272, 9609555, 9358589, 9196783, 9011856, 8814660, 8644638, 8494982, 8362728, 8166030, 7962714, 7866006, 7723280, 7627984, 7495452, 7418820, 7290230, 7194058, 7090488, 7003833, 6905129, 6862563, 6785621, 6677677, 6586803, 6525955, 6437471, 6317844, 6231796, 6141221, 6012694, 5948368, 5855505, 5745086, 5707843, 5635063, 5568230, 5529481]
3499E529481n0406P847q1308o7818N678p6563j09325p7424p846j20879o0041j0525
3487D880871m182o1643o633o5087n7122L272Q187n6640l7124m4970n916p7985
3475D475028k6479L4280P61k6538o8764O737M6875K2520L0148O541O362k6370
3463D481101r276l7895J1406L8815j9200J8959J9875m668N940j5037J6661j0591
3451D496090N7186K4708L7402K7385R935K662k4388M7777P1283K6563M2771M7344
3439D866718Q870L6559L3958k3750j47J1255L6083N8863M708J2834N8015j4355
3427E089611M604N2117K0209J1352l162J4337J6868k6552M8334K5162M1595K4694
3415E319169M1618p809M7128K2702L8222M6491O897J7526K9241N8953N6594Q3836
$$ y = [5529481, 5479075, 5486922, 5405614, 5337796, 5343474, 5266911, 5157586, 5080162, 5072316, 4951437, 4891396, 4880871, 4876689, 4815046, 4808413, 4743326, 4686204, 4689476, 4697663, 4641023, 4603899, 4558929, 4553013, 4475028, 4448549, 4482829, 4483590, 4457052, 4388288, 4395025, 4441900, 4464420, 4494568, 4501109, 4507471, 4481101, 4471825, 4433930, 4445336, 4484151, 4464951, 4483910, 4503785, 4499117, 4505057, 4490020, 4506681, 4496090, 4553276, 4577984, 4615386, 4642771, 4652706, 4655368, 4630980, 4678757, 4750040, 4776603, 4819374, 4866718, 4875588, 4912147, 4946105, 4922355, 4922208, 4933463, 4969546, 5028409, 5033117, 5045951, 5103966, 5089611, 5094215, 5146332, 5166541, 5177893, 5174731, 5189068, 5205936, 5179384, 5227718, 5252880, 5294475, 5319169, 5360787, 5352978, 5400106, 5422808, 5461030, 5507521, 5514418, 5531944, 5561185, 5620138, 5676732, 5760568]
3403E760568O9156Q2006P3459P4881J05805N4702J28636K18319J73340J41357
3393F882229J51719J31555J72901N8844m0135M7336K1047J7794O0262P9540J27367
3382G710459R9892R5444J59476K17462K10491K50370L57810L01394L11318L47001
3372A0061117L04777J88506K04756Q9413M1982l1252l8464o6229l4886l7881M049
3361A0685888M0266J65538J61634K84580K86727L39261L76105L43525M42032M39897
3351A3565453M62176M85926M94244M12254L09897L18222K38558J42925K12527
3342A6642182L06066L46429N17550O11666P98001Q98976J058835J152951J233035
3333B3565691J400053J424714J338003J201881R73639P17229M45761K65225K99174
$$ y = [5760568, 5829724, 5911730, 5985189, 6060070, 6165875, 6220577, 6349213, 6567532, 6740872, 6882229, 7033948, 7165503, 7338404, 7397248, 7357113, 7404449, 7425496, 7443290, 7503552, 7583092, 7710459, 7810351, 7905795, 8065271, 8282733, 8493224, 8743594, 9101404, 9402798, 9714116, 10061117, 10365894, 10554400, 10759156, 10848569, 10890551, 10859299, 10820835, 10754606, 10719720, 10681839, 10685888, 10726154, 10891692, 11053326, 11337906, 11624633, 11963894, 12339999, 12683524, 13125556, 13565453, 14027629, 14513555, 15007799, 15420053, 15729950, 16048172, 16286730, 16429655, 16642182, 16948248, 17294677, 17812227, 18423893, 19221894, 20120870, 21179705, 22332656, 23565691, 24965744, 26390458, 27728461, 28930342, 29903981, 30621210, 31066971, 31332196, 31631370]
3324C1631370K80784L62686O93399R64456J219812J509652J795082J943605K101845
3315D2502691K172687K078877J918900J718646J425831J075378R67999Q17231
3307E4678240Q13712O65894N88442M33217N53189N62270O67957P95883Q40096
3298F0598900R99882J288768J506860J638938J723541J402698J240552J007620
3290G1407759O13957K14672k17585n01493q55287j098201j068894q68120o49250
3281F6977558m82534l80303l09696j97137J9358K54308N08085N70054L72551J65804
3271F7498048J2118k03962m54343p18319r92170j278289j477677j442664j403529
3262E9539213j544310j552399j520866j519461j306063j226250j166156r96506
$$ y = [31631370, 31912154, 32274840, 32968239, 33932695, 35152507, 36662159, 38457241, 40400846, 42502691, 44675378, 46754255, 48673155, 50391801, 51817632, 52893010, 53861009, 54678240, 55491952, 56157846, 56746288, 57179505, 57732694, 58294964, 58962921, 59758804, 60598900, 61598782, 62887550, 64394410, 66033348, 67756889, 69159587, 70400139, 71407759, 72021716, 72236388, 72018803, 71517310, 70662023, 69563822, 68494928, 67626808, 66977558, 66495024, 66114721, 65805025, 65607888, 65627246, 65881554, 66389639, 66959693, 67332244, 67498048, 67510166, 67306204, 66851861, 66133542, 65141372, 63863083, 62385406, 60942742, 59539213, 57994903, 56442504, 54921638, 53402177, 52096114, 50869864, 49703708, 48707202]
3254D8707202q55061o55088m21478k51482m0698J57657K26212q1116l72343p19013
3244D5694792r62796j160614j041880q14494o85319k79777N8054K02274M34924
3235D1445164N34882O43121O04650N81782P75344P91229O97180P90329Q16293
3226D7679974P61654O95909N63923N35694N32350N33820M62429L00024J4098L864
3216E2083739O6573J61535L41971O51768Q32203R83547R11988P84392N61701K25290
3206E7604707M7876q7635l27011m85987o53189p02577o38211n42719k89182j54995
3196E3771077J08058K82660M60389N12124K47760n1096m70972p65891p92583q46237
3186E2455289p18997o42562n59475n14488n50014o13624o70617q03557q87946
$$ y = [48707202, 47852141, 47197053, 46775575, 46524093, 46483395, 46641052, 46867264, 46786148, 46413805, 45694792, 44731996, 43571382, 42529502, 41715008, 41029689, 40749912, 40807966, 41010240, 41445164, 41980046, 42623167, 43227817, 43809599, 44584943, 45376172, 46073352, 46863681, 47679974, 48441628, 49137537, 49701460, 50237154, 50769504, 51303324, 51765753, 52065777, 52079875, 52083739, 52150312, 52311847, 52653818, 53305586, 54137789, 55121336, 56033324, 56817716, 57379417, 57604707, 57652583, 57564948, 57237937, 56751950, 56098761, 55396184, 54757973, 54215254, 53926072, 53771077, 53879135, 54161795, 54622184, 55134308, 55382068, 55330972, 54860000, 54094109, 53301526, 52455289, 51736292, 51093730, 50534255, 50019767, 49469753, 48856129, 48185512, 47381955, 46494009]
3177D6494009p56180o50787n02716n15181n00379m84137l31282k67818j26498
3168D2359031n3845Q8144M0448k27279l88384m45127m49474m31567k12709j56412
3158D0122826J32794K49321K54892J82310P2641j5273l7530r4851j44018k60541
3148D0462571l34461l18433m71344m97432m74365m21913n07699n03729n63607
3139C6369588o36057o22941o44266n94656o68503o22372o56223o71866p20694
3130C0532010p25621o45361o44740o31839o91561p73247q06388p61481p28982
3121B4122790p39044p03632o29578o41408n93276n19896n26412m89660m51070
3112A8828814m26733m12673l53576l48661l21198k34994k35868j40266j99677
$$ y = [46494009, 45737829, 45087042, 44584326, 44069145, 43568766, 43084629, 42753347, 42485529, 42359031, 42305186, 42393330, 42433778, 42206499, 41818115, 41372988, 40923514, 40491947, 40279238, 40122826, 40255620, 40504941, 40759833, 40942143, 41014784, 40999511, 40961981, 40867130, 40723112, 40462571, 40128110, 39809677, 39338333, 38840901, 38366536, 37944623, 37436924, 36933195, 36369588, 35733531, 35110590, 34466324, 33871668, 33203165, 32580793, 31924570, 31252704, 30532010, 29806389, 29161028, 28516288, 27884449, 27192888, 26419641, 25613253, 24851772, 24122790, 23383746, 22680114, 22050536, 21409128, 20815852, 20295956, 19769544, 19279884, 18828814, 18402081, 17989408, 17635832, 17287171, 16965973, 16730979, 16495111, 16354845, 16155168]
3103A6155168k33535l16474l22988l54762l62235k09284k28869k64798j93679
3094A3668544k97392k47385j92505j85614j25484k28580k09819j82319j49930
3085A1849516p2236j37816j31532j05938j11066j34748o6644r9859j23044r4929
3075A0771704j02003j32026j01128r9101j26455q7242o3171o5314j14744j31756
3065I748764j11010j12601p6473j02954j34195p5272r9052j71202p3028j03756
3055H689221o8402j46688j33752o4265p2591j14926p0229j731o0845q4971p4212
3044G796609k4748j8982n0213o0637n9910j01061j31267n7899m5820l4457J0p5853
3032G135772l8645k8419J9506p3983n1555j7264R008j9169K7189k7452j1821M3657
$$ y = [16155168, 15921633, 15605159, 15282171, 14927409, 14565174, 14355890, 14127021, 13862223, 13668544, 13371152, 13123767, 12931262, 12745648, 12620164, 12391584, 12181765, 11999446, 11849516, 11777280, 11639464, 11507932, 11401994, 11290928, 11156180, 11089536, 10989677, 10866633, 10771704, 10669701, 10537675, 10436547, 10337446, 10210991, 10123749, 10060578, 9995264, 9880520, 9748764, 9637754, 9525153, 9448680, 9345726, 9211531, 9136259, 9037207, 8866005, 8792977, 8689221, 8620819, 8474131, 8340379, 8276114, 8203523, 8088597, 8018368, 8016637, 7955792, 7870821, 7796609, 7771861, 7752879, 7702666, 7642029, 7582119, 7481058, 7349791, 7291892, 7246072, 7211615, 7211625, 7135772, 7097127, 7068708, 7088214, 7014231, 6962676, 6945412, 6954420, 6935251, 6962440, 6934988, 6923167, 6966824]
3020F966824K7877p929J4224m1307r5661J3910n2402r8663j9411j4416j1025K2443
3008F704464M4787j5839J1676k5149K8218O0947R8345L9047J9478N880P0687O7821
2996G110362O6630m422k2249p7137J1870r4117n6643m3619k6904j00939q0409
2985F682423M815m1560m2349l4989p5403m3123n7883q0146j9456r5351N409k1728
2973F180659m7447L493l3703o2817n4706r0477p576l0656n5586o8827L5005m5197
2961E722165m1808l8708m1235N9300K2774K2208J2515L0567L4560O1854P7863
2950E922055O7645J03150M8484R3703J17289R7457R9713j5107m1113m8610j39710
2939F304956n6733o4743m7828J1098l254l6057l1017K4956L4554Q988P1766M2612
$$ y = [6966824, 6994701, 6986772, 7000996, 6959689, 6864028, 6877938, 6825536, 6726873, 6707462, 6693046, 6682021, 6704464, 6749251, 6733412, 6745088, 6719939, 6748157, 6809104, 6907449, 6946496, 6965974, 6971854, 7042541, 7110362, 7176992, 7172570, 7150321, 7073184, 7085054, 6990937, 6934294, 6890675, 6863771, 6762832, 6682423, 6687238, 6645678, 6603329, 6568340, 6492937, 6449814, 6391931, 6311785, 6292329, 6196978, 6202387, 6180659, 6133212, 6136705, 6103002, 6040185, 5985479, 5895002, 5887426, 5856770, 5801184, 5732357, 5767362, 5722165, 5680357, 5641649, 5600414, 5659714, 5682488, 5704696, 5717211, 5747778, 5782338, 5844192, 5922055, 5989700, 6092850, 6141334, 6235037, 6352326, 6449783, 6549496, 6534389, 6493276, 6444666, 6304956, 6248223, 6183480, 6135652, 6146750, 6143496, 6107439, 6076422, 6101378, 6135932, 6144920, 6216686, 6259298]
2927F259298O1223L0459M0477J5739J9518j6442L4301J2631O4915P7647N8864
2916F658630Q6053J07739J36154J33663J41215J45880J87012J47130K35093K81265
2906H259834K71112K64133L22512L61586K24964J39452J19323J10784J07668K35666
2896A0417034K46308K75395L10320L67905M18982M36571N17499N64004O44594
2887A4198612O68164P41959P94275O95605N24049K62592J3400k91254n66356p03679
2877A6337367o35860n40775k65619k69182m91551o29866p15464p88680o99129
2868A1301241n35613m57050l92476k47623k59298k13008k00358p1142k6441j2181
2858H886051Q675N5631J05651J81009K20045M40333N05014O44003O04572q9227
$$ y = [6259298, 6320521, 6350980, 6391457, 6407196, 6426714, 6410272, 6444573, 6457204, 6522119, 6599766, 6658630, 6744683, 6852422, 6988576, 7122239, 7263454, 7409334, 7596346, 7743476, 7978569, 8259834, 8530946, 8795079, 9117591, 9479177, 9704141, 9843593, 9962916, 10073700, 10181368, 10417034, 10663342, 10938737, 11249057, 11616962, 12035944, 12472515, 12990014, 13554018, 14198612, 14866776, 15608735, 16403010, 17098615, 17622664, 17885256, 17898656, 17607402, 17041046, 16337367, 15701507, 15160732, 14895113, 14625931, 14134380, 13504514, 12789050, 12000370, 11301241, 10765628, 10308578, 9916102, 9668479, 9409181, 9196173, 8995815, 8924673, 8898232, 8886051, 8894726, 8950357, 9056008, 9237017, 9457062, 9897395, 10402409, 11046412, 11650984, 11561757]
2848A1561757m25861o97227q60292q41350n96758m80768m01673l54234k03571
2839F700023j75131j57813j61989r6730j20776r7931P63O5897R62J02207J50755
2828F210237K06807K67965K24752k5450k59273l68539m68015l91786l39428j93506
2818D863764j96912k24410j25623j04696r2775q9112j03449j09712L1726j11454
2808C737347o7512o1867p1376j03852o0485m3564l5705l3554n0620k0527n6495
2797C131790p5753J6377n9868n9739j2350m2706j3320m9154Q257j2879l8592l5462
2785B756601k8860n2160l1768l2504k7394m0835K4041n9324j7506n9907J06m607
2773B425883j2498j7608o4738n3014L330K0109P265n3224m0731j2160j9648j0387
$$ y = [11561757, 11135896, 10438669, 9578377, 8737027, 8140269, 7659501, 7257828, 6903594, 6700023, 6524892, 6367079, 6205090, 6108360, 5987584, 5889653, 5890416, 5956313, 5957275, 6059482, 6210237, 6417044, 6685009, 6909761, 6884311, 6625038, 6256499, 5788484, 5396698, 5057270, 4863764, 4666852, 4442442, 4316819, 4212123, 4119348, 4030236, 3926787, 3817075, 3848801, 3737347, 3669835, 3607968, 3536592, 3432740, 3372255, 3328691, 3292986, 3259432, 3208812, 3188285, 3131790, 3056037, 3072414, 3012546, 2952807, 2940457, 2897751, 2884431, 2835277, 2843534, 2830655, 2792063, 2756601, 2727741, 2675581, 2643813, 2611309, 2583915, 2543080, 2567121, 2507797, 2490291, 2430384, 2430490, 2425883, 2413385, 2395777, 2331039, 2278025, 2281355, 2301464, 2308729, 2255505, 2214774, 2202614, 2182966, 2172579]
2761B172579j0261l5965l3633O8307m5560Q157l2330j3087j7466m9598l1346M237
2749A984034Q017k1803k3368r179r573N250j6504n7379j0461K1979R167m2387
2737A837793K2071j7279k0501K8159J1381n2925L5412m097l0398N3205N07J8212
2725A881540j1919N717J097o723J729J9153P023j3140K4808O7470L9937L1680
2713B048372P3859K9004O0528Q3756J2363J05337Q7380P1207J3464j4244Q2676
2702B653702j7146m6364j5919L3563l8220L1208O7682L9885J6630K9413J00746
2691B855180O0010J20303J41386J40263J66753K38054K28776J55494J30306R6496
2681D333021J8456o706p0475j06867j05609j00942j99835j00907n3878l8504O008
$$ y = [2172579, 2162318, 2126353, 2092720, 2161027, 2115467, 2123624, 2091294, 2078207, 2060741, 2011143, 1979797, 1984034, 1992051, 1970248, 1946880, 1937701, 1928128, 1933378, 1916874, 1859495, 1849034, 1871013, 1880180, 1837793, 1859864, 1842585, 1822084, 1850243, 1861624, 1808699, 1844111, 1840014, 1809616, 1862821, 1863328, 1881540, 1869621, 1875338, 1876435, 1869712, 1871441, 1890594, 1897617, 1884477, 1909285, 1976755, 2016692, 2048372, 2122231, 2151235, 2211763, 2295519, 2307882, 2413219, 2500599, 2571806, 2585270, 2571026, 2653702, 2636556, 2590192, 2574273, 2607836, 2569616, 2600824, 2668506, 2708391, 2725021, 2754434, 2855180, 2915190, 3035493, 3176879, 3317142, 3483895, 3721949, 3950725, 4106219, 4236525, 4333021, 4351477, 4344771, 4274296, 4167429, 4061820, 3960878, 3761043, 3660136, 3606258, 3567754, 3573762]
2670C573762Q705L2600R91N8464Q8751J19100J31929Q1638L8087O4418j0120n2467
2658D135858j2592J02412J24477J47487R6602m1066j11262m3434j81491j97633
2648D019358j08628j09208q1996k2634J2295j11268m1468J2853K6775p895J873
2637C590057k082N3735O7295J27496J78786Q0721J3735m8936P005q3196n8208
2626C926408m811m6209q0481j12198j43953q9252j60024k8195m3405o5221o757
2615C145902n1116n4371O99J5746l709j7552k9409k7744K5069j2057n1500M503
2603B944461o5570p5768n0101m4298l4457j35013j216n7702n4299n5091n1935
2592B319011l6543l0209n4639n8628o0933n4302n8017j08869j9228m2488r9525
$$ y = [3573762, 3582467, 3615067, 3616058, 3674522, 3763273, 3882373, 4014302, 4095940, 4134027, 4198445, 4188325, 4135858, 4123266, 4225678, 4350155, 4497642, 4594244, 4553178, 4441916, 4398482, 4216991, 4019358, 3910730, 3801522, 3719526, 3696892, 3709187, 3597919, 3556451, 3569304, 3596079, 3588184, 3590057, 3587975, 3641710, 3709005, 3836501, 4015287, 4096008, 4109743, 4060807, 4067812, 3984616, 3926408, 3921597, 3875388, 3794907, 3682709, 3538756, 3449504, 3289480, 3261285, 3217880, 3152659, 3145902, 3094786, 3040415, 3041114, 3056860, 3053151, 3035599, 3006190, 2978446, 3003515, 2991458, 2939958, 2944461, 2878891, 2803123, 2753022, 2708724, 2674267, 2539254, 2538038, 2480336, 2426037, 2370946, 2319011, 2282468, 2252259, 2197620, 2138992, 2078059, 2023757, 1965740, 1856871, 1837643, 1795155, 1695630]
2581A695630m8863n1798n7144l9593p4996m5510o8066m7664L6431m9071J1908
2570A261264r349n1752m2356n3102P393k7166l1422j7713k2921j4715L167p1574
2558I29754l0695l7334K2963q225r0203j7105N43k6815L1010l3643L1868k3425
2546G48693l6232l7506M138k5759K3291K3260O074p1228J605N657q684j9122k672
2533F11515j923J5955r375m3057n5890N4607j2871j8873o7715M0646M7049n7276
2521E02792M0064L8564k7651j6422j4017n1981L6927p548K414n0256L3306J5272
2509E01464l4079j4015k2625j1282j2811P013n1852L4933j811J3610J7990l6745
2497C89790O23J9669J2470o075K854l5506j2917K6108K1258L6684m0173o788J9542
$$ y = [1695630, 1646767, 1594969, 1537825, 1498232, 1423236, 1377726, 1309660, 1261996, 1298427, 1249356, 1261264, 1251915, 1200163, 1157807, 1104705, 1112098, 1084932, 1053510, 1035797, 1012876, 998161, 1001328, 929754, 899059, 861725, 884688, 876463, 786260, 769155, 769698, 742883, 773893, 740250, 772118, 748693, 712461, 674955, 679093, 653334, 676625, 699885, 705959, 634731, 636336, 641993, 633309, 614187, 611515, 609592, 625547, 616172, 573115, 517225, 571832, 558961, 540088, 472373, 513019, 560068, 502792, 542856, 581420, 553769, 537347, 523330, 471349, 508276, 500728, 503142, 452886, 486192, 501464, 467385, 453370, 430745, 419463, 406652, 413665, 361813, 396746, 394935, 408545, 426535, 389790, 390413, 410082, 422552, 416477, 419331, 383825, 370908, 397016, 418274, 454958, 414785, 407997, 427539]
2484D27539K7907k0366o1594J4803j8090j1092m4371N0279L5066k1153J7590Q300
2472D04818O556J2585j6793j7522n597M27M561K1823K8076M0396l5918k5703k3289
2459C94420M5882l3914K16K2082O016J3493K761k4693Q641N6547k3040k9288L1802
2446D70925N2411L1139o8384Q385K4987J2765L6538K9908R585l8013J1093M7401
2434F28740P820j7747m2030K3551J0794k4209N0469L2809J0473M157j0360J8192
2422F92659L0558O999m1585L1614K9139q1429o940K3783M6841M5268M846K2920
2410H04673J80n8626o974J1052O3872k3113m624K7252R683J4080l6914O4792L3323
2397H98656K6210m3454j1311l9984L5370l6132N231N872k9209r191n2480l373
$$ y = [427539, 455446, 435080, 373486, 388289, 370199, 359107, 314736, 365015, 400081, 378928, 396518, 404818, 411374, 423959, 407166, 389644, 384047, 384474, 389035, 410858, 438934, 479330, 443412, 417709, 394420, 440302, 406388, 406604, 428686, 434702, 448195, 450956, 426263, 434904, 491451, 468411, 439123, 470925, 523336, 554475, 486091, 494476, 519463, 532228, 568766, 598674, 608259, 570246, 581339, 628740, 636560, 618813, 576783, 600334, 611128, 586919, 637388, 670197, 680670, 684827, 674467, 692659, 723217, 730216, 688631, 720245, 749384, 667955, 661015, 684798, 731639, 776907, 781753, 804673, 804853, 746227, 739253, 750305, 814177, 791064, 786440, 813692, 823375, 837455, 800541, 865333, 898656, 924866, 881412, 870101, 830117, 865487, 829355, 834586, 840458, 811249, 802058, 749578, 746205]
2385G46205k9833R351n1831L3888Q118m5029j8006L2353Q171j9311L5709j4135
2373F95650J0635K1118m400L7388j7397o0617R514k2883k9343l2699o8516l2095
2361E06355J6319l4537P458j0066o351r182L966k8678l428J6619m5870K9869k5053
2348D17421j2348l2352k8541K5060M6387m0644n3680l5542O6271j1826o102m480
2336C29624l4931L8421J167k754m5511n1201M0934J3765k3263j4017L0583k596
2324B80221m7854N331r419l2623K0585L6446O273k7859J8222n054m3618q216L051
2311A95486K1788M9553p2176m7916J5702N0593n29K4161j8717l9761Q275m3897
2299A42562L8533J2024J5795O916j5632K1858J300n9614k0582K3679j6856k5291
$$ y = [746205, 716372, 725723, 673892, 707780, 715898, 670869, 652863, 685216, 693387, 674076, 709785, 695650, 706285, 727403, 723003, 760391, 742994, 682377, 691891, 669008, 639665, 606966, 538450, 506355, 522674, 488137, 495595, 485529, 479178, 469996, 473962, 445284, 441856, 458475, 412605, 442474, 417421, 405073, 372721, 344180, 369240, 415627, 374983, 321303, 285761, 352032, 340206, 334104, 329624, 294693, 333114, 334281, 331527, 286016, 234815, 275749, 289514, 266251, 252234, 282817, 280221, 232367, 237698, 228279, 195656, 216241, 252687, 258960, 231101, 249323, 244269, 200651, 192435, 195486, 217274, 266827, 194651, 146735, 162437, 213030, 212501, 236662, 217945, 178184, 186459, 142562, 181095, 193119, 208914, 215830, 200198, 222056, 223356, 163742, 143160, 166839, 149983, 124692]
2287A24692K5951M7198k1137K2903p146o5255J1369K4878J5623q6209M1715k1144
2275A13438N035J5902K8077J7420J4024k8858j4128m153j7065L1678j5137L1544
2263A77777o401l2621M4079K4062m6040n152r028l3496L5776N3100o016k9240
2251A66800j3248M290l7404Q514J3560l420r973L678P878J2022l635k1315P223
2238A34970O252J3465J9814l5570L2785k0466L9182N517o7824j2341L645k2196
2226I7233k9138M7573M2203m919k6750K0201J7991j2410L6274n6464J507k54l3393
2213I9654M2187j2710k5204n834K8979L6522l7821l2450j4098M4894L5116K579
2201A61814j4062m5279J4562K088j0248M2754m347o231n0016R834J7m264N0810
$$ y = [124692, 150643, 197841, 176704, 199607, 192461, 127206, 138575, 163453, 179076, 92867, 134582, 113438, 118473, 134375, 162452, 179872, 193896, 165038, 150910, 146757, 129692, 161370, 146233, 177777, 171376, 138755, 182834, 206896, 160856, 155704, 146676, 113180, 148956, 202056, 196040, 166800, 153552, 157842, 120438, 128952, 142512, 139092, 129119, 132797, 140675, 152697, 149062, 127747, 134970, 141222, 154687, 174501, 138931, 171716, 151250, 190432, 195949, 128125, 115784, 119429, 97233, 68095, 115668, 157871, 152952, 126202, 146403, 164394, 151984, 188258, 131794, 133301, 133047, 99654, 141841, 129131, 103927, 98093, 127072, 163594, 125773, 93323, 79225, 124119, 159235, 161814, 147752, 102473, 117035, 119123, 108875, 151629, 147282, 141051, 91035, 100869, 100886, 96622, 147432]
2188A47432o722p98l3663K6671l7856J1511M2093k548M6979o058l9115J047n3975
2175I4998L785P4555m407n5290J7329p922r871K1778l6431j1149J9348j0933r279
2162H6511l4029L3407j7094L2444K9255j8140K0400o648k0032j4062Q1601p075
2150A66538m8405j6607R823J8242J9811k6084k4434J3347J151K951L8201j4595
2138A39939j5269j3499j0096N2949j5710N922k5121k2720L8309p989k1368K8128
2126A33475j0984P559L2391N4323p3883o5024N5081q534m947k8290J7573o038
2114A02702L1720M0501k1697K3509j3461o1483K2242K1127l4641P1151n6015j6221
2102A09434J214k6433L8664R915j8277M2849N909k3167l5890k7955P0056Q239
$$ y = [147432, 140710, 139912, 106249, 132920, 95064, 106575, 148668, 146120, 193099, 187041, 147926, 148973, 94998, 98783, 173338, 168931, 113641, 130970, 123048, 113177, 134955, 98524, 87375, 106723, 95790, 86511, 52482, 85889, 68795, 101239, 130494, 112354, 132754, 126106, 106074, 92012, 173613, 166538, 118133, 101526, 111349, 129591, 149402, 123318, 98884, 112231, 113382, 116333, 154534, 139939, 124670, 111171, 101075, 154024, 138314, 144236, 119115, 96395, 134704, 126715, 105347, 133475, 122491, 130050, 162441, 216764, 142881, 77857, 132938, 124404, 119457, 91167, 108740, 102702, 134422, 174923, 153226, 176735, 163274, 101791, 124033, 145160, 110519, 181670, 125655, 109434, 110648, 84215, 122879, 132794, 114517, 157366, 163275, 140108, 104218, 76263, 146319, 154558]
2090A54558O822j0743k4156l496J6092J9797K7394l0069J584n379L085M9644n655
2077A99478R258J7489R046k9635J0763L4563N628J7757J4182p095L6823P658k284
2064C23631P423J0627M5623K2748J566k2727J7032M2247P253J0941K6067r35J4876
2051E06372P1762M0259M6499k987J2479O7306M9021J9634L4248K4937R9196N3838
2039A022564J43798J12444J03910J11563J49546J25948J48844K22798K64714K88125
2029B694254M99583O44565P92506O99090q175l21402o22940p41440o90378m02744
2019B542919m07620k51409k15827j86193j35673j24339q2835q7056l7064q2463
2009I32440r5731o3723n3025k6819k1104q8645J4130k7479p2464J9830j8281k1720
$$ y = [154558, 161380, 150637, 126481, 122985, 139077, 158874, 186268, 156199, 157783, 152404, 155489, 205133, 199478, 208736, 226225, 235271, 205636, 216399, 250962, 256590, 274347, 288529, 281434, 318257, 325915, 323631, 331054, 341681, 387304, 410052, 411618, 388891, 405923, 448170, 455423, 466364, 492431, 491496, 506372, 578134, 618393, 664892, 661905, 674384, 741690, 790711, 810345, 844593, 869530, 968726, 1022564, 1166362, 1278806, 1382716, 1494279, 1643825, 1769773, 1918617, 2141415, 2406129, 2694254, 3193837, 3838402, 4630908, 5329998, 5321823, 5000421, 4377481, 3636041, 2945663, 2542919, 2135299, 1883890, 1668063, 1481870, 1346197, 1221858, 1139023, 1051967, 1014903, 932440, 836709, 772986, 719961, 693142, 672038, 583393, 597523, 570044, 497580, 517410, 499129, 477409]
1997D77409k4641l472J7672m9619m8335m7170J1764K8666M3876k7686n7695J138
1985C21907J3973k6229k2151J4459n6456J3716P230J3280k0872q205o346j4135
1973B30171k2245J9528O351k4754J4932l4593j5911K986l7217K2047M1868j014
1961B02149M056j3878l3310J8055m3905m1186N8369K2018L6835l052k1921K2992
1949B07222l5158j1184R098m3756m7487N8641J5218j9002L5887k5780n7619p151
1937G8929Q5447j7696n5056K3956l5057Q589K1769m4962j6994L9114K7931M4985
1925A60955j0863n0291j0560O9043j6646m018m0666j0940K9099l2723J6323J3329
1913A12042J5694k8940J9041l950J1477K7925j6568j9274k5839J2539m9869n26
$$ y = [477409, 452768, 449296, 466968, 417349, 369014, 321844, 333608, 362274, 406150, 378464, 320769, 321907, 335880, 309651, 287500, 301959, 245503, 259219, 266449, 279729, 258857, 250652, 244306, 230171, 207926, 227454, 233805, 209051, 223983, 189390, 173479, 176465, 139248, 161295, 203163, 202149, 206205, 192327, 159017, 177072, 133167, 91981, 150350, 172368, 209203, 206151, 184230, 207222, 172064, 160880, 169978, 126222, 78735, 137376, 152594, 133592, 169479, 143699, 86080, 78929, 164376, 146680, 91624, 115580, 80523, 89112, 110881, 65919, 48925, 88039, 115970, 160955, 150092, 99801, 89241, 158284, 141638, 137620, 96954, 86014, 115113, 82390, 98713, 112042, 127736, 98796, 117837, 113887, 125364, 153289, 136721, 117447, 91608, 104147, 54278, 53752]
1901E3752M7118j4040j0836o755L0004P893j1262j7846j8669p889M9576m2912
1889E8134J8062J5103O9701k301p0086r758M6969L792k3046J7409r729o3648K7985
1876G8587N2583k0713n4206K7215M3294k3113j7668K3850K7320l162k9667L62
1864A04682m1737K3195p300L139M5207l0122L4986j9115j2473l0988J6577k0439
1852F5612M9462p472m5534K6527J6166J6245j6115L914n5738j2124J302M685J4732
1839F1662K1065l3866M2814J4674j3707O001l2009J579J9444j9731N6459J6929
1827A41314m0282J4703K4126m2026j4988j4994P133J1129p697J1170O905K9072
1815A25565k3411j3417k06l3831j5041J1859k570l7619Q498n425K5317q60N101
$$ y = [53752, 100870, 86830, 75994, 69239, 99243, 107136, 95874, 78028, 59359, 51470, 101046, 58134, 76196, 91299, 161000, 158699, 88613, 78855, 125824, 129616, 106570, 123979, 114250, 50602, 78587, 131170, 110457, 56251, 83466, 126760, 103647, 85979, 109829, 137149, 133987, 104320, 104682, 62945, 86140, 78840, 81979, 127186, 97064, 132050, 112935, 100462, 69474, 86051, 65612, 115074, 107602, 62068, 88595, 104761, 121006, 104891, 108805, 53067, 40943, 42245, 46930, 61662, 82727, 48861, 91675, 106349, 92642, 98643, 66634, 68213, 87657, 67926, 124385, 141314, 101032, 115735, 139861, 97835, 82847, 67853, 74986, 86115, 78418, 89588, 96493, 125565, 102154, 88737, 88531, 54700, 39659, 51518, 48948, 11329, 19827, 14402, 39719, 38859, 43960]
1802D3960R181k3794k1967K2909O7464j0943j7105L3894J937l9477l4738K3246
1790E4567j0300Q012J1311l7555J1053L6212L832k158J4684n250L8627l7009p868
1777G8158J1128k2549l5492L6667J0216m3644k2224P4626q686l6181j259L4990
1765G5750J1356j2526r247R60K2145k2762L216J2882j6413L8885N302L11n2210
1752E7649J1991j230J324m998K8507J5425m2229K7880j7349j0363j3032J1604
1740F5179K7705l1405M1572J2190j3156M266l7986J0268K1394l0109R805M585
1728H4308k7508k1377K0057j1227l635K5665K4895p551J7413n8862J2790O221
1716F1189K3902j3966m2499L746K9341J3927m8434N5467O5929n3278k9430J7366
$$ y = [43960, 53141, 29347, 7380, 30289, 97753, 86810, 69705, 103599, 105536, 66059, 31321, 54567, 44267, 52279, 63590, 26035, 37088, 73300, 77132, 74974, 89658, 84408, 123035, 86026, 78158, 89286, 66737, 31245, 67912, 78128, 34484, 12260, 86886, 78200, 42019, 40760, 75750, 87106, 74580, 65333, 66293, 88438, 65676, 68892, 81774, 65361, 104246, 109548, 109859, 57649, 69640, 68410, 69734, 64736, 93243, 108668, 66439, 94319, 76970, 66607, 53575, 65179, 92884, 61479, 103051, 115241, 102085, 106351, 68365, 78633, 100027, 69918, 79723, 84308, 56800, 35423, 55480, 44253, 40618, 66283, 91178, 83627, 101040, 42178, 54968, 61189, 85091, 71125, 28626, 32372, 61713, 75640, 27206, 82673, 148602, 95324, 65894, 83260]
1704H3260j0427O588Q157k1953r192m3106M1746l6667J3965l0784J629L2459N6763
1691I2438k2168k8214J6571m4848K4720m812L5739n0062P03p98k2148J0953L4645
1678D2719Q274J9576Q329Q581O35j5281p2121L7946j1557K9715N673L20n394m9677
1664G738j1574M2074n51N5603j3318K248K740n5645M0375j8876j1989J2037k0623
$$ y = [83260, 72833, 79421, 87578, 65625, 56433, 13327, 55073, 18406, 32371, 1587, 3216, 35675, 92438, 70270, 42056, 58627, 13779, 38499, 33687, 69426, 19364, 20067, 19269, -2879, 8074, 42719, 50993, 70569, 78898, 87479, 88114, 72833, 712, 38658, 27101, 56816, 62489, 62809, 57415, 7738, -3836, 38238, 37687, 93290, 79972, 82220, 84960, 29315, 69690, 50814, 38825, 50862, 30239]
$$ [...]
##END NTUPLES=NMR SPECTRUM
##END=
