##TITLE=1H_CA-9293-1
 CDCl3
 8 sc, 
 9.10.2024
##JCAMPDX= 6.0         $$ Bruker NMR JCAMP-DX V2.0
##DATA TYPE= NMR SPECTRUM
##DATA CLASS= NTUPLES
##ORIGIN= UXNMR, Bruker Analytische Messtechnik GmbH
##OWNER= root
$$ XWIN-NMR		Version 3.5
$$ Wed Oct  9 13:52:48 2024 Russian Standard Time (UT+4h)  she@DPX200
##.OBSERVE FREQUENCY= 200.1318
##.OBSERVE NUCLEUS= ^1H
##.ACQUISITION MODE= SIMULTANEOUS
##.ACQUISITION SCHEME= undefined
##.AVERAGES= 8
##.DIGITISER RES= 18
##SPECTROMETER/DATA SYSTEM= spect
##.PULSE SEQUENCE= zg30
##.SOLVENT NAME= CDCl3
##.SHIFT REFERENCE= (INTERNAL, CDCl3, 0, 21.0194)
##AUDIT TRAIL= $$ (NUMBER, WHEN, WHO, WHERE, WHAT)
$$ ##TITLE= Audit trail, XWIN-NMR		Version 3.5
$$ ##JCAMPDX= 5.01
$$ ##ORIGIN= Bruker BioSpin GmbH
$$ ##OWNER= she
$$ F:/spectra/data/she/nmr/H-F/1/pdata/1/auditp.txt
$$ ##AUDIT TRAIL=  $$ (NUMBER, WHEN, WHO, WHERE, WHAT)
(   1,<2024-10-09 13:51:35.31 +0400>,<she>,<DPX200>,
      <created by zg, POWCHK disabled, PULCHK disabled
       configuration hash MD5:
       00 E9 B6 7A A2 85 ED C7 34 08 36 98 17 FE 4E 26
       data hash MD5: 16K
       DA 2A FD 63 03 42 3B 8B BF 6F 09 5C A7 6A BD 30>)
(   2,<2024-10-09 13:51:37.56 +0400>,<she>,<DPX200>,
      <Start of raw data processing
       efp BC_mod = 2 LB = 0.24 FT_mod = 6 PKNL = 1 PHC0 = -26341.56 PHC1 = 12.38743 SI = 16K 
       data hash MD5: 16K
       31 D8 27 29 C6 79 C2 BC 78 A1 2C B6 A0 AA 2B B8>)
(   3,<2024-10-09 13:51:57.85 +0400>,<she>,<DPX200>,
      <pk PHC0 = -9.292243 PHC1 = 12.2 
       data hash MD5: 16K
       57 1C 10 B7 3F 78 C8 A6 B9 88 DC 96 31 3A CD 4C>)
(   4,<2024-10-09 13:52:01.62 +0400>,<she>,<DPX200>,
      <abs ABSG = 5 
       data hash MD5: 16K
       E1 6E BD 6F 73 D2 8B 5D 70 D0 66 90 BC 22 E4 53>)
$$ ##END=
$$ 
$$ hash MD5
$$ E9 03 A3 24 7A 96 38 0E 9C 72 26 1D 8C 54 66 59
##$RELAX= 
##$RELAX= 
##$RELAX= 
##$RELAX= 
##$RELAX= 
##$RELAX= 
$$ Bruker specific parameters
$$ --------------------------
##$DU= <F:/spectra>
##$EXPNO= 1
##$NAME= <H-F>
##$PROCNO= 1
##$TYPE= <nmr>
##$USER= <she>
##$AMP= (0..31)
100 100 100 100 100 100 100 100 100 100 100 100 100 100 100 100 100 100 
100 100 100 100 100 100 100 100 100 100 100 100 100 100 
##$AQSEQ= 0
##$AQ_mod= 1
##$AUNM= <au_zg>
##$AUTOPOS= <>
##$BF1= 200.13
##$BF2= 200.13
##$BF3= 200.13
##$BF4= 200.13
##$BF5= 200.13
##$BF6= 200.13
##$BF7= 200.13
##$BF8= 200.13
##$BYTORDA= 1
##$CFDGTYP= 0
##$CFRGTYP= 5
##$CHEMSTR= <none>
##$CNST= (0..31)
1 1 145 1 1 1 1 1 1 1 1 1 1 1 1 1 1 1 1 1 1 1 1 1 1 1 1 1 1 1 1 1 
##$CPDPRG= <>
##$CPDPRG1= <>
##$CPDPRG2= <>
##$CPDPRG3= <>
##$CPDPRG4= <mlev>
##$CPDPRG5= <mlev>
##$CPDPRG6= <mlev>
##$CPDPRG7= <mlev>
##$CPDPRG8= <mlev>
##$CPDPRGB= <>
##$CPDPRGT= <>
##$D= (0..31)
0 1.2 0 0 0 0 0 0 0 0.06 0 0.03 0 0 0 0 0.0002 0 0 0 0 0 0 0 0 0 0 0 0 
0 0 0 
##$DATE= 1728467494
##$DBL= (0..7)
120 120 120 120 120 120 120 120 
##$DBP= (0..7)
150 150 150 150 150 150 150 150 
##$DBP07= 0
##$DBPNAM0= <>
##$DBPNAM1= <>
##$DBPNAM2= <>
##$DBPNAM3= <>
##$DBPNAM4= <>
$$ [...]
##$SUBNAM3= <"">
##$SUBNAM4= <"">
##$SUBNAM5= <"">
##$SUBNAM6= <"">
##$SUBNAM7= <"">
##$SUBNAM8= <"">
##$SUBNAM9= <"">
##$SW= 24.0689170037331
##$SWIBOX= (0..15)
0 0 2 0 0 0 0 0 0 0 0 0 0 0 0 0 
##$SW_h= 4816.95568400771
##$TD= 16384
##$TD0= 1
##$TE= 0
##$TE2= 300
##$TE3= 300
##$TEG= 300
##$TL= (0..7)
0 120 120 120 120 120 120 120 
##$TP= (0..7)
150 150 150 150 150 150 150 150 
##$TP07= 0
##$TPNAME0= <>
##$TPNAME1= <>
##$TPNAME2= <>
##$TPNAME3= <>
##$TPNAME4= <>
##$TPNAME5= <>
##$TPNAME6= <>
##$TPNAME7= <>
##$TPOAL= (0..7)
0.5 0.5 0.5 0.5 0.5 0.5 0.5 0.5 
##$TPOFFS= (0..7)
0 0 0 0 0 0 0 0 
##$TUNHIN= 0
##$TUNHOUT= 0
##$TUNXOUT= 0
##$USERA1= <user>
##$USERA2= <user>
##$USERA3= <user>
##$USERA4= <user>
##$USERA5= <user>
##$V9= 5
##$VALIST= <valist>
##$VCLIST= <CCCCCCCCCCCCCCC>
##$VD= 0
##$VDLIST= <DDDDDDDDDDDDDDD>
##$VPLIST= <PPPPPPPPPPPPPPP>
##$VTLIST= <TTTTTTTTTTTTTTT>
##$WBST= 1024
##$WBSW= 4
##$XGAIN= (0..3)
0 0 0 0 
##$XL= 0
##$YL= 0
##$YMAX_a= 572431
##$YMIN_a= -357476
##$ZGOPTNS= <>
##$ZL1= 120
##$ZL2= 120
##$ZL3= 120
##$ZL4= 120
##$ABSF1= 20.99732
##$ABSF2= -3.071812
##$ABSG= 5
##$ABSL= 3
##$ALPHA= 0
##$AQORDER= 0
##$ASSFAC= 0
##$ASSFACI= 0
##$ASSFACX= 0
##$ASSWID= 0
##$AUNMP= <proc_1d>
##$AZFE= 0.1
##$AZFW= 0.1
##$BCFW= 0
##$BC_mod= 2
##$BYTORDP= 0
##$COROFFS= 0
##$CY= -3
##$DATMOD= 1
##$DC= 0
##$DFILT= <>
##$DTYPP= 0
##$F1P= 0
##$F2P= 0
##$FCOR= 1
##$FTSIZE= 16384
##$FT_mod= 6
##$GAMMA= 0
##$GB= 0
##$INTBC= 1
##$INTSCL= 3.70164e-10
##$ISEN= 128
##$LB= 0.24
##$LEV0= 0
##$LPBIN= 0
##$MAXI= 10000
##$MC2= 0
##$MEAN= 0
##$ME_mod= 0
##$MI= 1.114404
##$NCOEF= 0
##$NC_proc= -5
##$NLEV= 6
##$NOISF1= 3.799351
##$NOISF2= 2.8
##$NSP= 0
##$NTH_PI= 0
##$NZP= 0
##$OFFSET= 21.01936
##$PC= 1
##$PHC0= -26350.85
##$PHC1= 24.58743
##$PH_mod= 1
##$PKNL= yes
##$PPARMOD= 0
##$PSCAL= 0
##$PSIGN= 0
##$REVERSE= no
##$SF= 200.130001872805
##$SI= 16384
##$SIGF1= 3
##$SIGF2= 2
##$SINO= 5.538805
##$SIOLD= 16384
##$SREGLST= <1H.CDCl3>
##$SSB= 0
##$STSI= 16384
##$STSR= 0
##$SW_p= 4816.95568400771
##$SYMM= 0
##$S_DEV= 0
##$TDeff= 16384
##$TDoff= 0
##$TI= <>
##$TILT= no
##$TM1= 0
##$TM2= 0
##$TOPLEV= 0
##$USERP1= <user>
##$USERP2= <user>
##$USERP3= <user>
##$USERP4= <user>
##$USERP5= <user>
##$WDW= 1
##$XDIM= 16384
##$YMAX_p= 289261375
##$YMIN_p= -360625
$$ End of Bruker specific parameters
$$ ---------------------------------
##NTUPLES= NMR SPECTRUM
##VAR_NAME=  FREQUENCY,     SPECTRUM/REAL,   SPECTRUM/IMAG
##SYMBOL=    X,             R,               I
##VAR_TYPE=  INDEPENDENT,   DEPENDENT,       DEPENDENT
##VAR_FORM=  AFFN,          ASDF,            ASDF
##VAR_DIM=   16384,         16384,           16384
##UNITS=     HZ,            ARBITRARY UNITS, ARBITRARY UNITS
##FACTOR=    0.29402158847633, 1,            1
##FIRST=     4206.60447383629, 0,            0
##LAST=      -610.351210171419, 0,           0
##MIN=       -610.351210171419, -360625,     0
##MAX=       4206.60447383629, 289261375,    0
$$ Real data points
##PAGE= N=1
##DATA TABLE= (X++(R..R)), XYDATA
$$ [...]
7886E8502J211K5521k6289K0092L0693p0734P039n7762M4565J00847j5755p9423
7874C8507P6960q8628P0951j4072J1199k4841m677J4877Q038J312p8018N1096
7862F2704l3510n0579J3749P6670K139m1154l8355J03159j05522k5886J62240
7851A25655p172r0935Q6272K0998p0725l8142M8320M9490m7243L3233n0638J38
7839E9251k8228k6374N0769l960K1621N8745m7135p9508J2657L5939M4331r038
7827H9070j761m6777l7923J0171J8762l5413M756Q008K4771m353n5110O3733O0634
7814I8568j4166J8904j3700n7036j21709J22253n8723P086J6220k636O3372k8855
7802B9578L1045n2161J0617p166l2725K8261M5901j1672J4701M2434m3378l1232
$$ y = [58502, 59713, 85234, 58945, 79037, 109730, 38996, 46035, -11727, 32838, 133685, 117930, 38507, 115467, 26839, 97790, 83718, 94917, 70076, 65399, 80276, 88314, 89626, 11608, 62704, 29194, -21385, -7636, 69034, 71173, 30019, -8336, 94823, -10699, -36585, 125655, 118483, 27548, 113820, 134818, 64093, 25951, 74271, 123761, 76518, 109751, 59113, 59251, 31023, 4649, 55418, 51458, 73079, 131824, 84689, 5181, 17838, 53777, 98108, 89070, 87309, 40532, 2609, 12780, 31542, -3871, 885, 8893, 33664, 29311, -25799, 37934, 98568, 84402, 103306, 89606, 32570, -89139, 33114, -25609, -18523, -2303, -4939, 58433, 29578, 60623, 8462, 19079, 11913, -20812, 7449, 53350, 41678, 56379, 98813, 55435, 24203]
7790B4203K018l2843K6755P667P1882K1025m219r0001M3650n2987m6551m2456
7778g1857L2963N8312K2356j3568m9507P1744O3944j3696j4434l8165k0107R3369
7766A21354l2057K8212n6951M0173J9443o7932l2344K8430o040K1251m839m2181
7754A6519J4421q21K3020N117L5538n7263L4038L6999n0502j0982p2084O6812
7742D0812j5319K9243j7360J3195J7595p746M3064r7344K0616L6130K4743k3331
7730F4298m3303q2807O6734j4315n935L9130j3671J9481K6502j5055N5065j5796
7718H0328n2995n261P1618n2141N640j7238l9584M8749Q5010k6013j910R335K8294
7705A33832k2977o7873m9587l0303J08921L7229J5740r6588n2913O7641K2291
$$ y = [24203, 26221, -6622, 20133, 27800, 99682, 120707, 116488, 26487, 70137, 17150, -29401, -71857, -38894, 19418, 41774, 28206, -21301, 50443, 114387, 100691, 86257, 48092, 27985, 121354, 89297, 117509, 60558, 100731, 120174, 52242, 19898, 48328, 42288, 63539, 58700, 16519, 30940, 30119, 53139, 58256, 93794, 36531, 70569, 107568, 57066, 46084, -26000, 40812, 25493, 54736, 37376, 50571, 68166, 60420, 103484, 6140, 26756, 62886, 87629, 64298, 20995, -61812, 4922, -9393, -15328, 23802, 10131, 29612, 56114, 41059, 96124, 80328, 27333, 22072, 93690, 41549, 47189, 29951, -9633, 39116, 124126, 98113, 96203, 105538, 133832, 110855, 42982, -6605, -36908, 72013, 109242, 124982, 28394, -24519, 43122, 65413]
7694F5413k9975L9108L2451l3336L1171o6477q540M9434J8022m317l3356L900
7682F3498K5083r1834l1195J28993M7298j9004q0696j8093J19290L6604p6764
7671A03180l0559K7583M433m3992K4174k4869K4126Q702k335J764k2184p73O3979
7658A33229n9283o7444n733j9662M5781m606j7769J09150k090m7585K2577J9974
7646A06539Q894K3656q3093j473j5220L2139k8192J8517Q4931r129k7530j10847
7634h08K8674N0100N4294L6289j8052o3804m344K2989j2468N1515p0028N6959
7622A31316N5526k8107j9519J1501j10761L0640J09317k501o4322l5710N2283
7611A29663n5185M35P448k0460M2042k8087J8849J8362n209O013m8689Q8217l4820
$$ y = [65413, 35438, 74546, 106997, 73661, 104832, 38355, 29815, 79249, 97271, 92954, 59598, 63498, 88581, -3253, -34448, 94545, 141843, 122839, 42143, 24050, 143340, 179944, 103180, 72621, 100204, 104637, 60645, 84819, 59950, 84076, 92778, 90443, 92207, 70023, 69250, 133229, 73946, 6502, 769, -18893, 26888, 22282, 4513, 113663, 111573, 63988, 86565, 106539, 115433, 139089, 55996, 54523, 39303, 71442, 43250, 61767, 146698, 137569, 110039, -808, 27866, 77966, 132260, 168549, 150497, 86693, 82349, 105338, 92870, 144385, 74357, 131316, 186842, 158735, 139216, 150717, 39956, 70596, 179913, 177412, 113090, 77380, 129663, 74478, 74913, 82361, 61901, 103943, 75856, 94705, 113067, 107858, 113871, 65182, 153399, 118579]
7598A18579J2836m1182K989K3189k998k9548j7567O5601L7615k7918L3825m4598
7586A30823l4088J2543O3317m9808m5694O2882O386l1902J9492j6825k1625J8637
7574A14138M789m1058n683P3286p3441N4174K4388K2061p5067q661N1872J9562
7562A60360j12643K6515K4637R536R16J5301O557j778q2078l305J01766K1492
7550A67276o4178k9767P2966m722k1546M8319p3404P9j9508K0087K8480J6533
7538A40615K2363p9093m2205K8638l1827n9808J07380N890L5081q4830p569J122
7526C5757L2815L5109l8912p5672J05229m0951j3128M7806M1318N9548k3497p5681
7514H9741R6893p7729o4174l2306Q7590R8481l4732m1567L1482o5793m3917M4839
$$ y = [118579, 131415, 90233, 93222, 116411, 113413, 83865, 66298, 131899, 169514, 141596, 175421, 130823, 96735, 109278, 172595, 122787, 77093, 139975, 146361, 114459, 133951, 117126, 95501, 114138, 118927, 77869, 72186, 145472, 72031, 126205, 150593, 172654, 97587, 88926, 140798, 160360, 47717, 74232, 98869, 108405, 109321, 124622, 131179, 129401, 47323, 44018, 145784, 167276, 103098, 73331, 146297, 141575, 120029, 168348, 94944, 95023, 75515, 95602, 124082, 140615, 162978, 83885, 41680, 70318, 38491, -21317, 86063, 91953, 127034, 42204, 34635, 35757, 68572, 103681, 64769, -10903, 94326, 53375, 40247, 88053, 129371, 188919, 165422, 89741, 186634, 108905, 44731, 12425, 100015, 198496, 163764, 122197, 153679, 87886, 43969, 88808]
7502H8808m3506K9489k062N2817K1082o8184m4929j5346P6714J7229j0836l327
7490I7949j0980n48k5497M5107K0652l8593L8783N0198j7810n1495q430R3953
7478A93289j09521N4237M8058O600j27136j9355N4866K4514r984P197K3823k4915
7466A21673L5670K520K8039J2164k6226n8128J9688J9604l6494K9673m9384J8513
7454A17312K4833K5602K3106m837P6280q0226j8721l2443K8000k5154Q310j4856
7442A27206O471M1785O831n4031n9006J12369o3699J69138L2970p2929r7316J5071
7430A64860o7855O5569J5323K3636M3620n6826n4132J5995j2150L3383J3214k9032
7418A55605j994J5053N0081j5522l7129K0694k6266r486K9136q7596K2178j9158
$$ y = [88808, 45302, 74791, 72729, 125546, 146628, 78444, 33515, 18169, 94883, 112112, 101276, 97949, 86969, 86421, 60924, 106031, 126683, 88090, 126873, 177071, 159261, 107766, 99336, 193289, 83768, 138005, 186063, 192663, 65527, 46172, 101038, 125552, 115568, 122765, 146588, 121673, 157343, 159863, 187902, 200066, 173840, 115712, 135400, 155004, 118510, 148183, 98799, 117312, 142145, 167747, 190853, 186016, 262296, 182070, 163349, 130906, 158906, 133752, 142062, 127206, 133677, 175462, 182293, 128262, 69256, 181625, 117926, 287064, 320034, 247105, 149789, 164860, 97005, 162574, 177897, 201533, 245153, 188327, 134195, 150190, 138040, 171423, 184637, 155605, 153611, 168664, 218745, 203223, 166094, 186788, 160522, 151036, 180172, 92576, 114754, 95596]
7406I5596M1115K5908k695l2876O2230J9988Q7798r0865k702m7866J05214m6396
7394B14449J6719p131j2299J4133p944O2592n1297j9309k7038K7661L2819O0147
7382C03502J8307r2986K7706l4753m9530J03906q038m8489j6799K4853k1906m6597
7370A59176P6684M2382M19Q260K5691l9583L4672o757K3375j8355j8953n3878
7358B33133m8373Q1629M5823J9836k5435n026l37K6800J2200L9773j2495M4554
7346D12082k086m935J3115L7482L8528n0427J1692n0251L6013M5267j02366L9806
7334D23920k0134P8614n6122R66J0776L0778J0984K3901J1715K1154R941J5155
7322E61648o689k7041j2831L7587m3993N942J3720K2020L5722j9774o1452m7312
$$ y = [95596, 136711, 162619, 159924, 127048, 189278, 209266, 297064, 206199, 203497, 155631, 260845, 214449, 231168, 224037, 211738, 225871, 217927, 280519, 229222, 209913, 182875, 210536, 243355, 303502, 321809, 228823, 256529, 221776, 172246, 276152, 268114, 219625, 202826, 227679, 205773, 159176, 235860, 278242, 278661, 286921, 312612, 273029, 307701, 300944, 324319, 305964, 287011, 233133, 184760, 266389, 312212, 332048, 306613, 301587, 301250, 328050, 340250, 380023, 367528, 412082, 409996, 405061, 418176, 455658, 494186, 443759, 455451, 405200, 441213, 486480, 384114, 423920, 403786, 482400, 426278, 427244, 438020, 468798, 479782, 503683, 515398, 536552, 546493, 561648, 554959, 527918, 515087, 552674, 508681, 514623, 528343, 550363, 586085, 566311, 504859, 457547]
7310D57547J3772N1909r2076K8793q037J4355J5762n7008Q645j6473M1139L9136
7298D97464L316R08j1426l6476K847l1682L8104L03O8284N4537k6333M0275l596
7285E96525o2622j1229O6853J0996n5525M604P7275j8830R5212k0460o3409K9891
7273F49281K7787M1660L2625K6233m8667l4118R476J9926K5739j9367j11406M8677
7261F67846N199r649n8522L6033o4753M8922L1259J434o9345j6067O252m1869
7249E36740k5712O5776M0384N219l6207p9244M4266K9090L8376R49k9273M0593
7237F30957n7669l8723n4363L5395K2088J1901j5214J0922J4340j2652l3468m563
7225E08951k8896L2738K315K5848J6384R4246O1480m6028M9687o1103m2545Q023
$$ y = [457547, 471319, 523228, 431152, 459945, 451908, 466263, 482025, 425017, 433662, 417189, 458328, 497464, 500780, 501688, 490262, 453786, 456633, 424951, 463055, 463358, 531642, 586179, 559846, 600121, 596525, 533903, 522674, 589527, 600523, 544998, 549602, 626877, 608047, 703259, 682799, 619390, 649281, 677068, 718728, 751353, 777586, 728919, 694801, 704277, 724203, 749942, 730575, 619169, 667846, 673045, 663396, 604874, 640907, 576154, 625076, 656335, 657769, 588424, 572357, 578609, 536740, 511028, 576804, 617188, 622407, 586200, 506956, 551222, 580312, 618688, 619637, 590364, 630957, 573288, 534565, 480202, 515597, 537685, 549586, 534372, 545294, 559634, 546982, 513514, 508951, 480055, 512793, 515108, 540956, 557340, 651586, 713066, 667038, 716725, 655622, 613077, 621100]
7213F21100R200L4800O1543j6017k0978O1803L3634m2345l8842K5601j12872K4784
7201F41411P3095L0884j1762n2622j325o7699K0826K9762M8383m1121Q578o7162
7189F11248M1920R0456K1865j25315K1919M7378J4560q503k6842J5096j4042m9162
7177F40578J0079j964l6709k4777P374L8381j8706L0049k6066p0082m7551O7465
7165E68071N3146o9360q6473m7266O5451P8845K4063k1356n2179m2851l6151M8452
7153D82392R5600j12371M8439J528M691p9106J6751O0425O444l2465n949l3324
7141D53055j2882O6278m0290J4124N8905o3419P831N5573N484q8294m0869L6345
7129D51841p646N536o6395J47148N6351j04257k4534O4943k0814j23L6538l4945
$$ y = [621100, 630300, 665100, 726643, 710626, 689648, 751451, 785085, 742740, 703898, 729499, 616627, 641411, 714506, 745390, 733628, 681006, 679681, 611982, 632808, 662570, 710953, 669832, 678410, 611248, 653168, 743624, 765489, 640174, 662093, 709471, 724031, 715528, 688686, 703782, 689740, 640578, 650657, 648693, 611984, 587207, 594581, 632962, 614256, 644305, 618239, 548157, 500606, 568071, 621217, 551857, 465384, 418118, 483569, 562414, 586477, 565121, 512942, 470091, 433940, 482392, 577992, 465621, 514060, 515588, 520279, 441173, 457924, 518349, 524793, 492328, 486379, 453055, 440173, 506451, 466161, 480285, 539190, 475771, 483602, 539175, 544659, 456365, 415496, 451841, 444195, 449731, 383336, 530484, 586835, 482578, 458044, 522987, 502173, 502050, 538588, 503643]
7117E03643J9776J8460N8073k871j7179Q5017l4213J2260m0098Q1587o3053O6868
7105F88270M420K2249R386N3148l5231J2751M6006N798L0705m4666K1669m0523
7093G73982N7066n5847K3320N953Q4202J1777Q260j3564o6890j4414L9059L0304
7081H83208J188P4168o3989m2359J679K5918Q4459m2901P513k0644j7186M3489
7069I34543N6546o039N0559M5789N688m0441o167O3888Q1186O964N6070P3602
7057A322188L6408N4302J28720O6897K1118R1341P8487J64649J55999J55386K03499
7046B478994J91918K83201L19259M58021P83822P19373O31271J27845o13229q48816
7036D531659p65755n89752m05188k97537l15738k41652p3250j57036j15660j47868
$$ y = [503643, 523419, 541879, 599952, 597081, 579902, 664919, 630706, 642966, 602868, 684455, 621402, 688270, 692690, 714939, 724325, 777473, 742242, 754993, 800999, 806797, 837502, 792836, 814505, 773982, 831048, 775201, 798521, 804474, 888676, 900453, 908713, 895149, 828259, 813845, 852904, 883208, 884396, 958564, 894575, 852216, 853895, 879813, 964272, 921371, 928884, 908240, 891054, 934543, 991089, 985050, 1035609, 1081398, 1087086, 1046645, 1040478, 1104366, 1185552, 1192516, 1248586, 1322188, 1358596, 1412898, 1541618, 1608515, 1629633, 1720974, 1799461, 1964110, 2120109, 2275495, 2478994, 2670912, 2954113, 3273372, 3731393, 4515215, 5234588, 5865859, 5993704, 5380475, 4531659, 3765904, 3176152, 2770964, 2473427, 2157689, 1916037, 1842787, 1685751, 1570091, 1422223]
7026A422223o8409p4297p9969j0718j02300k3976k9662j8254j1389J1860K7467
7015A042576j55818n747P8622n9758J4525k162k6296j4812J5401O797m7908M9831
7003H95251j5537n4316K6557L2692k1669N713Q3211O009j1180n900o0006L1438
6991I12263q634n9713M3186J9782J5292M505j3480N180j9581k86M8364O0143l7382
6978I69639J1905K1574o080n3287K3585Q7088O6749k4186l7794L6828J6339J7560
6966A129920J3807M0907p6532K838P6819r220M5078P4401L3914J17717o1969j9912
6954A367768O2158K6276j3225j2444P1371j0126j7813J6634M7737l6583J077R3242
6942A596072M6123j417K4102J685J3888J36834J9106J30629K6056J9757K6864
$$ y = [1422223, 1353814, 1279517, 1199548, 1188830, 1086530, 1062554, 1032892, 1014638, 1003249, 1015109, 1042576, 886758, 881011, 959633, 899875, 914400, 912238, 885942, 871130, 886531, 893328, 845420, 895251, 879714, 825398, 851955, 884647, 862978, 868691, 951902, 957911, 946731, 940831, 880825, 912263, 903629, 843916, 887102, 906884, 922176, 926681, 913201, 918381, 898800, 898514, 946878, 1007021, 969639, 981544, 1003118, 997038, 943751, 967336, 1054424, 1121173, 1096987, 1059193, 1096021, 1112360, 1129920, 1143727, 1184634, 1108102, 1110940, 1187759, 1178539, 1223617, 1298018, 1331932, 1449649, 1387680, 1367768, 1429926, 1456202, 1442977, 1430533, 1501904, 1491778, 1473965, 1490599, 1538336, 1501753, 1502830, 1596072, 1642195, 1640778, 1664880, 1666565, 1680453, 1817287, 1836393, 1967022, 1993078, 2012835, 2039699]
6931B039699R8985Q0887P0453J33467P1285J59707Q1740R5565J23149J60372J02959
6920C218268J47052J06947J16511m5661p718r1P5959o3716j28715j89562k49430
6909B979844j69948j38316j12706k48547j06601o3189r5281o7031l9666N0812
6899A989371o1777j12874k7219m2009Q477m0995j7252j04276l4327j1879n6762
6888A488478K4738j3493k4773K3O9656J446J9307L2752o7991q90N2640L8664K4215
6875A644772K1953k535n312l341j1845k5145k1323J6054m4724r4746J0302j5739
6863A468371n6603M912k1717M8452M7039k7537l1055K4754P0817J1662J9953k361
6851A556687Q1799J904J1429K8608Q4225l1034j4208K8572O8966j4486k1861J15705
$$ y = [2039699, 2138684, 2219571, 2290024, 2423491, 2494776, 2654483, 2736223, 2831788, 2954937, 3115309, 3218268, 3365320, 3472267, 3588778, 3543117, 3535399, 3535308, 3611267, 3547551, 3418836, 3229274, 2979844, 2809896, 2671580, 2558874, 2310327, 2203726, 2140537, 2045256, 1978225, 1938559, 1989371, 1927594, 1814720, 1787501, 1745492, 1753969, 1712974, 1695722, 1591446, 1557119, 1545240, 1488478, 1513216, 1499723, 1474950, 1474973, 1544629, 1546075, 1565382, 1598134, 1530143, 1529253, 1581893, 1620557, 1644772, 1666725, 1664190, 1658878, 1655537, 1643692, 1618547, 1597224, 1613278, 1568554, 1473808, 1484110, 1468371, 1411768, 1416680, 1394963, 1443415, 1490454, 1462917, 1431862, 1456616, 1527433, 1539095, 1559048, 1556687, 1638486, 1640390, 1651819, 1680427, 1764652, 1733618, 1719410, 1747982, 1816948, 1802462, 1780601, 1896306]
6839A896306j1991L9587j101p8221L5899L4999m1713j8606J980j25381l5979L6308
6827A732087o732k5323L9029L5154Q7283l2201o684M2960N899R0037J1215J0180
6815A982904N3667M3266P6885J04564M8130o4271L8484k068M0589m5032n5990
6804B221128N2570l4088J2487k6558N0366L9726O4259O445J3198Q343J03766j1766
6792B499876R5055J11105l9036R9576J19410L6587Q0070M3062J29743K3413L7128
6781C235989R5097R3759J12634K1935Q0748J71048J84338J55601J03852J05710
6771D360711P3895K27719J88569J19889J25388K04893J74137J88902J87703K28165
6761F079971K42840K17429L40370L46469K76896L45247K99541L50250M27952L46119
$$ y = [1896306, 1884315, 1923902, 1922801, 1844580, 1880479, 1915478, 1873765, 1855159, 1857139, 1731758, 1695779, 1732087, 1725355, 1700032, 1739061, 1774215, 1861498, 1829297, 1822613, 1865573, 1871472, 1961509, 1972724, 1982904, 2036571, 2079837, 2156722, 2261286, 2309416, 2245145, 2283629, 2281561, 2322150, 2277118, 2221128, 2273698, 2239610, 2252097, 2225539, 2275905, 2315631, 2379890, 2386335, 2399533, 2407876, 2511642, 2499876, 2594931, 2706036, 2667000, 2766576, 2885986, 2922573, 3002643, 3045705, 3175448, 3198861, 3235989, 3331086, 3424845, 3537479, 3559414, 3640162, 3811210, 3995548, 4151149, 4255001, 4360711, 4434606, 4662325, 4850894, 4970783, 5096171, 5301064, 5475201, 5664103, 5851806, 6079971, 6322811, 6540240, 6880610, 7227079, 7503975, 7849222, 8148763, 8499013, 8926965, 9273084]
6751I273084N59399M95398M93873O01797O52438P70803P68246R82488J156674
6742A5754200J272306J470403J633956J341095Q77395M98908R714j0685M5206
6733B2892498J42081L38164L66009L86841L70289K55763L07898L54072M52513
6724B5866128P07820Q03255J007560J317421J559310J845946J995681K295763
6716C7398884K357883K324372K565962L072795L609347L934388L707652K661623
6708F1632906J174909m23662j660141k461820k577954k145831j368976n53868
6700E1615563O5849L87328O85277Q28245R03270R37780R44963J131564J452431
6691E8952270J630945J351673P87334n424m76133n69760n02247o10358j051937
$$ y = [9273084, 9832483, 10327881, 10821754, 11423551, 12075989, 12846792, 13615038, 14597526, 15754200, 17026506, 18496909, 20130865, 21471960, 22349355, 22848263, 22857977, 22847292, 22892498, 23034579, 23372743, 23738752, 24125593, 24495882, 24751645, 25059543, 25413615, 25866128, 26573948, 27377203, 28384763, 29702184, 31261494, 33107440, 35103121, 37398884, 39756767, 42081139, 44647101, 47719896, 51329243, 55263631, 58971283, 61632906, 62807815, 62384153, 60724012, 58262192, 55684238, 53538407, 52169431, 51615563, 51681412, 52068740, 52754017, 53582262, 54485532, 55423312, 56368275, 57499839, 58952270, 60583215, 61934888, 62722222, 62716798, 62240665, 61670905, 61168658, 60558300, 59506363]
6682E9506363j492313j676118j469028q29538j58396O28693J217653J879951K199242
6673E9806509K305892K143717K104277K184729K341923K215808J444515L28525
6665G4875895q58528j488043j676403j865273k497661l542946m575205m911176
6657E3460660m475497l710255k910382k445644k074628j838823j797001j501954
6649C2706476j482727j352846j247054j225342j282042j538269j485045j476311
6641B1616840j470920j284390j092278r91500q45478p33121o68447n65109n07899
6632A3457698m58899l87617m24384l94125m20423l95570l94428m31934l43548
6623I806770l56007l68632l02124l00344k56605k62560k39959k58260l23401k14448
$$ y = [59506363, 58014050, 56337932, 54868904, 54039366, 53880970, 54509663, 55727316, 57607267, 59806509, 62112401, 64256118, 66360395, 68545124, 70887047, 73102855, 74547370, 74875895, 74017367, 72529324, 70852921, 68987648, 66489987, 62947041, 58371836, 53460660, 48985163, 45274908, 42364526, 39918882, 37844254, 36005431, 34208430, 32706476, 31223749, 29870903, 28623849, 27398507, 26116465, 24578196, 23093151, 21616840, 20145920, 18861530, 17769252, 16777752, 15932274, 15199153, 14530706, 13965597, 13457698, 12998799, 12611182, 12186798, 11792673, 11372250, 10976680, 10582252, 10150318, 9806770, 9450763, 9082131, 8780007, 8479663, 8223058, 7960498, 7720539, 7462279, 7138878, 6924430]
6613F924430k22430j87733j00447j25302j25047j23275o8385j2476j31995j07178
6603E720162p4215o7161r8635q0903j72998k01200p7412j40253j13149n2216j93897
6592D448123j73562j16764r380q8756j48233j9883j06383j63446j2716m9699L9823
6581C599124j08525n9560j7884j6567q181p0976M8873J9383J1974M8078j7795
6570C427944o7811N4367m7908Q094n0348O1141l772K1527r4998j8485J01525J5964
6558C407240K9718o702Q205k071J751j7385L2458K2131o0399K3786O9673k9960
6546C478445M6410L9454L4441N0510m3056r0785j8162l9579K8420j31426J7702
6535C372374j9495p6348l3839r5668J8204r5266p014o5418p2539P436j25746j7807
$$ y = [6924430, 6702000, 6514267, 6413820, 6288518, 6163471, 6040196, 5971811, 5959335, 5827340, 5720162, 5645947, 5578786, 5480151, 5399248, 5226250, 5025050, 4947638, 4807385, 4694236, 4642020, 4448123, 4274561, 4157797, 4148417, 4059661, 3911428, 3891545, 3785162, 3621716, 3609000, 3559301, 3599124, 3490599, 3431039, 3413155, 3396588, 3388407, 3317431, 3366304, 3385687, 3397661, 3445739, 3427944, 3360133, 3414500, 3366592, 3374686, 3324338, 3385479, 3381707, 3403234, 3308236, 3289751, 3391276, 3407240, 3436958, 3430256, 3438461, 3436390, 3438141, 3420756, 3453214, 3475345, 3414946, 3438732, 3508405, 3478445, 3524855, 3564309, 3598750, 3649260, 3606204, 3515419, 3497257, 3457678, 3486098, 3354672, 3372374, 3352879, 3276531, 3242692, 3147024, 3165228, 3069962, 3062948, 2997530, 2924991, 2932427, 2806681, 2788874]
6523B788874l0855l4735j12617j00059l2417M0708p4724j59134p183r3749m8062
6512B136047l1421k0824j23962p7510k1076n5188l8993o7161J7582R24j5193j09134
6500A594091l5093p7561k6775K9201L9564K6978n3434j00992K9933k6083k8749
6489A371080J8284o6931l5977j149k9550K881L2857n5487L334K8477K2119O6690
6477A356628m1009L5424J7824n6020q4734m7081K27040l4584J6769J1746L7901
6466A439904N465n8268J3717q0464N676N8411J7325K7168Q2400k3687n285K4101
6454A506463K9497L8105j0470J00386r8772R387M8626Q6765J07939m8182J9506
6443A789250L4749l886P9693M5083P3350O7501J7249q1K4029R5860k994L7252
$$ y = [2788874, 2758019, 2723284, 2610667, 2510608, 2478191, 2518899, 2444175, 2285041, 2277858, 2184109, 2136047, 2104626, 2083802, 1959840, 1882330, 1861254, 1806066, 1767073, 1699912, 1717494, 1718418, 1703225, 1594091, 1558998, 1481437, 1454662, 1483863, 1523427, 1550405, 1496971, 1395979, 1425912, 1399829, 1371080, 1389364, 1322433, 1286456, 1285307, 1255757, 1258638, 1291495, 1236008, 1239342, 1267819, 1289938, 1356628, 1315619, 1351043, 1368867, 1312847, 1228113, 1181032, 1408072, 1373488, 1390257, 1402003, 1439904, 1445369, 1387101, 1400818, 1320354, 1326030, 1384441, 1401766, 1428934, 1511334, 1487647, 1482362, 1506463, 1535960, 1574065, 1563595, 1663981, 1565209, 1574596, 1623222, 1709987, 1817926, 1769744, 1789250, 1823999, 1820113, 1899806, 1944889, 2018239, 2085740, 2102989, 2102908, 2126937, 2222797, 2219803, 2257055]
6431B257055Q0524J7204K6913K7203P6034Q2789L9475J73046L0706J5315P1586
6420B897850L9046J48989J48353J03541L8546J44866J42760J44787M1509O5985
6410C916232J70760J37201K40973J79344J12620J84824J83193K20644K03978K82182
6400E831951K52268K47697L34960J83807L09760L12693K67726L14306K38924K78108
6390H572200K33165J84314K07229K53784J25913J22598J61990J62533Q1644P6132
6380A0181502J39950J33417J79744K47227K11629K57799K65738K45718K60766
6371A2123490J54532K38811R8562m7283j29582j16172k08097k61507k84156l24214
6361A1244384l68015k92495k04594j84247j94793j89924k64912j44763p0458j65288
$$ y = [2257055, 2337579, 2354783, 2381696, 2408899, 2484933, 2567722, 2607197, 2780243, 2810949, 2826264, 2897850, 2936896, 3085885, 3234238, 3337779, 3376325, 3521191, 3663951, 3808738, 3850247, 3916232, 4086992, 4224193, 4465166, 4644510, 4757130, 4941954, 5125147, 5345791, 5549769, 5831951, 6084219, 6331916, 6666876, 6850683, 7160443, 7473136, 7740862, 8055168, 8294092, 8572200, 8805365, 8989679, 9196908, 9450692, 9576605, 9699203, 9861193, 10023726, 10105370, 10181502, 10321452, 10454869, 10634613, 10881840, 11093469, 11351268, 11617006, 11862724, 12123490, 12278022, 12516833, 12615395, 12568112, 12438530, 12322358, 12114261, 11852754, 11568598, 11244384, 10876369, 10583874, 10379280, 10195033, 10000240, 9810316, 9545404, 9400641, 9330183, 9164895]
6351I164895j62770k01477j46826k14970l07046k57066k62894k26216l36666l50634
6341F698330k95989k74683k19380k62093k82924k21924k87732j99745j37785j70399
6331D345676j89993j08768j59999j41797n8844j17915m6338j52973o148j27990
6321C234911j11146q2137M339k2839n3583q1180n1460O8613o6810R1j22075k6382
6309B690342P6070l0871o2671o5312r5773O7154N2779j18557R002M3057q1426
6298B483794m2432L7189K8010J82l9808j1059K7091L3053n4828k879L6709j8427
6286B476595r438K013p8217j4542L5721q8759l6713R8896k8637k4799J3975r4977
6274B251118M5454k248l4716J6407K9008j2519q952n7531K7384o444K005O906
$$ y = [9164895, 9002125, 8800648, 8653822, 8438852, 8131806, 7874740, 7611846, 7385630, 7048964, 6698330, 6402341, 6127658, 5908278, 5646185, 5363261, 5141337, 4853605, 4653860, 4516075, 4345676, 4155683, 4046915, 3886916, 3745119, 3686275, 3568360, 3522022, 3369049, 3362901, 3234911, 3123765, 3041628, 3045967, 3023128, 2969545, 2888365, 2836905, 2905518, 2838708, 2838799, 2716724, 2690342, 2766412, 2735541, 2672870, 2607558, 2511785, 2578939, 2631718, 2513161, 2522163, 2565220, 2483794, 2441362, 2478551, 2506561, 2506743, 2466935, 2455876, 2482967, 2516020, 2461192, 2458313, 2495022, 2476595, 2467157, 2469170, 2390953, 2376411, 2412132, 2323373, 2286660, 2385556, 2356919, 2332120, 2346095, 2251118, 2296572, 2294324, 2259608, 2276015, 2305023, 2292504, 2283552, 2226021, 2253405, 2246961, 2248966, 2255872]
6262B255872j0204j1180M7029K2095k8089O241J826l001M0698L9703J3132L7837
6250B411959j9494r489j1827K0438M7955n997m4482P963Q4135L0491J1619o600
6238B516671N8127k60j474J35868l7761K758K3622m4986J06991Q4508O559k0469
6226B830154R5270p52k6893R8410M7367m761M8033M6269R3785L1903O1640J5745
6214C336170j6916M825M0084L9586O8399J35523o3667R1392K9699Q5474P4837
6203C825406K8858K4853J8040L6986R6320j8325l319Q4367Q8897j1954M5279m7949
6191D167459O3736O2982N9323J8321m4454O6456l4274O523J7127j0752k151j7222
6179D353074J33597n8719m9687M3310n0591M4989k5333j34250O5787J5524m2246
$$ y = [2255872, 2245668, 2234488, 2281517, 2303612, 2275523, 2281764, 2283590, 2280589, 2321287, 2360990, 2374122, 2411959, 2392465, 2382976, 2371149, 2391587, 2439542, 2433545, 2389063, 2397026, 2481161, 2511652, 2523271, 2516671, 2574798, 2574538, 2573064, 2708932, 2671171, 2673929, 2697551, 2652565, 2759556, 2844064, 2850623, 2830154, 2925424, 2924672, 2897779, 2996189, 3043556, 3038795, 3086828, 3133097, 3226882, 3258785, 3320425, 3336170, 3319254, 3324079, 3364163, 3403749, 3472148, 3607671, 3544004, 3635396, 3665095, 3750569, 3825406, 3854264, 3879117, 3897157, 3934143, 4030463, 4012138, 4008819, 4093186, 4182083, 4170129, 4215408, 4167459, 4231195, 4294177, 4353500, 4371821, 4327367, 4393823, 4359549, 4366072, 4383199, 4372447, 4370296, 4353074, 4486671, 4427952, 4378265, 4421575, 4370984, 4415973, 4390640, 4256390, 4322177, 4337701, 4295455]
6168D295455l27L4384n0738l287l7019j9829M1265m4768j428n4918n3289L2423
6156D137924n3308O616o4704j3813P649M8680n4736l5728N3966r0304q91p8480
6144C862871k0058L4853J39o5995l81m5172L8872k4903k5227m1433j5744J1445
6132C709267o7582K0285j5314q3135K5939j05711N5632k0665k5733k9587k8339
6121C435057k1099J1069q9727l345Q863J7567o2509l400j045m1558K4738j3987
6109C260624n2332N030k5526o1474L0782J9575l7719n8513L272N4922k1635r236
6097C107770L3266n2322m6408j3665J3165N5537l5359K0919r474M5073J29786
6086C248288n2046k7758q621j7304o1776N1333m6693R766Q454k4078O8903m4251
$$ y = [4295455, 4295128, 4329512, 4278774, 4275487, 4238468, 4218639, 4259904, 4215136, 4213708, 4158790, 4105501, 4137924, 4084616, 4091232, 4026528, 4012715, 4020364, 4069044, 4014308, 3978580, 4032546, 3942242, 3941351, 3862871, 3842813, 3877666, 3877805, 3811810, 3811429, 3766257, 3805129, 3780226, 3754999, 3713566, 3697822, 3709267, 3641685, 3661970, 3646656, 3563521, 3589460, 3483749, 3539381, 3518716, 3492983, 3463396, 3435057, 3413958, 3425027, 3335300, 3331955, 3340818, 3358385, 3295876, 3292476, 3291431, 3249873, 3274611, 3260624, 3208292, 3213322, 3187796, 3126322, 3157104, 3176679, 3138960, 3080447, 3083719, 3138641, 3117006, 3107770, 3141036, 3088714, 3042306, 3028641, 3041806, 3097343, 3061984, 3082903, 3073429, 3118502, 3248288, 3196242, 3168484, 3159863, 3142559, 3080783, 3132116, 3085423, 3095189, 3103643, 3079565, 3148468, 3104217]
6074C104217o2864L7447m4471r9191n3208K1437Q262j82272p0210l7685o956j330
6062B613176p2562J2944j54044J6226k1667k3834o0852j06471K5037o8305k7180
6051B132468k2678l6562M1026j0617q2818J3966K0854n7145p6339j1232j827q034
6039A901062k9365j9980l5815L8180m2903M3395k1083n4912K721J9611q8134J4298
6027A727075L8291N576o6112L1990o964j4155P6478j23945k6221l6831O4551k984
6015A666749l2529j9822j0770O3343J8546p766K8532o8621J1648J9533N1288R985
6003A730116L7879j8047j5290k7281K5779M1784P8490q732J4946J4079R3245k0058
5991A946910M9808O1677j6916K0321J11634r835O2519J07506L8782K4039J00648
$$ y = [3104217, 3041353, 3078800, 3034329, 2935138, 2881930, 2903367, 2911629, 2729357, 2659147, 2621462, 2614506, 2613176, 2540614, 2553558, 2399514, 2415740, 2394073, 2370239, 2309387, 2202916, 2227953, 2159648, 2132468, 2109790, 2073228, 2114254, 2103637, 2020819, 2034785, 2055639, 1998494, 1922155, 1910923, 1909096, 1901062, 1871697, 1851717, 1815902, 1854082, 1811179, 1854574, 1833491, 1778579, 1781300, 1800911, 1712777, 1727075, 1765366, 1770942, 1704830, 1736820, 1729856, 1715701, 1792179, 1668234, 1642013, 1605182, 1669733, 1666749, 1634220, 1614398, 1603628, 1666971, 1685517, 1677751, 1706283, 1637662, 1649310, 1668843, 1720131, 1730116, 1767995, 1749948, 1734658, 1707377, 1733156, 1774940, 1853430, 1844698, 1859644, 1873723, 1966968, 1946910, 1996718, 2058395, 2041479, 2061800, 2173434, 2163599, 2226118, 2333624, 2372406, 2396445, 2497093]
5980B497093k8797J09686P573M3475J42098N3194R1052J00279O7245R1665O3157
5969C237720J00707J00962J12898K68957J09786K10442J27836J72419K03988K59707
5959D905422K27953J72903J57569K10795J85017K42754L5630J35104Q7777N1658
5949F412582K8718J02542Q3199l2036K12536J61792J08219J88898J64300K26851
5939G657601J77085K36306J55378J08100R6156j0468r4475j24620k43866j89510
5929G767687k89745k60683j91813k17996j02686k47366j66690n8684j37352r1985
5919F002687j08071m8502j19440j40129j22474j71529k60832k08516j72818k44025
5909D406351k21814k26684j78262j25097k67366j62112j97515j08389j21884j12037
$$ y = [2497093, 2468296, 2577982, 2585555, 2629030, 2771128, 2824322, 2915374, 3015653, 3082898, 3174563, 3237720, 3338427, 3439389, 3552287, 3821244, 3931030, 4141472, 4269308, 4441727, 4645715, 4905422, 5133375, 5306278, 5463847, 5674642, 5859659, 6102413, 6138043, 6273147, 6360924, 6412582, 6441300, 6543842, 6627041, 6595005, 6807541, 6969333, 7077552, 7266450, 7430750, 7657601, 7834686, 8070992, 8226370, 8334470, 8430626, 8420158, 8325683, 8201063, 7957197, 7767687, 7477942, 7217259, 7025446, 6807450, 6704764, 6457398, 6290708, 6232024, 6094672, 6002687, 5894616, 5846114, 5726674, 5586545, 5464071, 5292542, 5031710, 4823194, 4650376, 4406351, 4184537, 3957853, 3779591, 3654494, 3387128, 3225016, 3027501, 2919112, 2797228, 2685191]
5899B685191r2919j36608j54965r2773l2662j62866m6855O79j15628p5910K7059
5888A801743r7918k2688p0262n4134q4218o7855k6580J631l9932k9433o7745j534
5876A241075l1642L9521j7017j43670J6410M9596j02409l1474n651L758K637l5602
5864I85532M9682l3990k8797J033J4578n9025n7250o481p596j1169k8636l1601
5852G86280L3530N263o5693j1883k5753m5364k1053M0198P9740l1255o6814k9782
5840F47414N9719m9991O2061L7673k2144r1595l2556N024k6201J23975j03148
5829F10231N3608M7842j10930k4629P9283K8998J4843L8823o1753L7797R2799
5818H06912m9491m9577K9098q507L7458l1682o2537Q2157q212m5535M4492L6944
$$ y = [2685191, 2592272, 2455664, 2300699, 2207926, 2175264, 2012398, 1965543, 1966222, 1850594, 1774684, 1801743, 1703825, 1681137, 1610875, 1556741, 1472523, 1404668, 1378088, 1379719, 1339787, 1310354, 1242609, 1241075, 1209433, 1248954, 1231937, 1088267, 1104677, 1154273, 1051864, 1020390, 1014739, 1018497, 1021134, 985532, 1035214, 1001224, 972427, 973460, 988038, 929013, 871763, 865282, 857686, 846517, 817881, 786280, 819810, 825073, 759380, 747497, 721744, 676380, 655327, 695525, 775265, 744010, 677196, 647414, 707133, 657142, 719203, 756876, 734732, 643137, 610581, 615605, 589404, 713379, 610231, 663839, 711681, 600751, 576122, 655405, 684403, 699246, 738069, 676316, 714113, 806912, 757421, 707844, 736942, 728435, 765893, 734211, 671674, 753831, 745619, 700084, 744576, 781520]
5806G81520n2488n160Q9899N2605l0700L3140l546M8808j35365P064q4423p273
5794F94081k9100o1376K3714p8365L1539Q6899O9520k3135l0500m3449n1130J8053
5782F06751ol2634n5024O0125m9005k1300N6359q8687l6541Q4937k0476m9100
5770D55399J03120O174m0213P444k9410M692m784k69l5397K5981P736J2813l7217
5757D76069m8067P0222J9327K0956l4108K74p9329M2528m4727j1374J4687O5361
5745D91819k4797j340O1588r8211L6464N0733l3628L6087p0973K4827J4629O1418
5733E48616m0705P3260l188L7703K4169p7075M7600Q042R677k098K3853K9330
5721F79184M238P0262k658k3602K4909J37M3616O7373J2998N4280k8354o400Q3740
$$ y = [781520, 729032, 723872, 813771, 866376, 835676, 868816, 865270, 914078, 778713, 785777, 701354, 694081, 664981, 603605, 627319, 548954, 580493, 667392, 736912, 713777, 683277, 639828, 588698, 606751, 606745, 574111, 519087, 579212, 530207, 508907, 565266, 476579, 440038, 524975, 504499, 455399, 558519, 564693, 524480, 531924, 502514, 507206, 502422, 502153, 466756, 492737, 500473, 513286, 476069, 428002, 498224, 517551, 538507, 504399, 504673, 425344, 467872, 423145, 411771, 426458, 491819, 467022, 465682, 527270, 429059, 465523, 516256, 482628, 518715, 447742, 472569, 487198, 548616, 507911, 581171, 577983, 615686, 639855, 562780, 610380, 618422, 628099, 626001, 649854, 679184, 683422, 753684, 751026, 727424, 752333, 752470, 796086, 863459, 876457, 930737, 902383, 895983, 979723]
5708I79723P3883P8959k8044L7978K0618K6964J11876O7593L8102M6812M8317
5697A502781J15212R2808Q337J71742J26309K17777K03377R6506K75216L70774
5687C180839M61233N09378P77328R65284J112868O42441j72841j025347j137325
5678E313858q52744o57163n26188n00801l24948k81571j92728j44570j54464j16366
5668A562315j37609m2052j15621j61881n5573n6620l3557j1491o2855j28600k1048
5657G35408k6427L843j80n4770J4575n1839j5803j210p5982K6459p7158N7070
5645E33986J6426q0330k288k2967O075K4450n0602P3607o5335n2025l5734N0628
5633C95891k5002l414M7400l8178J75L1193p3083k8912Q8071m6282M0295p1261
$$ y = [979723, 1053606, 1132565, 1104521, 1142499, 1163117, 1190081, 1301957, 1369550, 1407652, 1454464, 1502781, 1617993, 1710801, 1719138, 1890880, 2017189, 2234966, 2438343, 2534849, 2810065, 3180839, 3642072, 4151450, 4928778, 5894062, 7006930, 7649371, 7476530, 6451183, 5313858, 4461114, 3803951, 3277763, 2776962, 2452014, 2170443, 1977715, 1833145, 1678681, 1562315, 1424706, 1382654, 1267033, 1105152, 1049579, 992959, 959402, 947911, 885056, 756456, 735408, 708981, 712824, 712644, 657874, 672449, 620610, 604807, 603597, 527615, 554074, 476916, 533986, 550412, 470082, 467794, 444827, 450902, 475352, 424750, 498357, 433022, 380997, 345263, 395891, 370889, 367475, 414875, 376697, 376872, 408065, 334982, 306070, 394141, 347859, 388154, 316893]
5621C16893k2625L1449P92R0911l7525l3748R6969j26716j9042o4551L2186L8246
5609C03239P6689r3252P4313n7512k2331J5003m789l100k3187K000m3790O5628
5597B88911j3321l5589n327p6121q632k3064L6872J5613R0762j3927k1262O220
5585B41135J5256l7300M8266k7440l6278L8136L574o031l4129L5134j6917L1952
5573B55358q036j0389m0985k126m6172J4131K0755l8901M799J13880l1718m0563
5561A90033k8188R007r203R9486l1026k1454P3493M3830r3024L4220K6887k429
5549B91632o6254j0309k354Q396m6171K0477M570L969k3785j0020Q668j5168K2647
5536A86298j9741P5339j1873j1914j6399j4074l5723q426Q6292Q306k0374n0419
$$ y = [316893, 294268, 325717, 326509, 417420, 379895, 346147, 443116, 316400, 297358, 232807, 264993, 303239, 379928, 286676, 360989, 303477, 281146, 296149, 291360, 288260, 265073, 267073, 223283, 288911, 275590, 240001, 234674, 158553, 149921, 126857, 163729, 179342, 270104, 256177, 234915, 241135, 256391, 219091, 267357, 239917, 203639, 241775, 245349, 239318, 205189, 240323, 223406, 255358, 247322, 236933, 195948, 193822, 147650, 161781, 182536, 143635, 148434, 262314, 230596, 190033, 161845, 170852, 161649, 261135, 230109, 208655, 282148, 325978, 232954, 267174, 294061, 291632, 225378, 215069, 212715, 221111, 174940, 195417, 199987, 203956, 180171, 170151, 178819, 163651, 186298, 166557, 241896, 230023, 218109, 201710, 187636, 151913, 143487, 229779, 238085, 217711, 167292]
5524A67292L8879j1578n2692M4938P480L6381p9266J882K0409L3503O3410K067
5512B72705J0087j1838p0202Q3318j28719K1357M5025L059N1765l4770M5839n3430
5500B34196L4390P592m0254m5738m0831m6140R4499J5895l0021k546r676K0625
5488A91991m170m2474P713O6017L7782j03043M583K5403o3052R0059L5363l1093
5476B15079k9466j3329N360O829M3808l1245p0854J9870Q7492k1465n8722M6681
5464B00038j5959k0200N7962p581k2725l7911l95K8648O5987n3953l244l233K9599
5451B17033M0273j4931M9090j745n2788M204L1496L4286l4182q739J6782R38m0468
5438B41249M2978K4304r768n7997k9900M0523m2719k0365K3567N5871k057L534
$$ y = [167292, 206171, 194593, 141901, 186839, 194319, 230700, 151434, 153316, 173725, 207228, 270638, 272705, 282792, 270954, 200752, 284070, 155351, 176708, 221733, 224792, 276557, 241787, 287626, 234196, 268586, 276178, 235924, 190186, 149355, 103215, 197714, 213609, 183588, 181042, 171366, 191991, 187821, 145347, 153060, 219077, 256859, 153816, 158399, 183802, 120750, 210809, 246172, 215079, 185613, 172284, 177644, 184473, 228281, 197036, 126182, 146052, 233544, 212079, 153357, 200038, 184079, 163879, 221841, 214260, 191535, 153624, 153229, 181877, 247864, 193911, 190667, 187434, 217033, 257306, 242375, 291465, 289720, 236932, 241136, 272632, 306918, 272736, 263997, 280779, 281717, 241249, 284227, 308531, 298763, 240766, 210866, 251389, 208670, 188305, 211872, 267743, 265686, 269220]
5426B69220l0637J6385j2542Q1l3305J0385O078j135l3748J3045J8509N7853k6651
5413B53538l0130M9712r676j9932L0315o1654M2280n9940N0771j4611p847J9948
5401B42774l051K4446n0892K9627M2146n0846m9326N0606O8140M6651n2545m4933
5389B52797L0849K380m6604k6701M6687J6026o3269K5076N4345j9235l0716O5786
5377C07421m9013M0988j4677o9601K514k927O7107o9957j0552N2094K1482L2685
5365C07564j9607l0429J8382j5031k9746j6535r949k583L9374o0417j210M9911
5353B29724k0408J7918R101J4267k4791Q603m2588j3006k5102j1601O1131l3308
5341A69940k6041l1987Q6573K7252m8902l9934m98J1903J1169O5070M3809J2036
$$ y = [269220, 238583, 254968, 242426, 242507, 209202, 219587, 225665, 224530, 190782, 203827, 222336, 280189, 253538, 223408, 273120, 263444, 243512, 273827, 212173, 254453, 194513, 245284, 230673, 222826, 242774, 239723, 264169, 213277, 242904, 285050, 234204, 184878, 235484, 303624, 350275, 297730, 252797, 283646, 286026, 239422, 212721, 259408, 275434, 212165, 237241, 291586, 272351, 241635, 307421, 258408, 299396, 284719, 215118, 217632, 214705, 281812, 211855, 201303, 253397, 274879, 307564, 287957, 257528, 275910, 260879, 231133, 214598, 204649, 202066, 241440, 181023, 179813, 229724, 209316, 227234, 236335, 250602, 225811, 234414, 191826, 178820, 153718, 142117, 203248, 169940, 143899, 111912, 198485, 225737, 176835, 136901, 136403, 148306, 159475, 224545, 268354, 280390]
5329B80390k4405P529j0342j1227o4339J4297O2537J545j4425n179L63K148l5122
5316B03770J2026J04390m1199l6264Q2485q5017j3019K7523J1080K2248k8585
5305B59438K0673k4002M9866o1973k6504P9901p6041R3501K400l5876O5312l7524
5293C09171N1695k6891n1180N2894K0516r264n7757L1785L91J4215m9980K120
5281B87715R356k0675J9408q7706J0955K6406K2956O0907j00195Q7442N7238k9438
5269C44369J1182k4635J08858l7922n390l7889l6628K1988N9164K9239p7603J3258
5257C67991m0740o8822L3559P8230j8624N3935J645m0565O4575m285l8998l8829
5245C49072Q855K3284m2936r127j2947O0460l3144K3222M0611m5101L387J0149
$$ y = [280390, 255985, 263514, 253172, 241945, 177606, 191903, 254440, 255985, 241560, 236381, 236744, 238892, 203770, 215796, 320186, 278987, 242723, 325208, 240191, 227172, 254695, 265775, 288023, 259438, 280111, 256109, 305975, 244002, 217498, 297399, 221358, 314859, 317259, 281383, 346695, 309171, 360866, 333975, 282795, 335689, 356205, 346941, 289184, 320969, 321360, 335575, 285595, 287715, 297071, 276396, 295804, 208098, 219053, 245459, 268415, 329322, 229127, 316569, 373807, 344369, 355551, 330916, 439774, 401852, 396462, 358573, 321945, 343933, 403097, 432336, 354733, 367991, 327251, 258429, 291988, 370218, 351594, 405529, 407174, 366609, 431184, 426899, 387901, 349072, 357927, 381211, 338275, 329148, 316201, 376661, 343517, 366739, 407350, 362249, 365636, 375785]
5233C75785m9137n9187O4515J7072k6440J29441j07101l97j7687j4490l1552O2866
5221C43688J9144N7523l218o3750l2800P368o676Q582J4019n0753Q7682n1735
5209C29074L5260J5534n6947Q9275M631K2334J2720q7442j6813L1401m6211L8511
5197C71327j0380p9497M6570m8227J03644M1171j08420J6553k8935j8556R8982
5186C84232n3052K2705k8310N894L2507L7917k3053R336N4442o773j16224N8339
5174C77960m0538M2301l105J4868q563m5771P416N1832j1330M4009k4779O206
5162D10506L2889l3421J4770L4756j7796O4300J1489l1896p0032o8393m316J00552
5150D43408r104j5920k165l9960J4713m820N5498k9489n136O8972n2574O005M3985
$$ y = [375785, 326648, 267461, 331976, 349048, 322608, 452049, 344948, 344551, 326864, 312374, 280822, 343688, 362832, 420355, 417137, 353387, 320587, 327955, 321279, 329861, 343880, 293127, 380809, 329074, 364334, 379868, 322921, 412196, 416827, 439161, 451881, 364439, 347626, 379027, 332816, 371327, 360947, 281450, 328020, 279793, 383437, 424608, 316188, 332741, 303806, 285250, 384232, 331180, 353885, 325575, 331469, 363976, 401893, 378840, 388176, 442618, 435845, 319621, 377960, 337422, 379723, 376618, 391486, 382923, 337152, 344568, 396400, 385070, 429079, 404300, 410506, 443395, 409974, 424744, 459500, 441704, 506004, 517493, 485597, 415565, 347172, 342856, 443408, 434304, 418384, 416219, 376259, 390972, 386152, 441650, 412161, 407025, 475997, 423423, 429428, 473413]
5137D73413P07k5423m8028J00193r9891P2658m6360m3189k1739K8314q333K3771
5125D06093M0489m0704N0517M6454L4473o0654L87l8029O3527p791n0958J1015
5113D54819O7760p4042j42294K5273j530L0338N5430l5154Q6393r1468M6380M3356
5101D65261m6481O0959j5775M9977M1073o1650J4303Q268j6661K6098m263N4806
5089E75915j26971k239Q8093M8976j1377l1217l4649J1922o940O1017j6205q930
5077E47395o497p2530k0308P7359k7173p7767J114J2024L9253l204R163l3277
5065D45552L4197P0144n3372n5743L3861M7289j1099L3340o9410L5159m1218N4039
5053E22739K4159o4902R0527m2971K5238k3435q3655k251M7248L1809J7503O857
$$ y = [473413, 474120, 448697, 400669, 500862, 400971, 473629, 427269, 384080, 362341, 390655, 382322, 406093, 446582, 405878, 456395, 502849, 537322, 476668, 477055, 439026, 502553, 494762, 443804, 454819, 522579, 448537, 306243, 331516, 329986, 360324, 415754, 380600, 466993, 375525, 421905, 465261, 418780, 479739, 463964, 513941, 555014, 493364, 507667, 515935, 499274, 525372, 521109, 575915, 448944, 446705, 534798, 583774, 572397, 541180, 506531, 518453, 511513, 572530, 556325, 547395, 540898, 468368, 448060, 525419, 498246, 420479, 421593, 433617, 472870, 469666, 478829, 445552, 479749, 549893, 496521, 440778, 474639, 521928, 510829, 544169, 474759, 509918, 468700, 522739, 546898, 481996, 572523, 529552, 554790, 531355, 447700, 445449, 492697, 524506, 542009, 548866]
5041E48866J3258P131m2467P2586R551K2898M8251N0240P661L3715k1169P3170
5029H23691M3648r60k6419n282n7531J9468o325R705J2675m0146K3430L3370N1773
5016H81097j4429Q1624P5129j08346Q9963J48807K4643J06667O6084J43209J12163
5005A606611L100Q7974l0523n3046m0169k0542p3266N116j09235q0333L0740p7130
4993A249297R4059j6574j7612J10119J4469N7037Q9443M6399N9974J50783K9213
4982A866607J01842J35371L3062N8684J54490J85701m0427l0815j36106r6294
4972B232115j59260K123l951q3980N4722J3292k7733O6253J00821O2465M3940
4961B300807R0576K4946N2968L8806O7631K35436K65840K11489J71498P9991L8525
$$ y = [548866, 562124, 569255, 526788, 599374, 608925, 631823, 680074, 730314, 737975, 771690, 750521, 823691, 867339, 866379, 839960, 834678, 777147, 796615, 790290, 799995, 812670, 772524, 795954, 829324, 881097, 866668, 948292, 1023421, 915075, 1005038, 1153845, 1178488, 1285155, 1351239, 1494448, 1606611, 1609711, 1697685, 1667162, 1614116, 1573947, 1553405, 1480139, 1485255, 1376020, 1295687, 1326427, 1249297, 1343356, 1326782, 1309170, 1419289, 1433758, 1490795, 1580238, 1626637, 1686611, 1837394, 1866607, 1968449, 2103820, 2136882, 2195566, 2350056, 2535757, 2495330, 2464515, 2328409, 2232115, 2072855, 2074978, 2071027, 1987047, 2041769, 2055061, 2027328, 2093581, 2194402, 2256867, 2300807, 2391383, 2416329, 2469297, 2508103, 2575734, 2811170, 3077010, 3288499, 3459997, 3539988, 3578513]
4950C578513j45090r2418q9320n2665r4477m7584m5121o7351j35392j10547p7474
4939B621074j92318j03368n1934p8396m7967p7227N8258L4007k5740K9384K2660
4928B188433k9907M7902j42722M4206m6704j9989J2899P2334q5600p7348o783
4917A956721r3717j9997n066M9732K1496j03159j3122P0889m9739L5160P305q112
4905A848391m0678L3742K7849q974o831k1862o5371K1849J0142R64J9745M2691
4893A861657l4854K6171N4661L8656k8485j2652j22661K5519k7066k2139M4247
4882A803054q3433K0990N7348Q456R879K3067L3656L54k9777M8857K095j06162
4870A788384K8313J9911J6497l02J1014O8949n6251k6360M4010q541n749j1404
$$ y = [3578513, 3433423, 3341005, 3251685, 3199020, 3104543, 3056959, 3011838, 2944487, 2809095, 2698548, 2621074, 2428756, 2325388, 2273454, 2195058, 2147091, 2069864, 2128122, 2162129, 2136389, 2165773, 2188433, 2158526, 2206428, 2063706, 2107912, 2061208, 2041219, 2054118, 2126452, 2040852, 1963504, 1956721, 1863004, 1843007, 1837941, 1887673, 1909169, 1806010, 1792888, 1863777, 1814038, 1849198, 1856503, 1848391, 1807713, 1841455, 1869304, 1860330, 1853499, 1831637, 1766266, 1788115, 1798257, 1799221, 1818966, 1861657, 1826803, 1852974, 1907635, 1946291, 1917806, 1905154, 1782493, 1808012, 1780946, 1758807, 1803054, 1719621, 1740611, 1797959, 1806415, 1816294, 1839361, 1873017, 1873371, 1843594, 1892451, 1894546, 1788384, 1816697, 1836608, 1853105, 1852803, 1863817, 1932766, 1876515, 1850155, 1894165, 1885624, 1879875, 1868471]
4858A868471J8697Q2926L6510j2007M7516o375O6801p196k3949P1076J00679p3579
4846B169570O2894j4159k3687O052J3130R8950q700N9130J7751L0966J25624J8212
4834B555733M7211K4617j6042N4339j9739j5732l5443M4907Q9447j972j6939P754
4822B718141O1219R3084J6879n5490m8477J8686Q9365j0670K8046M4379K9006
4811B984168N3710R4164Q7864L2262M8518K9473L2783Q9006K406J4782Q6242N3025
4799C608403J08200N8452J14119N3338J28393J52508P2702J91999J38438J36625
4789D763177J67890J71855J75524J60247K37947J85616J64870J96598J73922L11798
4779F709444K37232K06870L96919K43286L44159L21458L25143M86591M48093N26080
$$ y = [1868471, 1887168, 1970094, 2006604, 1994597, 2042113, 2035738, 2102539, 2095343, 2071394, 2142470, 2243149, 2169570, 2232464, 2218305, 2194618, 2200670, 2213800, 2312750, 2304050, 2363180, 2380931, 2411897, 2537521, 2555733, 2602944, 2627561, 2611519, 2665858, 2646119, 2630387, 2594944, 2639851, 2729298, 2727326, 2710387, 2718141, 2779360, 2872444, 2889323, 2833833, 2785356, 2804042, 2893407, 2882737, 2910783, 2955162, 2984168, 3037878, 3132042, 3219906, 3252168, 3300686, 3330159, 3362942, 3451948, 3454354, 3469136, 3555378, 3608403, 3716603, 3775055, 3889174, 3942512, 4070905, 4223413, 4296115, 4488114, 4626552, 4763177, 4931067, 5102922, 5278446, 5438693, 5676640, 5862256, 6027126, 6223724, 6397646, 6709444, 6946676, 7153546, 7550465, 7793751, 8137910, 8459368, 8784511, 9271102, 9719195, 10245275]
4769A0245275N76022O53729N29721O35252O68257O62789O59282O72071Q48710
4760A6151108O30051Q11055Q54417Q82973R08009R00097R87039R25068J082825
4751B4132642J020257J172807J223023J317351J352796J468611J632621J639690
4743C4959798J662686J762166J790543J995850K240636K183500K396559K612092
4735E1603830K735265L138261L423026L652376M121174M621517N054126N778623
4727H4128198O492374P148469Q031173R106171J0732657J3044921J5888997J7757181
4719A72330141J5722058Q881352K81307m881229m749571j372267K839167O532155
4711A95583113Q903737R925413J0802324J2041789J2862853J2082703J0785404
$$ y = [10245275, 10821297, 11475026, 12004747, 12639999, 13308256, 13971045, 14630327, 15302398, 16151108, 16781159, 17592214, 18446631, 19329604, 20237613, 21137710, 22124749, 23049817, 24132642, 25152899, 26325706, 27548729, 28866080, 30218876, 31687487, 33320108, 34959798, 36622484, 38384650, 40175193, 42171043, 44411679, 46595179, 48991738, 51603830, 54339095, 57477356, 60900382, 64552758, 68673932, 73295449, 78349575, 84128198, 90620572, 97769041, 105800214, 114906385, 125639042, 138683963, 154572960, 172330141, 188052199, 196933551, 197214858, 192333629, 187584058, 186211791, 189050958, 195583113, 204486850, 214412263, 225214587, 237256376, 250119229, 262201932, 272987336]
4704B72987336R214621O290016P69402n284604j0172579j4726901j9327334k2181859
4696B17568098k1958197j9453993j6597137j4122702j2344936j0728683r788577
4689A12573873q835518q029668p195637o606446n927306n339186m850411m246404
4681F1543297l761647l313094l078825k721076k589099k355162k226178j922394
4673C9575822j742138j643172j614340j381970j362069j237344j025756j108055
4665B8460978j075605r63245q64398p49746q13084p61733p03445o88745p03307
4656B1137670o17291n31180n35204n48890m49648l69803m03720l74523m49430
4647A6857981l01950l45919m18774l36886k86755l31085k60458k73717l17384
$$ y = [272987336, 282201957, 288491973, 289261375, 283976771, 273804192, 259077291, 239749957, 217568098, 195609901, 176155908, 159558771, 145436069, 133091133, 122362450, 112573873, 103738355, 95708687, 88513050, 81906604, 75979298, 70640112, 65789701, 61543297, 57781650, 54468556, 51389731, 48668655, 46079556, 43724394, 41498216, 39575822, 37833684, 36190512, 34576172, 33194202, 31832133, 30594789, 29569033, 28460978, 27385373, 26422128, 25557730, 24807984, 23994900, 23233167, 22529722, 21840977, 21137670, 20520379, 19989199, 19453995, 18905105, 18455457, 18085654, 17681934, 17307411, 16857981, 16556031, 16210112, 15791338, 15454452, 15167697, 14836612, 14576154, 14302437, 13985053]
4638A3985053k44558j85911j74368j27501k00619p2499p9493j90391p3820j60869
4628A2475024j09743j64422j30215j53135m6644o9254j22515j25861o6705o9194
4618A1417336j72418r1131j8515j71116r0161k36j7488R57j20189q1455l3717
4607A0621867j5763o2377q5336k982m811n6854n6823o1601o695O4840J2772K8707
4595A0374944J917J11558J12456R9250O0884J19215J11839J12035J59304J85683
4585A1449085J59567L13254K18656K11812K81978M91732M29271L33300N82555
4576A4471210N02108L03866K24627J6571j10668j94657j54024q6342n5776L2899
4566A4949814J64424K62699K51835K36382M06514M83146O45337P31317P15379
$$ y = [13985053, 13740495, 13554584, 13380216, 13252715, 13052096, 12979597, 12900104, 12709713, 12635893, 12475024, 12365281, 12200859, 12070644, 11917509, 11870865, 11801611, 11679096, 11553235, 11486530, 11417336, 11244918, 11153787, 11135272, 10964156, 10873995, 10873759, 10856271, 10857228, 10737039, 10655584, 10621867, 10606104, 10543727, 10458391, 10455409, 10450598, 10393744, 10336921, 10275320, 10268625, 10333465, 10346237, 10374944, 10376861, 10488419, 10600875, 10700125, 10761009, 10880224, 10992063, 11104098, 11263402, 11449085, 11608652, 11921906, 12140562, 12352374, 12634352, 13126084, 13555355, 13888655, 14471210, 14973318, 15277184, 15501811, 15518382, 15407714, 15213057, 15059033, 14972691, 14916915, 14949814, 15114238, 15376937, 15628772, 15865154, 16271668, 16754814, 17400151, 18131468, 18846847]
4557A8846847Q58869R20030Q74822Q71508P45697N91897K00396j62361n01602
4548B3246103o38665o79261m68944l26983k08138m7407M3160J78471K98827M48209
4538B1845372O68650R25248J018506J273841J259452J292777J160309P98218M41694
4529C0684067L40115R239k16847p18145r65765j036416j014448q49666o34833
4520B5597301l42443j78485j71036K97040M09761O11079R03521R31966J251954
4511B9310658J440364J592217J662894J372186J135750R96445O43491L32125j32772
4502C8353358q90408j416831j798107j720357j566375j214537p88085o28488l03365
4493B8026805k3745J14334L86704O56857R40809J097465J390285J514970J580760
$$ y = [18846847, 19705716, 20625746, 21500568, 22372076, 23117773, 23709670, 23910066, 23747705, 23246103, 22607438, 21928177, 21459233, 21132250, 20924112, 20876705, 20919865, 21098336, 21397163, 21845372, 22514022, 23439270, 24457776, 25731617, 26991069, 28283846, 29444155, 30242373, 30684067, 31024182, 31033421, 30816574, 30098429, 29132664, 28096248, 27081800, 26232134, 25597301, 25254858, 25076373, 24905337, 25202377, 25612138, 26223217, 27126738, 28058704, 29310658, 30751022, 32343239, 34006133, 35378319, 36514069, 37510514, 38154005, 38486130, 38353358, 37462950, 36046119, 34248012, 32527655, 30961280, 29746743, 28958658, 28330170, 28026805, 28003060, 28117394, 28504098, 29160955, 30101764, 31199229, 32589514, 34104484, 35685244]
4484C5685244J493277R11949O7692o44269j134575j554523j747207j885608j748698
4475B9443282j602481j335741j064416q27250n89218n17173m24039l27629q285
4466B2747050R6734J97547L99866L12314L01502J40533N0169l59577p76883j182293
4456B1926962j297724j202615j147820r84028r13896q14180p17174n56085n34699
4447A3758741m09942m35933m30216l09304j75096k32578l42009l29664j99838
4438A0894161l37026l30919l65266l87281l43054l33044k75990k47906k53366
4429H020309k61101k30377k77293j93040j23852k25443j16868q9046j03961j08349
4419F290979j55807o8298p8800K239n4730k7150p3958q4047r5388m5822o8113
$$ y = [35685244, 37178521, 38090470, 38158162, 37513893, 36379318, 34824795, 33077588, 31191980, 29443282, 27840801, 26505060, 25440644, 24613394, 24024176, 23507003, 23082964, 22755335, 22747050, 22843784, 23041331, 23441197, 23753511, 24055013, 24195546, 24245715, 23886138, 23109255, 21926962, 20629238, 19426623, 18278803, 17294775, 16380879, 15566699, 14849525, 14293440, 13758741, 13348799, 12912866, 12482650, 12173346, 11998250, 11765672, 11423663, 11093999, 10894161, 10557135, 10226216, 9860950, 9473669, 9130615, 8797571, 8521581, 8273675, 8020309, 7759208, 7528831, 7251538, 7058498, 6934646, 6709203, 6592335, 6503289, 6399328, 6290979, 6135172, 6066874, 5988074, 5990313, 5935583, 5908433, 5834475, 5750428, 5655040, 5609218, 5541105]
4408E541105p8527o713j10291q2111O2469n4772p9615j23585o5229p3203M1508
4397D971036m4157k1742J1812p4065m4744p857J8820o4452O4972K5059j4803N5274
4385D875153N1452J05163L7757Q1359M9039R6875o4734J13389M0143k4586M332
4374E365342M6154N6236O077O2231R1275J69449Q1916J59605K35349K81934K97326
4363F852894L02208L19394M43236O24820N88759P25024R97784J164266J470123
4354A3488508J684366J163394K89641p42812j458431j765643j564326j326276
4346I768421j062424q92416p80986n86171l88089m29065m22229k30680l11105
4337D665256j62479k06177k39642j79723j40054j02226r4473q3987m9474q6321
$$ y = [5541105, 5462578, 5455865, 5345574, 5263463, 5325932, 5271160, 5191545, 5067960, 5002731, 4929528, 4971036, 4926879, 4905137, 4916949, 4842884, 4798140, 4790283, 4809103, 4744651, 4809623, 4834682, 4819879, 4875153, 4926605, 5031768, 5069525, 5150884, 5199923, 5296798, 5232064, 5345453, 5385596, 5361010, 5365342, 5411496, 5467732, 5473809, 5536040, 5627315, 5796764, 5878680, 6038285, 6273634, 6555568, 6852894, 7155102, 7474496, 7917732, 8542552, 9131311, 9856335, 10854119, 12018385, 13488508, 15172874, 16336268, 16625909, 15883097, 14424666, 12659023, 11094697, 9768421, 8705997, 7813581, 7032595, 6446424, 6058335, 5629270, 5207041, 4976361, 4665256, 4502777, 4296600, 4056958, 3877235, 3737181, 3634955, 3540482, 3456495, 3407021, 3320700]
4327C320700m6878j61546m3927j04524q3718j30956r115m0566j10270l655j26786
4316B458759j00273J060n8335p7811k99l4850m9857P62K1247n6172j18411n0639
4304A935181j1931M0471N9190m3890p0408l6701m73k7974o4427J0076l3369l4605
4292A721140m5411L6346q4755j9977K9153q6478L6435K7110q1775M894N5452Q265
4280A600399r0826l1987q5342J7941J1817l0887Q0263m7437k8597J30393p1435
4269A454302J5011K1971K3433J4525l1749n4032P1849n4404j735O6522Q152p842
4257A526003j9995j4083j1626N845N7789k370j3485O8216J1122O896q5373R1743
4245A620682O4522N92m1028O2254J3427L086k9902j4570o887K3803q4166P1920
$$ y = [3320700, 3273822, 3112276, 3068349, 2963825, 2880107, 2749151, 2740036, 2699470, 2589200, 2585545, 2458759, 2358486, 2359546, 2301211, 2223400, 2223101, 2188251, 2138394, 2139156, 2160403, 2104231, 1985820, 1935181, 1923250, 1963721, 2022911, 1979021, 1908613, 1871912, 1871439, 1843465, 1779038, 1789114, 1755745, 1721140, 1675729, 1712075, 1627320, 1607343, 1636496, 1550018, 1586453, 1613563, 1531788, 1536682, 1592134, 1600399, 1509573, 1477586, 1392244, 1410185, 1422002, 1391115, 1471378, 1423941, 1395344, 1525737, 1454302, 1469313, 1491284, 1514717, 1529242, 1497493, 1443461, 1515310, 1460906, 1459171, 1525693, 1533845, 1526003, 1506008, 1491925, 1480299, 1486144, 1543933, 1541563, 1528078, 1596294, 1607416, 1614312, 1528939, 1620682, 1685204, 1685796, 1644768, 1707022, 1720449, 1723535, 1693633, 1679063, 1672176, 1695979, 1611813, 1683733]
4233A683733j0709Q1471r970J9014J3903k4400K9176J7046j2575k6919j0982L6244
4221A785032n5190q1490Q4385N6328o5175m8970J2457j9779l9342k6379K6581
4210A628458N3399l9540l8172L3928J7433j8005J2117l9670L8373M7614n1426
4199A644509K2203j8695O7018P389r3914J4474m5225l227L4550k495O916L2506
4187A666009l0861m2892l4998l8207Q0089m0796Q2928K4180k1427J12688J22608
4176A879321q3850n4664M6903n3885L0871m640j0139k1289l269K9212m9750Q355
4164A713176m4534J5820j4304p186M3868L7793q2054l2219L106R8000M2007K2492
4152A795965m826R5106O5565j9250N4594p123L243p4750p078n0337M4406L0493
$$ y = [1683733, 1673024, 1754495, 1744525, 1763539, 1777442, 1753042, 1782218, 1799264, 1786689, 1759770, 1748788, 1785032, 1729842, 1648352, 1732737, 1789065, 1723890, 1674920, 1687377, 1667598, 1628256, 1601877, 1628458, 1681857, 1642317, 1604145, 1638073, 1655506, 1637501, 1649618, 1609948, 1648321, 1695935, 1644509, 1666712, 1648017, 1715035, 1722424, 1628510, 1642984, 1597759, 1594532, 1629082, 1626587, 1633503, 1666009, 1635148, 1592256, 1557258, 1519051, 1599140, 1558344, 1641272, 1665452, 1644025, 1756713, 1879321, 1795471, 1740807, 1787710, 1733825, 1764696, 1760056, 1749917, 1728628, 1725359, 1754571, 1704821, 1713176, 1668642, 1684462, 1670158, 1662972, 1706840, 1744633, 1662579, 1630360, 1633466, 1731466, 1773473, 1795965, 1791139, 1886245, 1951810, 1932560, 1987154, 1980031, 1983274, 1908524, 1901446, 1851109, 1895515, 1926008]
4140A926008P793q4837K6569R1284j8465j9687J043O1328J06888l2547P447J28819
4128B201643m2344n4925R6499O7084k6336R0293k7341L2948R1561L9420L2696
4117B501198J9217J6829l5145J36850L6684R0474P8230n1505Q097Q7611N7307
4106B945847l88K2933O0765M0963O6111k2865R9404J67791J11650J32343p970
4095C616584J36642J05564Q7998J86365J88828J70173N2419J31794K09848J80774
4085E066989J37813J59336K19236J84420J51110J16373J87704J45493J72977J64664
4075F706115J57746K23171K09003K39554K44187K37634K16038L31563K30587L71581
4065I167179M25713L59631M28533L14224L43975L01552L45536K83663M41082M07109
$$ y = [1926008, 1933801, 1848964, 1875533, 1966817, 1948352, 1928665, 1929708, 1991036, 2097924, 2065377, 2072824, 2201643, 2159299, 2104374, 2200873, 2267957, 2241621, 2331914, 2304573, 2337521, 2429082, 2468502, 2501198, 2520415, 2537244, 2502099, 2638949, 2675633, 2766107, 2844337, 2792832, 2800929, 2888540, 2945847, 2945459, 2968392, 3029157, 3070120, 3136231, 3113366, 3212770, 3380561, 3492211, 3624554, 3616584, 3753226, 3858790, 3946788, 4133153, 4321981, 4492154, 4544573, 4676367, 4886215, 5066989, 5204802, 5364138, 5583374, 5767794, 5918904, 6035277, 6222981, 6368474, 6541451, 6706115, 6863861, 7087032, 7296035, 7535589, 7779776, 8017410, 8233448, 8565011, 8795598, 9167179, 9592892, 9952523, 10381056, 10695280, 11039255, 11340807, 11686343, 11970006, 12411088, 12818197]
4055A2818197M01866M07594N09293M87993N84864O21048O18866O35604O73369
4046A7758694P74636R10506R06562J008005J108792J175413J408858J489175J679541
4037B8220182J782505J979777K094696K037221K017471J949953J935045J917771
4029D3934621J762097J462248J232964R43754P65430P18390P86514J014659J348979
4020E3969656J745579K036382K379317K586617K619664K307611J789115J012361
4012G0446302K84717j97757l68539k81444N1192K86021L72494J82193k29859p95369
4002F9749951j122768j325233j019362o39344j35404L52573P82301J206954J517813
3993F9367481J697508J527946Q52472k66762j734161k864797l394523l536394
$$ y = [12818197, 13220063, 13627657, 14136950, 14624943, 15209807, 15830855, 16449721, 17085325, 17758694, 18533330, 19443836, 20350398, 21358403, 22467195, 23642608, 25051466, 26540641, 28220182, 30002687, 31982464, 34077160, 36114381, 38131852, 40081805, 42016850, 43934621, 45696718, 47158966, 48391930, 49335684, 50101114, 50819504, 51606018, 52620677, 53969656, 55715235, 57751617, 60130934, 62717551, 65337215, 67644826, 69433941, 70446302, 70731019, 70533262, 70164723, 69883279, 69934471, 70220492, 70592986, 70775179, 70545320, 69749951, 68627183, 67301950, 66282588, 65643244, 65507840, 65860413, 66642714, 67849668, 69367481, 71064989, 72592935, 73445407, 73178645, 71444484, 68579687, 65185164, 61648770]
3985F1648770l167905k640222k137077j815663j565335j560070j581098j509913
3977D5671487j220950j076455r42365o91249o08084p42331p43423o40138n97333
3968C8409159m71194n35838r00819j243624j630332j819115j824630j819025j573128
3959B6591454j483191j184700j117274q55759p71815p66926n26128n03492m50290
3950A8931879l81194m24161o06073o56512o99828p79046p67352p16456n34363
3941A3366894m79465n52040m15821l75501l68145l50702k70541k63647k30008
3932A0061024k24438k09329k41120j66020j60690j89014j32997r9838j86523r0498
3922H360557j30733j73039j34413j0937k2705j23297n5509n0587n1247j40198
$$ y = [61648770, 58480865, 55840643, 53703566, 51887903, 50322568, 48762498, 47181400, 45671487, 44450537, 43374082, 42431717, 41740468, 41132384, 40390053, 39646630, 39006492, 38409159, 37937965, 37402127, 36501308, 35257684, 33627352, 31808237, 29983607, 28164582, 26591454, 25108263, 23923563, 22806289, 21950530, 21178715, 20411789, 19885661, 19382169, 18931879, 18550685, 18126524, 17520451, 16863939, 16164111, 15385065, 14617713, 13901257, 13366894, 12887429, 12335389, 11919568, 11544067, 11175922, 10825220, 10554679, 10291032, 10061024, 9836586, 9627257, 9386137, 9220117, 9059427, 8870413, 8737416, 8637578, 8451055, 8360557, 8229824, 8056785, 7922372, 7911435, 7888730, 7765433, 7709924, 7659337, 7608090, 7467892]
3912G467892p8800q5898j24956q781l5520j06885j28800k498r8638j68813O0292
3901F688595m3216j19046o183n1588j4913k6310o4311J1908o9080n1876J1352
3890F265332p4565K495o0808K8379J6420m8542p6953p9203R7905K5660M3990M2046
3878F182156L5910J53884N8427q404Q9992P633J04350J36727P1397J58514J50150
3867G140736J13382K01374J64901J65207K54840J02094K35103K91546L06409L16759
3857I292351J81074K56940L94117L88326N10920N17608M67451N89075O37509Q24190
3847A4059561Q44768Q38985J042231J151165J215384J217481J211554J027602
3839B2608731P94129M01454J66962l0697j37088j01020L7330K33398L34662N58209
$$ y = [7467892, 7389092, 7303194, 7178238, 7169457, 7133937, 7027052, 6898252, 6895754, 6797116, 6628303, 6688595, 6645379, 6526333, 6520150, 6468562, 6453649, 6427339, 6363028, 6374936, 6305856, 6253980, 6265332, 6190767, 6193262, 6132454, 6160833, 6177253, 6128711, 6051758, 5972555, 6070460, 6096120, 6140110, 6182156, 6218066, 6371950, 6430377, 6421973, 6511965, 6519598, 6623948, 6760675, 6832072, 6990586, 7140736, 7254118, 7455492, 7620393, 7785600, 8040440, 8142534, 8377637, 8669183, 8975592, 9292351, 9473425, 9730365, 10124482, 10512808, 11023728, 11541336, 12008787, 12597862, 13235371, 14059561, 14904329, 15743314, 16785545, 17936710, 19152094, 20369575, 21581129, 22608731, 23402860, 23804314, 23971276, 23940579, 23803491, 23702471, 23739801, 23973199, 24307861, 24866070]
3829B4866070O60019Q45714R56812J180744J307848J281718J181297J034111P58364
3820C4072697L50594N6357k27673m62845o32278o32519o35965o74704n89878p40198
3810B9883588o17643n97453m66682k85974k5938J68970L70554O43132Q07924J000559
3800C0881037J033415J009283O89833J45002l43498q39661r63107j109171q97630
3791B9605503q50592o53136n03972n57292m03304l86349j62285k02369j19439
3782B5766765L2589l526P2547N9930O4410J62040J40951J20230j0024j65001k63343
3771B5977568m24638n40710m94401o75431q25481p24150p86336p69697o23775
3762B0112949n55867m43452l45473l32054k10703k21033l47469l00913l65652
$$ y = [24866070, 25526089, 26371803, 27328615, 28509359, 29817207, 31098925, 32280222, 33314333, 34072697, 34423291, 34479648, 34251975, 33789130, 33156852, 32524333, 31888368, 31213664, 30623786, 29883588, 29265945, 28668492, 28201810, 27915836, 27889898, 28058868, 28429422, 29072554, 29880478, 30881037, 31914452, 32923735, 33613568, 33758570, 33415072, 32575411, 31612304, 30503133, 29605503, 28754911, 28101775, 27597803, 27040511, 26637207, 26250858, 26088573, 25886204, 25766765, 25799354, 25795828, 25868375, 25928305, 25992715, 26154755, 26295706, 26415936, 26405912, 26240911, 25977568, 25552930, 25012220, 24517819, 23842388, 23016907, 22292757, 21506421, 20736724, 20112949, 19557082, 19113630, 18768157, 18436103, 18225400, 18004367, 17656898, 17355985, 16990333]
3753A6990333k66179m77693n03162m52998m76871n10648n15746n66199o55131
3744A2565706m46753n31455n34092m27359l86192l39004l67770j88061k77586
3735I067434l20876k15844j49179j85187j44842k6577o0638j71190l3120Q922
3725G768903j11576p2862p9173m9576o3708K8735k6948j63768J4960n4155r0837
3714G099995q5048n159N9223o238J9737n2585K9520Q7259K2001Q0909J43688O3051
3702G456353J07793L6891Q6132J63817J21741J38488O9231J01535J49901J25972
3692H557854J96346J76648K44312L29396L34778K88047K36864L15338K60743J76929
3682A1117255J99511K60692L53408L54680L25295M19302N07197N26355M21613
$$ y = [16990333, 16724154, 16246461, 15743299, 15290301, 14813430, 14302782, 13787036, 13220837, 12565706, 12118953, 11587498, 11053406, 10626047, 10239855, 9900851, 9533081, 9345020, 9067434, 8746558, 8530714, 8381535, 8196348, 8051506, 8024929, 7964291, 7793101, 7759981, 7768903, 7657327, 7584465, 7505292, 7455716, 7392008, 7420743, 7393795, 7230027, 7244987, 7190832, 7099995, 7014947, 7009788, 7069011, 7062773, 7082510, 7029925, 7059445, 7146704, 7168705, 7249614, 7393302, 7456353, 7564146, 7601037, 7687169, 7850986, 7972727, 8111215, 8180446, 8281981, 8431882, 8557854, 8754200, 8930848, 9175160, 9504556, 9839334, 10127381, 10364245, 10679583, 10940326, 11117255, 11316766, 11577458, 11930866, 12285546, 12610841, 13030143, 13537340, 14063695, 14485308]
3673A4485308N04658M94571N24776M57877N10868N16063N00338N28689K46920
3664A8770068K21005K07538M3369P9127Q5021J85951K78149L65794L70164L78967
3654B0985153M57715M15636L86435K97655L35994K45377J51435j2336M4162j27897
3644B3179329k06144l10223l40090k48222l77572m90536n54570m51107m50271
3635A9750594l98604l73896m21442m38994m09947m64069m58311m84436n44031
3626A5756864n10696n23656m17090m02452k81244k52957j10556J9898Q0552L80737
3616A3739400O12505M98828J19045o84438j111717j124705j102993q18263o70902
3607I456760n21183m79810m32683k50709k91809k34483k78386k40197j83320k22733
$$ y = [14485308, 14989966, 15484537, 16009313, 16467190, 16978058, 17494121, 17994459, 18523148, 18770068, 18991073, 19198611, 19241980, 19321107, 19406128, 19592079, 19870228, 20236022, 20606186, 20985153, 21442868, 21858504, 22244939, 22542594, 22878588, 23123965, 23275400, 23263064, 23307226, 23179329, 22973185, 22662962, 22322872, 22074650, 21697078, 21206542, 20651972, 20200865, 19750594, 19351990, 18978094, 18556652, 18117658, 17707711, 17243642, 16785331, 16300895, 15756864, 15246168, 14722512, 14305422, 13902970, 13621726, 13368769, 13258213, 13278111, 13358663, 13739400, 14351905, 14850733, 14969778, 14285340, 13173623, 12048918, 10945925, 10127662, 9456760, 8935577, 8455767, 8023084, 7772375, 7480566, 7246083, 6967697, 6727500, 6544180, 6321447]
3597F321447j68653j42448j10170r2492j06257j91406q3573j00086j69737o7960
3587E088665j4416j42904n4940j75666o8757N7271p5333n3916K8834j28339m027
3576D456472J8148n5910n9633n8271k4560n4138J534j15205k3331K1422m905l6759
3564D064864k7075M7770l7173l1960n9925k0663M6555k235L7686L0537L5302l4358
3552D049325J11751L0439l2645n1597K7309K6566J4680N2866n2625M667k6675
3541D154061O3221r3198j5233R0034j762L9415R049j04668p2058P8670L0647J6967
3529D195145j8779Q7289n2698m7920q1171n30K5198j4413O8431L564k4455k9495
3517D110166L8485M5580p014o1550Q9063J1151O4485K9487r7987M1469M6491J280
$$ y = [6321447, 6152794, 6010346, 5900176, 5807684, 5701427, 5510021, 5426448, 5326362, 5156625, 5088665, 5074249, 4931345, 4876405, 4700739, 4631982, 4689253, 4613920, 4560004, 4588838, 4460499, 4456472, 4474620, 4418710, 4359077, 4300806, 4276246, 4222108, 4223642, 4108437, 4085106, 4106528, 4101623, 4064864, 4037789, 4085559, 4048386, 4016426, 3956501, 3935838, 3982393, 3980158, 4017844, 4048381, 4083683, 4049325, 4161076, 4191515, 4158870, 4107273, 4134582, 4161148, 4175828, 4228694, 4176069, 4180736, 4154061, 4217282, 4124084, 4108851, 4198885, 4197123, 4236538, 4245587, 4140919, 4068861, 4147531, 4178178, 4195145, 4176366, 4263655, 4210957, 4163037, 4081866, 4081336, 4106534, 4092121, 4160552, 4164116, 4139661, 4110166, 4148651, 4194231, 4187217, 4125667, 4214730, 4225881, 4290366, 4319853, 4221866, 4263335, 4309826, 4311106]
3505D311106M7612j6379M7138O5063J15922K2018q481K9818J1984M5913Q7479
3494D759193J31199k1438p542J9224J9260P9967k0060l444Q9223L2216L1026P493
3482E116317Q7824K4142O1873J4382m8815K8070N10l662J693J2574o0070L9661
3470E274499N3341j1161j20483m7619O1351m1197m3838K0095M914o2495j7324
3459E070083J2933n5867k6587k9434n5676J7935Q4912q3201p8834j7517l7857
3448D800890K5257j1814q975l3555L282K1767l1267K4352L6251q005n627j837
3436D810719j9095q2220m5250l4979P652l1084P6266Q106n3337o2146k5311M4295
3424D593616q015j8219q255O1952K9449k6988j05204K4225L3506Q3493l4146p16
$$ y = [4311106, 4358718, 4342339, 4389477, 4454540, 4570462, 4592480, 4583999, 4613817, 4625801, 4671714, 4759193, 4890392, 4868954, 4861412, 4880636, 4899896, 4979863, 4959803, 4956359, 5045582, 5077798, 5108824, 5116317, 5204141, 5228283, 5290156, 5304538, 5255723, 5283793, 5284303, 5280641, 5282334, 5294908, 5234838, 5274499, 5327840, 5316679, 5196196, 5148577, 5209928, 5168731, 5124893, 5144988, 5149902, 5087407, 5070083, 5083016, 5027149, 5000562, 4971128, 4915452, 4933387, 5018299, 4935098, 4856264, 4838747, 4800890, 4826147, 4814333, 4805358, 4771803, 4775085, 4796852, 4765585, 4789937, 4826188, 4818183, 4812556, 4810719, 4791624, 4709404, 4664154, 4629175, 4636827, 4605743, 4682009, 4690115, 4636778, 4574632, 4549321, 4593616, 4585601, 4567382, 4559127, 4621079, 4650528, 4623540, 4518336, 4542561, 4576067, 4659560, 4625414, 4624698]
3412D624698n1224j6717J1095o6562l1053N9609p4040N3926M2042q629L3198M2324
3400D618667j3964n4111J26779J2334M6954K2059M2976M6121j0684o6373j8582
3389D752176R987K5591M0097O9969M8402J4663L3402K6402J05542N8795L1488
3378E216514m338J16695l949M2352J11294R2914J24550L7746P8074J01016M8428
3367E961296O1585J89363N0234P708J11515J62313M2433R3241J19292N5851K3855
3356F878686J24275R9886J07549P1394O0579j72J78404J33408J21728J33912J44478
3345H054127M1046N9839M1321M8627J55648J13889N2002O9821J01601P7980Q4738
3334H900639J16358J57373J72159J57327K09333J89176K19319K46319K93153K94378
$$ y = [4624698, 4573474, 4556757, 4567852, 4501290, 4470237, 4529846, 4455806, 4509732, 4551774, 4543145, 4576343, 4618667, 4604703, 4550592, 4677371, 4689705, 4736659, 4758718, 4801694, 4847815, 4837131, 4770758, 4752176, 4762163, 4787754, 4827851, 4897820, 4946222, 4960885, 4994287, 5020689, 5126231, 5185026, 5216514, 5212176, 5328871, 5324922, 5367274, 5478568, 5571482, 5696032, 5733778, 5811852, 5912868, 5961296, 6022881, 6212244, 6262478, 6270186, 6381701, 6544014, 6586447, 6679688, 6798980, 6854831, 6878686, 7002961, 7102847, 7210396, 7281790, 7342369, 7342197, 7520601, 7654009, 7775737, 7909649, 8054127, 8095173, 8155012, 8196333, 8244960, 8400608, 8514497, 8566499, 8636320, 8737921, 8815901, 8900639, 9016997, 9174370, 9346529, 9503856, 9713189, 9902365, 10121684, 10368003, 10661156, 10955534]
3324A0955534K75418L68258K38207K89226M03746L46726K90228L74977N06757
3315A4049077M25255M65591M19876M65276N27095M12618M65919M51176N11498
3306A8193381N35667N33678N98698P01425P52024P09085Q36528P84709P86490
3297B4431685Q84440Q12001Q53499Q83781Q45023P95199P05431O79142P56163
3288C1646364O87272O53957P08673O32954O76002P48315P82111Q88371Q54740
3279C8278759R77781J014107R85172R61841R76530R27751R17257R06040Q88839
3270D6834077P01773O26101N73892N44952N64799N43061N73347O25662O03231
3261E2190895O91845P16501Q44968Q38060Q55164J006579J146958J108501J251267
$$ y = [10955534, 11230952, 11599210, 11837417, 12126643, 12530389, 12877115, 13167343, 13542320, 14049077, 14474332, 14939923, 15359799, 15825075, 16352170, 16764788, 17230707, 17681883, 18193381, 18729048, 19262726, 19861424, 20562849, 21314873, 22023958, 22860486, 23645195, 24431685, 25316125, 26128126, 26981625, 27865406, 28710429, 29505628, 30211059, 30890201, 31646364, 32333636, 32987593, 33696266, 34329220, 35005222, 35753537, 36535648, 37424019, 38278759, 39256540, 40270647, 41255819, 42217660, 43194190, 44121941, 45039198, 45945238, 46834077, 47535850, 48161951, 48735843, 49280795, 49845594, 50388655, 50962002, 51587664, 52190895, 52882740, 53599241, 54444209, 55282269, 56137433, 57144012, 58290970, 59399471, 60650738]
3252F0650738J110494R58278P87898M29550K73820J25133l9285P3368l4007n5018
3242F4280969K76J9583J40M0363K0042P9235J77569J72779K40065K16019J32818
3231F5379858K2460j78706m38122n87275o61532o53373o20738m79576m87527k91412
3221F1004057k47790n2441q8892N0060K92083L84226M58731N21629O52169N94503
3211F3568335O82909N93368N22231K47670P757j68713l33017l84284l90383l78178
3201F3967695k87015m16207m55164o17809q75805r78112j113916j032548j134585
3192E7056534j083920j121630j079559j209659j348791j462304j549788j548846
3184D6652037j573173j461337j288166j248566j307035j225308j118101j122391
$$ y = [60650738, 61761232, 62719510, 63507408, 63936958, 64210778, 64335911, 64296626, 64369994, 64335987, 64280969, 64281245, 64300828, 64300968, 64341331, 64361373, 64440608, 64618177, 64790956, 65031021, 65247040, 65379858, 65402318, 65223612, 64785490, 64198215, 63536683, 62883310, 62262572, 61782996, 61295469, 61004057, 60756267, 60703826, 60614934, 60664994, 60957077, 61341303, 61800034, 62321663, 62973832, 63568335, 64251244, 64844612, 65366843, 65614513, 65622270, 65453557, 65120540, 64736256, 64345873, 63967695, 63680680, 63264473, 62809309, 62191500, 61315695, 60337583, 59223667, 58191119, 57056534, 55972614, 54850984, 53771425, 52561766, 51212975, 49750671, 48200883, 46652037, 45078864, 43617527, 42329361, 41080795, 39773760, 38548452, 37430351, 36307960]
3176C6307960j072093j049432r79737r52132j010697r62704q49357q72360p92205
3167B7767243q06271p92971p17514o61848o46338n10122n31332n24598n20536
3158B2055713o49558n43095n28564n22737n11070l32407k37644l31218l74363
3149A8025057l96217m40444l56333l94086m06574l39838l13215l63411l73347
3140A4641592k26495k68333k66749j51634k85895k65369j86343j65905j22573
3131A2702296k51787p6187j35444j81943j64720j78430j49831k34807k53544j49683
3121A0925920j82150j04061k32047k12380j15778j83202j86589p9926j52396p7279
3111I400112j59933j38424q4255q0795j45010j08483o7036j53115j06510r82q4924
$$ y = [36307960, 35235867, 34186435, 33206698, 32254566, 31243869, 30281165, 29431808, 28559448, 27767243, 26960972, 26168001, 25450487, 24788639, 24142301, 23632179, 23100847, 22576249, 22055713, 21406155, 20863060, 20334496, 19811759, 19300689, 18968282, 18730638, 18399420, 18025057, 17628840, 17188396, 16832063, 16437977, 16031403, 15691565, 15378350, 15014939, 14641592, 14415097, 14146764, 13880015, 13728381, 13442486, 13177117, 12990774, 12824869, 12702296, 12450509, 12374322, 12238878, 12056935, 11892215, 11713785, 11563954, 11329147, 11075603, 10925920, 10743770, 10639709, 10407662, 10195282, 10079504, 9896302, 9709713, 9629787, 9477391, 9400112, 9240179, 9101755, 9017500, 8936705, 8791695, 8683212, 8616176, 8463061, 8356551, 8355569, 8270645]
3100H270645j24910n1609q9480j12316n9567l4599j14957k9509j14376r5198j5803
3089G428321r4720n0345p4463j32655j5104l5804n6126l3733M7115o6127k0453
3078F895906L5689l1168m3991j0728K3622j5068n5949J0604n901P6741r5408q1701
3066F702648j6496Q6061N4957m823q30l9332k6318J62760Q0938J831J3496J7941
3054G032833J06058J28787N4825J3076k308P7802J12578N9932p561m1501N4072
3043G588593K4456j7252p3805Q577k943q7946m227l4653j884r597p5148r245m6829
3030G258097J2808j4632p9302r4514m7445N0431k6477k9393R729M5717Q6120L1382
3018G202521k8203n6545J8751R0070j6561p0332J06177P0837M2305J65460P6961
$$ y = [8270645, 8145735, 8094126, 8004646, 7892330, 7832763, 7798164, 7683207, 7653698, 7539322, 7444124, 7428321, 7333601, 7283256, 7208793, 7076138, 7061034, 7025230, 6969104, 6935371, 6982486, 6916359, 6895906, 6931595, 6900427, 6856436, 6845708, 6869330, 6854262, 6798313, 6808917, 6803016, 6879757, 6784349, 6702648, 6686152, 6772213, 6827170, 6822347, 6821517, 6782185, 6755867, 6918627, 6999565, 7001396, 7014892, 7032833, 7138891, 7267678, 7322503, 7335579, 7333271, 7411073, 7523651, 7583583, 7576022, 7534521, 7588593, 7613049, 7595797, 7521992, 7530569, 7527626, 7439680, 7435453, 7400800, 7398916, 7389319, 7314171, 7304926, 7258097, 7270905, 7256273, 7176971, 7082457, 7035012, 7085443, 7058966, 7029573, 7039302, 7085019, 7171139, 7202521, 7174318, 7117773, 7136524, 7226594, 7210033, 7139701, 7245878, 7316715, 7359020, 7524480, 7601441]
3007G601441J28510K60676J23633J05563l782j72918p2514j27878l7924Q1634
2997G886441J18131J73562R9537J38573K24128K19977K49727L30081L60927L67648
2987A0168732K10788J06140L1911N0402J89814K52983K43788P5214j34281l92012
2977A0803479k52938k20124q605n0458l5420m7190O0426J63457l3914R2388J26768
2966A0597869K16981J53832J58915L20970L04372L43036L87389L85935N83474
2957A3452773N60114M92581M23997L56169M90569M93012M20626K97170J83077
2948A7170088O7550N5677J64600L02145M45676N63722P22584P41187Q15857R82635
2938B2031721J120346J187189J302236J426359J493751J288131R82067N55406
$$ y = [7601441, 7729951, 7990627, 8114260, 8219823, 8216041, 8043123, 7970609, 7842731, 7804807, 7886441, 8004572, 8178134, 8277671, 8416244, 8640372, 8860349, 9110076, 9440157, 9801084, 10168732, 10379520, 10485660, 10517571, 10567973, 10757787, 11010770, 11254558, 11329772, 11195491, 10803479, 10550541, 10330417, 10321812, 10271354, 10235934, 10188744, 10249170, 10412627, 10378713, 10471101, 10597869, 10814850, 10968682, 11127597, 11448567, 11752939, 12095975, 12483364, 12869299, 13452773, 14012887, 14505468, 14929465, 15285634, 15776203, 16269215, 16689841, 16987011, 17170088, 17237638, 17293315, 17457915, 17760060, 18205736, 18769458, 19492042, 20233229, 21049086, 22031721, 23152067, 24339256, 25641492, 27067851, 28561602, 29849733, 30831800, 31387206]
2930C1387206k77793j205403j712828j951508j949231j743711j520504j342814
2922A9683414j154219r63377r68839q79609o82837o91863n86933m81669m16302
2913A2857766n00846m03027k19370l20506l41487l14062k87551k44691k70036
2904I956190k20317k62303k40918k91630k22101j54796j57435j92783j43672j81255
2894G888980j67125j77619j43606j09713p3919p3991j15147j22546j14094r1681
2884F699539j47618q5602j19401j02499q4094j13056j25774m4676o6100r8378
2874E712341p0095n0499p2622j43297P256l0020l8502o4931N3463j10602m7890
2863E144602j3875j26052k0505m1019o2839j3409o7566q1386l6668n2080j5207
$$ y = [31387206, 31109413, 29904010, 28191182, 26239674, 24290443, 22546732, 21026228, 19683414, 18529195, 17565818, 16596979, 15717370, 15034533, 14342670, 13755737, 13274068, 12857766, 12356920, 11953893, 11734523, 11414017, 11072530, 10758468, 10470917, 10226226, 9956190, 9735873, 9473570, 9232652, 8941022, 8718921, 8564125, 8406690, 8213907, 8070235, 7888980, 7721855, 7544236, 7400630, 7290917, 7216998, 7143007, 7027860, 6905314, 6791220, 6699539, 6551921, 6466319, 6346918, 6244419, 6160325, 6047269, 5921495, 5876819, 5810719, 5712341, 5642246, 5591747, 5519125, 5375828, 5383084, 5353064, 5314562, 5249631, 5303094, 5192492, 5144602, 5130727, 5004675, 4984170, 4943151, 4880312, 4866903, 4799337, 4717951, 4681283, 4629203, 4613996]
2852D613996j19711p0775m6608n2747j4466n2215r4396n4037o8862l7457J0300
2841D013022K7506j00046p7499K2423p0237J8639l7389m2233L7176n1317q0225
2830C659820j6746Q657j40668j1364M5091o8714J700p8430j3918k5922r1108n9676
2818C208722q6673J4479m385n7672J1747n3567p7327K581n8772J6649l3991M6333
2806B928124n7626l3515J0349n871K0693j6278M2418J9408L959o7448o4568J7969
2794B797614N9265k7611m6337K5690l4033O720N312R794k5134m3734m858J11439
2782B834127p228L6723L4491M6584r276j7060J27240l4966O3874R1992k203Q4348
2770C248646O2451M7241J69J56341k15O1375J45068J07259Q3913J38595J45475
$$ y = [4613996, 4494285, 4423510, 4376902, 4324155, 4309689, 4257474, 4163078, 4109041, 4040179, 4002722, 4013022, 4040528, 3940482, 3862983, 3885406, 3815169, 3833808, 3796419, 3754186, 3791362, 3740045, 3659820, 3643074, 3651731, 3511063, 3499699, 3544790, 3476076, 3477776, 3399346, 3385428, 3359506, 3268398, 3208722, 3122049, 3136528, 3132143, 3074471, 3086218, 3032651, 2955324, 2957905, 2899133, 2915782, 2881791, 2928124, 2870498, 2836983, 2847332, 2841461, 2862154, 2845876, 2888294, 2907702, 2911661, 2844213, 2779645, 2797614, 2856879, 2829268, 2782931, 2808621, 2774588, 2781308, 2786620, 2796414, 2771280, 2727546, 2722688, 2834127, 2826899, 2863622, 2898113, 2944697, 2935421, 2918361, 3045601, 3010635, 3074509, 3166501, 3164298, 3248646, 3311097, 3358338, 3358507, 3514848, 3514633, 3576008, 3721076, 3828335, 3912248, 4050843, 4196318]
2759D196318K00361K23617K57003K14001J75234J37816P6337J04186R7734K5285
2749E707892k4805l5167j1091q3028M2261k8638n1385l750j1037J0732k337J77032
2737E686679J44514J08078J07336K18413L47447L68672L90980L85095L77376K75205
2727H409795L12124J76947J9642p5693j44387j74031k01446l6505k51145j37865
2717G897436m9479j70915k86575j97430k00437j34380p723L1992J50587K08277
2707G241353J44085J61442R3377P3023Q4905M6070J21208Q8119J51237L7264n5966
2696H186117o6550p3673r5219j20395l2243q9447n1397j81163p8552j36906M6269
2685G306841n1833N106m2454M0517j07515n5625M7571q409J22873J03139j7173
$$ y = [4196318, 4396679, 4620296, 4877299, 5091300, 5266534, 5404350, 5480687, 5584873, 5682607, 5707892, 5683087, 5647920, 5636829, 5553801, 5596062, 5567424, 5516039, 5512289, 5501252, 5511984, 5509647, 5686679, 5831193, 5939271, 6046607, 6265020, 6612467, 6981139, 7372119, 7757214, 8134590, 8409795, 8721919, 8898866, 8918508, 8842815, 8698428, 8524397, 8322951, 8286446, 8035301, 7897436, 7847957, 7677042, 7390467, 7193037, 6992600, 6858220, 6850497, 6882489, 7033076, 7241353, 7385438, 7546880, 7640257, 7713280, 7798185, 7844255, 7965463, 8053582, 8204819, 8242083, 8186117, 8119567, 8045894, 7950675, 7830280, 7798037, 7708590, 7657193, 7476030, 7397478, 7260572, 7306841, 7255008, 7260114, 7217660, 7258177, 7150662, 7095037, 7142608, 7134199, 7257072, 7360211, 7343038]
2674G343038m8036j46344k51652j72830k13506j65012j22618o8099n9176M0562
2664F136327m0847L6976j6459M852M2535l5649M686P6429l9332J663k73j11841
2652F059067j77148k01300p9032j86406p8161j58056r1722j30842j57081j8200
2642D781119j08046m8703n5821j02503K9333o1884j66853j26561j51770j09570
2632C878741j21331j12026n8477k03230j49245k1993j55908j35806o7092p9672
2622B773961m0770q9550l1149p2643k4477m0464j26524K4398r9683n7626j1504
2611B203969n8109j14633o9126p530p3516j8154m7933p945k690m8326J5657J5824
2599A787488o2161j19777O5025o4430j11797p0955M146R1162j5077j4400p9044
$$ y = [7343038, 7295002, 7148658, 6897006, 6724176, 6510670, 6345658, 6223040, 6154941, 6095765, 6136327, 6095480, 6132456, 6115997, 6120849, 6163384, 6127735, 6132421, 6208850, 6169518, 6171181, 6170908, 6059067, 5881919, 5680619, 5601587, 5415181, 5337020, 5178964, 5087242, 4956400, 4799319, 4781119, 4673073, 4624370, 4568549, 4466046, 4495379, 4433495, 4266642, 4140081, 3988311, 3878741, 3757410, 3645384, 3586907, 3383677, 3234432, 3212439, 3056531, 2920725, 2853633, 2773961, 2733191, 2643641, 2612492, 2539849, 2515372, 2474908, 2348384, 2372782, 2273099, 2215473, 2203969, 2145860, 2031227, 1962101, 1954571, 1881055, 1862901, 1814968, 1807023, 1804333, 1756007, 1771664, 1787488, 1725327, 1605550, 1670575, 1606145, 1494348, 1423393, 1427539, 1518701, 1503624, 1489224, 1410180]
2588A410180l2572m6941J1412j1665L6678K4601p7569j06510L1088P7465r7466
2577A218701N1059j07362k7077N5587j6595o1477k8965p0029m371N3223K899K2273
2565A087866n896M0067k9226r6394K0959o9285m4586K0158N9234K4047r2239J0782
2553I25487k3495n879L1734n9637O9889m0823J9084m1079p1254M2987q349L0827
2541H69492M5688o6510K959p4917J2883K3209p781J513p1320R9197L9518J0706
2529H84637j1515j3065K1667j2274J0413j09353N1288M5944J9508n5484M296Q6727
2517I22789O6108q0540l4541J8616P4388M2088l5423L4821p1640L1628k5339R5153
2505A038108M054j3927J6093J10301N3974m3481r4360J3768R7526R1553R734M306
$$ y = [1410180, 1377608, 1330667, 1342079, 1330414, 1367092, 1391693, 1314124, 1207614, 1238702, 1316167, 1218701, 1269760, 1162398, 1135321, 1190908, 1174313, 1112836, 1083871, 1013842, 1009471, 1062694, 1065593, 1087866, 1081970, 1122037, 1092811, 996417, 1017376, 948091, 903505, 923663, 982897, 1006944, 914705, 925487, 901992, 896113, 927847, 868210, 938099, 897276, 916360, 875281, 804027, 847014, 838665, 869492, 915180, 848670, 851629, 776712, 789595, 812804, 805023, 806536, 735216, 834413, 873931, 884637, 873122, 860057, 881724, 869450, 879863, 770510, 821798, 867742, 887250, 831766, 836062, 922789, 988897, 908357, 873816, 892432, 966820, 1008908, 973485, 1008306, 936666, 968294, 942955, 1038108, 1042162, 1028235, 1044328, 1154629, 1208603, 1165122, 1070762, 1084530, 1182056, 1273609, 1283343, 1287649]
2493A287649L1405k8966J17938M9009O1986j5689R8136N3629J114J6051J4145
2482A686407r58K0683M7295J5207N2797j1126L5964P3689O0225l2470R2888P6886
2470B117487Q2814M4674O268J09602K7242k4923M8445Q9323Q6240o248Q944O1349
2458B651217l1791O6683M0J700N7965j2896m0242L8422M0022k4143P4649L7426
2446B859052P9177Q0893P4667M3384Q1999P740m3862q1599l5415o8801l0384m5715
2434B921136p8584l4562j465q2106j4915n5768j0465O809M8681l5234r9486j899
2422B562142L0162o6475m2106J5405j2791m236R1174k6063q2827j06007J6887
2411B375265j6555j57733r1596j14703o3051n1280p9219L0j49261M4770O0029
$$ y = [1287649, 1319054, 1290088, 1408026, 1457035, 1519021, 1503332, 1601468, 1655097, 1656211, 1672262, 1686407, 1685449, 1706132, 1753427, 1768634, 1821431, 1810305, 1846269, 1919958, 1980183, 1947713, 2040601, 2117487, 2200301, 2244975, 2251243, 2360845, 2388087, 2363164, 2411609, 2500932, 2587172, 2580924, 2589868, 2651217, 2619426, 2686109, 2686149, 2687849, 2745814, 2732918, 2692676, 2731098, 2771120, 2746977, 2821626, 2859052, 2938229, 3019122, 3093789, 3137173, 3219172, 3226912, 3183050, 3101451, 3066036, 2997235, 2966851, 2921136, 2842552, 2807990, 2806525, 2724419, 2709504, 2653736, 2643271, 2650080, 2698761, 2663527, 2564041, 2562142, 2592304, 2525829, 2483723, 2499128, 2486337, 2482101, 2573275, 2547212, 2464385, 2358378, 2375265, 2358710, 2200977, 2109381, 1994678, 1931627, 1880347, 1801128, 1801158, 1651897, 1696667, 1756696]
2400A756696j09697L7120j09244n0205j3043j2744j35756l7580n1080p9081K9224
2389A224610J7465K7191m2310j04300K8786m8680l0412j2820m8192p0261j5722
2378I25355J470j70110J0044M59k0327o1386M3631J6690L1075J1172o2541l2920
2366F92612j4600k4688p0628L4686p272j017j3835l5891J8835N0030m1567l0704
2354E55961m6009P1016P917n0284m1361N9414q23q1895j9686O696J721K8299K1818
2341E12784p5546J6475J3215k4308p790o9912R3036K0244q324l3404l5528J0952
2329D11894q901J6173J453m0526M2398n4595O5395N2600o2946j3199R51n3572
2317C57125m963N2699K0268l6376o712M7963n3058j0202M855J05L3815J1652n8462
$$ y = [1756696, 1646999, 1684119, 1574875, 1524670, 1511627, 1498883, 1363127, 1325547, 1274467, 1195386, 1224610, 1242075, 1269266, 1226956, 1122656, 1151442, 1102762, 1072350, 1059530, 1011338, 941077, 925355, 926825, 756715, 766759, 767218, 746891, 685505, 729136, 745826, 776901, 788073, 725532, 692612, 678012, 653324, 582696, 617382, 610110, 609093, 595258, 559367, 578202, 628232, 586665, 555961, 509952, 580968, 588885, 538601, 497240, 556654, 555831, 473936, 454250, 460946, 462667, 490966, 512784, 437238, 453713, 466928, 442620, 434830, 364918, 457954, 478198, 469874, 436470, 400942, 411894, 402993, 419166, 420619, 380093, 422491, 367896, 433291, 485891, 422945, 409746, 410697, 357125, 352162, 404861, 425129, 388753, 382041, 430004, 376946, 366744, 371599, 371704, 405519, 417171, 358709]
2304C58709k1271J2650J00838o2054m5311o3818R195K9257N8811K3730p5103J4753
2292C40386m8972j8916K4004M4254R7939k6455m4313k8311j0769O4903k8750L9246
2280D04246n3211j4353Q2920O0463m9793J0364q278k4026l7555J8782l6342o02
2268C52615k0172K2588Q3891j2602r2580m9655L5037M4841j12946l902R4025j1337
2256C29803n5044M2481j8267M1644j9070m3690J24035R571m3360j08308M5512
2245C05307L8509k7032p3755M4117J8834M0681m6597L7672m8333M9176k0595M3290
2233C61274m106k9998N6597j7949j2694p703Q3796o1449n1271o3401L562l7299
2221B19359L1079N6668k0187M9397Q27L0750k1159m6184L4223L0068m6889k9177
$$ y = [358709, 337438, 350088, 450926, 388872, 343561, 279743, 288938, 318195, 377006, 400736, 325633, 340386, 291414, 272498, 296502, 340756, 438695, 412240, 367927, 339616, 328847, 393750, 365000, 404246, 351035, 336682, 419602, 480065, 430272, 440636, 432358, 408332, 370777, 389559, 353217, 352615, 332443, 355031, 438922, 426320, 333740, 284085, 319122, 363963, 251017, 247115, 341140, 329803, 274759, 317240, 298973, 340617, 321547, 277857, 401892, 411463, 368103, 259795, 305307, 343816, 316784, 243029, 287146, 305980, 346661, 300064, 337736, 289403, 338579, 317984, 361274, 357168, 327170, 383767, 365818, 353124, 345421, 429217, 367768, 316497, 253096, 256658, 219359, 250438, 307106, 286919, 336316, 337143, 367893, 346734, 300550, 334773, 364841, 317952, 288775]
2209B88775O536l1710M1501m194j3954p1631J9206L6017L1503M3192p288p6345
2197B61608J3851r200j4951N1806o4989R6301o0288N2082J6065N471L3936o9297
2185C12395k6940O002k0431j0724K1356J4265Q6966k5219p1021o3751K7366J1694
2173B61958N4198L032k0908O9877m5404l1427r775L0475k5268m723R102j3285
2161B77852N521K4536k7705P909M7859p492k5650j2030J1906l6073J0281K4861
2149C01775N177J1871N7244l4495P4727n1598k6491P8365l6181K7748M1575r572
2137D40145J9863M3151j6737p0489M7776m019k2903P6290j5097M9295P034O1189
2125F15498m9781R752K3510P2123n4320J1959K0055J09428k5198l0273N2463N1855
$$ y = [288775, 295311, 263601, 305102, 300908, 286954, 215323, 234529, 270546, 302049, 345241, 337953, 261608, 275459, 266259, 251308, 303114, 238125, 334426, 274138, 326220, 342285, 347756, 381692, 312395, 285455, 291457, 271026, 260302, 281658, 295923, 382889, 357670, 286649, 222898, 250264, 261958, 316156, 319188, 298280, 368157, 322753, 291326, 281551, 312026, 286758, 282035, 291137, 277852, 283373, 307909, 280204, 288113, 335972, 328480, 302830, 290800, 302706, 266633, 276914, 301775, 306952, 318823, 376067, 341572, 416299, 364701, 338210, 416575, 380394, 408142, 449717, 440145, 460008, 503159, 486422, 415933, 463709, 459690, 436787, 513077, 497980, 547275, 554309, 615498, 565717, 575469, 598979, 671102, 616782, 628741, 648796, 758224, 733026, 702753, 755216, 807071]
2113H07071O7206O0409N932j057L871o1740P2696O6024J10841J63619Q7607p9406
2101A303073J21707J04766m5841q009J58542J75442Q7982R6974L2022J08445J91506
2090B326609J85891K81214K36991J34990L04430K18227L89768M44429N18177O71503
2080E712229Q90378J274074J620183J589640O24648o37893j609478j609213j285238
2071F569330r00574p00954n73235m58915l67969k52148l10937l20720j05013j92351
2061B386514j99736j82685k07744j10079K019j13375r3641j30747m4193n8515
2051A247818j27891o9193J4424l1345J89n9257k5618l2809r303r3093N427r798
2039H09551k5589m9270N153k5198l5017K5213l5006K7844j23726O4048M2167q9841
$$ y = [807071, 874277, 934686, 940618, 939561, 943432, 881692, 954388, 1020412, 1131253, 1294872, 1382479, 1303073, 1424780, 1529546, 1483705, 1475696, 1634238, 1809680, 1897662, 1994636, 2026658, 2135103, 2326609, 2512500, 2793714, 3030705, 3165695, 3470125, 3688352, 4078120, 4522549, 5040726, 5712229, 6602607, 7876681, 9496864, 11086504, 11711152, 11073259, 9463781, 7854568, 6569330, 5668756, 4967802, 4394567, 3935652, 3567683, 3315535, 3004598, 2683878, 2578865, 2386514, 2186778, 2004093, 1796349, 1686270, 1688289, 1574914, 1481273, 1350526, 1306333, 1247818, 1119927, 1050734, 1065158, 1033813, 1034002, 974745, 949127, 916318, 907015, 813922, 819349, 809551, 783962, 734692, 739845, 714647, 679630, 704843, 669837, 697681, 573955, 638003, 680170, 590329]
2027E90329n7727K9472k815o843n8473q029M4629j0024J6762j5489o0930n9J4957
2014D75760P893j9292j8766j8474p8721J1111P2650L8844l6355Q778l6987N5487
2002D61928l8376M3558J7502r2678O963k2371L2682K0983J885J3725J3440j28050
1990C31191N5239O0099o6305m4416l5204J4764N3111k7001o190P794K2217j6719
1978C48580m3268K8190P0589l5954n6297N6060j06783m0675N6706M232J17239
1967C98619r3011q0981M8875L161j2178K7885o1313k6213K6492L6142p9631O3731
1955B51578J2530n0987P3055j02728L3431K4510J11403k1440r5405r144k5957
1944B00846K8053R038n0646j0277N2669K8940o5490K4843J9516k1586N6064n0371
$$ y = [590329, 532602, 562074, 559259, 552416, 493943, 485914, 530543, 520519, 537281, 521792, 460862, 460803, 475760, 483653, 464361, 445595, 427121, 348400, 359511, 432161, 471005, 434650, 443428, 406441, 461928, 423552, 467110, 484612, 391934, 398897, 376526, 409208, 430191, 432076, 445801, 459241, 331191, 386430, 446529, 380224, 335808, 300604, 315368, 368479, 341478, 335288, 343082, 365299, 348580, 305312, 333502, 404091, 368137, 311840, 367900, 261117, 220442, 277148, 281380, 398619, 305608, 224627, 273502, 276663, 264485, 292370, 231057, 204844, 231336, 267478, 187847, 251578, 264108, 213121, 286176, 183448, 216879, 241389, 352792, 331352, 235947, 226803, 200846, 228899, 237937, 187291, 177014, 229683, 258623, 193133, 217976, 237492, 215906, 271970, 221599]
1932B21599Q501j1169k2413O3273P799l4968k5243J4076K5949J4316r5929P911
1920A73702R3441J7946n9522n4966Q7648J4070p3796o1562R9291k660m3506N3991
1908B44077R682l3389L1983l7445l1808j1374M118k4053N3380n308L4623k9651
1896B04835m8650N694R388O4300j5298j1861m5925l1999Q9423K7450L3638n2942
1884B28053k0494o411k878L7440j6880K2831j0040n7540J00139n3189N379L83
1872B26793K3155N6038m2166j261o0354m6257p889M7055m8540j5962L4023J0341
1860A74976k6658J9854Q41J3626L8076o7335P278K5904O160j4492k0471P687n1939
1847A13507O1058K8802J1897K296o312o7622l5743N0675o4242P6962J7402j9059
$$ y = [221599, 230100, 218931, 196518, 259791, 267590, 232622, 207379, 221455, 247404, 261720, 165791, 173702, 267143, 285089, 225567, 170601, 258249, 272319, 198523, 136961, 236252, 233592, 190086, 244077, 253759, 220370, 252353, 214908, 183100, 171726, 175844, 151791, 205171, 199863, 234486, 204835, 156185, 161879, 171267, 235567, 220269, 208408, 162483, 130484, 219907, 247357, 280995, 228053, 207559, 201148, 198270, 235710, 218830, 241661, 231621, 174081, 274220, 221031, 226410, 226793, 249948, 305986, 263820, 262559, 202205, 155948, 148059, 195114, 146574, 130612, 164635, 174976, 148318, 168172, 169013, 182639, 220715, 153380, 160658, 186562, 192722, 178230, 157759, 165446, 113507, 174565, 203367, 215264, 217560, 211248, 143626, 107883, 158558, 94316, 171278, 188680, 169621]
1835A69621L1966l7503Q955n7722O596k4006O0995K4911r079J0298j869j6945
1823A66218n0203l1440N3350K5556J3098l928N7095O102q6542o0305J29250p8721
1811A39530k0978Q5777L6539r3064j3461N8770J4734n3971M8891n7372P186k5256
1799A27325K1225M3311q1192J12880M3816l8083k0222j05575J0847J7678m7178
1788H4832L1079l765R8875p9619N5748k8758k2607j5168O59M3275k9390k0655
1776A14506N2802l0018M9425L759J3092n0784N567Q824J9987R4484p8475J0389
1764B13558l7767m1020O847j0599l4779Q3867k0805J5251J00219j14661p2157
1753H7954O9808M8335k8422l8428L3639k1205l3872k902l197m2327Q0885o3032
$$ y = [169621, 201587, 164084, 173039, 115317, 121913, 97907, 158902, 183813, 174734, 185032, 183163, 166218, 116015, 84575, 137925, 163481, 176579, 172651, 229746, 235848, 149306, 89001, 218251, 139530, 118552, 204329, 240868, 147804, 134343, 193113, 207847, 153876, 202767, 145395, 152581, 127325, 148550, 191861, 110669, 223549, 267365, 229282, 209060, 103485, 114332, 132010, 84832, 115911, 112146, 211021, 131402, 187150, 158392, 135785, 120617, 121276, 164551, 135161, 114506, 167308, 137290, 186715, 190474, 203566, 152782, 158349, 167173, 187160, 281644, 203169, 213558, 175791, 134771, 141618, 131019, 96240, 180107, 159302, 174553, 274772, 160111, 87954, 157762, 206097, 177675, 139247, 172886, 151681, 117809, 114907, 111710, 69383, 150268, 87236]
1741H7236K9564m9826N6079L2633O041m8764n328J5266m609J8203J1228K23p2190
1728G5756k712K79M4655j2066K3274J4768N1816n1202o6419K0641O1296l0188
$$ y = [87236, 116800, 66974, 123053, 155686, 161727, 112963, 107635, 122901, 118292, 136495, 147723, 147946, 75756, 73044, 73323, 117978, 105912, 129186, 143954, 195770, 144568, 78149, 98790, 160086, 129898]
$$ [...]
##END NTUPLES=NMR SPECTRUM
##END=
