##TITLE=1H_CA-9292
 CDCl3
 8 sc, 
 3.10.2024
##JCAMPDX= 6.0         $$ Bruker NMR JCAMP-DX V2.0
##DATA TYPE= NMR SPECTRUM
##DATA CLASS= NTUPLES
##ORIGIN= UXNMR, Bruker Analytische Messtechnik GmbH
##OWNER= root
$$ XWIN-NMR		Version 3.5
$$ Thu Oct  3 14:50:13 2024 Russian Standard Time (UT+4h)  she@DPX200
##.OBSERVE FREQUENCY= 200.1318
##.OBSERVE NUCLEUS= ^1H
##.ACQUISITION MODE= SIMULTANEOUS
##.ACQUISITION SCHEME= undefined
##.AVERAGES= 8
##.DIGITISER RES= 18
##SPECTROMETER/DATA SYSTEM= spect
##.PULSE SEQUENCE= zg30
##.SOLVENT NAME= CDCl3
##.SHIFT REFERENCE= (INTERNAL, CDCl3, 0, 21.0076)
##AUDIT TRAIL= $$ (NUMBER, WHEN, WHO, WHERE, WHAT)
$$ ##TITLE= Audit trail, XWIN-NMR		Version 3.5
$$ ##JCAMPDX= 5.01
$$ ##ORIGIN= Bruker BioSpin GmbH
$$ ##OWNER= she
$$ F:/spectra/data/she/nmr/H-F/1/pdata/1/auditp.txt
$$ ##AUDIT TRAIL=  $$ (NUMBER, WHEN, WHO, WHERE, WHAT)
(   1,<2024-10-03 14:49:00.95 +0400>,<she>,<DPX200>,
      <created by zg, POWCHK disabled, PULCHK disabled
       configuration hash MD5:
       00 E9 B6 7A A2 85 ED C7 34 08 36 98 17 FE 4E 26
       data hash MD5: 16K
       D2 7B 1A 73 76 2F 6C 21 F9 24 AE DE 9D 33 04 38>)
(   2,<2024-10-03 14:49:05.65 +0400>,<she>,<DPX200>,
      <Start of raw data processing
       efp BC_mod = 2 LB = 0.24 FT_mod = 6 PKNL = 1 PHC0 = -26434.47 PHC1 = 9.38747 SI = 16K 
       data hash MD5: 16K
       45 53 50 87 3D A4 F8 5D 6C 18 F3 2B B4 52 AF D6>)
(   3,<2024-10-03 14:49:26.84 +0400>,<she>,<DPX200>,
      <pk PHC0 = 78.90855 PHC1 = 0 
       data hash MD5: 16K
       9C 38 E0 BF 08 99 B0 D5 8D 5E 15 0C 4D 5C A8 20>)
(   4,<2024-10-03 14:49:30.98 +0400>,<she>,<DPX200>,
      <abs ABSG = 5 
       data hash MD5: 16K
       6D B9 EA B1 FB 0D 51 F0 AE 39 F1 51 6F B2 90 0B>)
$$ ##END=
$$ 
$$ hash MD5
$$ D0 A2 CD 15 F9 51 FB BB F2 6E 13 26 5B 11 90 02
##$RELAX= 
##$RELAX= 
##$RELAX= 
##$RELAX= 
##$RELAX= 
##$RELAX= 
$$ Bruker specific parameters
$$ --------------------------
##$DU= <F:/spectra>
##$EXPNO= 1
##$NAME= <H-F>
##$PROCNO= 1
##$TYPE= <nmr>
##$USER= <she>
##$AMP= (0..31)
100 100 100 100 100 100 100 100 100 100 100 100 100 100 100 100 100 100 
100 100 100 100 100 100 100 100 100 100 100 100 100 100 
##$AQSEQ= 0
##$AQ_mod= 1
##$AUNM= <au_zg>
##$AUTOPOS= <>
##$BF1= 200.13
##$BF2= 200.13
##$BF3= 200.13
##$BF4= 200.13
##$BF5= 200.13
##$BF6= 200.13
##$BF7= 200.13
##$BF8= 200.13
##$BYTORDA= 1
##$CFDGTYP= 0
##$CFRGTYP= 5
##$CHEMSTR= <none>
##$CNST= (0..31)
1 1 145 1 1 1 1 1 1 1 1 1 1 1 1 1 1 1 1 1 1 1 1 1 1 1 1 1 1 1 1 1 
##$CPDPRG= <>
##$CPDPRG1= <>
##$CPDPRG2= <>
##$CPDPRG3= <>
##$CPDPRG4= <mlev>
##$CPDPRG5= <mlev>
##$CPDPRG6= <mlev>
##$CPDPRG7= <mlev>
##$CPDPRG8= <mlev>
##$CPDPRGB= <>
##$CPDPRGT= <>
##$D= (0..31)
0 1.2 0 0 0 0 0 0 0 0.06 0 0.03 0 0 0 0 0.0002 0 0 0 0 0 0 0 0 0 0 0 0 
0 0 0 
##$DATE= 1727952540
##$DBL= (0..7)
120 120 120 120 120 120 120 120 
##$DBP= (0..7)
150 150 150 150 150 150 150 150 
##$DBP07= 0
##$DBPNAM0= <>
##$DBPNAM1= <>
##$DBPNAM2= <>
##$DBPNAM3= <>
##$DBPNAM4= <>
##$DBPNAM5= <>
$$ [...]
##$SUBNAM3= <"">
##$SUBNAM4= <"">
##$SUBNAM5= <"">
##$SUBNAM6= <"">
##$SUBNAM7= <"">
##$SUBNAM8= <"">
##$SUBNAM9= <"">
##$SW= 24.0689170037331
##$SWIBOX= (0..15)
0 0 2 0 0 0 0 0 0 0 0 0 0 0 0 0 
##$SW_h= 4816.95568400771
##$TD= 16384
##$TD0= 1
##$TE= 0
##$TE2= 300
##$TE3= 300
##$TEG= 300
##$TL= (0..7)
0 120 120 120 120 120 120 120 
##$TP= (0..7)
150 150 150 150 150 150 150 150 
##$TP07= 0
##$TPNAME0= <>
##$TPNAME1= <>
##$TPNAME2= <>
##$TPNAME3= <>
##$TPNAME4= <>
##$TPNAME5= <>
##$TPNAME6= <>
##$TPNAME7= <>
##$TPOAL= (0..7)
0.5 0.5 0.5 0.5 0.5 0.5 0.5 0.5 
##$TPOFFS= (0..7)
0 0 0 0 0 0 0 0 
##$TUNHIN= 0
##$TUNHOUT= 0
##$TUNXOUT= 0
##$USERA1= <user>
##$USERA2= <user>
##$USERA3= <user>
##$USERA4= <user>
##$USERA5= <user>
##$V9= 5
##$VALIST= <valist>
##$VCLIST= <CCCCCCCCCCCCCCC>
##$VD= 0
##$VDLIST= <DDDDDDDDDDDDDDD>
##$VPLIST= <PPPPPPPPPPPPPPP>
##$VTLIST= <TTTTTTTTTTTTTTT>
##$WBST= 1024
##$WBSW= 4
##$XGAIN= (0..3)
0 0 0 0 
##$XL= 0
##$YL= 0
##$YMAX_a= 269180
##$YMIN_a= -257463
##$ZGOPTNS= <>
##$ZL1= 120
##$ZL2= 120
##$ZL3= 120
##$ZL4= 120
##$ABSF1= 20.95913
##$ABSF2= -3.110003
##$ABSG= 5
##$ABSL= 3
##$ALPHA= 0
##$AQORDER= 0
##$ASSFAC= 0
##$ASSFACI= 0
##$ASSFACX= 0
##$ASSWID= 0
##$AUNMP= <proc_1d>
##$AZFE= 0.1
##$AZFW= 0.1
##$BCFW= 0
##$BC_mod= 2
##$BYTORDP= 0
##$COROFFS= 0
##$CY= -3
##$DATMOD= 1
##$DC= 0
##$DFILT= <>
##$DTYPP= 0
##$F1P= 0
##$F2P= 0
##$FCOR= 1
##$FTSIZE= 16384
##$FT_mod= 6
##$GAMMA= 0
##$GB= 0
##$INTBC= 1
##$INTSCL= 3.70164e-10
##$ISEN= 128
##$LB= 0.24
##$LEV0= 0
##$LPBIN= 0
##$MAXI= 10000
##$MC2= 0
##$MEAN= 0
##$ME_mod= 0
##$MI= 1.114404
##$NCOEF= 0
##$NC_proc= -6
##$NLEV= 6
##$NOISF1= 3.799351
##$NOISF2= 2.8
##$NSP= 0
##$NTH_PI= 0
##$NZP= 0
##$OFFSET= 21.0076
##$PC= 1
##$PHC0= -26355.56
##$PHC1= 9.38747
##$PH_mod= 1
##$PKNL= yes
##$PPARMOD= 0
##$PSCAL= 0
##$PSIGN= 0
##$REVERSE= no
##$SF= 200.130004226409
##$SI= 16384
##$SIGF1= 3
##$SIGF2= 2
##$SINO= 5.538805
##$SIOLD= 16384
##$SREGLST= <1H.CDCl3>
##$SSB= 0
##$STSI= 16384
##$STSR= 0
##$SW_p= 4816.95568400771
##$SYMM= 0
##$S_DEV= 0
##$TDeff= 16384
##$TDoff= 0
##$TI= <>
##$TILT= no
##$TM1= 0
##$TM2= 0
##$TOPLEV= 0
##$USERP1= <user>
##$USERP2= <user>
##$USERP3= <user>
##$USERP4= <user>
##$USERP5= <user>
##$WDW= 1
##$XDIM= 16384
##$YMAX_p= 475419183
##$YMIN_p= -361216
$$ End of Bruker specific parameters
$$ ---------------------------------
##NTUPLES= NMR SPECTRUM
##VAR_NAME=  FREQUENCY,     SPECTRUM/REAL,   SPECTRUM/IMAG
##SYMBOL=    X,             R,               I
##VAR_TYPE=  INDEPENDENT,   DEPENDENT,       DEPENDENT
##VAR_FORM=  AFFN,          ASDF,            ASDF
##VAR_DIM=   16384,         16384,           16384
##UNITS=     HZ,            ARBITRARY UNITS, ARBITRARY UNITS
##FACTOR=    0.29402158847633, 1,            1
##FIRST=     4204.25123374902, 0,            0
##LAST=      -612.704450258687, 0,           0
##MIN=       -612.704450258687, -361216,     0
##MAX=       4204.25123374902, 475419183,    0
$$ Real data points
##PAGE= N=1
##DATA TABLE= (X++(R..R)), XYDATA
$$ [...]
7862g7830M5418L577R8041J09020j50182K9221r6490k7756l3930J66365m8692
7851A6762n0031P1305j46495O538J16626J9790r6172j5242R2373o6827P6963p1083
7839d5493k3762P0231j25288R8391J13584k00069J4891J52215O5304J05133N0883
7828B76020o7901r2131l7692o7627J9177m2227j33632o4641Q6656K1321M2969
7817e9708l120J5403M93M2238N0334J07131L323j33200j91066l3752O6390J72955
7805C7421K4125K4528o0156j972n1810m7513j37426J00103K0063R5809J4907j2059
7793F020o8993J2137Q5625N1212j40263R8474k6691L598m2508j31042J65167j75128
7781a62392p015J02884M5150J19379j22256n154L079p3356q2284J8415J27950
$$ plain form
7862 -77830 -32412 -28835 69206 178226 28044 57265 -39225 -66981 -100911 65454 16762
7851 16762 -33269 38036 -108459 -101921 14705 34495 -61677 -76919 15454 -51373 25590 -45493
7839 -45493 -69255 976 -124312 -25921 87663 -112406 -97515 54700 120004 225137 276020
7828 276020 208119 115988 78296 10669 29846 -12381 -146013 -210654 -123998 -102677 -59708
7817 -59708 -62828 -47425 -46932 -4694 45640 152771 156094 22894 -168172 -201924 -135534 37421
7805 37421 61546 86074 25918 23946 -27864 -75377 -212803 -112700 -92637 3172 18079 6020
7793 6020 -62973 -50836 34789 86001 -54262 44212 17521 21119 -21389 -152431 12736 -162392
7781 -162392 -169407 -66523 -21373 98006 -24250 -29404 -26325 -99681 -181965 -163550 -35600
7770c5600m8637J65375r0625P3386q6606Q7917k4008m133l2884L4438j28116l9753
7758a29246O7276o0647K8115J30341k0315j38594M4941M1544O0081k0633J6853
7747A9716l5925J29373j99174L2669j58177P5493K7851k1998j2962N8316n8534
7736a43352K6139N2980R706O5554q9004K1101J6273P373k30470L6092J12347j18206
7724b33467J28596P1743j01718L8867j4674J18094n7768J43755j79344N7712K8307
7713A03R5445r9572r2512j6296J4807J07052k6608j07064j6734L9146q090P2795
7701c7528j13627j2935J15788J38191q8653n017j3659j3051M5076K6104l5984
7690D705j37951j2193L1051M8113P4771J23537L4320r3400n3093o8223m0992M5886
$$ plain form
7770 -35600 -84237 81138 -9487 63899 -22707 65210 41202 37069 4185 38623 -89493 -129246
7758 -129246 -61970 -122617 -94502 35839 15524 -123070 -78129 -36585 23496 2863 19716
7747 19716 -16209 113164 -86010 -53341 -211518 -136025 -108174 -130172 -143134 -84818 -143352
7736 -143352 -117213 -64233 -54527 11027 -77977 -56876 -40603 -33230 -263700 -227608 -115261 -233467
7724 -233467 -104871 -33128 -134846 -95979 -110653 7441 -50327 93428 -85916 -28204 103
7713 103 95548 -4024 -96536 -112832 -98025 9027 -17581 -124645 -141379 -102233 -110323 -37528
7701 -37528 -151155 -164090 -48302 89889 1236 -3781 -17440 -30491 14585 40689 4705
7690 4705 -133246 -145439 -114388 -66275 8496 132033 166353 72953 19860 -48363 -89355 -43469
7678d3469q2925J35115O4844o7222P5910k6746m7685j202J2828M328J17557r465
7666A31868j13940J18836N6698j73670m8745R0245L5484m3861k3862r3284P8430
7655A4199n4160p7100p1591Q4465L3046L5160R4424l2973J41854k990j17683R0924
7643A37575j30287j0100J19540k8001q321l6321L2536j10846o0095Q9801q2070
7632h6589M0530l0643J39845Q651P210l8178J0101j98934J02272R8268J8003n5567
7620A4969p5888J48896l5588j24025J5880O1541j188O6478n9170j466J0091L0958
7608E1488K480j4208K0901l0748q3046J19023J3451l5927K7535K6798o3644N0346
7596H4449o346r4384K05255j09120l10550K40942j50946J16980P3183J5289L5061
$$ plain form
7678 -43469 -126394 8721 73565 6343 82253 55507 7822 6620 19448 23776 141333 131868
7666 131868 17928 136764 193462 19792 -28953 61292 96776 52915 29053 -64231 14199
7655 14199 -39961 -117061 -188652 -104187 -71141 -35981 58443 25470 167324 164334 46651 137575
7643 137575 7288 -2812 116728 88727 80406 44085 76621 -34225 -94320 -4519 -86589
7632 -86589 -46059 -76702 63143 71794 79004 40826 50927 -148007 -45735 52533 70536 14969
7620 14969 -60919 87977 52389 -71636 -55756 5785 4597 71075 11905 10439 20530 51488
7608 51488 53968 39760 60661 29913 -53133 65890 79341 43414 70949 97747 34103 84449
7596 84449 78103 -16281 188974 79854 -230696 10246 -140700 -23720 49463 64752 99813
7585I9813J84385j23166j37904N1097N5974l8762K4041j03502J1324j15407O8608
7574b3499Q900q6481Q9768o1675P5798j2972J5939O204o3332J39232k7384j17818
7562e7320P1107J06703q1917p9541J13217p6679J37193l9405o5062K7852j56781
7551a00633m855Q3081j91754L7035J19205L3777r5400M0888J60014q6400j5435
7540b0477J04274p297N4323k8543p661Q847M101o0981J16853l2886n9405n3271
7528A7877j55012L9758L7548P2885O7969m9740l7949l3455l7765J17676p3582
7517c3790k6880j44143j8899K33298J566l5818N495J22738r5619k3818R2545N7356
7505A34031j16499k0249k4496J81512J8982n1928K7363j08340J7986L7886j15779
$$ plain form
7585 99813 284198 161032 23128 74225 130199 91437 115478 11976 23300 -92107 -23499
7574 -23499 -14599 -101080 -11312 -72987 2811 -10161 5778 11982 -51350 87882 60498 -57320
7562 -57320 13787 120490 38573 -40968 72249 -4430 132763 93358 28296 56148 -100633
7551 -100633 -105488 -22407 -214161 -177126 -57921 -24144 -119544 -78656 81358 -5042 -20477
7540 -20477 83797 76500 130823 102280 94619 103466 107567 46586 163439 130553 71148 17877
7528 17877 -137135 -97377 -59829 13056 81025 31285 -6664 -40119 -77884 39792 -33790
7517 -33790 -60670 -204813 -223712 9586 11152 -24666 -19171 103567 7948 -15870 76675 134031
7505 134031 17532 -2717 -27213 154299 173281 121353 148716 40376 58362 96248 -19531
7494a9531Q7514J09287j01826o8787l806J11190j37807M0961R857J47675N3826
7483B28553k47371P2649J21025n8944q3004p361j31846j01652O5107J69138J07038
7472A33332j6194r4746P6220n3235M9519l0663m0954m5788J57753k3544q7174
7461B4526j0344J1411l0962M3734j27775j0807O9089k9822J28115r643j02614
7450d5092P3293J6861k434R896j20552j5686O3973j0285n7142N4967j22938J8034
7438a37105K12861q8851r1607M8913j08575K51031q9518P2937m0414J2932p6186
7427c3582K1159M1884J55397j13330n8687q945r4102P8955N643J20576L911m6220
7415G2659k4581o5935J53269j28743q5907L3324J0754R0059k7098m0042J87864
$$ plain form
7494 -19531 67983 177270 75444 6657 2851 114041 -23766 17195 27052 174727 228553
7483 228553 -18818 53831 174856 115912 32908 25547 -106299 -207951 -142844 26294 133332
7472 133332 117138 22392 98612 45377 94896 64233 23279 -22509 135244 111700 24526
7461 24526 14182 25593 -5369 38365 -89410 -100217 -31128 -60950 67165 57522 -45092
7450 -45092 28201 45062 42628 52524 -68028 -83714 -19741 -30026 -87168 -32201 -155139 -137105
7438 -137105 75756 -13095 -104702 -55789 -164364 86667 -2851 70086 29672 42604 -33582
7427 -33582 -12423 29461 184858 71528 12841 3896 -90206 -11251 -5608 114968 118879 72659
7415 72659 48078 -17857 135412 6669 -79238 -45914 -35160 54899 27801 -12241 175623
7404A75623L4000k8328k4302j42671N1403k6657j4220J5989k7723o4114j57758
7393b08758K92462Q2145O8486J84390k37331P4114n5961N6523j38514k7565O0894
7382A50885M5814j8434j16181j2565m2199J36123r3952k1184k3305J03298J2905
7371A21205j58379Q2414o5296j19012o952j1303J72903r3754J4565P366j44704
7360b00947J00162J62094R4018j14072J4673m735K13929p8718n9789m8129M8444
7349A26930l3266j71766Q5135J42104J09654j83894J5088R2478j48219j45325
7339a11081Q2971P5799l7908l5313N541R780R005j44678O4325O8838p6079Q1536
7327g264l104R0024K012Q5354r9785l9615J4376n9594K0547k3438j09477J14400
$$ plain form
7404 175623 209623 181295 156993 14322 65725 39068 24848 40837 13114 -51000 -208758
7393 -208758 83704 165849 234335 418725 181394 255508 199547 256070 117556 89991 150885
7382 150885 196699 178265 62084 49519 7320 143443 49491 28307 5002 108300 121205
7371 121205 -37174 45240 -20056 -139068 -146020 -157323 15580 -78174 -63609 -56243 -200947
7360 -200947 -100785 61309 155327 41255 55928 51193 265122 186404 126615 78486 126930
7349 126930 93664 -78102 7033 149137 258791 74897 89985 182463 34244 -111081
7339 -111081 -28110 47689 9781 -25532 -19991 -10211 -1206 -145884 -81559 -12721 -88800 -7264
7327 -7264 -10368 79656 81668 167022 67237 27622 41998 -17596 2951 -20487 -129964 -15564
7315a5564J34792o8596q2680l1520l4320O3957J46633k9600J305N0356r1703R3712
7303A36772r4412k9197o3004J55227L191K4836K3089j55115j8937N3769O9012
7292A05231J5522q7904J5278N5027n6498P6402J31633q3067p7204j14469n7625
7281g7674J27113N389K0522m7340Q270J4306M243L9118J6525o9663l9526N0598
7269E1881J2308j48397K11472K8669j59026J01940j0254L6053p9807m4456J03448
7258A03831l0195L5866N1612p7084o0929K9842p8599Q7831k6940O6557J7977j26269
7246f500j07961Q4971J31772p3060q357K27592l8103j3174j73489Q2656K7284
7235A33631r981J79413j27845J99710k52688r5367J5065L4667R4217O7795n9068
$$ plain form
7315 -15564 119228 50632 -32048 -63568 -97888 -33931 112702 83102 84407 134763 43060 136772
7303 136772 42360 13163 -49841 105386 108577 133413 156502 1387 -17550 36219 105231
7292 105231 120753 32849 48127 103154 46656 123058 254691 171624 94420 -20049 -77674
7281 -77674 49439 54828 75350 28010 36280 50586 54829 93947 110472 40809 1283 51881
7269 51881 64189 -84208 127264 155933 -3093 98847 88593 124646 44839 383 103831
7258 103831 73636 109502 161114 84030 23101 52943 -25656 62175 35235 101792 119769 -6500
7246 -6500 -114461 -29490 102282 29222 20865 248457 210354 197180 23691 106347 133631
7235 133631 123650 303063 175218 374928 122240 26873 41938 76605 170822 238617 179549
7224A79549j87593J05969M7406o5895k8680J48028J3528j10924O6179j0799q1277
7213G5491M1319P4466N9048m6107j91818O1114P3104j5796J61573k41945J60932
7202B11381J33038K2442p9329J70869m7906k73564L276L9567q9863p5910P9205
7191I3206N4554j6348m2236N8745L7569j22986J45835R5819L6382q6693J8816
7180B72663J06964j17859r5281o9625K6724Q7182n8178P1485J11289m4556q7497
7169B03311n7458J154J9292N9975q2375J11589j06155R1679m7030R1424j12209
7158A73197L0121J53148n3581m0773k9594O0924j17290J63116M9300k13896n1735
7147A22937J10144q1355Q0245l3634J38237Q4460q7103m1816j37965K3143J94842
$$ plain form
7224 179549 -8044 97925 145331 79436 50756 198784 212312 101388 167567 156768 75491
7213 75491 116810 191276 250324 204217 12399 73513 146617 130821 292394 50449 211381
7202 211381 344419 366861 287532 458401 410495 136931 140207 179774 89911 14001 93206
7191 93206 147760 131412 89176 147921 185490 62504 208339 304158 340540 253847 272663
7180 272663 379627 261768 166487 96862 123586 210768 152590 224075 335364 290808 203311
7169 203311 145853 147007 166299 226274 143899 255488 149333 241012 193982 285406 173197
7158 173197 203318 356466 302885 262112 232518 293442 176152 339268 388568 174672 122937
7147 122937 233081 151726 231971 198337 336574 421034 333931 292115 154150 177293 372135
7136C72135J39445j22401k851K450l8158m7621M2333p5618M969N8936J21093l0612
7124D24100L2602n2130j05371n4394Q2188m8402M3203j8108N0467K02614k7227
7113E29542j65555k0433J29637P7405q1524L4996J46172q740o5820k0186O2692
7102F18186J10226J460n2982K5663J53513j14271l8213J71922l4312n2915K2893
7091H11170n6835K05743k0732k0201J11110L3472J32483Q3701j0326k7433r1971
7080A150181J22080J05674K2994J61117m6458R5533J14594k0699J14464J41373
7070A960853J73502J22135J76645J49246O3918K02482R4978J17582J93460J16123
7060C370924J39287J17039M9000J97821J78097L20951L45262M68347L82918N44654
$$ plain form
7136 372135 511580 389179 386328 388778 350620 302999 345332 269714 274683 333619 454712 424100
7124 424100 456702 404572 299201 244807 326995 278593 321796 303688 354155 556769 529542
7113 529542 363987 343554 473191 550596 469072 504068 650240 641500 575680 555494 618186
7102 618186 728412 729872 676890 702553 856066 741795 703582 875504 841192 788277 811170
7091 811170 754335 960078 939346 919145 1030255 1063727 1196210 1279911 1269585 1242152 1150181
7080 1150181 1272261 1377935 1400929 1562046 1515588 1611121 1725715 1705016 1819480 1960853
7070 1960853 2134355 2256490 2433135 2582381 2646299 2848781 2943759 3061341 3254801 3370924
7060 3370924 3510211 3627250 3676250 3874071 4052168 4373119 4718381 5186728 5569646 6114300
7050F114300P14700P21235P33660J035880J162731J222140J735554K361393L103140
7041A8904733L056763O78772j969816k933719k800791k514530j813413j312979
7033I295020j404361j173594p13450o67583m24921n24475k81353l17534n70670
7024C217079l12871j35102k7227l14234j59556J9834k22984Q621j04311n3216
7014A916033q7642j00307n4700m223j04872P836R974Q094k04320P5360q6804L429
7002A377858n0230j47289m2419l5494o9968n1519K18456m2946l8219k7912n2622
6991A037696j36206P4770K2653r3214n8058J20408r1328k8710R9334J0850J6435
6980I74630m0288M1655M1020o3963O4633o0667j30064j04781l7568K1909Q5745
$$ plain form
7050 6114300 6829000 7550235 8283895 9319775 10482506 11704646 13440200 15801593 18904733
7041 18904733 21961496 22640268 20670452 17736733 14935942 12421412 10607999 9295020
7033 9295020 7890659 6717065 6003615 5336032 4911111 4386636 4105283 3787749 3217079
7024 3217079 2904208 2769106 2741879 2427645 2268089 2287923 2064939 2073560 1969249 1916033
7014 1916033 1828391 1728084 1673384 1669161 1564289 1572125 1582099 1590193 1385873 1461233 1374429 1377858
7002 1377858 1327628 1180339 1137920 1102426 1032458 980939 1199395 1156449 1118230 1090318 1037696
6991 1037696 901490 976260 998913 905699 847641 968049 876721 848011 947345 958195 974630
6980 974630 934342 975997 1017017 953054 1017687 957020 826956 722175 684607 706516 792261
6969G92261j2583K7325r5776J06603l3667K8348j24549J27595j52224j2328J73843
6958H24848P5990k13972L9887J07411r1591k7825l1114K5811K4372j11058K0326
6947F43085J79398J6520R568j45840r8515O3631K0517j7418L8908j7350J38261
6936H30765j3831j42471m8314J77457J54957o852k5519N6121J4771Q2380j04605
6925I74859P2523O4358o0703J83854n2373j09196j42967M4825O1766Q1872l6647
6914A082171j18368p7648k847j19743n6314J67568k59262R8059n098j8958O792
6903F96352J71594l3385j32330q5505J33431o9479j46102J35956Q7095j26688
6893F30939Q928R9969K8004j00136K1249O5794j04930L2736k6865J06728m7853
$$ plain form
6969 792261 779678 807003 711227 817830 784163 812511 687962 815557 663333 651005 824848
6958 824848 900838 686866 726753 834164 742573 714748 683634 709445 733817 622759 643085
6947 643085 822483 839003 848571 702731 604216 667847 688364 670946 709854 692504 830765
6936 830765 816934 674463 626149 803606 958563 951711 926192 982313 997084 1079464 974859
6925 974859 1047382 1111740 1051037 1234891 1182518 1073322 930355 975180 1036946 1118818 1082171
6914 1082171 963803 886155 883308 763565 707251 874819 615557 713616 708518 689560 696352
6903 696352 867946 834561 702231 616726 750157 680678 534576 670532 757627 630939
6893 630939 639867 739836 767840 667704 688953 754747 649817 682553 655688 762416 714563
6882G14563R6910N1119m2679r3905P4780N9527l6385q1334p311L4699n2433J24775
6870H42326l5430R5797M8774j35943l9353q627j1650K1932L8155P8789J29442
6859A024212m0516k1751J66127k35447J66905O5418q9135m771M3200P0261M480
6848A148983Q9028L6700j06032j83J29197r0269J07648r252j26451Q235Q8531
6837A276135j24464l8825K90809k0815J8413R452K0890l0608J6431Q2857n86O8104
6825A567793p5250o615m4418J84645J65353k5522P4158q6683N0329J74282k8041
6814A950031J44538K2756l3435Q881J96414o2293q8494K7924J50664n8015R8649
6803B357620J54631Q1291Q8962R6136j03322o4889J76475K40455J46155j01057
$$ plain form
6882 714563 811473 862592 819913 726008 800788 860315 823930 742596 735285 769984 717551 842326
6870 842326 806896 902693 951467 815524 776171 767544 755894 777826 815981 894770 1024212
6859 1024212 983696 961945 1128072 892625 1059530 1124948 1035813 1031042 1074242 1144503 1148983
6848 1148983 1238011 1274711 1168679 1168496 1297693 1207424 1315072 1305820 1179369 1187604 1276135
6837 1276135 1151671 1112846 1403655 1382840 1401253 1410705 1431595 1400987 1417418 1500275 1499689 1567793
6825 1567793 1492543 1485928 1441510 1626155 1791508 1765986 1840144 1753461 1803790 1978072 1950031
6814 1950031 2094569 2117325 2083890 2092771 2289185 2226892 2138398 2166322 2316986 2258971 2357620
6803 2357620 2512251 2593542 2682504 2778640 2675318 2610429 2786904 3027359 3173514 3072457
6793C072457J71318Q9383K48486K16671J31906J6976K48157L8914l9285K28430
6783D423413P0029K44200j09407K86709L48893J94961J42185K70305K43399L21407
6773F436094K48056K72623K18642M22888J43319K71144M68207M54698M62857M56155
6763I854683M25513L22386N15776O97095N28159N65406P92097P80188Q32794Q13779
6753A6127876R80617J351405J413634J529117J964935J957142K503869K632502
6745C0461097L173439K792485J934458J400598L62333m41767m57273r56177j349415
6736C6919778j450528j251860j203350n45856j27424j35514L35007O58817R45714
6727C4144784J362342J700960K164166K639992K834612L638947M522662M987321
$$ plain form
6793 3072457 3243775 3333158 3581644 3798315 3930221 3947197 4195354 4234268 4194983 4423413
6783 4423413 4493442 4737642 4628235 4914944 5263837 5458798 5600983 5871288 6114687 6436094
6773 6436094 6684150 6956773 7175415 7598303 7741622 8012766 8480973 8935671 9398528 9854683
6763 9854683 10280196 10602582 11118358 11815453 12343612 12909018 13701115 14481303 15314097 16127876
6753 16127876 17108493 18459898 19873532 21402649 23367584 25324726 27828595 30461097
6745 30461097 33634536 36427021 38361479 39762077 40124410 39682643 39225370 38269193 36919778
6736 36919778 35469250 34217390 33014040 32468184 32340760 32205246 32540253 33199070 34144784
6727 34144784 35507126 37208086 39372252 42012244 44846856 48485803 53008465 57995786
6719E7995786N550621N376406N019170M870479M777836L414339J079551k131262
6711H5952926m590707o125880o609987n828318n034529m141322l148590k362349
6703D8111244j841424j174035r22518n06526k02526K95060O43073R84109J368675
6694D6755132J731413K201453K582279L371229M112248M984796N438311N019051
6686G6195912L677600K265289J361778J648606K294665K243802R21814j664272
6678H8945194l788241n023335n078586m562335l511080k521928j903796j040083
6670F1515810n0216P18608J310242K136361L232139M262965N183356O422746P654855
6661I2386866P950220P885502P702143P115733O682346M817471L64925m861150
$$ plain form
6719 57995786 63546407 68922813 73941983 78812462 83590298 87004637 88084188 85952926
6711 85952926 81362219 75236339 68626352 62798034 57763505 53622183 50473593 48111244
6703 48111244 46269820 45095785 44173267 43666741 43464215 43759275 44402348 45386457 46755132
6694 46755132 48486545 50687998 53270277 56641506 60753754 65738550 71176861 76195912
6686 76195912 79873512 82138801 83500579 85149185 87443850 89687652 90609466 88945194
6678 88945194 85156953 80133618 75055032 70492697 66981617 64459689 62555893 61515810
6670 61515810 61465594 62184202 63494444 65630805 68862944 73125909 78309265 84732011 92386866
6661 92386866 100337086 108222588 115924731 123040464 129722810 134540281 134905206 130044056
6653A30044056r565990j2244201j2351713j1856948j0004190q418988p375573
6646E8226453o206684n174798m427107l617195l321432k796359k463647k190369
6638B8028862j828016j827810j510634j370393j324495j133136q64939r77043
6630A7192396o59298r65224p48901o25145o56006p20981m66700m75831l23400
6621A1550910m55815n08795l22996k86829k96363k28512l64911j97468k38762
6612H650459k41728r2781k09625l19729k64512j09261k51694j98140m2365p6338
6602F844286k39944k28029k79166k50209q6407r2678j95137j27049p1908k42799
6592E030960o6711l1016L3734m20045J16399m6856k88984l6492k2610j837j13220
$$ plain form
6653 130044056 120478066 108233865 95882152 84025204 74021014 65602026 58226453
6646 58226453 52019769 46844971 42417864 38800669 35479237 32682878 30219231 28028862
6638 28028862 26200846 24373036 22862402 21492009 20167514 19034378 18169439 17192396
6630 17192396 16533098 15567874 14818973 14193828 13537822 12816841 12350141 11874310 11550910
6621 11550910 11095095 10586300 10263304 9976475 9680112 9451600 9086689 8889221 8650459
6612 8650459 8408731 8315950 8106325 7786596 7522084 7412823 7161129 6962989 6920624 6844286
6602 6844286 6604342 6376313 6097147 5846938 5760531 5667853 5472716 5345667 5273759 5030960
6592 5030960 4964249 4933233 4966967 4546922 4663321 4616465 4327481 4290989 4268379 4266542 4153322
6581D153322p3976M433o4024m980j15540k05014L3609j2809O2497j64725k4926
6570C587867M8718j72174k51321J05023m4198n5121J04143j46477j17808P1653
6560C130305Q345j55820k2089J11973r5529j00315o9084J04133q6773P8927l1646
6549B872427l2641J23897P4156k31472K12222l5832j9957o5001O3144M4683R4799
6538C100425N2545j34788J6691K4128J27559k5493M4260n4561j6018N0636K36190
6527C421574n9214j5039N5675L326J7441O1790P1009J84696M4186N6630n8291
6516C783783J60427J21459L506J13024J34971K6748L7801J89938J98555q450J79584
6505D941346J07656K21484K34129j04694K54275K20089R7281L06605M7537K37586
$$ plain form
6581 4153322 4079346 4083779 4019755 4014775 3899235 3694221 3727830 3715021 3777518 3612793 3587867
6570 3587867 3636585 3464411 3213090 3318113 3273915 3218794 3322937 3176460 3058652 3130305
6560 3130305 3138650 2982830 2960741 3072714 2977185 2876870 2807786 2911919 2825146 2904073 2872427
6549 2872427 2839786 2963683 3037839 2806367 3018589 2982757 2962800 2897799 2960943 3005626 3100425
6538 3100425 3152970 3018182 3034873 3059001 3186560 3161067 3205327 3150766 3134748 3185384 3421574
6527 3421574 3362360 3347321 3402996 3406322 3423763 3485553 3556562 3741258 3785444 3842074 3783783
6516 3783783 3944210 4065669 4069175 4182199 4317170 4343918 4381719 4571657 4770212 4761762 4941346
6505 4941346 5049002 5270486 5504615 5399921 5654196 5874285 5971566 6278171 6325708 6563294
6495F563294L19514O1619K12324J10467J27892K87220L52708K36446M03451L77459
6485I052394J83031L19555M40494K91646L00527M92004M61588M00317M84677N65828
6475A2992061M70373N64989O14676M44343O15760O50979O54019P26499P16929
6466A8450628P54606P59005P10282P95362P39858Q02384N62181O67118P38316
6457B4979740N14475N45068N28717N43118O12504M45731N40014M27497M90028
6448B9626892M95948L82719M38146N99915L34318N87823M87997O76429L19307
6439C3949494Q6583J54174j15807j59274k72801l72811l94478m96288n20120n74135
6429C1284537o49241n35670o57993n61634o34957m26288m68075n83251m64407
$$ plain form
6495 6563294 6882808 6944427 7156751 7267218 7395110 7682330 8035038 8271484 8674935 9052394
6485 9052394 9235425 9554980 9995474 10287120 10587647 11079651 11541239 11941556 12426233 12992061
6475 12992061 13462434 14027423 14642099 15086442 15702202 16353181 17007200 17733699 18450628
6466 18450628 19205234 19964239 20674521 21469883 22209741 23012125 23574306 24241424 24979740
6457 24979740 25494215 26039283 26568000 27111118 27723622 28169353 28709367 29136864 29626892
6448 29626892 30122840 30505559 30943705 31543620 31877938 32465761 32953758 33630187 33949494
6439 33949494 34036077 34190251 34074444 33915170 33642369 33269558 32875080 32378792 31858672 31284537
6429 31284537 30635296 30099626 29441633 28879999 28245042 27818754 27350679 26767428 26303021
6420B6303021o03976m12611n63258p40074o16564q27570p42632p27678o96302
6411B0372356q10682p31598q32032p91786o79132q00144n98030o13392n66814
6402A3948746o80393o07302n01456m96050l40104l93331m21830l66039k98415
6393I843826j58885l51778m90675j28923l39824l68533l78845k53974j89702k43140
6383F939547k61974j54451k41524k91259k54694j77247j91128j46455k26899q1554
6373D912362j79452l61437K7543j04642j49057j264k93430K2688k43632k14463
6363C415216J05683P9696r8850o6534j35766j35933j26377m0001k07083Q5103
6353B875154j02699j37094j14276N3295Q6608j66066j13177n9708m4350o6387
$$ plain form
6420 26303021 25699045 25286434 24723176 23983102 23366538 22538968 21796336 21068658 20372356
6411 20372356 19561674 18830076 17998044 17206258 16527126 15726982 15128952 14515560 13948746
6402 13948746 13268353 12661051 12159595 11663545 11323441 10930110 10508280 10142241 9843826
6393 9843826 9684941 9333163 8842488 8713565 8373741 8005208 7626363 7372389 7182687 6939547
6383 6939547 6677573 6523122 6281598 5990339 5735645 5558398 5367270 5220815 4993916 4912362
6373 4912362 4732910 4371473 4399016 4294374 4145317 4144053 3850623 3873311 3629679 3415216
6363 3415216 3520899 3600595 3501745 3435211 3299445 3163512 3037135 2997134 2790051 2875154
6353 2875154 2772455 2635361 2521085 2574380 2660988 2494922 2381745 2322037 2277687 2211300
6343B211300r6384j4646q562K0250o0248j00735K195r5981Q6755j80758k06070
6332A557116l7736M8515J0626J52279P6123j42905m9049l9102k04549J5718p9304
6321A307732J08895J02324K9924j23257J7852j19353j39934P6981l9107j55072
6311A066985M8807q86M9388O7742l8023j8988j48900J7130Q0311j26594L0614
6300A027586O3475j07533Q3672O6606l6781n2744j67499l6659J54680r4951n8396
6289H41456j03812K3404M1692j22136J8747P3552j22393J31915K95l526J86339
6278I65533m6118l7018p5805j04379J8607k2650J6722J42442j24490o5743j44980
6267E22121L4076K2604o0040J89448K7965j84599M7072k6963O9487p7684n156
$$ plain form
6343 2211300 2114916 2100270 2091708 2111958 2051710 1950975 1953170 1857189 1943944 1763186 1557116
6332 1557116 1519380 1567895 1578521 1730800 1806923 1664018 1614969 1575867 1371318 1387036 1307732
6321 1307732 1416627 1518951 1548875 1425618 1443470 1324117 1184183 1261164 1222057 1066985
6311 1066985 1115792 1114906 1164294 1232036 1194013 1175025 1026125 1043255 1123566 996972 1027586
6300 1027586 1091061 983528 1067200 1133806 1097025 1044281 876782 840123 994803 899852 841456
6289 841456 737644 761048 802740 680604 699351 772903 650510 782425 782720 779194 965533
6278 965533 919415 882397 806592 702213 720820 698170 714892 857334 732844 667101 522121
6267 522121 556197 578801 518761 708209 736174 551575 598647 571684 641171 563487 558331
6256E58331P6039j31865j05651J56869j29423m1468J79361j12677j38495J37022
6246D48043M7162j05164J66702Q7981p9064j25707M1789N5244k1211l6424j52802
6235C26549K0320P6075p2012L5338J00508p0669p1450l2195j0533L1380K799O0661
6223C96771p8808L2953N5801M3363m8594l6976L5918k14707N5070n9863J57748
6212C38676o5018J52507J1904j90541J47837j81177J8864q9664R4331m0287M4853
6201B42285P8344o9548J4653n094j03650K8138J23942J2152n920J36828j44332
6190C07798l1599J24009N7404q1652n6459m9764o7869P3059J43800j06913n9726
6179B52088O9040j24381j0031P4070n6449l7299Q9084j88318J24839l9597j44617
$$ plain form
6256 558331 634370 502505 396854 553723 424300 382832 562193 449516 311021 448043
6246 448043 495205 390041 556743 644724 565660 439953 481742 536986 515775 479351 326549
6235 326549 346869 422944 350932 386270 486778 416109 344659 312464 301931 333311 336110 396771
6223 396771 317963 350916 406717 450080 401486 364510 400428 185721 240791 180928 338676
6212 338676 273658 426165 438069 247528 395365 214188 233052 143388 237719 197432 242285
6201 242285 320629 251081 265734 260640 156990 185128 309070 321222 315302 452130 307798
6190 307798 276199 400208 457612 375960 319501 269737 201868 274927 418727 311814 252088
6179 252088 321128 196747 186716 260786 204337 167038 256122 67804 192643 153046 8429
6168H429R4158j212R8184l2935K8661r607m4672N965L0954J38412j58724L9876
6156A97489n963j0531J55018r6022o6421R7973L4493k725j57465j47048J40227
6145A39025L2664l3766J28078j5024J11651j45217L6210l3898k7875R4610p1236
6134B15222p9276j18468r789J1382J90307M318Q8070p2871j07220k0247J05961
6123B07389K5426o5638r150j12147O2288J02014j29704J7604n9730n8836Q2515
6112F2031J28246J9101r8042l9280O0884M0284J14470j17476n7341n968R1720
6101A98629l2749q9872Q7078j107L8565J32180j76123r6569P1193J7942J47454
6090B96621o564J18270j20919j54510J932K1945K23519j5026q5209k00819j1118
$$ plain form
6168 8429 102587 101375 199559 166624 195285 185678 141006 146971 177925 316337 157613 197489
6156 197489 191526 180995 336013 239991 173570 271543 306036 303311 145846 -1202 139025
6145 139025 171689 137923 266001 250977 362628 217411 253621 219723 191848 286458 215222
6134 215222 135946 17478 7689 19071 209378 213696 301766 228895 121675 101428 207389
6123 207389 232815 167177 158027 45880 108168 210182 80478 98082 38352 -20484 62031
6112 62031 190277 209378 111336 72056 132940 173224 287694 170218 112877 106909 198629
6101 198629 165880 76008 163086 161979 200544 332724 156601 60032 131225 149167 296621
6090 296621 290057 408327 287408 132898 134830 156775 380294 365268 280059 79240 68122
6079F8122J32987O4354p687L4987j09653o4997Q1740o615M6786m0260L2104J17886
6067C49754J10710r5537r28M9144P0373k31976m4654R4205m69L1270N9088j4932
6055C76048J2043Q5748o7723o2365K8714j3412p9371j57201o5424N7956L2175
6044A47188N0810r9615M4615N6490J02862R6248n0703j11678o2627P6388o019
6033B43959r5375J59719K5759j5601n2846k5410K0191J0398p4773r8561J76844
6022B74304K8560k0600l1948m1685K7472p6605k9464n2686L7886Q5642p8056r3895
6010B8925P6142K5695j40129Q8756n5018R844j9202R726l0896K2476k8810j1652
5998b4143J24203J47998j34733l9920j5547m3180L9968L0838l8452q9572J17541
$$ plain form
6079 68122 201109 265463 257776 292763 183110 118113 199853 193238 240024 199764 231868 349754
6067 349754 460464 364927 363999 413143 483516 251540 206886 301091 300622 331892 390980 376048
6055 376048 388091 473839 406116 343751 372465 359053 279682 122481 57057 115013 147188
6044 147188 197998 98383 142998 199488 302350 398598 347895 236217 173590 249978 243959
6033 243959 148584 308303 334062 318461 265615 240205 260396 270794 196021 97460 274304
6022 274304 302864 282264 250316 208631 236103 159498 130034 77348 115234 200876 122820 28925
6010 28925 105067 130762 -9367 79389 24371 34215 15013 24739 -6157 16319 -12491 -24143
5998 -24143 100060 248058 113325 73405 57858 14678 54646 85484 47032 -42540 75001
5987G5001j2307l0176l8344k7169J40039O0175q7563O8301m9559l4134p6821Q3492
5975G0935k4376Q701O4743l6402K19800p7373j04666l7394R3821P0774j81373
5964F7190r4294p4234m6612J73695R2201o1906K5624R6450j41946J22811j0345
5953A48634n5520r7007J1412J17036p1507O7679k6948O2652r14j1177m5533j74540
5941g5733Q7917J53955j05690J365L113k44956J69618R2785j16296l8428j8382
5930i0732J35527J4792j3173J9095o9534J34455m7053j7452Q9600j22981j41054
5919a08510J99756m6452o5558J45738l4080j73670j1546K32776j71246r6034J93911
5908F5085J2587n4949P0392M2397k7307j0052N4293j07382R478n7103o7898N5691
$$ plain form
5987 75001 62694 32518 -5826 -32995 107044 167219 79656 147957 98398 64264 -12557 70935
5975 70935 46559 55260 120003 83601 303401 226028 121362 83968 177789 248563 67190
5964 67190 -27104 -101338 -147950 25745 117946 56040 81664 178114 36168 158979 148634
5953 148634 93114 -3893 7519 124555 53048 120727 93779 156431 155517 144340 98807 -75733
5941 -75733 12184 166139 60449 61814 64927 -180029 -10411 82374 -33922 -72350 -90732
5930 -90732 44795 59587 46414 65509 -4025 130430 83377 65925 155525 32544 -108510
5919 -108510 91246 44794 -20764 124974 90894 -82776 -94322 138454 -32792 -128826 65085
5908 65085 77672 22723 93115 135512 108205 98153 152446 45064 54542 -2561 -70459 -14768
5896a4768J40705J05654j38906j56659m3796J8061N4217K3417N3027j00790M9091
5885a0747o2859J58729p6210M4271N5477j48635J33524L7099O7024J7323o0526
5874A54470m1438l5792N1589j67184L3033J27757q4376j09996J9303J04440L0319
5863H2125m4629n9823J10881q6467k0950J80383j06188r6499J057O921m0115K26582
5851A53278j10142m3437O8861J7671j6570k4929n54N5204J42022j53218k6199
5840F1987k10877K22558R8518p6281L0983M3626P570m7741p4483m6290q6056L3960
5828d2526O7332o0607k2527K9558K6610L8504J816j34866L5672P4722o1426M19
5816d7319R9598N1303M9982j64624K3636o4560o5792J89150n5779L6065N8376
$$ plain form
5896 -14768 125937 231591 92685 -63974 -107770 -89709 -35492 -12075 40952 -59838 -10747
5885 -10747 -73606 85123 8913 53184 108661 -39974 93550 130649 197673 214996 154470
5874 154470 113032 77240 128829 -38355 -5322 122435 38059 -71937 -52634 51806 82125
5863 82125 37496 -22327 88554 2087 -18863 161520 55332 -41167 -40110 -33189 -73304 153278
5851 153278 43136 -301 68560 86231 69661 44732 44178 99382 241404 88186 61987
5840 61987 -148890 73668 172186 95905 126888 170514 178084 130343 55860 9570 -76486 -42526
5828 -42526 24806 -35801 -58328 -28770 -2160 36344 38160 -96706 -61034 13688 -47738 -47319
5816 -47319 52279 103582 153564 -11060 12576 -51984 -117776 71374 15595 51660 110036
5805A10036r0511k5093l8240m8046K0926N8137O2655k06581N1942J11013o595
5794c57J18760J31742j02116q2789J80794r983j51929o540O3631j84559K02455
5783A59109j40950n3249L8439K24333Q5326k31192j06742J2158Q2849j82330k4102
5772a36351J55012J42745j08302J58238n3348o6113p8759J0673M7014j2738o8760
5761a0689J5531L3655l9058J84678j33178j1709n3127P2324J59187o7468M8306
5750A98452r7503j55995J277J46118j46872j48177J67301K4185P7822J23632k31697
5739d1457l64j26559J04499J88973k22797O253P1722R1162p9919o9276l29L2028
5727d6064P0889O42Q1766J6195J8392j38646o4847o3004J95995J5288o6364r1977
$$ plain form
5805 110036 19525 -5568 -43808 -91854 -70928 -12791 49864 -156717 -104775 6238 -357
5794 -357 118403 250145 148029 65240 246034 236051 84122 77582 141213 -43346 159109
5783 159109 18159 -35090 3349 227682 313008 81816 -24926 -12768 70081 -112249 -136351
5772 -136351 18661 161406 53104 211342 157994 91881 13122 23795 70809 58071 -10689
5761 -10689 4842 38497 -561 184117 50939 39230 -13897 58427 217614 150146 198452
5750 198452 100949 -55046 -53769 92349 -54523 -202700 -35399 -11214 66608 190240 -41457
5739 -41457 -41821 -168380 -63881 125092 -97705 -91452 -19730 71432 -8487 -77763 -78092 -46064
5727 -46064 24825 25467 107233 123428 141820 3174 -61673 -124677 71318 86606 20242 -71735
5715g1735Q0508K1016R1512o6301l151l7838l5717q8842P570J80256o0646k2063
5703e431K3491l0503J35460n8930l4746M8625j23927O8637j18030J45063j21618
5692g1909O6739m9132K07854Q606l3056r3693R714n8830K1621J69467j13741j72877
5680a09237Q8222j0005Q5310J81889l0652j40537L1233m9150o2353m1654p943
5669f4877K20376L1015j31384p3254K26195j3299m1859q3151R4554L7532j35810
5658F6038j53443O3999M6773J6106l1290k9559l2958P7996j2102k6031k8673q3010
5646a26154J52056L5277j20169J8551p1984p6370K7975P7701L7845J60224n4618
5635F0334o2316K5915k856K2585o9227J194J53952j16371O565o9859r413n4593
$$ plain form
5715 -71735 8773 29789 121301 55000 51849 14011 -21706 -110548 -102978 77278 16632 -5431
5703 -5431 18060 -12443 123017 64087 29341 77966 -45961 22676 -95354 49709 -71909
5692 -71909 -5170 -54302 153552 162158 129102 35409 45123 -13707 7914 177381 63640 -109237
5680 -109237 -21015 -31020 54290 236179 205527 64990 96223 47073 -15280 -56934 -64877
5669 -64877 155499 186514 55130 -18124 208071 194772 152913 69762 164316 201848 66038
5658 66038 -87405 -23406 23367 39473 8183 -21376 -54334 23662 11560 -14471 -43144 -126154
5646 -126154 25902 61179 -58990 -40439 -112423 -188793 -160818 -83117 -45272 114952 60334
5635 60334 -1982 23933 21077 43662 -25565 -24371 129581 13210 19775 -50084 -59497 -114090
5623a14090J79366J5158j58002P0245k0485L2143M0346j56502n638K4973R6780
5612D294o2750P5798K10947j60922M2704j5655N5532j17731J96474J18655q9982
5601B57364Q2253r515M3832n573p5185k157j91590J32935p1386j10192j32093
5590h1307J06917l5667L062j6014K32327j96585L6379K2391n9844O8097J7528
5579I7284k64p8733J07946q6944M0183O3381m8804N8323Q5722j47625j80617P657
5567h2491L00973j03042j55374M005n4102l5931P2414J16802K1448n9484o4571
5556c9353O0392K15503m0474j70896M0590P3500J3203m5448p929o1680J32172
5545A69580j51898R1056J7877j38946l9719k4621J8705P1632J2307r471N4276
$$ plain form
5623 -114090 65276 80434 -77568 -7323 -27808 4335 44681 -111821 -117459 -92486 4294
5612 4294 -58456 17342 228289 67367 110071 94416 149948 32217 228691 347346 257364
5601 257364 339617 330102 373934 368361 293176 291019 99429 232364 160978 50786 -81307
5590 -81307 25610 -10057 -6995 -23009 209318 12733 49112 71503 11659 79756 97284
5579 97284 97020 18287 126233 39289 79472 142853 94049 152372 238094 90469 -90148 -82491
5567 -82491 218482 115440 -39934 -35929 -90031 -125962 -53548 63254 84702 25218 -39353
5556 -39353 21039 236542 196068 25172 65762 139262 152465 107017 99088 37408 169580
5545 169580 17682 108738 126615 -12331 -52050 -76671 -57966 13666 25973 16502 70778
5534G0778O559N4684j26202q882L8573P8390P0773j61008j1135J32167j15349
5523B9348q4426K7680O9460J45481j51283r9390J19925q1695J67756j59197q6691
5512a03032n470J38823N7316J9767r5927l3778P8283J616N1289K3874K2707j42603
5500A2865J299p8914m7222R8740J01054j00125o1411L9999O7066Q0136j20360
5489f873j2183k1915J90896o0910K4493L2128K2579o5713j3101k8892N8309k8014
5477I0804L7306O9206q6650l8732n6320m6816M0363J9599k2230R0992P2012m6529
5465A23005q9270j06422q9821K75969J02813p1324j08604m081O4961R894J8759
5454A25879Q5720J07287k30733o9306J33071n5862q5234O0587r2196L5619P3056
$$ plain form
5534 70778 77337 132021 5819 -3063 35510 113900 184673 23665 12530 144697 29348
5523 29348 -55078 -27398 42062 187543 36260 -63130 56795 -24900 142856 -16341 -103032
5512 -103032 -108502 30321 87637 107404 11477 -22301 55982 57598 108887 132761 155468 12865
5500 12865 14164 -64750 -111972 -13232 87822 -12303 -73714 -33715 33351 113487 -6873
5489 -6873 -19056 -40971 149925 89015 113508 145636 168215 102502 89401 60509 118818 90804
5477 90804 128110 197316 110666 71934 15614 -31202 9161 28760 6530 97522 169534 123005
5465 123005 33735 -72687 -162508 113461 216274 144950 36346 32265 97226 107120 125879
5454 125879 211599 318886 88153 18847 151918 96056 10822 71409 -20787 14832 87888
5443H7888m38m6230J01092P6303q0775n5642j23711P7659Q0634l7915M4969m8267
5431G5567j33951K4737J00636J32724r7562o3054L1606O279J06568P4013j46650
5420A10913o0962R413O314J74746l6659q3058K9483L4584o1951q8018O1247l2583
5408F3469o5703J50858J84009j71932j3170J18495k82724K2175R6307r9667N7373
5397E9490l7187m2135K0796p8334k526J07708O8146O7359j70046K3520N5165j14952
5385d2996R2769J40269n6678j16234k7458J01881N1316m7794n4778J30358j21251
5374D9404N8890L7650M558k30450m6216J76221q4003M6071k3284R0524J14690
5363A94055m7634l7291J3693K3038O588J02434q6780j70928O6233K1424p497L404
$$ plain form
5443 87888 87450 41220 142312 218615 137840 82198 -41513 36146 116780 78865 123834 75567
5431 75567 -58384 -33647 66989 199713 102151 39097 70703 76982 183550 257563 110913
5420 110913 49951 59364 65678 240424 203765 120707 150190 184774 122823 34805 96052 63469
5408 63469 -2234 148624 332633 160701 147531 266026 -16698 5477 101784 2117 59490
5397 59490 22303 -19832 964 -77370 -79896 27812 95958 163317 -6729 16791 71956 -42996
5385 -42996 49773 190042 133364 17130 -10328 91553 142869 95075 40297 170655 49404
5374 49404 108294 145944 150502 -79948 -126164 50057 -33946 12125 -11159 79365 194055
5363 194055 146421 109130 122823 145861 152449 254883 168103 -2825 63408 84832 77335 80739
5351H0739j64029Q0801J15160j5677r0106L397M3176R7769N9779k04094J23898
5340A30813n6816N222L3258p73J00204k0035j65432j90792O9125J47330O5847
5329A17951k2422J21391r3794j9415q2335P512O6975J12409K29n0161j1432K9220
5317A76128r499n6561P3787o745L1454j20203j39570Q0944q8525J20691R7206
5306A59107k2662o1971J7847k1370l696J19293m3046o7204L8854k1111L957P843
5294A05841m9700l6923R9713l8299j51450J19612n9067r625J09557p3154k0137
5283c632O3177M3134j4092o3979J71712m3698L7460j08086K02519n6150k29290
5272i25l2404Q1429L0571L5598r5503q350J08927M0345J9014k1801k9108J39960
$$ plain form
5351 80739 -83290 -2489 112671 96994 6888 10285 53461 151230 211009 6915 130813
5340 130813 73997 79219 112477 111704 211908 191873 26441 -164351 -95226 52104 117951
5329 117951 95529 216920 123126 103711 21376 28888 95863 208272 208501 158340 146908 176128
5317 176128 166629 110068 183855 177110 208564 88361 -51209 29735 -58790 61901 159107
5306 159107 136445 74474 92321 70951 67255 186548 143502 76298 115152 94041 97998 105841
5294 105841 56141 19218 118931 80632 -70818 48794 -10273 -19898 89659 16505 -3632
5283 -3632 59545 102679 88587 24608 196320 152622 190082 81996 284515 228365 -925
5272 -925 -33329 48100 78671 114269 18766 10416 119343 159688 178702 156901 127793 267753
5260B67753q7332k0680N1017N788p2294K7242J85501j20878J1464L5838o1713
5249B21706m5525P3351p9992l1151J66743r197m7856P1922j47388j7504J45278
5238C00387j33443J32969L302j19887l5135n4489L0703k2126p9967J53315j38600
5227C7029k4408K21433K7737j75016M7037j47700l8896K30588j00885O7553J4989
5216A59461k0888J79452j7196j15884J7332j25359Q2937n0007M612m3313P5922
5205A47069N9149j11134J63007O1003j88337O43Q8709j52814L4478J48537m9218
5194B01092l4704r995j6749j4424R5850j5765j47538J2199J14114P8824k7708
5183B35196m8706N2219p2230R5365j2891k8501J27363p8320o2704j19688J19993
$$ plain form
5260 267753 180421 159741 210758 216546 144252 171494 356995 236117 247581 283419 221706
5249 221706 176181 249532 169540 138389 305132 295935 248079 320001 172613 155109 300387
5238 300387 166944 299913 303215 183328 148193 93704 124407 102281 22314 175629 37029
5227 37029 12621 234054 261791 86775 133812 -13888 -52784 177804 76919 144472 159461
5216 159461 138573 318025 300829 184945 202277 76918 159855 109848 114460 71147 147069
5205 147069 206218 95084 258091 319094 130757 131400 220109 67295 101773 250310 201092
5194 201092 166388 156393 139644 125220 221070 205305 57767 69966 184080 262904 235196
5183 235196 186490 238709 166479 261844 248953 220452 347815 269495 206791 87103 207096
5172B07096m680J19804m6479j19480K5430j28647J68182n7707q331r723R3796
5161B39261K0971L2599o3053o8124K180O3555J35363j19451l6265J24950l0529
5150C01457J70183k6716M626o7287j13512j33524n9970J29081O4679J85724j46623
5139C08118j12642L5428J9305p1316M5874J39774m4686r249p579O081L2443p7225
5127B64326Q648j0919J3250J09083r5829j8681O8127J53839p7995j29462O6519
5116C50906p0016P5318M0961o2215P5431k47585P1914O5863N8131J65661m6743
5105D77626L5340j65641n9050n4574j9643N7746R9992K5081N5511j27187l7164
5094B88037K0972M6527n1159M6798P5480k20273M494J20359P5196q424R9488n0194
$$ plain form
5172 207096 202416 322220 275741 156261 181691 53044 221226 163519 155188 145465 239261
5161 239261 260232 292831 229778 161654 163834 227389 362752 243301 207036 331986 301457
5150 301457 471640 444924 449550 382263 268751 135227 75257 204338 269017 454741 308118
5139 308118 195476 230904 250209 178893 224767 364541 319855 310606 303027 309108 341551 264326
5127 264326 272974 262055 275305 384388 288559 269878 338005 491844 413849 284387 350906
5116 350906 280890 356208 397169 334954 410385 162800 234714 300577 358708 524369 477626
5105 477626 512966 347325 288275 233701 214058 271804 371796 396877 452388 325201 288037
5094 288037 309009 355536 304377 351175 426655 206382 210876 331235 406431 398007 497495 447301
5082D47301p3478o1892J4894K79870k76225P0049m2515j13791J40694r4552J05627
5071C95982o0840R8298J56019l8971M1259j05584o6593K48964j61350j0253J74200
5060F71131j23491m4176k6122Q7439n1959q7775K5338n4871j0514M3407Q4878
5049E13285M5441o0240K8716j43767j38682J36378J03218K1109M7996j0259p6770
5038D66425k8638L5383j1787Q9896j26162O0752r7761J385J08721Q4869r3539
5027D89544o8382N4482J19961j1141N5644J09055p3983L7547j57927l5521O2464
5016E81743O642j7078J04828k16067R4647R3039j21580N1390K12821j18208O9973
5005G42150L1856K5329r4448J08233J21301L5924J9157N1457J1302l5098R9242
$$ plain form
5082 447301 373823 311931 326825 606695 330470 400519 358004 244213 384907 290355 395982
5071 395982 335142 433440 589459 550488 591747 486163 419570 668534 507184 496931 671131
5060 671131 547640 503464 477342 564781 512822 425047 450385 395514 385000 428407 513285
5049 513285 558726 498486 527202 383435 244753 381131 484349 505458 553454 543195 466425
5038 466425 437787 473170 461383 551279 425117 485869 388108 389493 498214 583083 489544
5027 489544 421162 475644 595605 584464 640108 749163 675180 712727 554800 519279 581743
5016 581743 588385 571307 676135 460068 554715 647754 526174 577564 790385 672177 742150
5005 742150 774006 799335 704887 813120 934421 970345 989502 1040959 1052261 1017163 1116405
4994A116405J4717p9431r821n2255j35008O6919K13597j2472j4930N4338r8425
4983A063634J3120R6681L6873l1045J3880K35103P3937K8697J65313j26287J04807
4972A674713j9098J37139K2063K46556J13943R9923J18676K10256K18125K50853
4962C073149J06795l7194q4636q5651j95298l8738J67751J82549n5539L09350
4952C342538J57036k02135m1870l29273k04830k88035n1577q6046j49273j64331
4942A982204j08370k22381p2849M0376N7387m0844l2005j2847k9127r905J69746
4931A721385j56047l1276N777j09065O7867k2897J29115k9518N1409O6731M553
4920A698034R769N5112J11095q8904j17308l5273k0813p7416P0511K40241j12469
$$ plain form
4994 1116405 1131122 1051691 1041870 989615 854607 921526 1135123 1122651 1107721 1162059 1063634
4983 1063634 1076754 1173435 1210308 1179263 1193143 1428246 1502183 1530880 1696193 1569906 1674713
4972 1674713 1655615 1792754 1814817 2061373 2175316 2275239 2393915 2604171 2822296 3073149
4962 3073149 3179944 3142750 3058114 2972463 2777165 2738427 2906178 3088727 3033188 3342538
4952 3342538 3499574 3297439 3255569 2926296 2721466 2433431 2381854 2295808 2146535 1982204
4942 1982204 1873834 1651453 1578604 1618980 1676367 1635523 1603518 1590671 1561544 1551639 1721385
4931 1721385 1565338 1534062 1539839 1430774 1498641 1475744 1604859 1575341 1626750 1693481 1698034
4920 1698034 1707803 1762915 1874010 1785106 1667798 1632525 1611712 1534296 1604807 1845048 1732579
4909A732579p6014J604M8528R5840o3698m3480J3735J36062Q5088r4971M2052
4898A877325P789M2928M0337p618J33656O7878L1643j30481o4715Q412o1627N4085
4886A999612O0396K2975o5273M5255K9627K549m6548m6480J18918L9035O5532
4875B225598N3975K3507k4187j2156m084P7831Q2877p454j6449L4429J36800R9744
4863B670431K83276J0234r7172L7579N7714J55034M3499J5771L6230J61413M6965
4852C420974j43662J52786R5212j62220J23077j4197K12870o4375j38431J96581
4842C678615P7564j3201J49579j8177p4412K84783j19185L1915J36982r0756p292
4831D036415r341L1141K19398J1034J44838J4455J1670J42672J65365N5464o2900
$$ plain form
4909 1732579 1656565 1658169 1706697 1802537 1738839 1695359 1709094 1845156 1930244 1835273 1877325
4898 1877325 1885114 1928042 1968379 1960761 2094417 2162295 2193938 2063457 1998742 2007154 1945527 1999612
4886 1999612 2060008 2082983 2017710 2062965 2092592 2095141 2048593 2002113 2121031 2160066 2225598
4875 2225598 2279573 2303080 2278893 2266737 2262653 2340484 2423361 2415907 2399458 2433887 2570687 2670431
4863 2670431 2953707 2963941 2866769 2904348 2962062 3117096 3160595 3176366 3212596 3374009 3420974
4852 3420974 3277312 3430098 3525310 3363090 3486167 3471970 3684840 3620465 3482034 3678615
4842 3678615 3756179 3742978 3892557 3874380 3799968 4084751 3965566 3997481 4134463 4043707 4036415
4831 4036415 4027074 4058215 4277613 4288647 4433485 4447940 4459610 4602282 4767647 4823111 4760211
4820D760211K97817J44970K7149N5188O5014J81601P348m7711J12011P5533L02086
4809E981217L8410M9615J02004J33992L4271R6536K32708J2355J46071J47035
4799F974214J72327J95629K68360N4529Q2972K28643M52483K14246K78266M13859
4789I335528K47352M53689M44260L43016K96448N91806N81875N57338M72545P13123
4779A4036980O50648N04503N71824P47155Q28661P87233R48287O41135J014917
4770B0731343Q99866R50078J102797R54504J030981J170186J200847J206339J150749
4761C0397690J336087J397253J514142J694636J452794J765009J962253K052500
4753D3572364K216113K144555K320924K701703K531981K534490K938722L193233
$$ plain form
4820 4760211 5058028 5202998 5230147 5285335 5350349 5531950 5539298 5491587 5603598 5679131 5981217
4809 5981217 6019627 6069242 6171246 6305238 6339509 6436045 6668753 6681108 6827179 6974214
4799 6974214 7146541 7342170 7610530 7665059 7748031 7976674 8429157 8643403 8921669 9335528
4789 9335528 9582880 10036569 10480829 10823845 11120293 11712099 12293974 12851312 13323857 14036980
4779 14036980 14687628 15192131 15763955 16511110 17339771 18127004 19075291 19716426 20731343
4770 20731343 21631209 22581287 23684084 24638588 25669569 26839755 28040602 29246941 30397690
4761 30397690 31733777 33131030 34645172 36339808 37792602 39557611 41519864 43572364
4753 43572364 45788477 47933032 50253956 52955659 55487640 58022130 60960852 64154085
4745F4154085L408713L424687L654787L978155L990349M335142M391341M805260
4737I6142519N042027N513153O183444O558369P117925Q011862R293935J0833609
4729A54696843J2549016J4878589J6662290J9135146K1255018K3601518K7350218
4722B90128638L5203985M4461152N0122189M1036992J4466227j1921500k4610239
4715D38887444k4763430j8097710q216251K882774J4606923K4762885K3439467
4708D53502102K086617k6500710m4571369m9085444m5159080l6988312k9759913
4701B23523891k5192126k1951208j8403042j5932987j3741706j1933377r935563
4694A06433882q486080p377699o412922n645884n033627m782982m236352l791984
$$ plain form
4745 64154085 67562798 70987485 74642272 78620427 82610776 86945918 91337259 96142519
4737 96142519 101184546 106697699 112881143 119439512 126557437 134569299 143863234 154696843
4729 154696843 167245859 182124448 198786738 217921884 239176902 262778420 290128638
4722 290128638 325332623 369793775 419915964 460952956 475419183 463497683 438887444
4715 438887444 414124014 396026304 387810053 390692827 405299750 430062635 453502102
4708 453502102 455588719 429088009 384516640 335431196 290272116 253283804 223523891
4701 223523891 198331765 176380557 157977515 142044528 128302822 116369445 106433882
4694 106433882 97947802 90570103 84157181 78511297 73477670 68694688 64458336 60666352
4686F0666352l523994l036945k812416k478301k257815k014776j863098j746989
4678D0932018j874294j588379j476222j447867j394193j303054j303562j096919
4670B9447528p27123p51697q51513o96742q40571p72803q30808q90492p42506
4661B2343273n75091q77149n47322n61633n95060o85972o69147n17412m34788
4652A6879699l24713n54046m30571m46785n25495n99247l23363k87813k84197
4643A3103469j90909j89511l05598k44973l19925j18262k50574m50060k95373
4634A0738284j98967k12735j95879r1351k01565l48038j78602m78882j50453j40632
4624H541180q9059l12722j40361n369j86517j05621L4772j29827o277l24j36407
$$ plain form
4686 60666352 57142358 54105413 51292997 48814696 46556881 44542105 42679007 40932018
4678 40932018 39057724 37469345 35993123 34545256 33151063 31848009 30544447 29447528
4670 29447528 28720405 27968708 27117195 26420453 25579882 24807079 23976271 23085779 22343273
4661 22343273 21768182 20891033 20343711 19782078 19187018 18501046 17831899 17314487 16879699
4652 16879699 16554986 16000940 15570369 15123584 14598089 13998842 13675479 13387666 13103469
4643 13103469 12912560 12723049 12417451 12172478 11852553 11734291 11483717 11033657 10738284
4634 10738284 10539317 10326582 10130703 10039352 9837787 9489749 9311147 8832265 8681812 8541180
4624 8541180 8452121 8139399 7999038 7993669 7807152 7701531 7736303 7606476 7600199 7599875 7463468
4613G463468r0499j09785o5397l10455j04334k26468o0135p1193m1689N4775p3440
4602F364848K0443l7349K05525r899R2743P3312j46o6809Q191J84208m8934J99890
4590F986023P1958r8896J67689L5843K0291j17890k57848l76830j31726j13442
4580F185172j20854j18843J08845M6339n0658J4712l9896O92J52279N9919J07851
4569F345558K25449J21415J63076J92020J92685P599O2216J17613K12954l8169
4559G602416J25766J34017K43246L31601J96984J83016K21666K31931J36087M23123
4549I829853K37421J69068N29758L93679K24952K67395M34671M20516M43401M25982
4539A3376696N28121O36671O61876N71252O32020O71940Q35183R79660J325343
$$ plain form
4613 7463468 7372969 7263184 7197787 6887332 6782998 6556530 6496395 6425202 6383513 6438288 6364848
4602 6364848 6385291 6347942 6553467 6543568 6636311 6709623 6709477 6642668 6650859 6835067 6786133 6986023
4590 6986023 7057981 6959085 7126774 7162617 7182908 7065018 6807170 6430340 6298614 6185172
4580 6185172 6064318 5945475 6054320 6100659 6050001 6064713 6024817 6025509 6177788 6237707 6345558
4569 6345558 6571007 6692422 6855498 7047518 7240203 7247802 7310018 7427631 7640585 7602416
4559 7602416 7728182 7862199 8105445 8437046 8634030 8817046 9038712 9270643 9406730 9829853
4549 9829853 10067274 10236342 10766100 11159779 11384731 11652126 12086797 12507313 12950714 13376696
4539 13376696 13904817 14541488 15203364 15774616 16406636 17078576 17913759 18893419 20218762
4530B0218762J168335J417379J435892J644789J921454K105451K204395K529924
4522C4646381K764715K488615J994535Q68120J28905o88117p74206p85312m98174
4513D0145462j40287K87387M93318J066857J397290J938870K277593K782346L459366
4504E3708202M037118M276209M864605N065577M882906M209612L669192K934020
4496H7647441J159093r00943l039192m435098m957243m742442l914885l042613
4488F3774118k171070j244454m93622K34558R41186J589739K382020L169954L940733
4479G2123162M592855N013741M576469K948085R86923j039050k465560l871302
4471H2865323m658342n375788n584685n496660m628185m127933l309454k746334
$$ plain form
4530 20218762 21387097 22804476 24240368 25885157 27806611 29912062 32116457 34646381
4522 34646381 37411096 39899711 41894246 42762366 42891271 42203154 41428948 40643636 40145462
4513 40145462 40005175 40292562 40785880 41852737 43250027 45188897 47466490 50248836 53708202
4504 53708202 57745320 62021529 66886134 71951711 76834617 81044229 84713421 87647441
4496 87647441 88806534 87905591 84866399 80431301 75474058 70731616 66816731 63774118
4488 63774118 61603048 60358594 59864972 60099530 61040716 62630455 65012475 68182429 72123162
4479 72123162 76716017 81729758 86306227 89254312 90241235 89202185 86736625 82865323
4471 82865323 78206981 72831193 67246508 61749848 57121663 52993730 49684276 46937942
4463D6937942k184642j493519j045271r85768o54942j20986J75321P13874J081053
4454D2423062J140976N68142k30986j480576k429109k861495k967587k631541
4446C1530886k532178k154391k158189j766989j791687j315895j110138j104211
4438A7597208p11587j011491n08379o28385n09438n27955m60508k48726m13393
4429A2577346j08348k53917m6837l19060r4018j829o0588j7841o2883k865O2602
4418A1671762k4183k15344Q6824J24869m7038J14132J68153K6493L22138K48181
4408A2475987J63129L21297K51627K55670L06594K45380M78505K38110N97754
4399A5334053M39954L17562J97336M67893M31881N42758O95644N56785R11040
$$ plain form
4463 46937942 44753300 43259781 42214510 41228742 40573800 40452814 40628135 41342009 42423062
4454 42423062 43564038 44132180 43901194 42420618 39991509 37130014 34162427 31530886
4446 31530886 28998708 26844317 24686128 22919139 21127452 19811557 18701419 17597208
4438 17597208 16885621 15874130 15365751 14737366 14227928 13699973 13239465 12990739 12577346
4429 12577346 12468998 12215081 12168244 11849184 11755166 11753337 11692749 11674908 11612025 11609160 11671762
4418 11671762 11647579 11432235 11519059 11643928 11596890 11711022 11879175 11905668 12227806 12475987
4408 12475987 12639116 12960413 13212040 13467710 13774304 14019684 14498189 14736299 15334053
4399 15334053 15774007 16091569 16288905 16756798 17188679 17731437 18427081 18983866 19894906
4390A9894906O43416Q07818Q10251J076099R93463J062438J116804J189711J225589
4381B8820495J271201J416981J572353J547438J551414J879909J897834J944843
4373D1902468K155815K479645K415340K915193L149102L653489M402073N250008
4365F8323133O168255P313235Q554461R956409J1304102J2850258J5346439J9933984
4357A59750276K5112482K6601203J8999641J735668j5653891k5348956k6983567
4350A64212856k4035137j9761570j6116584j3614797j1163719r100245p502684
4343F2918120o344291n508103m630744l996183l275987k931644k594869k353378
4335C1282921k405764j796044j891742j592772j419428j182789j032521q72290
$$ plain form
4390 19894906 20538322 21346140 22156391 23232490 24225953 25288391 26405195 27594906 28820495
4381 28820495 30091696 31508677 33081030 34628468 36179882 38059791 39957625 41902468
4373 41902468 44058283 46537928 48953268 51868461 55017563 58671052 63073125 68323133
4365 68323133 74491388 81804623 90359084 100315493 111619595 124469853 139816292 159750276
4357 159750276 184862758 211463961 230463602 232199270 216545379 191196423 164212856
4350 164212856 140177719 120416149 104299565 90684768 79521049 70420804 62918120
4343 62918120 56573829 51065726 46434982 42438799 39162812 36231168 33636299 31282921
4335 31282921 28877157 27081113 25189371 23596599 22177171 20994382 19961861 19089571
4327A9089571j096811q95627q36319p95621p46880o67095n59351o10888m19004
4318A2461975n28192k87824m18638l88688k18468l64241k47265l12860k86788
4309I409011k45609l47584l54649j46128j74270k86129j57197k67628q5637j28947
4299G215233k87946k43844j07626j81824l19875k04892j27448O3529q1808m5337
4289E678162j48497k52518K085L6761J16026k25429J01680j46823J6704l3878
4279E144273r7160k07358m4876l19939k32700M6834k16884q2850j98674j76920
4269C613746q255j37906j02699M2853j5649q9682j33784r9207M5324j69755J9372
4258B964358O1556K18426j97829j76490J00751n5141N2176j5264M1959L429K2201
$$ plain form
4327 19089571 17992760 17097133 16260814 15465193 14718313 14051218 13491867 12880979 12461975
4318 12461975 11933783 11645959 11227321 10838633 10620165 10255924 10008659 9695799 9409011
4309 9409011 9163402 8815818 8461169 8315041 8140771 7854642 7697445 7429817 7344180 7215233
4299 7215233 6927287 6683443 6575817 6393993 6074118 5869226 5741778 5805307 5723499 5678162
4289 5678162 5529665 5277147 5279232 5315993 5432019 5206590 5308270 5161447 5178151 5144273
4279 5144273 5047113 4839755 4794879 4474940 4242240 4289074 4072190 3989340 3790666 3613746
4269 3613746 3605491 3467585 3364886 3407739 3392090 3302408 3168624 3069417 3114741 2944986 2964358
4258 2964358 3025914 3244340 3046511 2870021 2970772 2915631 2967807 2952543 2994502 2997931 3020132
4247C020132j2828q1738M3574L7290Q4431J02748l2785J42652K82292j5379J25302
4236C695691k0956J88257J61812r6601L0073j46962k06102j48461j94114j12648
4226C149989r410n5969k16051o5162M6119j10580j61761N7581N4754R530j22446
4215B576594L7474N4288O9314R2046k07751Q5073P586m5098n7079n394Q414K63938
4203B879405j54320J04736q7045k19611j23554J42293l0215j43502j20545J19229
4193B366871j19821q4023k7166J61067k3270j32878J5268k48893N8974Q994m0703
4182A934420K5086R910K8328o6203k9630J9487k24905r188r9516n4477j65488
4171A367824J63028J4354k8562j9568m6194J23049P4235j80049j17708k2822J21068
$$ plain form
4247 3020132 3007304 2925566 2969140 3006430 3090861 3193609 3160824 3303476 3585768 3570389 3695691
4236 3695691 3674735 3862992 4024804 3928203 3958276 3811314 3605212 3456751 3262637 3149989
4226 3149989 3140579 3084610 2868559 2803397 2849516 2738936 2577175 2634756 2689510 2699040 2576594
4215 2576594 2614068 2668356 2737670 2829716 2621965 2707038 2714624 2669526 2612447 2607053 2615467 2879405
4203 2879405 2725085 2829821 2742776 2523165 2399611 2541904 2511689 2368187 2247642 2366871
4193 2366871 2247050 2163027 2135861 2296928 2273658 2140780 2156048 1907155 1966129 1975123 1934420
4182 1934420 1959506 1969416 1997744 1931541 1901911 1921398 1696493 1687305 1587789 1533312 1367824
4171 1367824 1530852 1545206 1516644 1497076 1450882 1573931 1648166 1468117 1350409 1327587 1448655
4160A448655J30652r2734n2080m9168J45184n313j33291j6045j8550M1310j01087
4149A297533M1091O1341O8017o5628j348J59666j73458J28973j37044L6691J66572
4138A582406J81942q9028m6787J31257M9481L6095N0767p8152j03293J03935J29666
4127A948289N1624J04459m2945K16078J85726J03223R4883K05938j67575j86204
4117B513496Q729j36433q3081r6559J24640p793j09832q7937J4981q0849L609
4106B062971P0004j18988K1731m1150J3932J65372o3894P0062q459m901q5031
4095B081649J22049m7516J36026J12086n5496O3782M7294J71474J88l1296J46185
4084B746425q2844P4887K19143N3208K890J5692k0964J33895J58082K0550J90093
$$ plain form
4160 1448655 1579307 1486573 1434493 1385325 1530509 1525196 1391905 1375860 1357310 1398620 1297533
4149 1297533 1338624 1399965 1467982 1402354 1401006 1560672 1387214 1516187 1379143 1415834 1582406
4138 1582406 1764348 1675320 1628533 1759790 1809271 1845366 1896133 1817981 1714688 1818623 1948289
4127 1948289 1999913 2104372 2061427 2277505 2463231 2566454 2661337 2867275 2699700 2513496
4117 2513496 2522225 2385792 2302711 2206152 2330792 2322999 2213167 2125230 2140211 2059362 2062971
4106 2062971 2132975 2013987 2035718 1994568 2008500 2173872 2109978 2180040 2171581 2166680 2081649
4095 2081649 2203698 2156182 2292208 2404294 2348798 2412580 2459874 2631348 2631536 2600240 2746425
4084 2746425 2663581 2738468 2957611 3010819 3013709 3029401 3008437 3142332 3300414 3320964 3511057
4073C511057J95000J46563J15778J17146N708R4312R9160J26941R6926K19096
4063D727687K72905J11815K81504K02606K00301L18532J53968J45292L56682K36654
4053G007946J65346L47808J17571M82060L80753K35181N16991K30237M96940N05660
4043A0486493M08372L72463N72736N21234P60545O80954N66189O18603Q00939
4034A5788528P56600Q43253Q46761N54874Q21597J002636J169447J188283J331598
4025B4303577J456214J651076J850531K104845K518872K602818K956053L440800
4017D2884786L855216M221261M618152N117554N146461M168280K654828N39109
4009G3205647j600015k787322l392464l475903k909600k173851j530043r93515
$$ plain form
4073 3511057 3706057 3852620 3968398 4085544 4091252 4185564 4284724 4411665 4508591 4727687
4063 4727687 5000592 5112407 5393911 5596517 5796818 6115350 6269318 6414610 6771292 7007946
4053 7007946 7173292 7521100 7638671 8120731 8501484 8736665 9253656 9483893 9980833 10486493
4043 10486493 10894865 11267328 11840064 12361298 13121843 13802797 14368986 14987589 15788528
4034 15788528 16545128 17388381 18235142 18790016 19611613 20614249 21783696 22971979 24303577
4025 24303577 25759791 27410867 29261398 31366243 33885115 36487933 39443986 42884786
4017 42884786 46740002 50961263 55579415 60696969 65843430 70011710 72666538 73205647
4009 73205647 71605632 68818310 65425846 61949943 59040343 56866492 55336449 54342934
4001E4342934l33874M63079R91748J677537K382131L121276L682820M309454N397939
3992G6035044O241884P478856Q254062P734385O129673K603725j809048n629479
3984A07039102q064017q986409q684277p532828o367754n264447m521832l607415
3976E4010123k771571k190717j544498j040715m90353M6645P52615J045591J549794
3967D9366914K045977K418029K285888J478034K15150j655427l270289m356154
3959D8528122m332660m556727m023671l422420l100243k713890k305112j970134
3951B2103265j808358j485837j308966j111682j037915q22636q09297n54996q66812
3942A2296766n98412o06202n71694n45578l98489l21203k10122m69194m41811
$$ plain form
4001 54342934 54009060 54472139 55463887 57141424 59523555 62644831 66327651 70637105 76035044
3992 76035044 82276928 89755784 98009846 105744231 111873904 114477629 112668581 107039102
3984 107039102 98975085 89988676 81304399 73771571 67403817 62139370 57617538 54010123
3976 54010123 51238552 49047835 47503337 46462622 45972269 46018914 46771529 47817120 49366914
3967 49366914 51412891 53830920 56116808 57594842 57809992 56154565 52884276 48528122
3959 48528122 44195462 39638735 35615064 32192644 29092401 26378511 24073399 22103265
3951 22103265 20294907 18809070 17500104 16388422 15350507 14527871 13718574 13163578 12296766
3942 12296766 11698354 11092152 10520458 9974880 9576391 9255188 9045066 8575872 8134061
3933H134061k34984k68772j46577l14243k94346l79476m43091l7751j80262j56627
3923E677932j30470k00067j94703j94146k14403j66373J22896k24214m07116N0660
3913D119996o4636m2507j11795n7515k21874j01293k3369m8080j253k71800p9671
3902C096203j95312p6895J05302j96374j46328K9397o4850n2080j16320o7321
3892B315422n5598j32477k7878Q8520j00239j85421J47556j37210r5670J9703
3882A836708j97640L9522R0859j3166k33574K1793J33708k0135o7975j73714Q1319
3871A497705j21886p6398J46276l8138j6277j60757R6415L398q6947L0523p5373
3860A198541j0621J50769j39816M9039o0640L02J25994r249o0334j51286j67057
$$ plain form
3933 8134061 7899077 7630305 7483728 7169485 6875139 6495663 6052572 6014821 5834559 5677932
3923 5677932 5547462 5347395 5152692 4958546 4744143 4577770 4700666 4476452 4069336 4119996
3913 4119996 4055360 4012853 3901058 3843543 3621669 3520376 3497007 3448927 3447674 3175874 3096203
3902 3096203 2900891 2823996 2929298 2732924 2586596 2615993 2551143 2499063 2382743 2315422
3892 2315422 2259824 2127347 2099469 2187989 2087750 1902329 2049885 1912675 1817005 1836708
3882 1836708 1639068 1678590 1769449 1756283 1522709 1544502 1678210 1658075 1590100 1416386 1497705
3871 1497705 1375819 1299421 1445697 1407559 1391282 1230525 1326940 1330338 1243391 1273914 1198541
3860 1198541 1187920 1338689 1198873 1247912 1187272 1187574 1313568 1304319 1243985 1092699 925642
3849I25642N6388K30807J3300n5080j30917l6968p6783J1302J63668j52552o9966
3838H78841O6786j3958j18874J41717J34908j52648j11705j6255J34385J17596
3828A060793k1420K9240r6615j5055N7320q5426q7361M4894k2158j39400J01227
3817H26039O495k2762l5258p104J72199r8211M3459L4493k1018j99308J92474
3806H91498L387l8750J25845j17117j4028Q9390J5284P4188j73462J24017j1668
3795I68584r5960Q4669l0362J68057J359k4516r2620K9575J1639J10043q085j74411
3783I47972Q5347q2647N044J31338R6545K4048L868j40934R3001M1538j4263R109
3771A199966N8150J16815K874j03688K27962j35696J8230p7731j82975k8051O0026
$$ plain form
3849 925642 982030 1212837 1226137 1171057 1040140 1003172 926389 937691 1101359 948807 878841
3838 878841 945627 931669 812795 954512 1089420 936772 825067 808812 943197 1060793
3828 1060793 1039373 1068613 971998 956943 1014263 928837 841476 886370 864212 724812 826039
3817 826039 832534 809772 774514 767410 939609 841398 884857 919350 898332 699024 891498
3806 891498 894885 856135 981980 864863 850835 940225 955509 1029697 856235 980252 968584
3795 968584 872624 957293 926931 1094988 1096347 1071831 979211 1008786 1020425 1130468 1122383 947972
3783 947972 1033319 950672 955716 1087054 1183599 1207647 1211515 1070581 1163582 1205120 1190857 1199966
3771 1199966 1258116 1374931 1377805 1274117 1502079 1366383 1384613 1306882 1123907 1095856 1155882
3760A155882J9534j33083K939m2814M7437q3200j03914K6261J57424N0273q4351
3749A012388J352K17586k67522J47810Q3476p192q5268J8519L5708n8577q7928
3738A010352J48294O665o3564J35874J1048l51382J4055M9822J82803j68202K11686
3727A187451J880o3702l2551P8552j00768j50149Q2378J49114q795p2758J3986
3716A084638P8314N4291p286O2937j37825o7241R3335J18543m4480j25097r1952
3705A018177P4865J13086j2303Q0087P4543j10609m2288J00M4510L4348M7042
3694A321558J62868q6340n7680j02121N2534K4551K23500N5443K6736k5097k34083
3683A361869J37404n3223J26067N6348j34311K9929J7422P3501l2818J7892m0996
$$ plain form
3760 1155882 1175416 1042333 1045272 1002458 1049895 966695 862781 889042 1046466 1096739 1012388
3749 1012388 1013740 1231326 963804 1111614 1195090 1187898 1102630 1121149 1156857 1098280 1010352
3738 1010352 1158646 1165311 1101747 1237621 1248669 897287 911342 961164 1143967 975765 1187451
3727 1187451 1189331 1125629 1093078 1171630 1070862 920713 1003091 1152205 1143410 1070652 1084638
3716 1084638 1162952 1217243 1209957 1272894 1135069 1067828 1161163 1279706 1235226 1110129 1018177
3705 1018177 1093042 1206128 1193825 1273912 1348455 1237846 1195558 1195658 1240168 1274516 1321558
3694 1321558 1484426 1398086 1340406 1238285 1290819 1315370 1538870 1594313 1621049 1595952 1361869
3683 1361869 1499273 1446050 1572117 1628465 1494154 1524083 1541505 1615006 1582188 1600080 1559084
3672A559084J52951J49339p0171l4432j85886N4814M8496K03367j65087M0020
3662A752495K7825p1075k7695J32867Q1692O9742N3175J21903N7571j66304M1529
3651B073725l2240M933M5265l3154M8292M0716J28064n6787o1291N2801K55202
3640B465526j59836O392K34482k4983j86878K08399J48361j14753p380j0591O1147
3629B619886K8715J60741R4683j53194P3068j39701P9551J33795K7010l260K1200
3618B942494m5803l4781j96236K51584J14361j35302j99602K31645M8066q1160
3608B895266K42503o713o2218J9644j10705J00529J24676k05094J36037J8489
3598C152414j39442n2531L0210K6800K20261m014o4257K9738r716j02878M6598
$$ plain form
3672 1559084 1712035 1861374 1791203 1756771 1570885 1625699 1674195 1877562 1712475 1752495
3662 1752495 1780320 1709245 1681550 1814417 1896109 1965851 2019026 2140929 2198500 2032196 2073725
3651 2073725 2041485 2046418 2091683 2058529 2106821 2147537 2275601 2218814 2157523 2210324 2465526
3640 2465526 2305690 2312082 2546564 2521581 2334703 2543102 2691463 2576710 2569330 2558739 2619886
3629 2619886 2648601 2809342 2904025 2750831 2823899 2684198 2763749 2897544 2924554 2921294 2942494
3618 2942494 2896691 2861910 2665674 2917258 3031619 2896317 2696715 2928360 2976426 2895266
3608 2895266 3137769 3131056 3068838 3088482 2977777 3078306 3202982 2997888 3133925 3152414
3598 3152414 3012972 2960441 2990651 3017451 3237712 3233698 3169441 3199179 3189463 3086585 3133183
3587C133183O7954J1523l0057k0423J7398l8200n5340J95209Q272j20268o4965
3576C104286N9355n0902O614N6936l1137j78618R4543l3603k50267K63283M3019
3565C083509r7745K0220J04701p1251j85018m0032M1945O3645J8232m827m8764
3554B884615j63297l3895J31322J3839K3360j20130r7571J06881J6333j47026
3544B614431n6964l2565K7528l4000k6734j04049n2342K6984J86887j04909n7689
3533B386578k6760m0132M9655j0790j42491j3157m1694j05348J36531q6431q7015
3522B018946M3980j78202K619l9856j08501m377k8461J61388M6960Q7671j70565
3511A831602j79774J62389o8530N5854N270K531m9372o3171j8686j6560L656o5952
$$ plain form
3587 3133183 3201137 3212660 3182603 3162180 3179578 3141378 3086038 3281247 3289519 3169251 3104286
3576 3104286 3163641 3112739 3119353 3176289 3145152 2966534 3061077 3027474 2777207 3040490 3083509
3565 3083509 2985764 3005984 3110685 3039434 2854416 2814384 2856329 2919974 2938206 2933379 2884615
3554 2884615 2721318 2687423 2818745 2832584 2855944 2735814 2638243 2745124 2761457 2614431
3544 2614431 2557467 2524902 2552430 2518430 2491696 2387647 2335305 2362289 2549176 2444267 2386578
3533 2386578 2359818 2319686 2369341 2358551 2216060 2202903 2161209 2055861 2192392 2105961 2018946
3522 2018946 2062926 1884724 1887343 1847487 1738986 1734609 1706148 1867536 1914496 2002167 1831602
3511 1831602 1651828 1814217 1745687 1801541 1806811 1809342 1759970 1696799 1678113 1661553 1665209 1599257
3499A599257Q993n5516N1205M0132j40782J0692k08382R0217J44267l9158j58000
3488A342925r0449M62p4326J8309k4321o5217O3509J32945J9023R3867k07633
3477A209094q9499K01939l2195j01487K6655L1722j45547n9656J04476j04341
3467A041161r916N6330n0464p235J8207N9334j53371j42309J74118k3564j18557
3456H43734R5854J81665j39212R2884j77095N6035q858j49818l7224J1475J772
3445G71212k3114O7076r4325L1360j4786L5495m4353m2526L1702J3366r2461J29559
3433G68205j80981l999L2372L6029k8511O0035r3060q2841R7060o6575m2917J58310
3421F53127q917n1708N8319r7749K26548k13716j14577J43640l8903O8762J163
$$ plain form
3499 1599257 1608250 1552734 1603939 1644071 1503289 1513981 1305599 1395816 1540083 1500925 1342925
3488 1342925 1252476 1252938 1178612 1196921 1172600 1107383 1170892 1303837 1322860 1416727 1209094
3477 1209094 1119595 1321534 1289339 1187852 1214507 1246229 1100682 1041026 1145502 1041161
3467 1041161 1031245 1087575 1037111 1029876 1048083 1107417 954046 811737 985855 962291 843734
3456 843734 939588 1121253 982041 1074925 897830 953865 945007 795189 757965 769440 771212
3445 771212 748098 815174 720849 752209 737423 772918 728565 686039 717741 731107 638646 768205
3433 768205 587224 583225 615597 651626 623115 683150 590090 507249 604309 537734 494817 653127
3421 653127 644210 592502 650821 553072 779620 565904 451327 594967 556064 624826 625989
3410F25989J107k1347m1918M5587j34229J83002j19831j12321Q9208p364J15807
3399F23690n1849r9564n1693L7797K4085j1865o7726M4261j8554l091O4324o5757
3387D24058n1858K762J68936m0322o2762m3998K7463Q7457R974l3601P8472k05692
3375C60889o2389p1388J15590Q3646j51947N721J82521R8001j00609j0141o709
3364D43185L587J44785n1700k2365k17574J11410M4665O4115R299j13575J6172
3353D32004q6970M3355l3832j1735o4913o1419L1810J31715K1993j80004P7820
3342B99824J19707L0039j65385M8562J07432j20824N293j28804J61866m208M7492
3331D00994k545j76984L5081R005n6123k2449p8825J0540J1992J47700l9497Q0432
$$ plain form
3410 625989 627096 605749 563831 609418 475189 658191 538360 426039 515247 507883 623690
3399 623690 571841 472277 420584 458381 482466 470601 402875 447136 428582 425491 489815 424058
3387 424058 372200 374962 543898 503576 440814 396816 424279 511736 521710 488109 566581 360889
3375 360889 298500 227112 342702 426348 274401 280122 462643 560644 460035 449894 443185
3364 443185 446772 591557 539857 517492 299918 411328 455993 520108 529407 415832 432004
3353 432004 345034 388389 354557 342822 277909 216490 248300 380015 402008 222004 299824
3342 299824 419531 449570 284185 332747 440179 319355 324648 195844 357710 353502 400994
3331 400994 398449 221465 256546 265551 209428 186979 108154 118694 130686 278386 238889 319321
3319C19321m6128k4087l5512o8609R1366J09403o5803j95597K4299M8765P3218
3308B30636L0269q6042j40130O1968Q5987j33634J22090n5073J03186n218l927
3297B10112N7004J435p3254k0309j083L8971O8599r1076j11467K15744j93893
3286A00783q677J62079p1235k161p0853N5588N0517j08170l6750J11586j05132
3275G7575L9010O3099j7158N7287Q9981k41281Q1829P8616p6479j3920l1998N8488
3263A65049J69996l7663j29790Q2860q5568p3001m7049Q8761n9616M4617M0096
3252A58692l0621L9882N3400o282n1786m9981l0371r0499J24064J16922o4958
3241A68462m9779j007K22381O4586j12122p5368O6624n1665J88481j00098l1963
$$ plain form
3319 319321 273193 249106 213594 144985 236351 345754 279951 84354 108653 157418 230636
3308 230636 260905 174863 34733 96701 182688 49054 171144 116071 219257 214039 210112
3297 210112 267116 268551 195297 174988 173905 212876 281475 190399 78932 294676 100783
3286 100783 92106 254185 182950 180789 109936 165524 216041 107871 71121 182707 77575
3275 77575 116585 179684 162526 219813 309794 68513 150342 228958 152479 138559 106561 165049
3263 165049 335045 297382 167592 250452 164884 91883 44834 133595 73979 118596 158692
3252 158692 128071 167953 221353 215071 163285 113304 82933 -7566 116498 233420 168462
3241 168462 118683 117676 340057 404643 292521 217153 283777 232112 420593 320495 288532
3230B88532M2006n2958J32182l5443j45043m4274j67825J07912J5707R1483J70692
3219D02971K9283k63958p91N5945R4729q5079N242P467j93559J66142J3164K0113
3207B51669P6601r0712j34338Q3591P0603n744L9777n2901q0437Q5261Q184j21169
3195A30385K2658O7900J7823Q9089j73992L3387O3464k2215j79663K6086m9298
3184B5624J09369k2823j53156O40J45425j2689k0747N0978j80924J00007N8762
3173A00466p7068J27455p6094L3899Q7640j36690M8620l8773j0230J09996R3588
3162B62809j52158J3556K5786k6264K4476p9557j7546k3096M7506K7794o8096
3151C5210L9740o5365J02298J190Q195M1196p4410Q7419o5623j02159J91818K7041
$$ plain form
3230 288532 330538 277580 409762 374319 229276 185002 17177 125089 140796 232279 402971
3219 402971 432254 168296 167505 223450 318179 233100 238342 245809 52250 218392 231556 251669
3207 251669 328270 237558 103220 186811 257414 251670 291447 238546 158109 243370 251554 130385
3195 130385 153043 220943 238766 327855 153863 187250 250714 228499 48836 74922 25624
3184 25624 134993 112170 -40986 -40346 105079 92390 71643 122621 -58303 41704 100466
3173 100466 23398 150853 74759 108658 196298 59608 108228 69455 59225 169221 262809
3162 262809 110651 124207 149993 123729 148205 68648 51102 28006 75512 103306 35210
3151 35210 74950 9585 111883 113073 121268 162464 88054 175473 109850 7691 199509 226550
3139B26550k12424j910O0470R3953K3172k66595R0292k0991K6978m6831J02738
3128G5402n8334K4127k8292j7632J21066m7770N9356n7201o0950L664J2139J21857
3116A47432O7982k00270J24455j46050k7883J35269P4247l08784q6599K04471
3106a5730Q4488j09712l9290R9304K1576m5155O809O1537R5591M129j88656J7231
3094g878J4279n8661J04444j00877K4797J1654j3693J00250p8998q3487k2194
3083a10364l1798J78306J39461j24829q4907J3522p1121N1744N7383m7350J07589
3072G7636N1319j43015P6418J3540o200m3419J33334l8866k13034J06990l427
3061A1276R0994j45135N863Q5435P1373m3204J3187O5932J34878j29253j22377
$$ plain form
3139 226550 14126 12216 72686 166639 189811 -76784 13508 -7483 19495 -27336 75402
3128 75402 17068 41195 12903 -4729 116337 68567 127923 70722 9772 13436 25575 147432
3116 147432 215414 15144 139599 -6451 -34334 100935 175182 -133602 -220201 -15730
3106 -15730 68758 -40954 -80244 19060 40636 -4519 2290 63827 159418 163547 -25109 -7878
3094 -7878 6401 -52260 52184 -48693 -23896 -12242 -25935 74315 -4683 -88170 -110364
3083 -110364 -142162 36144 175605 50776 -34131 -20609 -91730 -39986 17397 -29953 77636
3072 77636 128955 -14060 62358 75898 69698 26279 159613 120747 -92287 14703 11276
3061 11276 102270 -42865 -37002 48433 119806 76602 89789 155721 290599 161346 38969
3050C8969J8762k9290j47695R7051O4465N8415o4775j0519Q739k3809Q8487J8465
3038A17265O4840p3680L8880o2733L2116j33900K01011n5656P6351Q4902p9220
3027B10176M9362R5l3384N8434J64367k19206j37792P2618k5164J78641M1226
3016C59373k55081j2657J44658N9091J15188K2634Q0339P9789p89j68549M6999
3005D70995O6495p3973p5543Q926P1750k63205O0732J8983Q2397K951J55034O5381
2993E90923j38980J64608O5011r6033p0686J6739J94359N9239N0649p9814J21209
2982H77224o8171k5703o7059r0412K2144R8420m4744j1001L4940r9521J78429
2971H04546Q4485p1712p274J90575o2223j74775J4850L7104K0413Q5164K21384
$$ plain form
3050 38969 57731 28441 -119254 -22203 42262 100677 35902 25383 34122 10313 98800 117265
3038 117265 182105 108425 147305 84572 116688 -17212 183799 128143 204494 289396 210176
3027 210176 259538 259633 226249 284683 449050 229844 92052 164670 139506 318147 359373
3016 359373 104292 91635 236293 295384 410572 433206 513545 593334 592545 423996 470995
3005 470995 537490 463517 387974 396900 468650 205445 266177 285160 367557 370508 525542 590923
2993 590923 451943 616551 681562 585529 514843 531582 725941 785180 835829 756015 877224
2982 877224 809053 783350 716291 625879 648023 746443 701699 690698 725638 626117 804546
2971 804546 889031 817319 810045 1000620 938397 763622 778472 815576 835989 921153 1142537
2960A142537J2084j44241l061k7080j3046P2913J06746L7724P8687N4809l5999
2949A282073J48547K39566J76653J43829K06127Q7465j91490j63598K41243O3374
2939B233789m1852j293j16142o7029J27858j73738j53966n2750p0290m6168Q0069
2928A718488n2320j37448J05795l8503O6323J91025J58499L9336K6515j99990
2918A877720k92427j94230r0417j49890o0145j85052K3438j28312l0654j40376
2908F29655n0994n4379K29690n6153J8903J21067M6416N9657n9186M4192O0228
2897I89096N9509j20819k9099p1143q9415j44629j22563J4103j09303L9128N2173
2886D67038j38366l8390o4786o8109K49894k48739m3555J67640p5187l0829L4918
$$ plain form
2960 1142537 1154621 1010380 1007319 980239 967193 1040106 1146852 1184576 1263263 1318072 1282073
2949 1282073 1430620 1670186 1846839 1990668 2196795 2284260 2092770 1929172 2170415 2233789
2939 2233789 2191937 2190644 2074502 2007473 2135331 1961593 1807627 1754877 1684587 1638419 1718488
2928 1718488 1666168 1528720 1634515 1596012 1662335 1853360 2011859 2051195 2077710 1877720
2918 1877720 1585293 1391063 1300646 1150756 1090611 905559 928997 800685 770031 629655
2908 629655 578661 524282 753972 697819 716722 837789 884205 943862 884676 928868 989096
2897 989096 1048605 927786 898687 827544 738129 593500 470937 485040 375737 414865 467038
2886 467038 328672 290282 225496 157387 407281 158542 114987 282627 207440 176611 211529
2875B11529l4249j07432J51707O4480n9016j6184K2626J4564K2774K7353j6673
2864B81479k32339J05059L4021N6727k29219j23051J79586p9519Q9027j41447
2854e9676M0543N7916j46527j636J03780N017k3630K5762P7942k660r2522M4125
2842B8434N9389r7370p6622J42397j7624O9812k8147o4495j33235N5942O2573
2831A054K2521Q0470p9793j11980J08964l8423J67448j402k6019j50930k21696
2820b49786J17147l169O3566R6541M9567k00056K9218P626r0498j2211J04240
2809h7815J79469M779l1753o7379p1598L3099M2047O6363R6566j83002p0536l1041
2797a20801l2655n7380J48601L5581J5930M6571R8593j20702m2401K849J70990
$$ plain form
2875 211529 177280 69848 221555 286035 227019 210835 233461 248025 270799 298152 281479
2864 281479 49140 154199 188220 244947 15728 -107323 72263 -7256 81771 -59676
2854 -59676 -19133 38783 -107744 -109380 -5600 -583 -24213 1549 79491 76831 -15691 28434
2842 28434 87823 -9547 -86169 56228 38604 108416 80269 15774 -117461 -61519 1054
2831 1054 23575 104045 24252 -87728 21236 -17187 150261 148859 122840 -28090 -249786
2820 -249786 -132639 -135808 -72242 24299 73866 -126190 -96972 -89346 -179844 -192055 -87815
2809 -87815 91654 96433 64680 -2699 -74297 -41198 849 67212 163778 -19224 -89760 -120801
2797 -120801 -153456 -210836 -62235 -26654 -10724 35847 134440 13738 -28663 -25814 145176
2786A45176L7724n1443p4768l0164N2648j47460N4022j4078L4675P7143l1419
2775E2056o8476J5135M5063j48108K7569J68557K0304j35106k7855J10793P7917
2764A37849m7853l33245K12276Q1489j03544P3886k2321J57064Q5136j80976j11792
2753e2031J30146j50667l5935K5516P098n7675j4775J04431K0494Q9463o874M1821
2741A01012J5484J9967N890j93137q399J2925P9373J31794k39563j03552Q1949
2730i6257j8857m1989J29876j22153N5835J19096N1699j35881q0436J57727j593
2719A7067r0896M1659J16624K559j06352J45520J16168n7010j02712j14480N9366
2708B7513k606J63295J43564j65411p9570j01178k2777J08588M4820J13615J26238
$$ plain form
2786 145176 182900 131457 56689 26525 79173 -68287 -14265 -28343 6332 83475 52056
2775 52056 -16420 -1285 43778 -104330 -76761 91796 112100 -23006 -50861 59932 137849
2764 137849 89996 -243249 -30973 50516 -53028 20858 -1463 155601 240737 59761 -52031
2753 -52031 78115 -72552 -108487 -82971 -75873 -133548 -148323 -43892 -23398 66065 59191 101012
2741 101012 116496 136463 142353 -50784 -59183 -46258 33115 164909 -74654 -178206 -96257
2730 -96257 -115114 -157103 -27227 -149380 -93545 25551 77250 -58631 -139067 18660 17067
2719 17067 -73829 -32170 84454 87013 -19339 126181 242349 185339 82627 -31853 27513
2708 27513 24907 188202 331766 166355 86785 -14393 -37170 71418 116238 229853 356091
2697C56091j94992M816j05697J17748M4564j4705N0626k13637k0784N8483l5946
2686D6567J22367k7020K2318R8489o6510j44509M8611J15257k01061N2088J07525
2675A74122j02965j71335j0382K9006M8450N3363P1487r9713R282J70013j84900
2664a3572L1042M8675p0678J16054N6676j06144R78j1509j34599p4072J49876
2653g273J7117j6733L6242k9259K2808P857j734j07317J59426j01206k4007n7467
2641a01546R7173O2521r0518K3950p2704L491l789k4335N9358O5143j67404J46727
2629a933p5462n4716J9648m9872m752m7173J45662P8791k18115M3077J35999J00673
2617G1827k9044n8636q8444n1102J47236Q4421q5266j83188N3736J6868J08042
$$ plain form
2697 356091 161099 165915 60218 177966 222530 207825 258451 44814 24030 82513 46567
2686 46567 168934 141914 164232 262721 196211 51702 100313 215570 14509 66597 174122
2675 174122 71157 -100178 -110560 -81554 -33104 20259 91746 -7967 1315 171328 -13572
2664 -13572 17470 66145 -4533 111521 168197 62053 63031 51522 -83077 -157149 -7273
2653 -7273 9844 -6889 29353 94 22902 30759 29025 -78292 81134 -20072 -44079 -101546
2641 -101546 -4373 58148 -32370 -8420 -81124 -77633 -81422 -105757 -46399 18744 -148660 -1933
2629 -1933 -77395 -132111 -112463 -162335 -167087 -214260 -68598 10193 -207922 -164845 -28846 71827
2617 71827 42783 -15853 -104297 -155399 -8163 76258 -9008 -192196 -138460 -121592 -13550
2606a3550m9212j70260P0687N351Q9296P8397j0016J2430j38952j01998J35843
2595i1984l8859L9038m9476k1049L0368r18Q2206O5793j22441j27837K16346K4083
2583E270N6768p3299l2300k4014P0628o1183n3073m0248o2072l9316O0905J65375
2571b6559l5495o2648J26324j34964J17066n8162j19726J36320O2322o9670N1950
2560a3242m122j40292k3550R8178n6048J84161o3530L8353o4670k23485K69893
2549A646l1391m2602K911j13941J17738M6417O01j12356N0292J48147k8440l6623
2537B399k03556K34350J08717n5270j08659q1811p0812M6133J47743r9353j15287
2526a95406q5532J24793j00680J03099o5340m9649M3956j03887J65856j2072O5682
$$ plain form
2606 -13550 -62762 -233022 -162335 -156984 -67688 10709 693 13123 -125829 -227827 -91984
2595 -91984 -130843 -91805 -141281 -162330 -131962 -132880 -50674 15119 -107322 -235159 -18813 5270
2583 5270 62038 -11261 -43561 -67575 3053 -58130 -111203 -151451 -213523 -252839 -191934 -26559
2571 -26559 -62054 -124702 1622 -133342 -16276 -74438 -194164 -57844 4478 -65192 -13242
2560 -13242 -17364 -157656 -181206 -83028 -139076 45085 -18445 19908 -44762 -268247 1646
2549 1646 -29745 -72347 -69436 -183377 -65639 -19222 -18621 -130977 -80685 67462 39022 2399
2537 2399 -201157 33193 141910 86640 -22019 -103830 -174642 -128509 19234 -80119 -195406
2526 -195406 -280938 -156145 -256825 -153726 -219066 -268715 -224759 -328646 -162790 -174862 -109180
2515a09180Q3799j87238J24477l2492N0734j13933m9843J36393k168J49231j24223
2504g4443q8952M9764Q8743K1305l4790j69483J878J34727J34166m988j48690
2493i0763j06997J75392L3257N2990j23300J9777k0768J8299o7221J49437K2086
2482F2189j19665p3463j02315R9387q5638p8635K17269J09888j57628J05279R4812
2471G1480j43492p2235J16399Q2811k6040j88418j270J49980k2052N9993l4714
2460g558l8448q951l0303J01537j55604q5455J20009O429J55559j19328O4112
2449A999K6379n0086n0907k7127p1470o3569J03046J8076l1114J06448L9569N0393
2437E1637j9149q7644m7876N1161J43260k08696P4944j04027n4509O0528k9343
$$ plain form
2515 -109180 -25381 -212619 -88142 -120634 -69900 -183833 -233676 -97283 -99451 49780 -74443
2504 -74443 -163395 -113631 -24888 -3583 -38373 -207856 -205978 -71251 62915 57927 -90763
2493 -90763 -197760 -22368 10889 63879 -59421 -39644 -60412 -42113 -109334 40103 62189
2482 62189 -57476 -130939 -233254 -133867 -219505 -298140 -80871 29017 -128611 -23332 71480
2471 71480 -72012 -144247 -27848 54963 28923 -159495 -160765 -10785 -32837 27156 -7558
2460 -7558 -46006 -54957 -85260 16277 -139327 -224782 -104773 -98344 57215 -62113 1999
2449 1999 28378 -21708 -72615 -99742 -171212 -234781 -131735 -113659 -144773 -38325 1244 51637
2437 51637 32488 -55156 -103032 -51871 91389 -117307 -42363 -146390 -200899 -140371 -169714
2426a69714j1719N3432J26670N1061n9296J84560j68026q6235j0718L30J76062
2415H6407j59905M8264k7425P5591j37561O0181O2855Q1043q7674N9569n0302
2404A1043j29187M235J0707l5450P2384k6366N2974p8568l9937q0894m1232J72884
2392a07407J06225Q0323j87673J08424K9515j25326j46150Q6881L4970M1058q966
2381h8126l5059j09099P6054k5876O4498N6523r186J50527j11969P5157l475q1633
2369d1664O7830o656q2114N5843q4135j7440R7024r103M1223m2067j10580O291
2357a25548M7700L7472J16116j28286O6907k38628L545J42654O9417j03871j2127
2346a24649j25852L0663N3287l1040J52183N9202j32117J6K269Q9227L2747J12887
$$ plain form
2426 -169714 -181433 -128001 -1331 49730 -9566 174994 6968 -79267 -89985 -89655 86407
2415 86407 -73498 -25234 -52659 22932 -114629 -54448 8407 89450 1776 61345 11043
2404 11043 -118144 -113909 -103202 -138652 -66268 -92634 -39660 -118228 -158165 -239059 -280291 -107407
2392 -107407 -1182 79141 -108532 -108 29407 -95919 -242069 -155188 -120218 -79160 -88126
2381 -88126 -123185 -232284 -156230 -182106 -117608 -61085 -70271 80256 -31713 43444 39969 -41664
2369 -41664 26166 19510 -62604 -6761 -90896 -108336 -11312 -20415 20808 -21259 -131839 -125548
2357 -125548 -77848 -40376 75740 -52546 14361 -224267 -220722 -78068 -8651 -112522 -124649
2346 -124649 -250501 -219838 -166551 -197591 -45408 13794 -118323 -118307 -116038 -26811 5936 118823
2334A18823l1401j83565J03988j10315K5298R7237l0742K9456j33216M3943k6762
2323i7256l0101J81089j27240j5770k9274k3135L1113l7588J03553Q3771k6977
2312A2185K47201o0705k23434q8604q1682j3011O5653N1021L8839N7716J31090
2301A36269k12713M8146J02661j05339j7515O3818M4622r8644J75559n2417q1203
2290C244M1903J9743M6801k00615R1765J58749l3255j44061K13895L1365j66852
2279F2682r9887j29517J68735P7737j1738o0311P1538L5146q6151r7172K40796
2268A71858k16161M9796J2535l2519J30748j24549m1693J49115j49659L5433J9185
2257D089K9766K6655Q7636j18424j46164L3009o1189K26839k818j14019N5204
$$ plain form
2334 118823 87422 -96143 7845 -102470 -77172 20065 -10677 18779 -114437 -70494 -97256
2323 -97256 -127357 53732 -73508 -89278 -118552 -141687 -110574 -148162 -44609 39162 12185
2312 12185 259386 198681 -24753 -113357 -195039 -208050 -142397 -91376 -52537 5179 136269
2301 136269 -76444 -28298 74363 -30976 -48491 15327 59949 -38695 136864 84447 3244
2290 3244 45147 64890 111691 -88924 2841 161590 128335 -15726 198169 229534 62682
2279 62682 -37205 -166722 2013 79750 68012 7701 79239 114385 28234 -68938 171858
2268 171858 -44303 5493 18028 -14491 116257 -8292 -49985 99130 -50529 -15096 4089
2257 4089 33855 60510 148146 29722 -116442 -83433 -144622 82217 79399 -34620 20584
2246B0584P3624q2334q4180J9377J14146m2075p543J17687o8212n8518L6497r3689
2234e4636P8850m1288R4704n8594P5161P954j27996O5966O3773j23458p2725L2769
2222e9520O5632J02955l7640R7327M452r2975Q9272J1922P1551j43377O5703p1697
2210A03605M6189N814r7758L633M7817k6682R5908j39623j00327J70936R594p1278
2198D7828P2998N665R621j45184Q5161J19792j13585o9043J47339r3919j20166
2187e3493J48701J38725K016j75905L790p0673m3640J64110K6967Q6049R583J27577
2175C63807j80862l5170J33558l0516k0836j0337N3255j21228l775j60756J65048
2164A52188J00O0495J5009M3671j12476J12627R279Q6034L0997o8671J07845R3785
$$ plain form
2246 20584 94208 11874 -72306 -52929 61217 19142 11599 129286 61074 2556 39053 -54636
2234 -54636 24214 -17074 77630 19036 94197 102151 -25845 40121 103894 -19564 -92289 -59520
2222 -59520 6112 109067 71427 168754 173206 80231 169503 181425 252976 109599 175302 103605
2210 103605 149794 155608 57850 61483 109300 82618 178526 38903 -61424 109512 119106 47828
2198 47828 120826 126491 136112 -9072 76089 195881 82296 13253 160592 66673 -53493
2187 -53493 95208 233933 235949 60044 63834 -6839 -50479 113631 140598 226647 236230 363807
2175 363807 182945 147775 281333 250817 229981 219644 272899 151671 147896 -12860 152188
2164 152188 152288 212783 227792 271463 158987 271614 280893 366927 397924 329253 437098 530883
2152E30883j32358k7094J61465P2458N1800n6772N6544J1339J42476J02602l1019
2141H82324N994q6141o0055J68156l1206J10658K6918O4941P8508k3804J45605
2130A281898j82151J71456j1810M3132J52963J75686J9696J70662J02218P12J42937
2119B067399J05591L2918J54939J99026J42902J40064k02086L02132L56972K30610
2109C530467K23432J24893J56836J90191J55578L86787K87602L17773N19989K74203
2099F167751M72411M51846M28915N23944O40413Q89760J030864J112388J095932
2090A2814224J473321J695988J778013K795641L686604M498726K664896j114078
2082C0293335l302792m057689l839643k906555k217814j765475j551039j249284
$$ plain form
2152 530883 398525 371431 532896 605354 657154 600382 656926 668265 810741 913343 882324
2141 882324 888318 802177 742122 910278 879072 989730 1016648 1081589 1160097 1136293 1281898
2130 1281898 1099747 1271203 1259393 1302525 1455488 1631174 1650870 1821532 1923750 1924462 2067399
2119 2067399 2172990 2205908 2360847 2559873 2702775 2842839 2640753 2942885 3299857 3530467
2109 3530467 3753899 3878792 4035628 4225819 4381397 4768184 5055786 5373559 5893548 6167751
2099 6167751 6640162 7092008 7520923 8044867 8685280 9575040 10605904 11718292 12814224
2090 12814224 14287545 15983533 17761546 20557187 24243791 28742517 31407413 30293335
2082 30293335 26990543 22932854 19093211 16186656 13968842 12203367 10652328 9403044
2074I403044j092884p94167o41118q90309o37001m33630m98703k18545k69707
2065C926980m71591l28037j19208k26306k64637j94205r2188m0684j45844m3839
2055B000441j65408j39903r6644J039j54982m7162j91067J0815N5192j37854j24779
2044A009688L8921j134n482N3635j22582l4227L4089l0489m1379n8764l4662j14839
2032F92775l5729O277M4285J6021j71532j31838J41801J46243j36138j53518n744
2021D12903q6873J7959n3137J44470n5188l4661K5315N0337j8190J9814J41379
2010E64128l6926j66025l5542q925n5534p0401j36959Q6513k9692m5175R7236
1999A62698J33071j33762j18115N8874m0852l2893O2150o5914P9294J22384n2640
$$ plain form
2074 9403044 8310160 7515993 6874875 5984566 5347565 4913935 4415232 4196687 3926980
2065 3926980 3455389 3127352 3008144 2781838 2517201 2322996 2230808 2190124 2044280 2000441
2055 2000441 1835033 1695130 1598486 1599525 1444543 1397381 1206314 1217129 1272321 1134467 1009688
2044 1009688 1048609 1047475 1041993 1095628 973046 938819 972908 942419 901040 842276 807614 692775
2032 692775 657046 663323 707608 723629 552097 420259 562060 708303 572165 418647 412903
2021 412903 326030 343989 290852 435322 380134 345473 370788 421125 402935 422749 564128
2010 564128 527202 361177 325635 316710 261176 190775 53816 140329 110637 65462 162698
1999 162698 295769 162007 43892 102766 61914 29021 91171 25257 104551 226935 174295
1988A74295j59429m5329P4659N3366L3660j3286k0498R4566k58958M0315Q6468
1977E9829R7921o6434J800L673l9094M2719R106K12051q5357r3891j5462J02427
1965B29288j9843p4067k51585k00510J46890J41671K01j05886K41394j05730J38176
1954A39999l8604j09716P1590K2122k8492M555Q9211j22786r927j1132k4468m1163
1942e8811J63611k6197p6249k1368J54441m0429j66689O270Q5253J27844l4513
1931A13163J8547O177L4425p2268q5171M6511O062q2177q9051L3911p6355J527
1919a44699N691R3895n5275j2261P7129K0526O3401j11899J03704P0940p9509
1908C1643O9462k5251p3278j38845J30571o96M1740r2325Q4703L6460R0542j62533
$$ plain form
1988 174295 14866 -30463 44196 97562 131222 117936 97438 192004 -66954 -26639 59829
1977 59829 157750 91316 93116 96789 57695 100414 109520 321571 236214 142323 126861 229288
1965 229288 209445 135378 -116207 -316717 -169827 -28156 -27955 -133841 107553 1823 139999
1954 139999 101395 -8321 63269 85391 56899 61454 150665 27879 17952 6820 -17648 -58811
1942 -58811 104800 78603 2354 -19014 135427 94998 -71691 -65421 19832 147676 113163
1931 113163 131710 137887 172312 100044 14873 61384 67446 -14731 -103782 -69871 -146226 -144699
1919 -144699 -139008 -45113 -100388 -112649 -35520 -14994 48407 -63492 40212 111152 31643
1908 31643 101105 75854 2576 -136269 -5698 -6394 35346 -56979 27724 64184 154726 -7807
1896g807m2755L8152R1992J7261j01786J18314o3492o41P0502J1443R874k9078
1884A11979K9289N1603j65107M928P2556J3683N2585k385j46370J6764P3863n4458
1872E8930j55182Q2133J6222L4494q1557P0149R895o8656j39777N7008J12195
1861d146J991q2203j55633P1676N5142J21406n8229p0080m894k2102o8225J82083
1849c3214L4235J7988o6321m5928M6245K932K9802J7606n9772j16889R6651L3070
1837d3595L4332j2442n5605j16431P3133R2775j4100o7337J66437n2259j28799
1826a23891P4407j851J07004o3608j61371Q6726Q4904R1370l3066m0886j06850
1815h7112M6780J66513o9142l85p8241n5481O1504p5708j11325M8136K5325p5903
$$ plain form
1896 -7807 -50562 -12410 79582 96843 -4943 113371 49879 49238 119740 131183 141057 111979
1884 111979 141268 192871 27764 32692 105248 118931 171516 169131 22761 39525 113388 58930
1872 58930 -96252 -14119 2103 36597 -44960 25189 35084 -33572 -173349 -116341 -4146
1861 -4146 -2155 -84358 -239991 -168315 -113173 8233 -49996 -120076 -124970 -147072 -215297 -33214
1849 -33214 1021 19009 -47312 -93240 -46995 -44063 -14261 3345 -56427 -173316 -76665 -43595
1837 -43595 -9263 -21705 -77310 -193741 -120608 -27833 -41933 -109270 57167 4908 -123891
1826 -123891 -49484 -51335 55669 -7939 -169310 -82584 2320 93690 60624 19738 -87112
1815 -87112 -40332 126181 57039 56654 -21587 -77068 -15564 -91272 -202597 -154461 -129136 -205039
1803b05039K69570k9093K7544l5658K2481j13504j9501R0995L8827M4984j70033
1792g8427o798J76179l8384j76001L4957l086j75586O0129J37251O3898l2134
1781c8002l5159L2181R0512j00370R2603J17738k10096n3626q5237O2746R4335
1770c2375o3332k4445K2273n0597J22590j30070O6369R3747j12603J05510J12427
1759A09494j0652k21097L5325J121j34469J16176J17739k71338N8948J29653j69479
1748b38579M3555J14251J07252j19394K951j1498N6812L9799m0198j39301q487
1737a92837J52641M5508k53014M0695N4549J45749p1566K2321m1033n8356J6028
1726a39315R2676o6598n8649K52089r7520n6603j18715J9675J01516k9845J82745
$$ plain form
1803 -205039 64531 35438 62982 27324 49805 -63699 -83200 7795 46622 91606 -78427
1792 -78427 -85225 90954 52570 -123431 -88474 -91560 -267146 -207017 -69766 -5868 -38002
1781 -38002 -73161 -40980 49532 -50838 41765 159503 -50593 -104219 -189456 -126710 -32375
1770 -32375 -95707 -120152 -97879 -148476 -25886 -155956 -89587 4160 -108443 -2933 109494
1759 109494 98842 -122255 -86930 -85809 -220278 -104102 13637 -257701 -198753 -69100 -238579
1748 -238579 -195024 -80773 26479 -92915 -89964 -101462 -44650 -4851 -45049 -184350 -192837
1737 -192837 -40196 5312 -247702 -207007 -152458 -6709 -78275 -55954 -96987 -155343 -139315
1726 -139315 -46639 -113237 -171886 80203 -17317 -73920 -192635 -172960 -71444 -101289 81456
1715H1456k13966o3670O2268o9526K2216P350j8176J03175J39372O69j17028l3018
1703i8878J08866k9579j19610O6367k0020n1472Q4131l1280Q8493q110j55709
1692a66801P9624j94093J61091K9586J9036J3113q9136r561k1534J4916J18994
1681d4765k7478r4830r3153L2173J02371j35216J34943Q6106J28487j49294P0518
1670I862p4506J51718K0499j34671r3978n2054O4029k1055P2859l7274j03382
1659a97953O8207j8718P9183Q8176J73201n8166j41998q5695O6473m7571j05026
1648a79887K0290J36355o8095o931K8259J982O3965M2062J3382J4051m8135N426
1636B2724r551M4082j89047Q1620O6368N5370O131j39728l5288M9382J38236n1891
$$ plain form
1715 81456 -132510 -196180 -133912 -203438 -181222 -173872 -192048 -88873 50499 51168 -65860 -98878
1703 -98878 9988 -19591 -139201 -72834 -92854 -144326 -60195 -91475 -2982 -11092 -166801
1692 -166801 -87177 -281270 -120179 -90593 -71557 -58444 -147580 -157141 -178675 -163759 -44765
1681 -44765 -72243 -167073 -260226 -228053 -125682 -260898 -125955 -39849 88638 -60656 9862
1670 9862 -64644 87074 107573 -27098 -121076 -173130 -109101 -130156 -57297 -94571 -197953
1659 -197953 -129746 -148464 -69281 18895 192096 133930 -8068 -93763 -27290 -74861 -179887
1648 -179887 -159597 -23242 -91337 -98268 -70009 -68027 -4062 38000 51382 65433 17298 22724
1636 22724 13173 57255 -131792 -50172 16196 71566 77697 -62031 -97319 -47937 90299 38408
1624C8408J6612K7586j17361j08766J33896j04014O7017m9596m5434P99N73N0316
1612h9964K6613O4338J05106J064l6534p3344r9951o6832j02469J50234N3231
1601f8508J56169j4574k488j25551m4440j17040N6449J80221n5184M3656o2556
$$ plain form
1624 38408 55020 82606 -34755 -143521 -9625 -113639 -46622 -96218 -141652 -140853 -140280 -89964
1612 -89964 -63351 987 106093 107157 70623 -2721 -102672 -169504 -271973 -121739 -68508
1601 -68508 87661 73087 70599 -54952 -99392 -216432 -159983 20238 -34946 8710 -53846
$$ [...]
##END NTUPLES=NMR SPECTRUM
##END=
