##TITLE=1H_CA-9291-2
 CDCl3
 8 sc, 
 4.10.2024
##JCAMPDX= 6.0         $$ Bruker NMR JCAMP-DX V2.0
##DATA TYPE= NMR SPECTRUM
##DATA CLASS= NTUPLES
##ORIGIN= UXNMR, Bruker Analytische Messtechnik GmbH
##OWNER= root
$$ XWIN-NMR		Version 3.5
$$ Fri Oct  4 14:13:58 2024 Russian Standard Time (UT+4h)  she@DPX200
##.OBSERVE FREQUENCY= 200.1318
##.OBSERVE NUCLEUS= ^1H
##.ACQUISITION MODE= SIMULTANEOUS
##.ACQUISITION SCHEME= undefined
##.AVERAGES= 8
##.DIGITISER RES= 18
##SPECTROMETER/DATA SYSTEM= spect
##.PULSE SEQUENCE= zg30
##.SOLVENT NAME= CDCl3
##.SHIFT REFERENCE= (INTERNAL, CDCl3, 0, 21.0561)
##AUDIT TRAIL= $$ (NUMBER, WHEN, WHO, WHERE, WHAT)
$$ ##TITLE= Audit trail, XWIN-NMR		Version 3.5
$$ ##JCAMPDX= 5.01
$$ ##ORIGIN= Bruker BioSpin GmbH
$$ ##OWNER= she
$$ F:/spectra/data/she/nmr/H-F/1/pdata/1/auditp.txt
$$ ##AUDIT TRAIL=  $$ (NUMBER, WHEN, WHO, WHERE, WHAT)
(   1,<2024-10-04 14:12:45.89 +0400>,<she>,<DPX200>,
      <created by zg, POWCHK disabled, PULCHK disabled
       configuration hash MD5:
       00 E9 B6 7A A2 85 ED C7 34 08 36 98 17 FE 4E 26
       data hash MD5: 16K
       EB 81 FA BE 95 03 3B A4 82 BD 83 9D EE C9 A1 BE>)
(   2,<2024-10-04 14:12:49.87 +0400>,<she>,<DPX200>,
      <Start of raw data processing
       efp BC_mod = 2 LB = 0.24 FT_mod = 6 PKNL = 1 PHC0 = -26341.82 PHC1 = 9.38747 SI = 16K 
       data hash MD5: 16K
       13 AD 2A 99 9B C5 73 76 4D 6D 25 4E 78 90 12 89>)
(   3,<2024-10-04 14:13:11.40 +0400>,<she>,<DPX200>,
      <pk PHC0 = -7.669611 PHC1 = 11.8 
       data hash MD5: 16K
       03 57 30 38 2C 9F EB 62 25 40 38 D2 7A B2 07 AC>)
(   4,<2024-10-04 14:13:14.79 +0400>,<she>,<DPX200>,
      <abs ABSG = 5 
       data hash MD5: 16K
       A7 1F F0 62 AC C1 A6 84 BC 73 2A A7 CB 94 3F 35>)
$$ ##END=
$$ 
$$ hash MD5
$$ 4D 2E 59 A7 D5 6D C5 F1 69 AD 4A B8 83 A9 4B F9
##$RELAX= 
##$RELAX= 
##$RELAX= 
##$RELAX= 
##$RELAX= 
##$RELAX= 
$$ Bruker specific parameters
$$ --------------------------
##$DU= <F:/spectra>
##$EXPNO= 1
##$NAME= <H-F>
##$PROCNO= 1
##$TYPE= <nmr>
##$USER= <she>
##$AMP= (0..31)
100 100 100 100 100 100 100 100 100 100 100 100 100 100 100 100 100 100 
100 100 100 100 100 100 100 100 100 100 100 100 100 100 
##$AQSEQ= 0
##$AQ_mod= 1
##$AUNM= <au_zg>
##$AUTOPOS= <>
##$BF1= 200.13
##$BF2= 200.13
##$BF3= 200.13
##$BF4= 200.13
##$BF5= 200.13
##$BF6= 200.13
##$BF7= 200.13
##$BF8= 200.13
##$BYTORDA= 1
##$CFDGTYP= 0
##$CFRGTYP= 5
##$CHEMSTR= <none>
##$CNST= (0..31)
1 1 145 1 1 1 1 1 1 1 1 1 1 1 1 1 1 1 1 1 1 1 1 1 1 1 1 1 1 1 1 1 
##$CPDPRG= <>
##$CPDPRG1= <>
##$CPDPRG2= <>
##$CPDPRG3= <>
##$CPDPRG4= <mlev>
##$CPDPRG5= <mlev>
##$CPDPRG6= <mlev>
##$CPDPRG7= <mlev>
##$CPDPRG8= <mlev>
##$CPDPRGB= <>
##$CPDPRGT= <>
##$D= (0..31)
0 1.2 0 0 0 0 0 0 0 0.06 0 0.03 0 0 0 0 0.0002 0 0 0 0 0 0 0 0 0 0 0 0 
0 0 0 
##$DATE= 1728036765
##$DBL= (0..7)
120 120 120 120 120 120 120 120 
##$DBP= (0..7)
150 150 150 150 150 150 150 150 
##$DBP07= 0
##$DBPNAM0= <>
##$DBPNAM1= <>
##$DBPNAM2= <>
##$DBPNAM3= <>
##$DBPNAM4= <>
$$ [...]
##$SUBNAM3= <"">
##$SUBNAM4= <"">
##$SUBNAM5= <"">
##$SUBNAM6= <"">
##$SUBNAM7= <"">
##$SUBNAM8= <"">
##$SUBNAM9= <"">
##$SW= 24.0689170037331
##$SWIBOX= (0..15)
0 0 2 0 0 0 0 0 0 0 0 0 0 0 0 0 
##$SW_h= 4816.95568400771
##$TD= 16384
##$TD0= 1
##$TE= 0
##$TE2= 300
##$TE3= 300
##$TEG= 300
##$TL= (0..7)
0 120 120 120 120 120 120 120 
##$TP= (0..7)
150 150 150 150 150 150 150 150 
##$TP07= 0
##$TPNAME0= <>
##$TPNAME1= <>
##$TPNAME2= <>
##$TPNAME3= <>
##$TPNAME4= <>
##$TPNAME5= <>
##$TPNAME6= <>
##$TPNAME7= <>
##$TPOAL= (0..7)
0.5 0.5 0.5 0.5 0.5 0.5 0.5 0.5 
##$TPOFFS= (0..7)
0 0 0 0 0 0 0 0 
##$TUNHIN= 0
##$TUNHOUT= 0
##$TUNXOUT= 0
##$USERA1= <user>
##$USERA2= <user>
##$USERA3= <user>
##$USERA4= <user>
##$USERA5= <user>
##$V9= 5
##$VALIST= <valist>
##$VCLIST= <CCCCCCCCCCCCCCC>
##$VD= 0
##$VDLIST= <DDDDDDDDDDDDDDD>
##$VPLIST= <PPPPPPPPPPPPPPP>
##$VTLIST= <TTTTTTTTTTTTTTT>
##$WBST= 1024
##$WBSW= 4
##$XGAIN= (0..3)
0 0 0 0 
##$XL= 0
##$YL= 0
##$YMAX_a= 623796
##$YMIN_a= -405868
##$ZGOPTNS= <>
##$ZL1= 120
##$ZL2= 120
##$ZL3= 120
##$ZL4= 120
##$ABSF1= 21.02818
##$ABSF2= -3.040955
##$ABSG= 5
##$ABSL= 3
##$ALPHA= 0
##$AQORDER= 0
##$ASSFAC= 0
##$ASSFACI= 0
##$ASSFACX= 0
##$ASSWID= 0
##$AUNMP= <proc_1d>
##$AZFE= 0.1
##$AZFW= 0.1
##$BCFW= 0
##$BC_mod= 2
##$BYTORDP= 0
##$COROFFS= 0
##$CY= -3
##$DATMOD= 1
##$DC= 0
##$DFILT= <>
##$DTYPP= 0
##$F1P= 0
##$F2P= 0
##$FCOR= 1
##$FTSIZE= 16384
##$FT_mod= 6
##$GAMMA= 0
##$GB= 0
##$INTBC= 1
##$INTSCL= 3.70164e-10
##$ISEN= 128
##$LB= 0.24
##$LEV0= 0
##$LPBIN= 0
##$MAXI= 10000
##$MC2= 0
##$MEAN= 0
##$ME_mod= 0
##$MI= 1.114404
##$NCOEF= 0
##$NC_proc= -6
##$NLEV= 6
##$NOISF1= 3.799351
##$NOISF2= 2.8
##$NSP= 0
##$NTH_PI= 0
##$NZP= 0
##$OFFSET= 21.05609
##$PC= 1
##$PHC0= -26349.49
##$PHC1= 21.18747
##$PH_mod= 1
##$PKNL= yes
##$PPARMOD= 0
##$PSCAL= 0
##$PSIGN= 0
##$REVERSE= no
##$SF= 200.129994523808
##$SI= 16384
##$SIGF1= 3
##$SIGF2= 2
##$SINO= 5.538805
##$SIOLD= 16384
##$SREGLST= <1H.CDCl3>
##$SSB= 0
##$STSI= 16384
##$STSR= 0
##$SW_p= 4816.95568400771
##$SYMM= 0
##$S_DEV= 0
##$TDeff= 16384
##$TDoff= 0
##$TI= <>
##$TILT= no
##$TM1= 0
##$TM2= 0
##$TOPLEV= 0
##$USERP1= <user>
##$USERP2= <user>
##$USERP3= <user>
##$USERP4= <user>
##$USERP5= <user>
##$WDW= 1
##$XDIM= 16384
##$YMAX_p= 412067667
##$YMIN_p= -957619
$$ End of Bruker specific parameters
$$ ---------------------------------
##NTUPLES= NMR SPECTRUM
##VAR_NAME=  FREQUENCY,     SPECTRUM/REAL,   SPECTRUM/IMAG
##SYMBOL=    X,             R,               I
##VAR_TYPE=  INDEPENDENT,   DEPENDENT,       DEPENDENT
##VAR_FORM=  AFFN,          ASDF,            ASDF
##VAR_DIM=   16384,         16384,           16384
##UNITS=     HZ,            ARBITRARY UNITS, ARBITRARY UNITS
##FACTOR=    0.29402158847633, 1,            1
##FIRST=     4213.955056564, 0,              0
##LAST=      -603.000627443714, 0,           0
##MIN=       -603.000627443714, -957619,     0
##MAX=       4213.955056564, 412067667,      0
$$ Real data points
##PAGE= N=1
##DATA TABLE= (X++(R..R)), XYDATA
$$ [...]
7785A111228P9830Q2969j36300Q3255n5993r9807J93311j34653Q4769m735q5203
$$ 1111228 1191058 1274027 1137727 1220982 1164989 1065182 1258493 1123840 1208609 1203874 1118671
7774A118671J8947J27004j9941M711o745Q5931r6516q3106O0566o478J22827k1544
$$ 1118671 1137618 1264622 1244681 1249392 1242647 1328578 1232062 1148956 1209522 1203044 1325871 1304327
7762A304327J21072j86098n7058J3009q3180O2448J36842P9453j1953q0414J4827
$$ 1304327 1425399 1239301 1182243 1195252 1112072 1174520 1311362 1390815 1378862 1298448 1313275
7751A313275M5864O8079j6523J37276j32246J1168q6264J16651J22853j63351
$$ 1313275 1359139 1427218 1410695 1547971 1415725 1426893 1340629 1457280 1580133 1416782
7741A416782Q594M1430N9038j5077O983o2790j1076Q1598l4014L0072j911m6210
$$ 1416782 1425376 1466806 1525844 1510767 1517750 1454960 1443884 1525482 1491468 1521540 1519629 1473419
7729A473419L4225J04503K9250M9601J01580n9556p3196j1989L8604p7389p7350
$$ 1473419 1507644 1612147 1641397 1690998 1792578 1733022 1659826 1647837 1686441 1609052 1531702
7718A531702k9732L23100O4051q477m501q1995L8161P9289l0230N8081O697J34546
$$ 1531702 1501970 1825070 1889121 1880644 1876143 1794148 1832309 1911598 1881368 1939449 1946146 2080692
7706B080692o8154n3815J13508p5437K6994q3369Q5037J68890n5555k8227J03365
$$ 2080692 2012538 1958723 2072231 1996794 2023788 1940419 2025456 2194346 2138791 2110564 2213929
7695B213929l0810N6496J21213j10881q1353J28919J3382J18128J6111J6045j4251
$$ 2213929 2183119 2239615 2360828 2249947 2168594 2297513 2310895 2429023 2445134 2461179 2446928
7684B446928j7134P4550l8690Q3182q6348J39858p0145K6242p7636Q6698K12669
$$ 2446928 2429794 2504344 2465654 2548836 2462488 2602346 2532201 2558443 2480807 2567505 2780174
7673B780174j45499m9797J10357J03887N6537L8103K9142j09938J3144K01759
$$ 2780174 2634675 2584878 2695235 2799122 2855659 2893762 2922904 2812966 2826110 3027869
7663C027869n8867M6499R8142M4001k5107J2520M9189J41618m401p2642O1424
$$ 3027869 2969002 3015501 3113643 3157644 3132537 3145057 3194246 3335864 3331463 3258821 3320245
7652C320245Q8393k5514N2281J04309Q2235J1761L5287k6465j05257J32548J38335
$$ 3320245 3408638 3383124 3435405 3539714 3621949 3633710 3668997 3642532 3537275 3669823 3808158
7641C808158J5632R029J19083Q4184o019M2567p0984N6122P7266N0075J28834
$$ 3808158 3823790 3832819 3951902 4036086 4030067 4072634 4001650 4057772 4135038 4185113 4313947
7630D313947J50619L6260k3155p8071P4641P2998P8838L4392J57866p9849j060
$$ 4313947 4464566 4500826 4477671 4399600 4474241 4547239 4626077 4660469 4818335 4738486 4737426
7619D737426J19034J0378J18043Q7295N9277O1948J53681P9664P0529L3598p042
$$ 4737426 4856460 4866838 4984881 5072176 5131453 5193401 5347082 5426746 5497275 5530873 5523831
7608E523831J63842Q5249l279L0639J21767j8038J46388K19111J43745j19404
$$ 5523831 5687673 5772922 5769643 5800282 5922049 5904011 6050399 6269510 6413255 6293851
7598F293851J51805J30464J09259J66302R9471R0804Q8304J48469L8203J88339
$$ 6293851 6445656 6576120 6685379 6851681 6951152 7041956 7130260 7278729 7316932 7505271
7588G505271N7657J33576K45275Q7035J04517K83787K382J35813J41228J61899
$$ 7505271 7562928 7696504 7941779 8028814 8133331 8417118 8419500 8555313 8696541 8858440
7578H858440P4057R9419K79532J12634J36716J89790K80266Q5323K23904K79647
$$ 8858440 8932497 9031916 9311448 9424082 9560798 9750588 10030854 10116177 10340081 10619728
7568A0619728O6256K17263K27269K90836J80346K95393P4688J28151M60525L21147
$$ 10619728 10685984 10903247 11130516 11421352 11601698 11897091 11971779 12099930 12560455 12881602
7558A2881602K04956K84680L07725M93512M27233L43672K97688L84107M44768
$$ 12881602 13086558 13371238 13678963 14172475 14599708 14943380 15241068 15625175 16069943
7549A6069943O10545P08329N62713N56593O12375N52334N14260K87142M56293
$$ 16069943 16680488 17388817 17951530 18508123 19120498 19672832 20187092 20474234 20930527
7540B0930527J64550K65150L53879K64526L30383M61540N91856N08135N75499
$$ 20930527 21095077 21360227 21714106 21978632 22309015 22770555 23362411 23870546 24446045
7531B4446045M32598O09283O36105O84437R39012O47674P51870R76827J013246
$$ 24446045 24878643 25487926 26124031 26808468 27747480 28395154 29147024 30123851 31137097
7522C1137097R24420Q28849J116843J148564J097939J199998J145141J087055
$$ 31137097 32061517 32890366 34007209 35155773 36253712 37453710 38598851 39685906
7514C9685906J342401J417491J313771J457287J508484J544656J516603J671211
$$ 39685906 41028307 42445798 43759569 45216856 46725340 48269996 49786599 51457810
7506E1457810J815651J811431J971047K051074K124451J917397K400473K222305
$$ 51457810 53273461 55084892 57055939 59107013 61231464 63148861 65549334 67771639
7498F7771639K372700K622728K660903K564605K832144L063603L115766L162766
$$ 67771639 70144339 72767067 75427970 77992575 80824719 83888322 87004088 90166854
7490I0166854L362352L410451L555963L999510L860812M104615M091066M403654
$$ 90166854 93529206 96939657 100495620 104495130 108355942 112460557 116551623 120955277
7482A20955277M424767M433913M594336M638563M613234M505327M486992M431295
$$ 120955277 125380044 129813957 134408293 139046856 143660090 148165417 152652409 157083704
7474A57083704M048161L727251L536969L034759K433593J846481J180047M62984
$$ 157083704 161131865 164859116 168396085 171430844 173864437 175710918 176890965 177353949
7466A77353949l02108r85257j823629k296057k920692l722827l980271m286577
$$ 177353949 177051841 176066584 174242955 171946898 169026206 165303379 161323108 157036531
7458A57036531m591565m803562n078655n036309n110958n067198m952408m969980
$$ 157036531 152444966 147641404 142562749 137526440 132415482 127348284 122395876 117425896
7450A17425896m847441m555172m415069m217874m071670m085342l646562l583833
$$ 117425896 112578455 108023283 103608214 99390340 95318670 91233328 87586766 84002933
7442H4002933l412080l396273k991161k904602k820776k749693k538564k411180
$$ 84002933 80590853 77194580 74203419 71298817 68478041 65728348 63189784 60778604
7434F0778604k263995k245525k146850j832257j978662j639772j886904j550576
$$ 60778604 58514609 56269084 54122234 52289977 50311315 48671543 46784639 45234063
7426D5234063j409839j605986j361981j476786j228423j134925j156138j116832
$$ 45234063 43824224 42218238 40856257 39379471 38151048 37016123 35859985 34743153
7418C4743153j138515j010900j031555r59653j028357r38885p86910q28241p62340
$$ 34743153 33604638 32593738 31562183 30602530 29574173 28635288 27848378 27020137 26257797
7409B6257797o12637p76742r86147m78578n07333o10609q01749n23687m28927
$$ 26257797 25645160 24868418 23882271 23403693 22896360 22285751 21484002 20960315 20531388
7400B0531388o24356l99488n31436n38943n75767l53935n11781l99711n30934
$$ 20531388 19907032 19507544 18976108 18437165 17861398 17507463 16995682 16595971 16065037
7391A6065037m65211j75370n17781j87158o02287k14791l00812k53218l43607
$$ 16065037 15599826 15424456 14906675 14719517 14117230 13902439 13601627 13348409 13004802
7382A3004802l34753l83463k56276l21551j97790j16988l48880j91213l75662
$$ 13004802 12670049 12286586 12030310 11708759 11510969 11393981 11045101 10853888 10478226
7373A0478226k22101k28691q7112j18468j42315k97872l68438k2228j84109j14179
$$ 10478226 10256125 10027434 9940322 9821854 9679539 9381667 9013229 8991001 8806892 8692713
7363H692713r398l22240r4989j97936j67880j59593j42638j05146j40566k19882
$$ 8692713 8683315 8361075 8266086 8068150 7900270 7740677 7598039 7492893 7352327 7132445
7353G132445k78991j35473o767j09824n2250j12511k36942j35457k922L5256j21313
$$ 7132445 6853454 6717981 6711214 6601390 6549140 6436629 6199687 6064230 6061308 6096564 5975251
7342E975251k19046q2289k89509o0056k23156l2602J2854L75J4184j63207j02346
$$ 5975251 5756205 5673916 5384407 5324351 5101195 5068593 5081447 5081822 5096006 4932799 4830453
7331D830453j0692j09930r0907n5747P4372k27228l7380k45627R6934l0305j10039
$$ 4830453 4819761 4709831 4618924 4563177 4637549 4410321 4372941 4127314 4224248 4193943 4083904
7320D083904Q0316j16612o0660o9326O0609r7627q7631J0453j58996j28843j09204
$$ 4083904 4164220 4047608 3986948 3917622 3978231 3880604 3792973 3803426 3644430 3515587 3406383
7309C406383j89672Q4869L5562Q3712k22728m3506m8767j08290r4898Q1755q3800
$$ 3406383 3216711 3301580 3337142 3420854 3198126 3154620 3105853 2997563 2902665 2984420 2900620
7298B900620k7173L0753k4203j55237k3563q9000K069k5261j23432J71456j51259
$$ 2900620 2873447 2904200 2879997 2724760 2701197 2612197 2614266 2589005 2465573 2637029 2485770
7287B485770M9294j03357l4066J7949r6922r4366q3779n0751j50996K33153L4547
$$ 2485770 2535064 2431707 2397641 2415590 2318668 2224302 2140523 2089772 1938776 2171929 2206476
7276B206476L0618l6869j04276n644l3289j13979j238J8282j83919p449N5191
$$ 2206476 2237094 2200225 2095949 2090305 2057016 1943037 1941799 1960081 1776162 1768713 1823904
7265A823904J8581l7923p8938q5909j08648m6076K29769n8436r7029j01734J00075
$$ 1823904 1842485 1804562 1725624 1639715 1531067 1484991 1714760 1656324 1559295 1457561 1557636
7254A557636J3467K3605R0075J2096k09210o1294M3581J632m5586L8115J176J2661
$$ 1557636 1571103 1594708 1684783 1696879 1487669 1426375 1469956 1471588 1426002 1464117 1465293 1477954
7242A477954k5642K7628m0944N2472j77695J9355J08183r9501n7283k16555J90857
$$ 1477954 1452312 1479940 1438996 1491468 1313773 1333128 1441311 1341810 1284527 1067972 1258829
7231A258829p3074J5372q9543Q1731j18378Q9294p379m5787q7046m2726j11534
$$ 1258829 1185755 1201127 1111584 1193315 1074937 1164231 1156852 1111065 1024019 981293 869759
7220H69759q09Q2480Q8203Q4135l0916p6681l5034l6377o1637p6816O8822K7021
$$ 869759 868950 951430 1039633 1123768 1092852 1016171 981137 944760 883123 806307 875129 902150
7208I02150j17566J94178j50046r8060P9064j24194O3397O9590j8052J0358N0593
$$ 902150 784584 978762 828716 730656 809720 685526 748923 818513 800461 810819 861412
7197H61412j33814J8228N3629J47064k2092j21889p3877l8232J61564M2946n2253
$$ 861412 727598 745826 799455 946519 924427 802538 728661 690429 851993 894939 842686
7186H42686o5153k7035R3725O6508q5056k03064L851J22276J699J12912l8156
$$ 842686 777533 750498 844223 910731 825675 622611 626462 748738 750437 863349 825193
7175H25193q6008J10815j270J0425l2510j33783O6573l8809O4618J09065n4925
$$ 825193 739185 850000 848730 859155 826645 692862 759435 720626 785244 894309 839384
7164H39384j57983O5727k5004J02185M9285j24918r1052K1050j09193O957M7161
$$ 839384 681401 747128 722124 824309 873594 748676 657624 678674 569481 576438 623599
7153F23599J16088J13966J19769J23969r9943j23289M5963J6957J452R0558r649
$$ 623599 739687 853653 973422 1097391 997448 874159 920122 937079 938531 1029089 1019440
7142A019440R2913r6912j50340j2721r1199P2066m5746l0584L5174k51108j9523
$$ 1019440 1112353 1015441 865101 852380 761181 833247 787501 756917 792091 540983 521460
7131E21460J50033K9825m9622k4151K219L78582r9114p8243O1078j2236n6302
$$ 521460 671493 701318 651696 627545 629764 1008346 909232 830989 892067 879831 823529
7120H23529j71383o5969J43103j16362r3226l1540J13085J520M8524J1358j24721
$$ 823529 652146 586177 729280 612918 519692 488152 601237 602757 651281 662639 537918
7109E37918J20404n7994j10257m1382J37956P9287j18278n7717O6151J93902q150
$$ 537918 658322 600328 490071 448689 586645 665932 547654 489937 556088 749990 741840
7098G41840j46367L5185J10878k9115m1392J61977k63915J62992L1600m353p9552
$$ 741840 595473 630658 741536 712421 671029 833006 569091 732083 763683 759330 679778
7087F79778M2970p7019O7098J15540k5346K6370p0185J13499q6132l8937q803
$$ 679778 722748 645729 712827 828367 803021 829391 759206 872705 786573 747636 738833
7076G38833R5967K12801l3509r2082j1462N1174K1584M5783j49916Q6481K07353
$$ 738833 834800 1047601 1014092 922010 910548 961722 983306 1029089 879173 965654 1173007
7065A173007P985Q4991N5152p3294J05558J02488J81780J57090o8007O5979R5048
$$ 1173007 1180992 1265983 1321135 1247841 1353399 1455887 1637667 1794757 1726750 1792729 1887777
7054A887777R913J9314L13159J98852J17200M81360K54600L94709L96951N86553
$$ 1887777 1897690 1917004 2230163 2429015 2546215 3027575 3282175 3676884 4073835 4660388
7044D660388R89435J107978J610045K192630j64850j616083j751746j367948q73362
$$ 4660388 5649823 6757801 8367846 10560476 10395626 8779543 7027797 5659849 4786487
7035D786487p76433n74439o04900k25405m02014k37727j73390k88885O766l7657
$$ 4786487 4010054 3435615 2830715 2605310 2203296 1965569 1792179 1503294 1510060 1472403
7025A472403L865j67806k11006r3363J15934n0497j29685k6687k26929J66080
$$ 1472403 1476268 1308462 1097456 1004093 1120027 1069530 939845 913158 686229 852309
7015H52309j84599q516j33295m235M9576J8221j53652J8425Q4128j1045n1865
$$ 852309 667710 659194 525899 521664 571240 589461 435809 454234 538362 527317 475452
7004D75452P4007R9068j86374o2096p20o9471K18454j68501O1902M8833o4506
$$ 475452 549459 648527 462153 400057 399337 329866 548320 379819 441721 490554 426048
6993D26048j3962J20282R758n285n9022p3325j9651R9214K5828j27452P2257j24313
$$ 426048 412086 532368 542126 536841 477819 404494 384843 484057 509885 382433 454690 330377
6981C30377p9926N7117Q2123J65436r1774k1174m0102Q9072J2108n4451j32676
$$ 330377 250451 307568 389691 555127 463353 442179 402077 491149 503257 448806 316130
6970C16130J31429O1622K2472l872o1033l3381R2193n7030j11447M3696K4329
$$ 316130 447559 509181 531653 527781 466748 433367 525560 468530 357083 400779 425108
6959D25108j274O7388M8510o3867J95191j12080j9099o1144K2944j8640m9317
$$ 425108 423834 491222 539732 475865 671056 558976 539877 478733 501677 483037 433720
6948D33720J32151o7414k85439P8428J14404j16580j0954p8589J16143j5184n1631
$$ 433720 565871 498457 213018 291446 405850 289270 278316 199727 315870 300686 249055
6937B49055o5488Q2317Q2191l5914M7970j81070R0509j23362Q7133P8824p6324
$$ 249055 183567 265884 348075 312161 360131 179061 269570 146208 233341 312165 235841
6926B35841o7644J3962P6439j22145q093J13487J6084n0505o2249k6924o4556
$$ 235841 168197 182159 258598 136453 128360 241847 257931 207426 145177 118253 53697
6915E3697J9899k0622R6949j4159j0469j8594J4792n7633o0467K0194L8546j17426
$$ 53697 73596 52974 149923 135764 125295 106701 121493 63860 3393 23587 62133 -55293
6903e5293Q3059J21928m1534M0637R2455J60799j62704j25484L5444L9146L892
$$ -55293 27766 149694 108160 148797 241252 402051 239347 113863 149307 188453 192345
6892A92345k20988J35627P0415m1529p8461Q8188j2354M6105r7649J57278k1203
$$ 192345 -28643 106984 177399 135870 57409 145597 133243 179348 81699 238977 217774
6881B17774n6220O7018n9975l249j96627R1451L5459N7656k5850k4181j17225
$$ 217774 161554 228572 168597 165348 -31279 60172 95631 153287 127437 103256 -13969
6870a3969Q6043J27490M719o2052K5821N234j19994m4107J59584J07366j02670
$$ -13969 72074 199564 204283 142231 168052 173286 53292 9185 168769 276135 173465
6859A73465l2045j36869O0324Q9065j6451q2237o134M7798l1962J9209J8667j45989
$$ 173465 141420 4551 64875 153940 137489 55252 49118 96916 64954 84163 102830 -43159
6847d3159J19513J2747O6675K8024k1857K2914o5037J80198q9681k2827K2331
$$ -43159 76354 89101 155776 183800 161943 184857 119820 300018 210337 187510 209841
6836B09841J21767J4387j63626k7907O2456Q703K7974n1920j11207N3656O5811
$$ 209841 331608 345995 182369 154462 216918 225621 253595 201675 90468 144124 209935
6825B09935j50088J25287K8698l1264j27457l3316K03867l2488j4700N0897O2888
$$ 209935 59847 185134 213832 182568 55111 21795 225662 193174 178474 229371 292259
6814B92259O987q9302N3624j80528L4229j5781Q2557m636J5671O7531m1041L6838
$$ 292259 299246 209944 263568 83040 117269 101488 184045 179409 195080 262611 221570 258408
6802B58408J87068q1072j72590R7662j02649j45186j37495R7078M3562q1256o104
$$ 258408 445476 364404 191814 289476 186827 41641 -95854 1224 44786 -36470 -42574
6791d2574K9020o7811n6480J76815Q5849n3682J30818J26041r46r5727K9221o254
$$ -42574 -13554 -81365 -137845 38970 124819 71137 201955 327996 327050 231323 260544 254290
6779B54290m0993R957L6916k7218r5515k9082p5836L7288j58636P7315L0352M5562
$$ 254290 213297 223254 260170 232952 137437 108355 32519 69807 -88829 -11514 18838 64400
6767F4400O0569o037j15371q235N8238j2761J67524p1431L6745n8853J70311j19354
$$ 64400 124969 118932 3561 -4674 53564 40803 208327 136896 173641 114788 285099 165745
6755A65745r0225J44816m3321j41647J00228J89726j1267j38731L1465r9516l0921
$$ 165745 75520 220336 177015 35368 135596 325322 314055 175324 206789 107273 76352
6744G6352o703M6421J99695L5638j5886r6614j66771l4828K80250O0289j02290
$$ 76352 69649 116070 315765 351403 335517 238903 72132 37304 317554 377843 275553
6733B75553q3782L6147j41723M3853J57973L8078k674p1274r9953N741K6120M9866
$$ 275553 191771 227918 86195 130048 288021 326099 323425 252151 152198 157939 184059 233925
6721B33925J66005n4748J8280M6791L3425P9206L9675J37223R5430M3044n0589
$$ 233925 399930 345182 363462 410253 443678 522884 562559 699782 795212 838256 787667
6710G87667j05180j4015k16256J9141j35619k5007J92358k13913J9107r5423p4854
$$ 787667 682487 668472 452216 471357 335738 310731 503089 289176 308283 212860 138006
6699A38006J43095j11750j36389J22001K7684N4398M206M1242j47165N3346M1999
$$ 138006 281101 169351 32962 154963 182647 237045 241251 282493 135328 188674 230673
6688B30673n6477J7960j9230J1699p654j3714q4728J65706j07053J28123K6439
$$ 230673 174196 192156 172926 184625 176971 163257 78529 244235 137182 265305 291744
6677B91744j44636j13689J12007K6499j82088M362O6021l3460R519l9578N45P3675
$$ 291744 147108 33419 145426 171925 -10163 -5801 60220 26760 36279 -3299 -2754 70921
6665G0921p3m9469o6746M2761j2404l8407M3253J3319J07262P8133l1962P6513
$$ 70921 70848 21379 -45367 -2606 -15010 -53417 -10164 3155 110417 188550 156588 233101
6653B33101j22117j69657J36562P8816M6503j28919J54377n2169j12299O8243
$$ 233101 110984 -58673 77889 156705 203208 74289 228666 176497 64198 132441
6643A32441o3517r5437L3356J56299j42358M4935o686N2138l408j94015J40623
$$ 132441 68924 -26513 6843 163142 20784 65719 59033 111171 107763 -86252 54371
6632E4371j12074n9774J81813J19836P5355j21976j21179r0141J44862j66m0552
$$ 54371 -57703 -117477 64336 184172 259527 137551 16372 -73769 71093 70927 30375
6621C0375o3683J17427M2208n7079K3364J05391L713L4970l1996k1908N2811K3501
$$ 30375 -33308 84119 126327 69248 92612 198003 201716 236686 204690 182782 235593 259094
6609B59094R3789L7432p4626P9222o8334k24654M7902J4955j8796r8681M9390
$$ 259094 352883 390315 315689 394911 326577 101923 149825 164780 145984 47303 96693
6598I6693r0143Q2088J08511j75585L2875N1360r424n6728Q2776k2754M5016m0265
$$ 96693 6550 88638 197149 21564 54439 105799 96375 39647 122423 99669 144685 104420
6586A04420j3102K3937n6556N5262J03232p3548n3143L3472j35040L2051P7837
$$ 104420 91318 115255 58699 113961 217193 143645 90502 123974 -11066 20985 98822
6575I8822n8181o3139N5462p7992O8903K45185j14335j39177N0028J04235J17006
$$ 98822 40641 -22498 32964 -45028 23875 269060 154725 15548 65576 169811 286817
6564B86817K3506j25701j23313l5389J56126j9012q1765j5033k7160J32898L5069
$$ 286817 310323 184622 61309 25920 182046 163034 81269 66236 39076 171974 207043
6553B07043k37552K21899K4675o1528J1414l6265j15826p0273M891J26591J88091
$$ 207043 -30509 191390 216065 154537 165951 129686 13860 -56413 -51522 75069 263160
6542B63160k25919O1483J51905o0194q7891j11893J32724N9575k15383R9106o3698
$$ 263160 37241 98724 250629 190435 102544 -9349 123375 182950 -32433 66673 2975
6531B975J45392K27691k06486j45484L501n847m1925N3124K33325j70018j42281
$$ 2975 148367 376058 169572 24088 27589 21742 -20183 32941 266266 96248 -46033
6520d6033R0988Q1203P4170j32350K3697K2101l5071j09743J0515J56900j73829
$$ -46033 44955 126158 200328 67978 91675 113776 78705 -31038 -20523 136377 -37452
6509c7452Q1694K576r2458J24210n5976J8961J4439j37298J24805n2737m2633
$$ -37452 44242 46818 -45640 78570 22594 41555 55994 -81304 43501 -9236 -51869
6498e1869J853p5757L1307K97670j93229p9292l8840p1513M9719K63638p4227
$$ -51869 -50016 -125773 -94466 203204 9975 -69317 -108157 -179670 -129951 133687 59460
6487E9460r7058m6029J2593J22789q7444m6920N2577j88671J01403Q7463L2959
$$ 59460 -37598 -83627 -71034 51755 -35689 -82609 -30032 -218703 -117300 -29837 3122
6476C122K9225q6335j30396l8173J76940j45729Q6211P8561M2911j2644j25624
$$ 3122 32347 -53988 -184384 -222557 -45617 -191346 -105135 -26574 16337 3693 -121931
6465a21931N1375M4646O0069P1318j38568l4659Q0783k4381q4271P1492M6984
$$ -121931 -70556 -25910 34159 105477 -33091 -67750 13033 -11348 -95619 -24127 22857
6454B2857n9288j00594Q2262n4898m5442K3925k364J0793J13889k8578L6220j06441
$$ 22857 -36431 -137025 -54763 -109661 -155103 -131178 -133542 -122749 -8860 -37438 -1218 -107659
6442a07659K031k5564J74210o2871m1933R1958M5714r9822J19640j05124n8929
$$ -107659 -105628 -131192 43018 -19853 -61786 30172 75886 -23936 95704 -9420 -68349
6431f8349J61952M4885O97p119k1841L8433j26737q5657J04429q775n2619N0060
$$ -68349 93603 138488 139185 132066 110225 148658 21921 -63736 40693 31918 -20701 29359
6419B9359q0741Q8862Q1041q6535Q891k7548J74545l3571o3176l8421q3981J09596
$$ 29359 -51382 37480 118521 31986 40877 13329 187874 154303 91127 52706 -31275 78321
6407G8321j7907j02620m9898P6092j108J3388J15234n2949j15336L7730K019n8205
$$ 78321 60414 -42206 -92104 -16012 -17120 -3732 111502 58553 -56783 -19053 -17034 -75239
6395g5239J52120N0183j07893J05734q2858K0377K6171l0582J2349O6077M2182
$$ -75239 76881 127064 19171 124905 42047 62424 88595 58013 70362 136439 178621
6384A78621k57030j5008r7948J37124J34796Q183j14696r6205J19883P8661k20706
$$ 178621 -78409 -93417 -191365 -54241 80555 88738 -25958 -122163 -2280 76381 -144325
6373a44325M9825N125K25034m0643r6389q6204M919P0053k05485J03719J32002
$$ -144325 -94500 -89375 135659 95016 -1373 -87577 -82658 -12605 -218090 -114371 17631
6362A7631p955J4465r2244l0354p1223J23896r609q7244J55570j8237J0943P333
$$ 17631 9676 24141 -68103 -98457 -169680 -45784 -55393 -142637 12933 -5304 5639 12972
6350A2972l629l6015Q5756M3964p6231q0181L0906l5748J00495m5734p268J01058
$$ 12972 9343 -26672 59084 103048 26817 -53364 -22458 -58206 42289 -3445 -10713 90345
6338I0345m6473j7177P971m4997q0290n1690j62567J27445O0655N817k5972J1696
$$ 90345 43872 26695 34666 -10331 -90621 -142311 -304878 -177433 -116778 -110961 -136933 -125237
6326a25237P3741M9284j90004N9541K1526L8181J3952j8454P7540m0685n5152
$$ -125237 -51496 -2212 -192216 -132675 -111149 -72968 -59016 -77470 70 -40615 -95767
6315i5767n0964P6335p262k27156J40304J39842J05328j28818n2500K1779o3150
$$ -95767 -146731 -70396 -77658 -304814 -164510 -24668 80660 -48158 -100658 -78879 -142029
6304a42029N0814k0210J07320j5921j35143O5922K02661Q2228j46161j29308K9856
$$ -142029 -91215 -111425 -4105 -20026 -155169 -89247 113414 195642 49481 -79827 -49971
6293d9971J48718n9340l7464j04432j52856L01451p7975J21046j54203r7624o5223
$$ -49971 98747 39407 1943 -102489 -255345 46106 -31869 89177 -65026 -162650 -227873
6282b27873K46141M5472p6058j65101J0587O7786J1683P9505N4568M1888p0055
$$ -227873 18268 63740 -12318 -177419 -166832 -99046 -87363 -7858 46710 88598 18543
6271A8543K4719P1733n6350o9029l782p5976M875J09304j56196J0914J0685m7785
$$ 18543 43262 114995 58645 -10384 -14166 -90142 -85267 24037 -132159 -121245 -110560 -158345
6259a58345K07258Q8912J4406j28727m85l7373Q9744j6716N2478m9365r6751J1661
$$ -158345 48913 137825 152231 23504 23019 -14354 75390 58674 111152 61787 -34964 -23303
6247b3303J86692P4522o8026l1336L581Q6330j68195J18917r8853o5883J21465
$$ -23303 163389 237911 169885 138549 142130 228460 60265 179182 80329 14446 135911
6236A35911P1687J23717j05772j46986K20415l0940j45610J35094m9753J04003
$$ 135911 207598 331315 225543 78557 298972 268032 122422 257516 207763 311766
6226C11766J47568j20556n1846Q8051r837J02779P36o1664j52394P9908J53425
$$ 311766 459334 338778 286932 374983 365146 467925 468661 406997 254603 334511 487936
6215D87936l9723k9755L2497J8760j18417j53279r2624J12922l2659o840J06584
$$ 487936 448213 418458 450955 469715 351298 198019 105395 218317 185658 178818 285402
6204B85402J5020K7852k235J49932j29654L3941j175n8385R7354M5556k4892l6373
$$ 285402 300422 328274 326039 475971 346317 380258 379083 320698 418052 463608 438716 402343
6192D02343O2942L7925N7838m2142J44617J12244Q2784J54086J6633p6348J3694
$$ 402343 465285 503210 561048 518906 663523 775767 858551 1012637 1029270 952922 966616
6181I66616J92710M8789K0865o2653J16978K01595J86016O1876J02506J60182
$$ 966616 1159326 1208115 1228980 1166327 1283305 1484900 1670916 1732792 1835298 1995480
6171A995480J14066L66089K19294L61400L33781L10808M91641N70943N8910j02046
$$ 1995480 2109546 2475635 2694929 3056329 3390110 3700918 4192559 4763502 4822412 4720366
6161D720366j78398l17869l16974j93168J39114J5005J48587K68562M22429N35611
$$ 4720366 4541968 4224099 3907125 3713957 3853071 3868076 4016663 4285225 4707654 5243265
6151E243265O08260P09334O61637N19762J03931l58492q59074q61261o62034o18534
$$ 5243265 5851525 6560859 7222496 7742258 7846189 7487697 6628623 5767362 5105328 4486794
6141D486794l66973j94153k59713j53484K0680Q0935L70738K60869J92985M4620
$$ 4486794 4119821 3925668 3665955 3512471 3533151 3614086 3984824 4245693 4438678 4483298
6131D483298k28478m20167l82877n73881l49397k76165l89967j71585q1903k42402
$$ 4483298 4254820 3834653 3451776 2877895 2528498 2252333 1862366 1690781 1608878 1366476
6121A366476j76729k5898j51560J965j51638j37716p6372k7993o2676P5033J55123
$$ 1366476 1189747 1163849 1012289 1014254 862616 724900 648528 620535 557859 632892 788015
6110G88015j42894k026q9338l287N8177Q4836q8351j21780n7302j9947L4106k315
$$ 788015 645121 643095 553757 550470 608647 693483 605132 483352 426050 406103 440209 437894
6098D37894P5465j55186j0431m9274l8034P2551P5518l8537n888J38811K9346
$$ 437894 513359 358173 347742 298468 260434 332985 408503 369966 364078 502889 532235
6087E32235O4382o0588j53367p0751P9793O81j3403L3608j93804O1261J14661
$$ 532235 596617 536029 382662 311911 391704 392385 378982 412590 218786 280047 394708
6076C94708L42L1868J65767R9618j48932k3910j54752J61723N7902j87168L6966
$$ 394708 395050 426918 592685 692303 543371 519461 364709 526432 584334 397166 434132
6065D34132M2726j9735o5736K5987j18924J50266j05235P7757o0888J5926L9351
$$ 434132 476858 457123 391387 417374 298450 448716 343481 421238 360350 376276 415627
6054D15627R9286l069k699R9796j33443J19625Q6382j39851J90068Q8787r5334
$$ 415627 514913 511844 509145 608941 475498 595123 681505 541654 731722 820509 725175
6043G25175J14893p29J10954O5088p0305k5017J28647k6712J36504J60389l5660
$$ 725175 840068 839339 950293 1015381 945076 920059 1048706 1021994 1158498 1318887 1283227
6032A283227J31181m9189k860J46834j32358J74404J28927M803O8435m6246l39
$$ 1283227 1414408 1365219 1362359 1509193 1376835 1551239 1680166 1684969 1753404 1707158 1706819
6021A706819P0110J10904R9690Q2311l6824O7792N9622N5035Q1400N1876J0148
$$ 1706819 1776929 1887833 1987523 2069834 2033010 2100802 2160424 2215459 2296859 2348735 2358883
6010B358883M4546L10744P8287Q1191L18427L65848K13437N1211L00335L82996
$$ 2358883 2403429 2714173 2792460 2873651 3192078 3557926 3771363 3822574 4122909 4505905
6000D505905L92438J49359M68824L62562K91290M50683P4513K93994J83567K33899
$$ 4505905 4898343 5047702 5516526 5879088 6170378 6621061 6695574 6989568 7173135 7407034
5990G407034K50868K40357o1550Q7130J41207L95206R3649m65034j67427j77381
$$ 7407034 7657902 7898259 7836709 7923839 8065046 8460252 8553901 8088867 7921440 7744059
5980G744059k70253J9385l59460m92814k05154k35334l80643k77183k32091l06803
$$ 7744059 7473806 7493191 7133731 6640917 6435763 6200429 5819786 5542603 5310512 5003709
5970E003709k70019k97215l02626k63497k02757l59638k29087m08574k61167j91788
$$ 5003709 4733690 4436475 4133849 3870352 3667595 3307957 3078870 2670296 2409129 2217341
5960B217341l4653j98110k52914j75471j80545p2929k6993j92250K0360j21938
$$ 2217341 2182688 1984578 1731664 1556193 1375648 1302719 1275726 1083476 1103836 981898
5950I81898l8301p7564p924p2399q391J1531j64734K37j7547Q048j46447J03244
$$ 981898 943597 866033 858109 785710 777319 788850 624116 624353 606806 614854 468407 571651
5938E71651L042o4433j45337J45940k02743N8477N5584j56879N0740J23851M952
$$ 571651 574693 510260 364923 510863 308120 366597 422181 265302 316042 439893 444845
5927D44845n1229K3635n6417P9729M4820j9944n196o7355J44882o9200j06160
$$ 444845 393616 417251 360834 440563 485383 465439 460243 392888 537770 468570 362410
5916C62410m4926J8919j26584K9898Q7401m5965L4408j54560j21235K660J788
$$ 362410 317484 336403 209819 239717 327118 281153 315561 161001 39766 42426 44214
5905D4214J40708l8791j04721M8417n381n9072p0848K12432q8112J0179r1588
$$ 44214 184922 146131 41410 89827 84446 25374 -45474 166958 78846 89025 -2563
5894b563j2136L2531N8666k1245k8235J7363j78468J41247J43573r1803K5923
$$ -2563 -14699 17832 76498 55253 27018 44381 -134087 7160 150733 58930 84853
5883H4853o6192j19O8938n4837p1218J5190j231j0764P7171j73009N3018J4688
$$ 84853 18661 18542 87480 32643 -38575 -23385 -24616 -35380 41791 -131218 -78200 -63512
5871f3512l1213N480J07520P5658k45228J9876N0860j52578N6969J4605R9158
$$ -63512 -94725 -89245 18275 93933 -151295 -131419 -80559 -233137 -176168 -161563 -62405
5860f2405J5005o7451p529q5568j5219k9489J00401o310J4775N8265n3929k8343
$$ -62405 -47400 -114851 -122380 -207948 -223167 -252656 -152255 -158565 -143790 -85525 -139454 -167797
5848a67797M0345L3883j7805r5703J05703q0673M6185n760M0421P1995j67134
$$ -167797 -127452 -93569 -111374 -207077 -101374 -182047 -135862 -141622 -101201 -29206 -196340
5837a96340j8467J40916L3514K3790K7142l8342p4441R1824j17917k2698J5579
$$ -196340 -214807 -73891 -40377 -16587 10555 -27787 -102228 -10404 -128321 -151019 -135440
5826a35440P2376L9760r790q394l8454P3847j21496r6405J00519M2085N6082k9871
$$ -135440 -63064 -23304 -33094 -41488 -79942 -6095 -127591 -223996 -123477 -81392 -25310 -55181
5814e5181m4223J09131K7723j42573N8858L9758j15959J02745n3289q8965M5670
$$ -55181 -99404 9727 37450 -105123 -46265 -6507 -122466 -19721 -73010 -161975 -116305
5803a16305n2793O3458l1934L1672l7041J10522J6613k5135J4349m8371P4729
$$ -116305 -169098 -105640 -137574 -105902 -142943 -32421 -15808 -40943 -26594 -74965 -236
5792b36l7674j4156j41575K7352N1638M3286j27111L0375N5065l2897l2891L5516
$$ -236 -37910 -52066 -193641 -166289 -114651 -71365 -198476 -168101 -113036 -145933 -178824 -143308
5780a43308k9339N5529m8699P4860O4739q1665q2109j47081P1538N6141n2550
$$ -143308 -172647 -117118 -165817 -90957 -26218 -107883 -189992 -337073 -265535 -209394 -261944
5769b61944J22374j3345k3681J55875m7188j36983O417J10583m24j73769m1252
$$ -261944 -139570 -152915 -176596 -20721 -67909 -204892 -198475 -87892 -88316 -262085 -303337
5758c03337J05683J24590j5522l4491o3251p3958K2236O4386J0717m9899m4909
$$ -303337 -197654 -73064 -88586 -123077 -186328 -260286 -238050 -173664 -162947 -212846 -257755
5747b57755M6381N0420L5339k3247O8169P6417j4427q0034j14514M6128M1096
$$ -257755 -211374 -160954 -125615 -148862 -80693 -4276 -18703 -98737 -213251 -167123 -126027
5736a26027q0576P4804r3910R9986j40662Q6610R7234P1476r9124j16454J29114
$$ -126027 -206603 -131799 -225709 -125723 -266385 -179775 -82541 -11065 -110189 -226643 -97529
5725i7529j09084J09983j3208P6860k4426o6364M1558j9578M7011J10658j6731
$$ -97529 -206613 -96630 -109838 -32978 -57404 -123768 -82210 -101788 -54777 55881 39150
5714C9150o7566q0642R2550L5716O0775j23565r0228N9288o9418K22792j23587
$$ 39150 -28416 -109058 -16508 19208 79983 -43582 -133810 -74522 -143940 78852 -44735
5703d4735j00930N9098R1815r3590j09837J80569j04474o0614P1797K3496J3374
$$ -44735 -145665 -86567 5248 -88342 -198179 -17610 -122084 -182698 -110901 -87405 -74031
5692g4031P351o1929K9590n2476p5527O0063K1436J8901J7799p3519K8152n8233
$$ -74031 -66680 -128609 -99019 -151495 -227022 -166959 -145523 -126622 -108823 -182342 -154190 -212423
5680b12423J56677M3609r8108n3490R3408J25758k49464P3342J75301k9928q423
$$ -212423 -55746 -12137 -110245 -163735 -70327 55431 -194033 -120691 54610 24682 16259
5669A6259K2483j08827q9378j50602R0490J51949j0820O5045Q5529l2577j05659
$$ 16259 38742 -70085 -159463 -310065 -219575 -67626 -78446 -13401 72128 39551 -66108
5658f6108n6496J5103N0108k1153j2038j1032j0812J46559O7949k56509M2587
$$ -66108 -122604 -107501 -57393 -78546 -90584 -101616 -112428 34131 102080 -154429 -111842
5647a11842Q692L7759r2817P2953L4306j5374j51294J45222P0271m7061J03661
$$ -111842 -103150 -65391 -158208 -85255 -50949 -66323 -217617 -72395 -2124 -49185 54476
5636E4476j93632j09412P0132J36408o840n3215n4574L7666N1386p9534M073K5366
$$ 54476 -139156 -248568 -178436 -42028 -48868 -102083 -156657 -118991 -67605 -147139 -143066 -117700
5624a17700r7400M4815R7120j8717J05608k8404J7140k9282r013M4903j02884
$$ -117700 -215100 -170285 -73165 -91882 13726 -14678 2462 -26820 -35833 9070 -93814
5613i3814j2462m3243J04663N477L4951j1475Q3444l8365j18794q5636p0679J36384
$$ -93814 -106276 -149519 -44856 -39379 -4428 -15903 67541 29176 -89618 -175254 -245933 -109549
5601a09549o2659R9261R4404j68465p3480N5219J20809N0626j02419l9844O0101
$$ -109549 -172208 -72947 21457 -147008 -220488 -165269 -44460 6166 -96253 -136097 -75996
5590g5996J00177M41q7921Q4392j4525N1996L2342j39612K1254j4603J15117j4745
$$ -75996 24181 24622 -63299 21093 6568 58564 90906 -48706 -27452 -42055 73062 58317
5578E8317q087K2930r5192O4927L6516l5068k4346l3797n3617M9940j7266j13589
$$ 58317 50230 73160 -22032 42895 79411 44343 19997 -13800 -67417 -17477 -34743 -148332
5566a48332r2217K8021J84986k9916l3596j68133J59234J23370q2805O8456p4591
$$ -148332 -240549 -212528 -27542 -57458 -91054 -259187 -99953 23417 -59388 9068 -65523
5555f5523K6058N9842j2394o951j27949O9982J42830p7639j7154J07584p1794
$$ -65523 -39465 20377 7983 1032 -126917 -56935 85895 8256 -8898 98686 26892
5544B6892j83535R1108R1243R0584j02795j3982m8373m0839j49233M1502J94460
$$ 26892 -156643 -65535 25708 116292 13497 -485 -48858 -89697 -238930 -197428 -2968
5533b968M9748o1151l8744j6719P8572L0545L0011j32929k6868l8870K42224J1654
$$ -2968 46780 -14371 -53115 -69834 8738 39283 69294 -63635 -90503 -129373 112851 124505
5521A24505j20739m629k8113J63988l3207n0820j11907k02731J41165m3977J09688
$$ 124505 3766 -863 -28976 135012 101805 50985 -60922 -263653 -122488 -166465 -56777
5510e6777j8226L4052L6709M6094J43873j70785l6373P1173J31179j05422J08892
$$ -56777 -75003 -40951 -4242 41852 185725 14940 -21433 49740 180919 75497 184389
5499A84389O1147o4247N0430n4536m1554j12069R8781J24737l0499J98692j97594
$$ 184389 245536 181289 231719 177183 135629 23560 122341 247078 216579 415271 217677
5488B17677K7901j581j48176L5539m9729m7642K4958K376R8811j46117o5232k0657
$$ 217677 245578 243997 95821 131360 81631 33989 58947 61323 160134 14017 -51215 -71872
5476g1872L1414J9836k2471n7297O5864P2944o2728K7539l4420l011o5030J8008
$$ -71872 -40458 -20622 -43093 -100390 -34526 38418 -24310 3229 -31191 -34202 -99232 -81224
5464h1224K0633q2240p2873k3672R0452J04587J53769k06615j8630J46418o9175
$$ -81224 -60591 -142831 -215704 -239376 -148924 -44337 109432 -97183 -115813 30605 -38570
5453c8570M4392k7132m1076r0041J03352J40610l7020k6541n6524m2739o632n4787
$$ -38570 5822 -21310 -62386 -152427 -49075 91535 54515 27974 -28550 -71289 -77921 -132708
5441a32708o3434J24806N150j0513k4233j5213r200J41662L0475P0996n7861j62175
$$ -132708 -196142 -71336 -66186 -76699 -100932 -116145 -125345 16317 46792 117788 59927 -102248
5429a02248l8679J23820J92382k6179k11604k16732J31759K09550L3084j02090
$$ -102248 -140927 -17107 175275 149096 -62508 -279240 -147481 62069 95153 -6937
5419f937j44725r393J44163M6535r9697j8197j00404J24416L7051k06907R9210
$$ -6937 -151662 -161055 -16892 29643 -70054 -88251 -188655 -64239 -27188 -234095 -134885
5408a34885N1232J04711p3706J90983q5461p73l8262Q8239J2260m5433m4124k7804
$$ -134885 -83653 21058 -52648 138335 52874 52101 13839 102078 114338 68905 24781 -3023
5396c023Q0002j7643j21565M8029q9159O4778M6785p5462Q5235R9766q4295n4698
$$ -3023 76979 59336 -62229 -14200 -103359 -38581 8204 -67258 17977 117743 33448 -21250
5384b1250K9916L4794q0237j42143J84584P0478K1515j08339P4191O2154j0368
$$ -21250 8666 43460 -36777 -178920 5664 76142 97657 -10682 63509 125663 115295
5373A15295Q4330M1866j24832L4555M5055j54075j13428P974l3794M9618R955
$$ 115295 199625 241491 116659 151214 196269 42194 -71234 -63260 -97054 -47436 -37481
5362c7481o1798M5653J16746j38589N7824j4235k5603q7686R3181O6488P7836
$$ -37481 -99279 -53626 63120 -75469 -17645 -31880 -57483 -145169 -51988 14500 92336
5351I2336L6199j9773j3615j13479o0788Q901J03684j95801K6146K05831o4242
$$ 92336 128535 108762 95147 -18332 -79120 -70219 33465 -162336 -136190 69641 5399
5340E399J2057m0831M798k2885j759O6012o3312k1290o8857J53339N884m6523
$$ 5399 17456 -23375 -18577 -41462 -43221 22791 -40521 -61811 -130668 22671 28555 -17968
5328a7968Q7655J24666j36211j2425o0763k777q1630J2966q1110J3350q5932K7016
$$ -17968 69687 194353 58142 45717 -15046 -17823 -99453 -86487 -167597 -154247 -240179 -213163
5316b13163K12804M1018m5392n5596J3271k2501M4884j6457J8725n2217O0095
$$ -213163 -359 40659 -4733 -60329 -47058 -69559 -24675 -41132 -22407 -74624 -14529
5305a4529j34611N4367J68992Q311j0052o333m9517K6002j24040J64018r0467
$$ -14529 -149140 -94773 74219 82530 72478 66145 16628 42630 -81410 82608 -7859
5294g859j05704J8379N7610J17998k8636l4094j13739O6891O3230j22944J45969
$$ -7859 -113563 -95184 -37574 80424 51788 17694 -96045 -29154 34076 -88868 57101
5283E7101q5724K8765R2762O0981m4221m6907P0676n4693o0869J46868N7314m6208
$$ 57101 -28623 142 92904 153885 109664 62757 133433 78740 17871 164739 222053 175845
5271A75845M8686L7791j6912L495j2871j17267O7072m4471j1782k2981l2089l0893
$$ 175845 224531 262322 245410 248905 236034 118767 185839 141368 129586 106605 74516 43623
5259D3623O1267R569N4292J07352n3609q6702O5076j1621k4553J94073j33957
$$ 43623 104890 114459 168751 276103 222494 135792 200868 189247 164694 358767 224810
5248B24810k8739k3072N8527J21957k00239P9571j12936K0723J70042p1598O4996
$$ 224810 196071 172999 231526 353483 153244 232815 119879 140602 310644 239046 304042
5237C04042j06951k19282P0525J70941r3135j23745P8265N2919N5789o2000P049
$$ 304042 197091 -22191 48334 219275 126140 2395 80660 133579 189368 127368 134417
5226A34417r9219K256O8237J22875R0932n0355j42192j05209R8801l6838N2198
$$ 134417 35198 37454 105691 228566 319498 269143 126951 21742 120543 83705 135903
5215A35903J52431p4741r1223O2320J45811j61359L5605n6794M7666j26425M8369
$$ 135903 288334 213593 122370 184690 330501 169142 204747 147953 195619 69194 117563
5204A17563J6788Q4685J0552j20100J1799q5351P4775P3298O8797L3089Q1243
$$ 117563 134351 219036 229588 109488 121287 35936 110711 184009 252806 285895 367138
5193C67138j56455l8622P1773m6550n6101j39467m1895O7989l043j2755L0346
$$ 367138 210683 172061 243834 197284 141183 1716 -40179 27810 24767 12012 42358
5182D2358O6551J4885N8193r4077J3795j62330J26690J60472j1014j29024J29690
$$ 42358 108909 123794 181987 87910 101705 -60625 66065 226537 215523 86499 216189
5171B16189J96318j23530L5754j33705p1889O6718O3872n7826m5764J49534o83
$$ 216189 412507 288977 324731 191026 119137 185855 249727 191901 146137 295671 294988
5160B94988j32037M1220M6862j17946k2236J35319J7415L8997r3061l4225n1781
$$ 294988 162951 204171 251033 133087 110851 246170 263585 302582 209521 175296 123515
5149A23515J57597q613R71N5904j16834N1568p3530k9539M9692J4718J03931m0089
$$ 123515 281112 272499 273470 329374 212540 264108 190578 161039 210731 225449 329380 289291
5137B89291n6367J7400m680L5717O6741P970k7266j5910j07323J19273j7974l5917
$$ 289291 232924 250324 245644 281361 348102 356072 328806 312896 205573 324846 306872 270955
5125B70955J23610j26162J73320j3408k1789j2724J36582J9946k10534j09883
$$ 270955 394565 268403 441723 428315 406526 393802 530384 550330 339796 229913
5115B29913J27910J09143p0008j1271j00602N1159J7334P4615O0660O7994j12707
$$ 229913 357823 466966 396958 385687 285085 336244 353578 428193 488853 556847 444140
5104D44140Q1567j23697K15800j31838J23864R7374n4263r6950p7874K6374k1830
$$ 444140 525707 402010 617810 485972 609836 707210 652947 555997 478123 504497 482667
5093D82667J38139j95092j3037K4972Q6088J44930j09972Q1765J43236N6622o4901
$$ 482667 620806 425714 412677 437649 523737 668667 558695 640460 783696 840318 775417
5082G75417K2224O9611n7095Q9743j25000L2926j28341J14138J57323M6043p2267
$$ 775417 797641 867252 810157 899900 774900 807826 679485 793623 950946 996989 924722
5071I24722k7882J61505K9752R299r110n1935J106j8749J18451m2437M4282M849
$$ 924722 896840 1058345 1088097 1097396 1088286 1036351 1037457 1018708 1137159 1094722 1139004 1143853
5059A143853j95798k2499j3045J49913j8660n5809L8439j442j9683j7813l931
$$ 1143853 948055 925556 912511 1062424 1043764 987955 1026394 1024952 1005269 987456 983525
5048I83525J30017k9691p551q218p9260p4488J28224m4571p0381m0919J53315
$$ 983525 1113542 1083851 1076300 1068082 988822 914334 1042558 997987 927606 886687 1040002
5037A040002j08465M6291R2247k6686J33782J91616k01884r5427J7714J87622
$$ 1040002 931537 977828 1070075 1043389 1177171 1368787 1166903 1071476 1089190 1276812
5027A276812m671N0821m9509J43196J51735k8342m7359p8221J15531k040L7342
$$ 1276812 1272141 1322962 1273453 1416649 1568384 1540042 1492683 1414462 1529993 1527953 1565295
5016A565295J7059L5440j13824p6540K29281q0430N405O2803J2096K93734o2459
$$ 1565295 1582354 1617794 1503970 1427430 1656711 1576281 1581686 1644489 1656585 1950319 1887860
5005A887860k1023l6243R3890l4463P6322M3890N6548k05943Q6131m2612j55584
$$ 1887860 1866837 1830594 1924484 1890021 1966343 2010233 2066781 1860838 1946969 1904357 1748773
4994A748773j18056P9008J4931M7855J8338J68148K3466k9152J0719n9516q4052
$$ 1748773 1630717 1709725 1724656 1772511 1790849 1958997 1982463 1953311 1964030 1904514 1820462
4983A820462P2203M0101l2782n8924J5299J07977o0775l8367O155J01337Q5720
$$ 1820462 1892665 1932766 1899984 1841060 1856359 1964336 1903561 1865194 1871349 1972686 2058406
4972B058406R6560l041l1802r216p2393K66383l3489M618P8943O2391N5697o5650
$$ 2058406 2154966 2151925 2120123 2110907 2038514 2304897 2271408 2276026 2354969 2417360 2473057 2407407
4960B407407R7389m5447K19149J17686R486M9740O1089O2685P0559J21223J23202
$$ 2407407 2504796 2459349 2678498 2796184 2805670 2855410 2916499 2979184 3049743 3170966 3294168
4949C294168O9545K53554J49821k1233J11222k5182j6859L7212K4584j13791J73125
$$ 3294168 3363713 3617267 3767088 3745855 3857077 3831895 3815036 3852248 3876832 3763041 3936166
4938C936166Q1565q7943J25830K32152q7714O9202J91175j9786L6392P0904o0611
$$ 3936166 4017731 3929788 4055618 4287770 4200056 4269258 4460433 4440647 4477039 4547943 4487332
4927D487332M5314p3632q2265J25785l2397J37768l3659j64365l9031J62221J22359
$$ 4487332 4532646 4459014 4376749 4502534 4470137 4607905 4574246 4409881 4370850 4533071 4655430
4916D655430J02063P277j14113j9186n8035O1957P9567j09409j33663K7160M5551
$$ 4655430 4757493 4764770 4650657 4631471 4573436 4635393 4714960 4605551 4471888 4499048 4544599
4905D544599j81853O0716L6915l8218J06650J29808m7857p3780J91474m4507L11832
$$ 4544599 4362746 4423462 4460377 4422159 4528809 4658617 4610760 4536980 4728454 4683947 4995779
4894D995779J71964r2849j29843m591n8011J8329O5580J0235k21591K2712M5915
$$ 4995779 5167743 5074894 4945051 4940460 4882449 4900778 4966358 4976593 4755002 4777714 4823629
4883D823629M5374l8620J4524o1309J13540K96053J15974k7114q4513J91816P6172
$$ 4823629 4869003 4830383 4844907 4783598 4897138 5193191 5309165 5282051 5197538 5389354 5465526
4872E465526K01737o6660M7192o2958K53388J65370r8451J23438M30308M8998
$$ 5465526 5667263 5600603 5647795 5584837 5838225 6003595 5905144 6028582 6458890 6507888
4862F507888J3775l2109j30944o3394K18184m5284j2601j20831r3880P7772O4030
$$ 6507888 6521663 6489554 6358610 6295216 6513400 6468116 6455515 6334684 6240804 6318576 6382606
4851F382606R8066K76195K25661M70967J96762K37832J42853o8342j58160j93498
$$ 6382606 6480672 6756867 6982528 7453495 7650257 7888089 8030942 7962600 7804440 7610942
4841G610942n6851O52J3121J0588r8924j98315n9247l5388N6331N9210J90165
$$ 7610942 7554091 7554743 7567864 7578452 7479528 7281213 7221966 7186578 7242909 7302119 7492284
4830G492284K09881Q8882J88029j27908j2002l8368j98630o6396R6578k5500r4753
$$ 7492284 7702165 7791047 7979076 7851168 7839166 7800798 7602168 7535772 7632350 7606850 7512097
4819G512097p9352Q151j21919j04684R9901o8852N765Q4317j6886J79400Q429
$$ 7512097 7432745 7440896 7318977 7214293 7314194 7245342 7251107 7335424 7318538 7497938 7506367
4808G506367l7392J4041L6547Q2886L7259J57017J58896J04366o4257J21580J22053
$$ 7506367 7468975 7483016 7519563 7602449 7639708 7796725 7955621 8059987 7995730 8117310 8239363
4797H239363n0704J42131K80325m8415q5634J55757K10445J50579J79166J48160
$$ 8239363 8188659 8330790 8611115 8562700 8477066 8632823 8843268 8993847 9173013 9321173
4787I321173J55625J85561J03219L0039K57275J60001J74279L20339K50522J9913
$$ 9321173 9476798 9662359 9765578 9795617 10052892 10212893 10387172 10707511 10958033 10977946
4777A0977946K79641M22534K60670L35451L13425K41412L37010J80323K76133
$$ 10977946 11257587 11680121 11940791 12276242 12589667 12831079 13168089 13348412 13624545
4768A3624545L56406M60165L82228L81701L33247N17901O25433M94893M49951
$$ 13624545 13980951 14441116 14823344 15205045 15538292 16056193 16681626 17176519 17626470
4759A7626470O01957N98668P13118O96096Q42818O91613Q75174R61154P50234
$$ 17626470 18228427 18827095 19540213 20236309 21079127 21770740 22645914 23607068 24357302
4750B4357302P86566R20174J170417J154743R81365J405610J367454J367416J607777
$$ 24357302 25143868 26064042 27234459 28389202 29370567 30776177 32143631 33511047 35118824
4741C5118824J773661J597057J817325J737950J857864J777491J959330J967708
$$ 35118824 36892485 38489542 40306867 42044817 43902681 45680172 47639502 49607210
4733D9607210K215426K250572K430785K495695K531948K821512K969430L040081
$$ 49607210 51822636 54073208 56503993 58999688 61531636 64353148 67322578 70362659
4725G0362659L150996L576043L835074M151505M333435M843026N162259N670893
$$ 70362659 73513655 77089698 80924772 85076277 89409712 94252738 99414997 105085890
4717A05085890O057175O799442P500433Q475009R464777J0491206J1825184J3285739
$$ 105085890 111143065 117942507 125442940 133917949 143382726 153873932 165699116 178984855
4709A78984855J5002549J7119961J8962374K0965562K1720118K0100833J5428823
$$ 178984855 193987404 211107365 230069739 251035301 272755419 292856252 308285075
4702C08285075Q822845L305632J92319l22105J392264M088052P176609J0464721
$$ 308285075 317107920 320413552 320605871 320283766 321676030 325764082 332940691 343405412
4694C43405412J2484050J3140413J1520425R397388P741377O347143N370241K661218
$$ 343405412 355889462 369029875 380550300 389947688 397689065 404036208 409406449 412067667
4686D12067667p40857l961481o031478o219720n953326n760556o919630r183100
$$ 412067667 411326810 407365329 401333851 395114131 389160805 383400249 376480619 367297519
4678C67297519j0466609j0224175q245276n120311j752675R48517K270704M76708
$$ 367297519 356830910 346606735 338361459 333241148 331488473 332436990 334707694 335184402
4670C35184402m303281j1644577j8565441k2198544k3009167k1494538j9294977
$$ 335184402 330881121 319236544 300671103 278472559 255463392 233968854 214673877
4663B14673877j6712880j4109037j1927108r737124p707314o809061o672583o658885
$$ 214673877 197960997 183851960 171924852 162187728 154480414 147671353 140998770 134339885
4655A34339885o604872n765070n012284m247183l272968k685112k052022j577126
$$ 134339885 127735013 121969943 116957659 112710476 109437508 106752396 104700374 103123248
4647A03123248j527692j253833j035522p73539o73170p41343j114857j409434
$$ 103123248 101595556 100341723 99306201 98532662 97859492 97118149 96003292 94593858
4639I4593858j717517j681544j293456j258455q83113n04011r3323o4279p56117
$$ 94593858 92876341 91194797 89901341 88642886 87759773 87255762 87162439 87098160 86342043
4630H6342043j339063r99585m16802L49824N33777j53293j107846j927867j572898
$$ 86342043 85002980 84003395 83586593 83936417 84470194 84316901 83209055 81281188 79708290
4621G9708290j297709j089641j193070j258900r86743q68349m27552q3549L0179
$$ 79708290 78410581 77320940 76127870 74868970 73882227 73013878 72586326 72502777 72532956
4612G2532956J38484K10034K51597K75423J23113K0140j15846m60540n25885n29848
$$ 72532956 72671440 72881474 73133071 73408494 73531607 73551747 73435901 72975361 72449476 71919628
4602G1919628j94021j54080P7934K40033L85361K97902J03685P7668m5483k05069
$$ 71919628 71725607 71571527 71649461 71889494 72274855 72572757 72676442 72754110 72708627 72503558
4592G2503558j40951k99990l35767j12978j24358m50491l72319j12426l29696
$$ 72503558 72362607 72062617 71726850 71613872 71489514 71039023 70666704 70554278 70224582
4583G0224582l65283m74967k17609k68587k17683j04312l95730p60967j170871
$$ 70224582 69859299 69384332 69166723 68898136 68680453 68576141 68180411 67419444 66248573
4574F6248573j151904j363110j398411j253858j288925j162882j144028j047975
$$ 66248573 65096669 63733559 62335148 61081290 59792365 58629483 57485455 56437480
4566E6437480o06183q12904n98530o74209k86816m03471m61361n20969p77441
$$ 56437480 55831297 55018393 54419863 53745654 53458838 53055367 52594006 52073037 51295596
4557E1295596o41841p35811r25186o94274n69249m79949m16687l08940l82017
$$ 51295596 50653755 49917944 48992758 48298484 47729235 47249286 46832599 46523659 46141642
4548D6141642r5040j88437l69691m24718m74020m80785p00759k57839j18608j34108
$$ 46141642 46046602 45858165 45488474 45063756 44589736 44108951 43408192 43150353 43031745 42897637
4538D2897637J31699M55745R1853m192k42032k93786o88514o28317m52061n00926
$$ 42897637 43029336 43485081 43576934 43572742 43330710 43036924 42348410 41720093 41268032 40767106
4528D0767106m47942k35908k54884m15451l26145j35262J20810N8854J06459M8226
$$ 40767106 40319164 40083256 39828372 39412921 39086776 38951514 39072324 39131178 39237637 39285863
4518C9285863J25096n0927l70681m08697m47995l82304m02667o13781m27368k39121
$$ 39285863 39410959 39360032 38989351 38580654 38132659 37750355 37347688 36733907 36306539 36067418
4508C6067418m95236l88914l36130k84936l83942j40167l81065m46554o39503
$$ 36067418 35572182 35183268 34847138 34562202 34178260 34038093 33657028 33210474 32570971
4499C2570971n53296p95066p00084p96268q54179p99551p10479r27253o82135
$$ 32570971 32017675 31222609 30522525 29726257 28872078 28072527 27362048 26434795 25752660
4490B5752660o19001m67614n21466n19874o32437o22274l60669n76181o75434
$$ 25752660 25133659 24666045 24144579 23624705 22992268 22369994 22009325 21433144 20757710
4481B0757710o95823q57887n84020n59608o06605p21591m51321l06856k98176
$$ 20757710 20061887 19204000 18619980 18060372 17453767 16732176 16280855 15973999 15675823
4472A5675823k45007j58568k01166n7630k63086j52518j27114j46616k5505j82303
$$ 15675823 15430816 15272248 15071082 15013452 14750366 14597848 14470734 14324118 14298613 14116310
4462A4116310j99241n5372N3496q2134J80018J10553o3847R9894J31173K0809
$$ 14116310 13917069 13861697 13915193 13833059 14013077 14123630 14059783 14159677 14290850 14311659
4452A4311659K99068K71318M2408J06299L0507J41517L63535L82551K61589L97909
$$ 14311659 14610727 14882045 14924453 15030752 15061259 15202776 15566311 15948862 16210451 16608360
4442A6608360L35305L18685M43944K59536L40223K44253K87191L19273K34272
$$ 16608360 16943665 17262350 17706294 17965830 18306053 18550306 18837497 19156770 19391042
4433A9391042L48260L13807J72668L5607L5468m1932K52971J32770J46975j25675
$$ 19391042 19739302 20053109 20225777 20261384 20296852 20254920 20507891 20640661 20787636 20661961
4423B0661961K2168J53260l946J04195n0187J24435j17396o9501R6562R9093k78310
$$ 20661961 20684129 20837389 20833443 20937638 20887451 21011886 20894490 20824989 20921551 21020644 20742334
4412B0742334j86808k45036p9484l57581j80528j68197r9690k52339j90647k48523
$$ 20742334 20555526 20310490 20231006 19873425 19692897 19524700 19425010 19172671 18982024 18733501
4402A8733501k85068k15826j33480l23737j20725q5807j12682l00148J32561k90475
$$ 18733501 18448433 18232607 18099127 17775390 17654665 17568858 17456176 17156028 17288589 16998114
4392A6998114j93943j83312m05307m11867k10270j68242k67925k00636j78218
$$ 16998114 16804171 16620859 16215552 15803685 15593415 15425173 15157248 14956612 14778394
4383A4778394N4533J92186j7495K79771J94171K43084K09716J58178K27602K59231
$$ 14778394 14832927 15025113 15007618 15287389 15481560 15724644 15934360 16092538 16320140 16579371
4373A6579371J27094K72880J85218J76103J52306K75080K35849N66619M77525
$$ 16579371 16706465 16979345 17164563 17340666 17492972 17768052 18003901 18570520 19048045
4364A9048045M17753O10601O87373M77380K52834K06637M19707O14204N19648
$$ 19048045 19465798 20076399 20763772 21241152 21493986 21700623 22120330 22734534 23254182
4355B3254182L90692K36477K99234M67558N54927N24704O01439P97513P45243
$$ 23254182 23644874 23881351 24180585 24648143 25203070 25727774 26329213 27126726 27871969
4346B7871969J045737J106716J126013J320346J426129J596405J585490J427169
$$ 27871969 28917706 30024422 31150435 32470781 33896910 35493315 37078805 38505974
4338C8505974J409638J509024J606622J720509J950761K341008K776332L308359
$$ 38505974 39915612 41424636 43031258 44751767 46702528 49043536 51819868 55128227
4330E5128227L392671L744408M314680M736936N930511O924461Q108314R176587
$$ 55128227 58520898 62265306 66579986 71316922 77247433 84171894 92280208 101456795
4322A01456795J0724442J2822402J6509752K0419475K6700030L4238642M0779485
$$ 101456795 112181237 125003639 141513391 161932866 188632896 222871538 263651023
4315B63651023K9469858p278930l1066583l8900926l3988597k6699411k1864396
$$ 263651023 293120881 285841951 254775368 215874442 181885845 155186434 133322038
4308A33322038j7392790j3724424j1021217r183664p449006o011721m967890m326801
$$ 133322038 115929248 102204824 91183607 81999943 74550937 68539216 63571326 59244525
4300E9244525l787750l118127k715879k784063k631346k423218k229915j812978
$$ 59244525 55456775 52338648 49622769 46838706 44207360 41784142 39554227 37741249
4292C7741249j829250j488647j119023j196221q68097p67242p19755n48208o99156
$$ 37741249 35911999 34423352 33304329 32108108 31240011 30472769 29753014 29204806 28505650
4283B8505650o88210n17361m49865m81976p69933l97581l26729k93948k86925
$$ 28505650 27817440 27300079 26850214 26368238 25598305 25200724 24873995 24580047 24293122
4274B4293122m00731k68436j50851j43649j05922k3582J62889P7693k220J69853
$$ 24293122 23892391 23623955 23473104 23329455 23223533 23199951 23362840 23440533 23438313 23608166
4264B3608166j00971j32166N2932P9239K1551J3762L40325J75522J28361L49271
$$ 23608166 23507195 23375029 23427961 23507200 23528751 23542513 23882838 24058360 24186721 24535992
4254B4535992N34259K16164N15762M77521N52755M36705P39366Q06899P17882
$$ 24535992 25070251 25286415 25802177 26279698 26832453 27269158 28008524 28815423 29533305
4245B9533305O75860R70770O88132R02563J130853J041306J175564J287327J360307
$$ 29533305 30209165 31179935 31868067 32770630 33901483 34942789 36118353 37405680 38765987
4236C8765987J439202J486487J631379J566764J802254J869876J970827K060136
$$ 38765987 40205189 41691676 43323055 44889819 46692073 48561949 50532776 52592912
4228E2592912K099677K475745K517995K605302K668630L091003L126853L092997
$$ 52592912 54692589 57168334 59686329 62291631 64960261 68051264 71178117 74271114
4220G4271114L600568L689419L902507M262802M650543M925882N388354O021577
$$ 74271114 77871682 81561101 85463608 89726410 94376953 99302835 104691189 110712766
4212A10712766O468027P227659Q034448R045434J0215258J1088833J2664305J4219643
$$ 110712766 117180793 124408452 132442900 141488334 151703592 162792425 175456730 189676373
4204A89676373J5987656J7859823J9696476K1543288K1698346J9560107J4676326
$$ 189676373 205664029 223523852 243220328 264763616 286461962 306022069 320698395
4197C20698395P539582J464698j970067k427474q92898J912905M861562P469965
$$ 320698395 328237977 329702675 327732608 325305134 324412236 326325141 331186703 338656668
4189C38656668Q771225Q284823O964022N945649N651577O318105O576535N085862
$$ 338656668 347427893 355712716 362676738 368622387 374273964 380592069 387168604 392254466
4181C92254466J713093k425536o094065p981445q975418r362092j0839496j2466821
$$ 392254466 393967559 391542023 385447958 377466513 368491095 359129003 348289507 335822686
4173C35822686j3011304j1744288r727656o975194l675955j244543J13507n15267
$$ 335822686 322811382 311067094 301339438 294364244 290688289 289443746 289557253 289041986
4165B89041986m049567r699501j5282085j8977843j9914961j9440999j7947065
$$ 289041986 284992419 275292918 260010833 241032990 221118029 201677030 183729965
4158A83729965j6149088j4366994j2556144j1040237r586769q160690p487453
$$ 183729965 167580877 153213883 140657739 129617502 120030733 111870043 104382590
4151A04382590o460519n840270n018272m667623m062055l613032l478831l099963
$$ 104382590 97922071 92081801 87063529 82395906 78333851 74720819 71241988 68142025
4143F8142025k820497k611050k410119k183653k079458j889469j659093j664874
$$ 68142025 65321528 62710478 60300359 58116706 56037248 54147779 52488686 50823812
4135E0823812j360201j317486j398618j069442j062665j032834r20361q24550
$$ 50823812 49463611 48146125 46747507 45678065 44615400 43582566 42662205 41837655
4127D1837655q61424o88756m62202m95397l47280l00895l07890p1769k78392p5844
$$ 41837655 40976231 40287475 39825273 39329876 38982596 38681701 38373811 38302042 38023650 37947806
4117C7947806P4534J40575M10175K85480O81050O73532Q97279R45420Q71952P40653
$$ 37947806 38022340 38162915 38573090 38858570 39539620 40213152 41110431 42055851 42927803 43668456
4107D3668456O23178P27258P67230P68284J060971J256428J600134J479542J985961
$$ 43668456 44291634 45018892 45786122 46554406 47615377 48871805 50471939 51951481 53937442
4098E3937442K161249K134804J987913J706603J649648J001781O48187J00334
$$ 53937442 56098691 58233495 60221408 61928011 63577659 64579440 65227627 65327961
4090F5327961j74342n54677j520262j794037k138910k428893k430375k428642
$$ 65327961 65153619 64598942 63078680 61284643 59145733 56716840 54286465 51857823
4082E1857823k477317k477995k142266k152664k055179j732263j362900j143515
$$ 51857823 49380506 46902511 44760245 42607581 40552402 38820139 37457239 36313724
4074C6313724j047167q47331o74108p56688o35546o21697p66409r21007j266346
$$ 36313724 35266557 34419226 33745118 32988430 32352884 31731187 30964778 30043771 28777425
4065B8777425j408203j413562j255149j284830j141732j125013r98472p70224
$$ 28777425 27369222 25955660 24700511 23415681 22273949 21148936 20150464 19380240
4057A9380240o28797m92221o50733n12095m91992n01115n40935k35284l16752
$$ 19380240 18751443 18259222 17608489 17096394 16604402 16103287 15562352 15327068 15010316
4048A5010316l09563l71865l03284j89136l19834j34088l49458k42989k34637
$$ 15010316 14700753 14328888 14025604 13836468 13516634 13382546 13033088 12790099 12555462
4039A2555462j46972j41254K1890j71463p0282j04243n3031m3639j90632k15782
$$ 12555462 12408490 12267236 12289126 12117663 12047381 11943138 11890107 11846468 11655836 11440054
4029A1440054l7852k0853j19481j9817j29641j0243j05657J4815j62986q651k0811
$$ 11440054 11402202 11381349 11261868 11242051 11112410 11102167 10996510 11011325 10848339 10839688 10818877
4018A0818877k9992Q0847k1035n2856J78626p7378O3295j3626K6602J92842M4409
$$ 10818877 10788885 10869732 10848697 10795841 10974467 10897089 10960384 10946758 10973360 11166202 11210611
4007A1210611O1934N3473J73800J04736J22245J74904K21549K63763L53894L59486
$$ 11210611 11272545 11326018 11499818 11604554 11726799 11901703 12123252 12387015 12740909 13100395
3997A3100395L42098K74992M74730N03913M75444O77165P91815Q85003J300597
$$ 13100395 13442493 13717485 14192215 14696128 15171572 15848737 16640552 17525555 18826152
3988A8826152J302417J589406J866331J727536J350426K63876l37402n62926n64359
$$ 18826152 20128569 21717975 23584306 25311842 26662268 26926144 26588742 26025816 25461457
3979B5461457k07666J76942L07280L73225O84905O19686K54739L67295O74888
$$ 25461457 25253791 25430733 25738013 26111238 26796143 27415829 27670568 28037863 28712751
3970B8712751Q16441P15518O92275Q2333l77694p44353q46883n17191o72533n37919
$$ 28712751 29529192 30244710 30936985 31019318 30641624 29897271 29050388 28533197 27860664 27322745
3960B7322745o32310o60718o33732l96100k8740L33850M40256L67448M07644n70683
$$ 27322745 26690435 26029717 25395985 24999885 24971145 25304995 25745251 26112699 26520343 25949660
3950B5949660j022834j491377j439062j421249j009594q55911p67907o78822m69079
$$ 25949660 24926826 23435449 21996387 20575138 19565544 18709633 17941726 17262904 16793825
3941A6793825n18670n58566l17690j82295o8122n9809L697J28751P3660J33960
$$ 16793825 16275155 15716589 15398899 15216604 15148482 15088673 15092370 15221121 15294781 15428741
3931A5428741k0079k7639P546j10079j13140j43222j83936p6100J16813k22594
$$ 15428741 15408662 15381023 15388569 15278490 15165350 15022128 14838192 14762092 14878905 14656311
3921A4656311R893k60491j1466N3133j73415l06782k55328l09126l29659l03793
$$ 14656311 14666204 14405713 14394247 14447380 14273965 13967183 13711855 13402729 13073070 12769277
3911A2769277k93146l34196l23935k34832J55016j68985k58230k47768k03182
$$ 12769277 12476131 12141935 11818000 11583168 11738184 11569199 11310969 11063201 10860019
3902A0860019k58709q1089j52602j39304o730J93877K10531p9156N4264J01369
$$ 10860019 10601310 10520221 10367619 10228315 10221585 10415462 10625993 10546837 10601101 10702470
3892A0702470K35278j40984K5077P0773J75448n9709j36247L8237J7350J60982
$$ 10702470 10937748 10796764 10821841 10892614 11068062 11008353 10872106 10910343 10927693 11088675
3882A1088675N9026K27611K16273K47729J99084L67382L63890M44383M56108L67079
$$ 11088675 11147701 11375312 11591585 11839314 12038398 12405780 12769670 13214053 13670161 14037240
3872A4037240M63235M17990K94912j57573j80488k59984k17551j59196k4126M6308
$$ 14037240 14500475 14918465 15213377 15055804 14875316 14615332 14397781 14238585 14214459 14260767
3862A4260767J89891R6184J51617J73303K43011J97825J39780J53277J80027n3454
$$ 14260767 14450658 14546842 14698459 14871762 15114773 15312598 15452378 15605655 15785682 15732228
3852A5732228n5524j45002j39287l9035n1521j76994O161m0748N574L32258J42159
$$ 15732228 15676704 15531702 15392415 15353380 15301859 15124865 15131026 15090278 15095852 15428110 15570269
3841A5570269M39300J87517K89032L47138R664M4002L5022K29874J91087K06334
$$ 15570269 16009569 16197086 16486118 16833256 16842920 16886922 16921944 17151818 17342905 17549239
3831A7549239N73501O46815O48603R13832R28997R89409J140183O55210N11252
$$ 17549239 18122740 18769555 19418158 20331990 21260987 22250396 23390579 24045789 24557041
3822B4557041L46434j9557j94725j97556k67003J49491K21449J46901M46927N73751
$$ 24557041 24903475 24883918 24689193 24491637 24224634 24374125 24595574 24742475 25189402 25763153
3812B5763153O97456J077436J141509J158125J250170Q80819O11596P15263L63253
$$ 25763153 26460609 27538045 28679554 29837679 31087849 31968668 32580264 33295527 33658780
3803C3658780q1187k72044m89356n40897o31227p47863n96457p31581q13225o40002
$$ 33658780 33577593 33305549 32816193 32275296 31644069 30896206 30299749 29568168 28754943 28114941
3793B8114941p43298l89483j7422j69329J93299K63484N13333O93664P86420Q44257
$$ 28114941 27371643 26982160 26964738 26795409 26988708 27252192 27765525 28459189 29245609 30089866
3783C0089866O05474o746n45131j009714j420597j427238j242617j028863p48088
$$ 30089866 30695340 30688594 30143463 29133749 27713152 26285914 25043297 24014434 23266346
3774B3266346o86877o29527l44575j76813j70904k17095J82172K29246N75262
$$ 23266346 22579469 21949942 21605367 21428554 21257650 21040555 21222727 21451973 22027235
3765B2027235O92759Q24000M79787p7038k28521m44160o11625n71681l78299k07861
$$ 22027235 22719994 23543994 24023781 23946743 23718222 23274062 22662437 22090756 21712457 21504596
3755B1504596k38834j17068K0572J42754J99241K21036L26631L06364L92639P09881
$$ 21504596 21265762 21148694 21169266 21312020 21511261 21732297 22058928 22365292 22757931 23467812
3745B3467812R83719J158043J205437Q53279P15202L67913j61216k07826k53235
$$ 23467812 24451531 25609574 26815011 27668290 28383492 28751405 28590189 28382363 28129128
3736B8129128l92649n37588r09631r44433r48801o81987o29779k97874m4814p9914
$$ 28129128 27736479 27198891 26289260 25344827 24396026 23714039 23084260 22786386 22741572 22661658
3726B2661658K31108K91956O09071O34198O00850Q93520J063064J135655Q67533
$$ 22661658 22892766 23184722 23793793 24427991 25028841 25922361 26985425 28121080 28988613
3717B8988613L98083j79704r78529j378708j840315j600415j133143r45793o33014
$$ 28988613 29386696 29206992 28228463 26849755 25009440 23409025 22275882 21330089 20697075
3708B0697075m11622k63724j49571K21293M74990M49141N20251N00188K34667
$$ 20697075 20285453 20021729 19872158 20093451 20568441 21017582 21537833 22038021 22272688
3699B2272688J7973m5326k45276m98513p54927q43597p79045q12610q93073o04468
$$ 22272688 22290661 22245335 22000059 21501546 20746619 19903022 19123977 18311367 17418294 16813826
3689A6813826m22191k02564l48179R710J29580O7749L55283K35632K38301K91153
$$ 16813826 16391635 16189071 15840892 15850602 15980182 16047931 16403214 16638846 16877147 17168300
3679A7168300j91637l92232k89430l33160m16223n7124n1732j30134R8638j656
$$ 17168300 16976663 16584431 16295001 15961841 15545618 15488494 15436762 15306628 15405266 15403610
3669A5403610O1352J6246q6809K0520J66225j21731j06708j60339j23199K9717
$$ 15403610 15464962 15481208 15394399 15414919 15581144 15459413 15352705 15192366 15069167 15098884
3659A5098884j18333q664r7418m5412R3467J0844N7535R9273J58933J57241J05352
$$ 15098884 14980551 14971887 14874469 14829057 14922524 14933368 14990903 15090176 15249109 15406350 15511702
3648A5511702J90206J62890Q5526j43454l49226k93822j88457l03282m05340m86153
$$ 15511702 15701908 15864798 15950324 15806870 15457644 15163822 14975365 14672083 14266743 13780590
3638A3780590l16887j77148l64573l08293l44787m62239p2168q6482j92484N5945
$$ 13780590 13463703 13286555 12921982 12613689 12268902 11806663 11734495 11648013 11455529 11511474
3628A1511474N7873J21247n1532K27971O8421J3103q662k52897m83370l53615
$$ 11511474 11569347 11690594 11639062 11867033 11935454 11948557 11939895 11686998 11203628 10850013
3618A0850013m01319k81548k90978k52117j93314j53182j41879m3230j1622j1416
$$ 10850013 10448694 10167146 9876168 9624051 9430737 9277555 9135676 9092446 9080824 9069408
3608I069408j80421j63424N8265j29360N0278k32420j5789N1012J1537J59525
$$ 9069408 8888987 8725563 8783828 8654468 8704746 8472326 8456537 8507549 8519086 8678611
3598H678611J2099m1190K7559m8489J23384n152M8168L59463J260J8720J03979
$$ 8678611 8690710 8649520 8677079 8628590 8751974 8746822 8794990 9154453 9155713 9174433 9278412
3587I278412J3455J09158q7979j51710k1380O4950J08219J1954P9208j0576q469
$$ 9278412 9291867 9401025 9313046 9161336 9139956 9204906 9313125 9325079 9404287 9393711 9385242
3576I385242O0890J23429J24679k7516O0374K47433k8046K31976q6449L7822K7238
$$ 9385242 9446132 9569561 9694240 9666724 9727098 9974531 9946485 10178461 10092012 10129834 10157072
3565A0157072q3072J05204M0522J61095N8614n0730L6826N4528J33983Q8160J16452
$$ 10157072 10074000 10179204 10219726 10380821 10439435 10388705 10425531 10480059 10614042 10702202 10818654
3554A0818654K52525L8703J80302M02808K35225J77332J95948K86963K11229K25011
$$ 10818654 11071179 11109882 11290184 11692992 11928217 12105549 12301497 12588460 12799689 13024700
3544A3024700K26560K94815M05198L26603M31387L67501K66093N27340M65581
$$ 13024700 13251260 13546075 13951273 14277876 14709263 15076764 15342857 15870197 16335778
3535A6335778L32685N88399O05525O42558M76722N86893L50986O36604O06760
$$ 16335778 16668463 17256862 17862387 18504945 18981667 19568560 19919546 20556150 21162910
3526B1162910N87464N30302L62493N20397M37253K13802K78136L37211L49878
$$ 21162910 21750374 22280676 22643169 23163566 23600819 23814621 24092757 24429968 24779846
3517B4779846M60659M04669J59768r1833p2954k10201l1404j42605k98788j77567
$$ 24779846 25240505 25645174 25804942 25713109 25640155 25429954 25398550 25255945 24957157 24779590
3507B4779590j76874k35082k28637j85642l47598k82885k85176l32782l91368
$$ 24779590 24602716 24367634 24138997 23953355 23605757 23322872 23037696 22704914 22313546
3498B2313546l95989j77692p7407k38039k71036k22741p9980k53956j43960k31723
$$ 22313546 21917557 21739865 21662458 21424419 21153383 20930642 20850662 20596706 20452746 20221023
3488B0221023l33660k29160k60051j76576n9139j88554Q4226J78264m3740j8406
$$ 20221023 19887363 19658203 19398152 19221576 19162437 18973883 19058109 19236373 19192633 19174227
3478A9174227q6777J33451J01676J20565L06749K47659K17940L64938J23397J67254
$$ 19174227 19087450 19220901 19322577 19443142 19749891 19997550 20215490 20580428 20703825 20871079
3468B0871079J18693K08963L37431J89953J45468K30348L20718J81867K94245
$$ 20871079 20989772 21198735 21536166 21726119 21871587 22101935 22422653 22604520 22898765
3459B2898765M24951L24600J36514J55764L32175K95496N20455O60884N38190
$$ 22898765 23323716 23648316 23784830 23940594 24272769 24568265 25088720 25749604 26287794
3450B6287794L25455L00201J33087L08983N98692M69989O12914L16615N88588
$$ 26287794 26613249 26913450 27046537 27355520 27954212 28424201 29037115 29353730 29942318
3441B9942318N59621P08321O31163L90516m9830k81571k2898O0554L50824K40059
$$ 29942318 30501939 31210260 31841423 32231939 32182109 31900538 31877640 31938194 32289018 32529077
3431C2529077K70878L41026J96579J59808K63591L58946K65427J46456M3442l1583
$$ 32529077 32799955 33140981 33337560 33497368 33760959 34119905 34385332 34531788 34575230 34543647
3421C4543647L9559j34564K23722L06778k28141n33595o80061n32359n00324n07215
$$ 34543647 34583206 34448642 34672364 34979142 34751001 34217406 33537345 33004986 32504662 31997447
3411C1997447l45508k32302j98945J79556K62342K90436J84163J35757J59451
$$ 31997447 31651939 31419637 31220692 31400248 31662590 31953026 32137189 32272946 32432397
3402C2432397j50514l66638n75381o06282m62739o62882n57640l58438l60443
$$ 32432397 32281883 31915245 31339864 30733582 30270843 29607961 29050321 28691883 28331440
3393B8331440l76420j41515J9377p2317J39064J91957K48959L5327L60685O86549
$$ 28331440 27955020 27813505 27832882 27760565 27899629 28091586 28340545 28375872 28736557 29423106
3383B9423106M68620M94923K67203K63297K45656j87073l23686l67399q5424K6673
$$ 29423106 29891726 30386649 30653852 30917149 31162805 30975732 30652046 30284647 30199223 30225896
3373C0225896L49098N28911R81097J073257J329238J518595J656290J827276K092358
$$ 30225896 30574994 31103905 32085002 33158259 34487497 36006092 37662382 39489658 41582016
3364D1582016K391347K462251K440758K575016K119156J751722J104313L12458
$$ 41582016 43973363 46435614 48876372 51451388 53570544 55322266 56426579 56739037
3356E6739037k93210o60922p49262p32686o36431p78816r00171j115791j318504
$$ 56739037 56445827 55784905 55035643 54302957 53666526 52887710 51987539 50871748 49553244
3347D9553244j781474k067134k337789k297002k296770k167707j921295j624385
$$ 49553244 47771770 45704636 43366847 41069845 38773075 36605368 34684073 33059688
3339C3059688j471755j417791j221278j252179r90592r17000q34484n80337m83557
$$ 33059688 31587933 30170142 28948864 27696685 26706093 25789093 24954609 24374272 23890715
3330B3890715m96879m92397m79046k66965l54566k33965l06710k39209k31246
$$ 23890715 23393836 22901439 22422393 22155428 21800862 21566897 21260187 21020978 20789732
3321B0789732l16577m14905j69022R8887r1646m3575R795k74110j00809R4481
$$ 20789732 20473155 20058250 19889228 19988115 19896469 19852894 19862689 19588579 19487770 19582251
3311A9582251q5864J07716J25788N5281j21313J20282m4110J48387J45002J85496
$$ 19582251 19496387 19604103 19729891 19785172 19663859 19784141 19740031 19888418 20033420 20218916
3301B0218916j21821o7025L5144J95490J01166N4298M2610N5656K79144L28888
$$ 20218916 20097095 20030070 20065214 20260704 20361870 20416168 20458778 20514434 20793578 21122466
3291B1122466K48570K70473M45058K92110K13335L48011K34162K53523K83859
$$ 21122466 21371036 21641509 22086567 22378677 22592012 22940023 23174185 23427708 23711567
3282B3711567K60305K34317p507K72747M13994L30792M02954M00075N47364L23339
$$ 23711567 23971872 24206189 24198682 24471429 24885423 25216215 25619169 26019244 26566608 26889947
3272B6889947N10995N28317O11614L55272N75782P12694N76790O08097L04546
$$ 26889947 27400942 27929259 28540873 28896145 29471927 30184621 30761411 31369508 31674054
3263C1674054O05381O44028L60121M61044L04504N31727N69962N28652N73829
$$ 31674054 32279435 32923463 33283584 33744628 34049132 34580859 35150821 35679473 36253302
3254C6253302M53792P23229N98657O82577O45139M47495L62190M31115L78431
$$ 36253302 36707094 37430323 38028980 38711557 39356696 39804191 40166381 40597496 40975927
3245D0975927N36339L31916M06590M83581L94689M44271N63368O35254O36550
$$ 40975927 41512266 41844182 42250772 42734353 43129042 43573313 44136681 44771935 45408485
3236D5408485O37294P50295Q25515P30478M20982L37375K86616K71021O63398
$$ 45408485 46045779 46796074 47621589 48352067 48773049 49110424 49397040 49668061 50331459
3227E0331459P95166R12420J062230J168886J369633J193180J216669J305603
$$ 50331459 51126625 52039045 53101275 54270161 55639794 56832974 58049643 59355246
3219E9355246J146782J367587J530057J566507J749781J827565J978651K033174
$$ 59355246 60502028 61869615 63399672 64966179 66715960 68543525 70522176 72555350
3211G2555350J782176J731751J900031J928036J815870J868686K107095J720644
$$ 72555350 74337526 76069277 77969308 79897344 81713214 83581900 85688995 87409639
3203H7409639J894667J756464J314316J071670J128436J115924R84807O33186
$$ 87409639 89304306 91060770 92375086 93446756 94575192 95691116 96675923 97309109
3195I7309109O28940N77510N58691M96792K66631R3647l19520l46217n54733q73315
$$ 97309109 97938049 98515559 99074250 99571042 99837673 99931320 99611800 99265583 98710850 97837535
3185I7837535r18734r28783r07091q87918j041363r40516j277094j256315j341441
$$ 97837535 96918801 95990018 95082927 94195009 93153646 92213130 90936036 89679721 88338280
3176H8338280j341222j741579j883039j697837j617907j630975j606563j567685
$$ 88338280 86997058 85255479 83372440 81674603 80056696 78425721 76819158 75251473
3168G5251473j788618j588927j593626j566026j221414j154055j313549j280567
$$ 75251473 73462855 71873928 70280302 68714276 67492862 66338807 65025258 63744691
3160F3744691j366441j176809j038268j145518r21382r06594r94916j057245j238269
$$ 63744691 62378250 61201441 60163173 59017655 58096273 57189679 56194763 55137518 53899249
3151E3899249j322141j247419j145756q92483q85608p21897n09441o33844q14350
$$ 53899249 52577108 51329689 50183933 49291450 48405842 47683945 47174504 46540660 45726310
3142D5726310q46365p78350p22946q45884q31774p53656q31827m36040n29385
$$ 45726310 44879945 44101595 43378649 42532765 41700991 40947335 40115508 39679468 39150083
3133C9150083p85758r44447q99688j000163r84103n78503m33927k05566k34714
$$ 39150083 38364325 37419878 36520190 35520027 34535924 33957421 33523494 33317928 33083214
3124C3083214k26894l43289m27682o56765o32560l97045m57357k64632l09723
$$ 33083214 32856320 32513031 32085349 31428584 30796024 30398979 29941622 29676990 29367267
3115B9367267m03060k19856k65254m51686n35142n77946o17779m34792n93387
$$ 29367267 28964207 28744351 28479097 28027411 27492269 26914323 26296544 25861752 25268365
3106B5268365k94186o3561m68332o36922m41767o33789o20350n39453m97261n34611
$$ 25268365 24974179 24910618 24442286 23805364 23363597 22729808 22109458 21570005 21072744 20538133
3096B0538133m78345m40005m50439m13876l76780l82666m83006j80159k74547
$$ 20538133 20059788 19619783 19169344 18755468 18378688 17996022 17513016 17332857 17058310
3087A7058310j79213q9763j67044j56510j5347k50615p9637j09856R7972l21143
$$ 17058310 16879097 16789334 16622290 16465780 16450433 16199818 16120181 16010325 16108297 15787154
3077A5787154m03604j01481m14457m19236l67314l73485m14641l19877k03403
$$ 15787154 15383550 15282069 14867612 14448376 14081062 13707577 13292936 12973059 12769656
3068A2769656k61035n08653l39086k89037m00991k61198j60509j19035j75778
$$ 12769656 12508621 11999968 11660882 11371845 10970854 10709656 10549147 10430112 10254334
3059A0254334j67488j61416r6278p4224L5689k13211j19010l4210j28127l29772
$$ 10254334 10086846 9925430 9829152 9754928 9790617 9577406 9458396 9424186 9296059 8966287
3049H966287j00600l3427L5244j6094j25467q7523q1178q6409j40422j43879r2796
$$ 8966287 8865687 8832260 8867504 8851410 8725943 8638420 8557242 8470833 8330411 8186532 8093736
3038H093736j33832k42727o6899j08126Q7307k5450k26522j63313l6099k9361
$$ 8093736 7959904 7717177 7650278 7542152 7629459 7604009 7377487 7214174 7178075 7148714
3028G148714n5393N276r846j0133o8242o3849j22302j10789J0479j73762L4226
$$ 7148714 7093321 7098597 7088751 7078618 7010376 6946527 6824225 6713436 6723915 6550153 6584379
3017F584379n2985k06608j60108J49854k07670Q9198j44990k71429M0204o6321
$$ 6584379 6531394 6324786 6164678 6314532 6106862 6196060 6051070 5779641 5819845 5753524
3007E753524J24008j23393n9365n4671k4631K1755n1166p0823K8877N9247O8880
$$ 5753524 5877532 5754139 5694774 5640103 5615472 5637227 5586061 5515238 5544115 5603362 5672242
2996E672242l1892j40574o7285P6045J32970j40809L6681K06305N1136k05438
$$ 5672242 5640350 5499776 5432491 5508536 5641506 5500697 5537378 5743683 5794819 5589381
2986E589381M0847q4463o3311p2016O9904M6386J1651M6507q8758q5320N0713
$$ 5589381 5630228 5545765 5482454 5410438 5480342 5526728 5538379 5584886 5496128 5410808 5461521
2975E461521M4970N4264j5843r5206O8871p949q4063M118j2307M1284L9734j5713
$$ 5461521 5506491 5560755 5544912 5449706 5518577 5510628 5426565 5430683 5418376 5459660 5499394 5483681
2963E483681P8823j737j46657j03404R3776J22592j02140j21813L7277n2353j5607
$$ 5483681 5562504 5560767 5414110 5310706 5404482 5527074 5424934 5303121 5340398 5288045 5272438
2952E272438N1709L1470K387M9355n0091r3867j03816J49007J55855n5867J22363
$$ 5272438 5324147 5355617 5358004 5407359 5357268 5263401 5159585 5308592 5464447 5408580 5530943
2941E530943J0052O6005J85668k1088O4939j31454j2274l238o3632p54n1473J87808
$$ 5530943 5540995 5607000 5792668 5771580 5836519 5705065 5692791 5689553 5625921 5625167 5573694 5761502
2929E761502j5286k5479J63328J1652P1077j14795O9877L3382J26164n3014R9594
$$ 5761502 5746216 5720737 5884065 5895717 5966794 5851999 5921876 5955258 6081422 6028408 6128002
2918F128002M1016K22886K84158N7051r1489M3531J04081N0936J42391M5880L48510
$$ 6128002 6169018 6391904 6676062 6733113 6641624 6685155 6789236 6840172 6982563 7028443 7376953
2907G376953K03956Q283k7715l12002k26195l42383j84502j12159j69882j64442
$$ 7376953 7580909 7589192 7561477 7249475 7023280 6680897 6496395 6384236 6214354 6049912
2897F049912k95143j77833r142n2382j8694K41971K7414q8370K0135r328j0658
$$ 6049912 5754769 5576936 5567794 5515412 5496718 5738689 5766103 5677733 5697868 5688540 5677882
2886E677882M777J15893L72702J40521J96501j36233j37078m4555p3465o4958
$$ 5677882 5682659 5798552 6171254 6311775 6508276 6372043 6234965 6190410 6116945 6051987
2876F051987L63614K58577Q7315k0690n2875m23224k91445l56966k76996p7728
$$ 6051987 6415601 6674178 6761493 6740803 6687928 6264704 5973259 5616293 5339297 5261569
2866E261569r0372p3192r0998p1997k55094P6104m641K04028L4844K1555J24240
$$ 5261569 5171197 5098005 5007007 4935010 4679916 4756020 4751379 4955407 4990251 5011806 5136046
2855E136046k8209Q5738J12092Q0385P3359l50027l98281k93687k66475l16694
$$ 5136046 5107837 5193575 5305667 5386052 5459411 5109384 4711103 4417416 4150941 3834247
2845C834247j99596j32804j32207j85061j21212k41044n5318k1341n5547m7272
$$ 3834247 3634651 3501847 3369640 3184579 3063367 2822323 2767005 2745664 2690117 2642845
2835B642845j31263j21602j14579N803l3183r8765l4283k12426R9535J5395m8426
$$ 2642845 2511582 2389980 2275401 2281204 2248021 2149256 2114973 1902547 2002082 2017477 1969051
2824A969051r1789M5995n4230j69838j3973K6671J0197l7741j23188j55198J37773
$$ 1969051 1877262 1923257 1869027 1699189 1685216 1711887 1722084 1684343 1561155 1405957 1543730
2813A543730R328p1844o2551M8879r7013M0345N7922K7795O3276j17568j62578
$$ 1543730 1553058 1481214 1418663 1467542 1370529 1410874 1468796 1496591 1559867 1442299 1279721
2802A279721N9148J1806P2487j31108K8028P8691k3215J5390o7823m4731p3733
$$ 1279721 1338869 1350675 1423162 1292054 1320082 1398773 1375558 1390948 1323125 1278394 1204661
2791A204661j48751M7517j312k0904L0724J98819l3311j4679k1532k02404K7471
$$ 1204661 1055910 1103427 1102115 1081211 1111935 1310754 1277443 1262764 1241232 1038828 1066299
2780A066299L4930L8852J4742k4952j5746J10220o3276j5165k8956J1374j7878
$$ 1066299 1101229 1140081 1154823 1129871 1114125 1224345 1161069 1145904 1116948 1128322 1110444
2769A110444N9351N144j33495p6487J04813q406o6771J27854l1150p8095n3814
$$ 1110444 1169795 1174939 1041444 964957 1069770 1061364 994593 1122447 1091297 1013202 959388
2758I59388L4740J03279j57430p7040J38597k1123m8637l8231o7990n5168J58543
$$ 959388 994128 1097407 939977 862937 1001534 980411 931774 893543 825553 770385 928928
2747I28928q1919j30038J08872J15469j0758k9045J16325L9993j88490k6218J11782
$$ 928928 847009 716971 825843 941312 930554 901509 1017834 1057827 869337 843119 954901
2736I54901O3026j55465N0174r5270k8578k0920J05879j25105j7234J78906j09205
$$ 954901 1017927 862462 912636 817366 788788 767868 873747 748642 731408 910314 801109
2725H01109j1957l8636l4077n2534J14646Q3440j02370n9598Q5395l9755j02525
$$ 801109 789152 750516 716439 663905 778551 861991 759621 700023 785418 745663 643138
2714F43138Q8515Q292J83969j54534j46144k2508L5805J50564n3734o4804j12002
$$ 643138 731653 739945 923914 769380 623236 600728 636533 787097 733363 668559 556557
2703E56557j5148O580J01593j67672J33073J17387N6744j1488P1640k22944J18015
$$ 556557 541409 547989 649582 481910 614983 732370 789114 777626 849266 626322 744337
2692G44337M3691p236j1904l1546Q6053p8949k0109L3215O4210j73709J8719J0091
$$ 744337 788028 780792 768888 737342 823395 744446 724337 757552 821762 648053 666772 676863
2680F76863k8062J41187m4432j9304P6563j70499Q4642M7609l0769P8679J45587
$$ 676863 648801 789988 745556 726252 802815 632316 716958 764567 733798 812477 958064
2669I58064j40953K7962n8215j02671L4333J06802L5374j55851K4593p3495P2900
$$ 958064 817111 845073 786858 684187 718520 825322 860696 704845 729438 655943 728843
2658G28843q741L7901j3130j38671q419J00991m8130n4682J91854N8588j58089
$$ 728843 720102 758003 744873 606202 597783 698774 650644 595962 787816 846404 688315
2647F88315J12531k2216n5818J5383M11j48162Q6402m9031j29893R3059J5110
$$ 688315 800846 778630 722812 738195 738606 590444 676846 627815 497922 590981 606091
2636F06091p2044J58949j02026j10540j3643Q7118j3330k0576K26029j18358j15971
$$ 606091 534047 692996 590970 480430 466787 553905 540575 519999 746028 627670 511699
2625E11699K2928R3595j35413p4145J6233M1644m8738J3877j04133n5376J00519
$$ 511699 534627 628222 492809 418664 434897 476541 427803 441680 337547 282171 382690
2614C82690J0524j74724k3151J81682J03871n2188j13271J95407j46645M3869
$$ 382690 393214 218490 195339 377021 480892 428704 315433 510840 364195 408064
2604D08064l0730j0220J15382L4565j39399j45696P9440k8098P7782m0731J2877
$$ 408064 377334 367114 482496 517061 377662 231966 311406 283308 361090 320359 333236
2593C33236M5166M2006p3995j744J36263r3462j04053k7824P795p833j57886J34585
$$ 333236 378402 420408 346413 344669 480932 387470 283417 255593 263388 255555 97669 232254
2581B32254J03460k9135o2669J1464J8496n8916K0450j1847m9603J16382o1290
$$ 232254 335714 306579 243910 255374 273870 214954 235404 223557 173954 290336 229046
2570B29046m2206J89440q7668j62008k6025J38722L9590o5664J77604o7915j12388
$$ 229046 186840 376280 288612 126604 100579 239301 278891 213227 390831 322916 210528
2559B10528J07136J05130j16971j06097j48008J86639O4563m1489o7218m0831
$$ 210528 317664 422794 305823 199726 51718 238357 302920 261431 194213 153382
2549A53382R027P9762O5805j72302m3641k2517J37171K8681j48325l4816J15381
$$ 153382 162409 242171 307976 135674 92033 69516 206687 235368 87043 52227 167608
2538A67608j9345j9680l795j34601L8133K9465N8593L8291j9807l0611k8449J01282
$$ 167608 148263 128583 124788 -9813 28320 57785 116378 154669 134862 104251 75802 177084
2526A77084K5773k9237q034N5318l9848M2300J24758j24729K0252r8679m5054
$$ 177084 202857 173620 165586 220904 181056 223356 348114 223385 243637 144958 99904
2515I9904K6379L465o2491K2617P6986j492P2218k5578j21252k3704N0517n7422
$$ 99904 126283 129748 67257 89874 166860 165368 237586 212008 90756 67052 117569 60147
2503F0147N0445P7547j72763J24504o94o6486P5432j24946J50030R0717n4312
$$ 60147 110592 188139 15376 139880 139186 72700 148132 23186 173216 263933 209621
2492B09621j46021k5784P3691K1105N9056j57905M3191J6756l4714Q1170M7044
$$ 209621 63600 37816 111507 132612 191668 33763 76954 93710 58996 140166 187210
2481A87210q5477r9729O9766j7430O789N3196q7766q4236K11297r281p8468J09506
$$ 187210 101733 2004 71770 54340 61129 114325 26559 -57677 153620 144339 65871 175377
2469A75377l6821m0504l0708P9986m1119n3093N2719o8467O6965m1098J66393
$$ 175377 138556 98052 67344 147330 106211 53118 105837 37370 104335 63237 229630
2458B29630j61858J51880J7238j73867k1844k0218J1726L4254j4278l4946J50644
$$ 229630 67772 219652 236890 63023 41179 20961 32687 66941 52663 17717 168361
2447A68361j34016l6283k7470r205J73056k2927L0412J0025r8281n4820R5205
$$ 168361 34345 -1938 -29408 -38613 134443 111516 141928 151953 53672 -1148 94057
2436I4057P5779p9338j70482J5229J53038J37859K3006o6544l9317k6118j66589
$$ 94057 169836 90498 -79984 -64755 88283 226142 249148 182604 143287 117169 -49420
2425d9420j6433O6272J35249j1444r6912J3567M8227L8976r0790J6945p2440J26678
$$ -49420 -65853 419 135668 124224 27312 40879 89106 128082 37292 54237 -18203 108475
2413A08475M2114j10703k9664j33106R9748R1386M1120j1783K1911K6119j20456
$$ 108475 150589 39886 10222 -122884 -23136 68250 109370 97587 119498 145617 25161
2402B5161Q0411M5450O4991j05183k7908J32353j20409k09730J89975R6132k3855
$$ 25161 105572 151022 216013 110830 82922 215275 94866 -114864 75111 171243 147388
2391A47388J3320l5534p78M8199L9425p2396R434l4879p6029N9458l6524j2115
$$ 147388 160708 125174 124396 172595 212020 139624 149058 114179 38150 97608 61084 48969
2379D8969n5767j8272R3789o8588j1181O8241J93410L900j86304J1464J52433
$$ 48969 -6798 -25070 68719 131 -11050 57191 250601 254501 68197 79661 232094
2368B32094k01372j24448J23675J06436M4185n0831j17000P9024q0118O2564N2005
$$ 232094 30722 -93726 29949 136385 180570 129739 12739 91763 11645 74209 126214
2357A26214k6907j20040j30289M0461K3824L5950J12391K2764k6023l7910J8505
$$ 126214 99307 -20733 -151022 -110561 -86737 -50787 61604 84368 58345 20435 38940
2346C8940J4672Q5209R5478k08353l0649l2315J33663J44023n9233r6776N1682
$$ 38940 53612 138821 234299 25946 -4703 -37018 96645 240668 181435 84659 136341
2335A36341k2246m551j00301R0878R2855j19542j45101J11710n4694K0988q5552
$$ 136341 114095 109544 9243 100121 192976 73434 -71667 40043 -14651 6337 -79215
2324g9215k3387M3737q4416M6824O6907N3605m3222r7484q1459P7727Q1052o9518
$$ -79215 -102602 -58865 -143281 -96457 -29550 24055 -19167 -116651 -198110 -120383 -39331 -108849
2312a08849M1909K3387Q2425j08365j7880K07184q2173o6651m6195J34182J4925
$$ -108849 -66940 -43553 38872 -69493 -87373 119811 37638 -29013 -75208 58974 73899
2301G3899J5066J41919p1599m4047K5241j0240o5999q1778K2803l4257J00853
$$ 73899 88965 230884 159285 115238 140479 130239 64240 -17538 5265 -28992 71861
2290G1861J5986m727M4113q1774o2943J5371o0677k7387R3396l2754J49154K6967
$$ 71861 87847 83120 127233 45459 -17484 -2113 -62790 -90177 3219 -29535 119619 146586
2278A46586l4890q5315J669O1447L1398l4696N8332J9933r066L4137j10843J18126
$$ 146586 111696 26381 28050 89497 120895 86199 144531 164464 155398 189535 78692 196818
2266A96818j04059r7490M7083Q3194K7152K7092q1394j05081Q9564P3745Q9584
$$ 196818 92759 -4731 42352 125546 152698 179790 98396 -6685 82879 156624 246208
2255B46208l2394o4984J14123j64969l5119O4034p2634J43771p9572L6695p0676
$$ 246208 213814 148830 262953 97984 62865 126899 54265 198036 118464 155159 84483
2244H4483J23897r3114m9951p8413m294Q9572l833j54979N5799J87662K8231J02420
$$ 84483 208380 115266 65315 -13098 -17392 72180 68347 -86632 -30833 156829 185060 287480
2232B87480o5980k17404K1323l8900Q1798Q5365j88868K0699J35272J73798j46138
$$ 287480 221500 4096 25419 -13481 68317 153682 -35186 -14487 120785 294583 148445
2221A48445o2165R1788p6630N2783Q852j75980J67591j27586q9353p1884L5302
$$ 148445 86280 178068 101438 154221 163073 -12907 154684 27098 -62255 -134139 -98837
2210i8837O9172n241J9544M6441r174o0414Q2286j8328o8808Q3867k5317J46164
$$ -98837 -29665 -34906 -15362 31079 21905 -38509 43777 25449 -43359 40508 15191 161355
2198A61355K5413p9082n2174O2204L0003j41951j13062K31134o9967j34700r565
$$ 161355 186768 107686 55512 117716 147719 5768 -107294 123840 53873 -80827 -90392
2187i0392J9867O8344K0958M8044m5866r6293J22716L7339j0714j826k7420M0921
$$ -90392 -70525 -2181 18777 66821 20955 -75338 47378 84717 74003 72177 44757 85678
2175H5678O115m4326J1363o904L5652J7848p4817K3909m1269K9950M7264j02996
$$ 85678 91793 47467 58830 51926 87578 105426 30609 54518 13249 43199 90463 -12533
2163a2533L1993N9956k0738M2832j23785l9521K03298L9246j25224j17029J2995
$$ -12533 19460 79416 58678 101510 -22275 -61796 141502 180748 55524 -61505 -48510
2152d8510J7065n0175j9367O0103M8116J23190j5011P4325o6300K2489M3373p8388
$$ -48510 -31445 -81620 -100987 -40884 7232 130422 115411 189736 123436 145925 189298 110910
2140A10910k1455J51797j54780r814J4600Q9192K3771j24825J30988j77774J87899
$$ 110910 89455 241252 86472 76658 91258 180450 204221 79396 210384 32610 220509
2129B20509j8523j73052Q5383P3200j9175j2344L6287J932m7556P7127K0883r5798
$$ 220509 201986 28934 114317 187517 168342 155998 192285 194217 146661 223788 244671 148873
2117A48873L0514J11630K4136R814p5943j2659J01236J12931p5256l6361J1884
$$ 148873 179387 291017 315153 324967 249024 236365 337601 450532 375276 338915 350799
2106C50799Q9109L4375R1418L6423j67699R6035K39086N476o9940p5086k7446
$$ 350799 439908 474283 565701 602124 434425 530460 769546 775022 705082 629996 602550
2095F02550N6969K12369R5797l09590J96528P7138J48661k1547Q2430J23129m4037
$$ 602550 659519 871888 967685 658095 854623 931761 1080422 1058875 1141305 1264434 1220397
2084A220397N5985J89757Q5472o4416J00916K00357K77405n7569J31034L7840
$$ 1220397 1276382 1466139 1551611 1487195 1588111 1788468 2065873 2008304 2139338 2177178
2074B177178J50811N3179K09145N3574J48716Q0003L03069K93682K74462K52115
$$ 2177178 2327989 2381168 2590313 2643887 2792603 2872606 3175675 3469357 3743819 3995934
2064C995934M26691M36378M97083L09548O41062O11013P28762Q91985J654236
$$ 3995934 4422625 4859003 5356086 5665634 6306696 6917709 7646471 8538456 10192692
2055A0192692J470412K564313L689628N213512O59402k947737l647447l551272
$$ 10192692 11663104 14227417 17917045 23130557 23789959 20842222 17194775 13643503
2047A3643503k092861j926708j261065j165470q57825o76084l15629n78637n02935
$$ 13643503 11550642 9623934 8362869 7197399 6339574 5663490 5347861 4769224 4266289
2038D266289m57462j53158l67302o3420l02481j68809l68651j78003j23281j93722
$$ 4266289 3808827 3655669 3288367 3224947 2922466 2753657 2385006 2207003 2083722 1890000
2028A890000k372q9614l07481j61193L1615J18736m1999K6319k61360j44373J01417
$$ 1890000 1887628 1798014 1490533 1329340 1360955 1479691 1437692 1464011 1202651 1058278 1159695
2017A159695N5256k68298R3644j57647j3250o7219p8473o466J48175j57072n6014
$$ 1159695 1214951 946653 1040297 882650 869400 802181 723708 717242 865417 708345 652331
2006F52331L2737p1851m674N3848o8493O8454k2245r3797k9290l9923n5062J8671
$$ 652331 685068 613217 608543 662391 593898 662352 640107 546310 517020 477097 422035 440706
1994D40706O113J0424q6530J45347j612j45538K0030J42103l6684l0492J18227
$$ 440706 446819 457243 370713 516060 514448 368910 388940 531043 494359 463867 582094
1983E82094j06479p5484M5359K6077k7545j28850P3592j56101P7080K0875n3126
$$ 582094 475615 400131 445490 471567 444022 315172 388764 232663 309743 330618 277492
1972B77492N1L3690m9858n9327N3029P0298n788o3650l0982p1879O6120m0591
$$ 277492 277543 311233 261375 202048 255077 325375 319587 255937 224955 153076 219196 178605
1960A78605p286j04480K09192M7767k28r2243j01545M351r7315Q4116m3856l0463
$$ 178605 171319 66839 276031 323798 323570 231327 129782 134133 36818 120934 77078 46615
1948D6615M9152K3053K58444j52549m4875l2215J2604j66393Q1674K1594J29616
$$ 46615 95767 118820 377264 224715 179840 147625 160229 -6164 75510 97104 226720
1937B26720j8623Q127p6827j22074J56341r7458O125K0236o0755j96777K27735
$$ 226720 208097 216224 139397 17323 173664 76206 82331 102567 41812 -154965 72770
1926G2770O4311j47871J71312O4784j16940K0752m6966n3564J9259J24455P2307
$$ 72770 137081 -10790 160522 225306 108366 129118 82152 28588 47847 172302 244609
1915B44609j38493J7784j18458J1415n6216J21494N2629M0105N6331j25219K4612
$$ 244609 106116 123900 5442 16857 -39359 82135 134764 174869 231200 105981 130593
1904A30593L6478j31260J51726q4244o3046P2036n3182j66813J19815J32056j37903
$$ 130593 167071 35811 187537 103293 40247 112283 59101 -107712 12103 144159 6256
1893F256J34264J3975J47491q990j49901j4324L5179j52589J00475o9137r1474
$$ 6256 140520 154495 301986 292996 143095 128771 163950 11361 111836 42699 -48775
1882d8775L228O9930l751M4130K37605m3394j65411j7032P1561p3681l4506J12850
$$ -48775 -45547 24383 20632 64762 302367 258973 93562 76530 148091 74410 39904 152754
1870A52754o3237k3145L165j35676J02791n7969P6281Q2284j03967l617O9519
$$ 152754 89517 66372 69537 -66139 36652 -21317 54964 137248 33281 29664 99183
1859I9183R6515J995j79102J27475J3702q7354l9314J5513Q9736l0362J49124
$$ 99183 195698 197693 18591 146066 159768 72414 33100 48613 138349 107987 257111
1848B57111n3267p2221o8681J08944K8025j44128J59549k36491J60311q0163j68134
$$ 257111 203844 131623 62942 171886 199911 55783 215332 -21159 139152 58989 -109145
1837a09145J37741K7569K4573m3611p0438Q8928J17237r091p1533N129q5431J42069
$$ -109145 28596 56165 80738 37127 -33311 55617 172854 163763 92230 97359 11928 153997
1825A53997j32475O050O9890J01809O1718m8346q7089j69941J54621R8961j2717
$$ 153997 21522 27572 97462 199271 260989 212643 125554 -44387 110234 209195 196478
$$ [...]
##END NTUPLES=NMR SPECTRUM
##END=
