##TITLE=1H_CA-9291-1
 DMSO-d6
 8 sc, 
 7.10.2024
##JCAMPDX= 6.0         $$ Bruker NMR JCAMP-DX V2.0
##DATA TYPE= NMR SPECTRUM
##DATA CLASS= NTUPLES
##ORIGIN= UXNMR, Bruker Analytische Messtechnik GmbH
##OWNER= root
$$ XWIN-NMR		Version 3.5
$$ Mon Oct  7 14:09:22 2024 Russian Standard Time (UT+4h)  she@DPX200
##.OBSERVE FREQUENCY= 200.1318
##.OBSERVE NUCLEUS= ^1H
##.ACQUISITION MODE= SIMULTANEOUS
##.ACQUISITION SCHEME= undefined
##.AVERAGES= 8
##.DIGITISER RES= 18
##SPECTROMETER/DATA SYSTEM= spect
##.PULSE SEQUENCE= zg30
##.SOLVENT NAME= DMSO
##.SHIFT REFERENCE= (INTERNAL, DMSO, 0, 20.9929)
##AUDIT TRAIL= $$ (NUMBER, WHEN, WHO, WHERE, WHAT)
$$ ##TITLE= Audit trail, XWIN-NMR		Version 3.5
$$ ##JCAMPDX= 5.01
$$ ##ORIGIN= Bruker BioSpin GmbH
$$ ##OWNER= she
$$ F:/spectra/data/she/nmr/H-F/1/pdata/1/auditp.txt
$$ ##AUDIT TRAIL=  $$ (NUMBER, WHEN, WHO, WHERE, WHAT)
(   1,<2024-10-07 14:07:42.65 +0400>,<she>,<DPX200>,
      <created by zg, POWCHK disabled, PULCHK disabled
       configuration hash MD5:
       00 E9 B6 7A A2 85 ED C7 34 08 36 98 17 FE 4E 26
       data hash MD5: 16K
       22 65 D1 B9 4A 5B D4 CB A3 A2 D5 A7 BA F0 92 31>)
(   2,<2024-10-07 14:07:45.28 +0400>,<she>,<DPX200>,
      <Start of raw data processing
       efp BC_mod = 2 LB = 0.24 FT_mod = 6 PKNL = 1 PHC0 = -26344.99 PHC1 = 14.18747 SI = 16K 
       data hash MD5: 16K
       97 2D 96 BF 54 EC 4D F6 41 D9 A8 85 59 E7 1A C5>)
(   3,<2024-10-07 14:08:02.79 +0400>,<she>,<DPX200>,
      <pk PHC0 = -3.097524 PHC1 = -1.4 
       data hash MD5: 16K
       D7 18 7B 02 59 20 14 D2 08 6B 02 3D D6 6C 60 DF>)
(   4,<2024-10-07 14:08:06.07 +0400>,<she>,<DPX200>,
      <abs ABSG = 5 
       data hash MD5: 16K
       22 99 3B E2 A7 FC D1 9E 70 86 38 ED B9 18 46 57>)
(   5,<2024-10-07 14:08:22.14 +0400>,<she>,<DPX200>,
      <abs ABSG = 5 
       data hash MD5: 16K
       D0 9B 97 4B 84 E8 06 06 87 C9 64 77 93 F4 F6 CF>)
$$ ##END=
$$ 
$$ hash MD5
$$ 0F 9C 38 53 D3 BA 07 3E 9F 7D E7 4D 34 C8 1B 84
##$RELAX= 
##$RELAX= 
##$RELAX= 
##$RELAX= 
##$RELAX= 
##$RELAX= 
$$ Bruker specific parameters
$$ --------------------------
##$DU= <F:/spectra>
##$EXPNO= 1
##$NAME= <H-F>
##$PROCNO= 1
##$TYPE= <nmr>
##$USER= <she>
##$AMP= (0..31)
100 100 100 100 100 100 100 100 100 100 100 100 100 100 100 100 100 100 
100 100 100 100 100 100 100 100 100 100 100 100 100 100 
##$AQSEQ= 0
##$AQ_mod= 1
##$AUNM= <au_zg>
##$AUTOPOS= <>
##$BF1= 200.13
##$BF2= 200.13
##$BF3= 200.13
##$BF4= 200.13
##$BF5= 200.13
##$BF6= 200.13
##$BF7= 200.13
##$BF8= 200.13
##$BYTORDA= 1
##$CFDGTYP= 0
##$CFRGTYP= 5
##$CHEMSTR= <none>
##$CNST= (0..31)
1 1 145 1 1 1 1 1 1 1 1 1 1 1 1 1 1 1 1 1 1 1 1 1 1 1 1 1 1 1 1 1 
##$CPDPRG= <>
##$CPDPRG1= <>
##$CPDPRG2= <>
##$CPDPRG3= <>
##$CPDPRG4= <mlev>
##$CPDPRG5= <mlev>
##$CPDPRG6= <mlev>
##$CPDPRG7= <mlev>
##$CPDPRG8= <mlev>
##$CPDPRGB= <>
##$CPDPRGT= <>
##$D= (0..31)
0 1.2 0 0 0 0 0 0 0 0.06 0 0.03 0 0 0 0 0.0002 0 0 0 0 0 0 0 0 0 0 0 0 
0 0 0 
##$DATE= 1728295662
##$DBL= (0..7)
$$ [...]
##$SUBNAM3= <"">
##$SUBNAM4= <"">
##$SUBNAM5= <"">
##$SUBNAM6= <"">
##$SUBNAM7= <"">
##$SUBNAM8= <"">
##$SUBNAM9= <"">
##$SW= 24.0689170037331
##$SWIBOX= (0..15)
0 0 2 0 0 0 0 0 0 0 0 0 0 0 0 0 
##$SW_h= 4816.95568400771
##$TD= 16384
##$TD0= 1
##$TE= 0
##$TE2= 300
##$TE3= 300
##$TEG= 300
##$TL= (0..7)
0 120 120 120 120 120 120 120 
##$TP= (0..7)
150 150 150 150 150 150 150 150 
##$TP07= 0
##$TPNAME0= <>
##$TPNAME1= <>
##$TPNAME2= <>
##$TPNAME3= <>
##$TPNAME4= <>
##$TPNAME5= <>
##$TPNAME6= <>
##$TPNAME7= <>
##$TPOAL= (0..7)
0.5 0.5 0.5 0.5 0.5 0.5 0.5 0.5 
##$TPOFFS= (0..7)
0 0 0 0 0 0 0 0 
##$TUNHIN= 0
##$TUNHOUT= 0
##$TUNXOUT= 0
##$USERA1= <user>
##$USERA2= <user>
##$USERA3= <user>
##$USERA4= <user>
##$USERA5= <user>
##$V9= 5
##$VALIST= <valist>
##$VCLIST= <CCCCCCCCCCCCCCC>
##$VD= 0
##$VDLIST= <DDDDDDDDDDDDDDD>
##$VPLIST= <PPPPPPPPPPPPPPP>
##$VTLIST= <TTTTTTTTTTTTTTT>
##$WBST= 1024
##$WBSW= 4
##$XGAIN= (0..3)
0 0 0 0 
##$XL= 0
##$YL= 0
##$YMAX_a= 843680
##$YMIN_a= -784513
##$ZGOPTNS= <>
##$ZL1= 120
##$ZL2= 120
##$ZL3= 120
##$ZL4= 120
##$ABSF1= 20.99292
##$ABSF2= -3.076212
##$ABSG= 5
##$ABSL= 3
##$ALPHA= 0
##$AQORDER= 0
##$ASSFAC= 0
##$ASSFACI= 0
##$ASSFACX= 0
##$ASSWID= 0
##$AUNMP= <proc_1d>
##$AZFE= 0.1
##$AZFW= 0.1
##$BCFW= 0
##$BC_mod= 2
##$BYTORDP= 0
##$COROFFS= 0
##$CY= -3
##$DATMOD= 1
##$DC= 0
##$DFILT= <>
##$DTYPP= 0
##$F1P= 0
##$F2P= 0
##$FCOR= 1
##$FTSIZE= 16384
##$FT_mod= 6
##$GAMMA= 0
##$GB= 0
##$INTBC= 1
##$INTSCL= 3.70164e-10
##$ISEN= 128
##$LB= 0.24
##$LEV0= 0
##$LPBIN= 0
##$MAXI= 10000
##$MC2= 0
##$MEAN= 0
##$ME_mod= 0
##$MI= 1.114404
##$NCOEF= 0
##$NC_proc= -5
##$NLEV= 6
##$NOISF1= 3.799351
##$NOISF2= 2.8
##$NSP= 0
##$NTH_PI= 0
##$NZP= 0
##$OFFSET= 20.99292
##$PC= 1
##$PHC0= -26348.09
##$PHC1= 12.78747
##$PH_mod= 1
##$PKNL= yes
##$PPARMOD= 0
##$PSCAL= 0
##$PSIGN= 0
##$REVERSE= no
##$SF= 200.1300071649
##$SI= 16384
##$SIGF1= 3
##$SIGF2= 2
##$SINO= 5.538805
##$SIOLD= 16384
##$SREGLST= <1H.CDCl3>
##$SSB= 0
##$STSI= 16384
##$STSR= 0
##$SW_p= 4816.95568400771
##$SYMM= 0
##$S_DEV= 0
##$TDeff= 16384
##$TDoff= 0
##$TI= <>
##$TILT= no
##$TM1= 0
##$TM2= 0
##$TOPLEV= 0
##$USERP1= <user>
##$USERP2= <user>
##$USERP3= <user>
##$USERP4= <user>
##$USERP5= <user>
##$WDW= 1
##$XDIM= 16384
##$YMAX_p= 395326289
##$YMIN_p= -335222
$$ End of Bruker specific parameters
$$ ---------------------------------
##NTUPLES= NMR SPECTRUM
##VAR_NAME=  FREQUENCY,     SPECTRUM/REAL,   SPECTRUM/IMAG
##SYMBOL=    X,             R,               I
##VAR_TYPE=  INDEPENDENT,   DEPENDENT,       DEPENDENT
##VAR_FORM=  AFFN,          ASDF,            ASDF
##VAR_DIM=   16384,         16384,           16384
##UNITS=     HZ,            ARBITRARY UNITS, ARBITRARY UNITS
##FACTOR=    0.29402158847633, 1,            1
##FIRST=     4201.31321437702, 0,            0
##LAST=      -615.642469630694, 0,           0
##MIN=       -615.642469630694, -335222,     0
##MAX=       4201.31321437702, 395326289,    0
$$ Real data points
##PAGE= N=1
##DATA TABLE= (X++(R..R)), XYDATA
$$ [...]
6565C01311l8379k4718j15741K00704L9548q0639J2778J011q3546Q7520p168n3325
6553B39356k6339n1635J7638m0633K3516J35180p1868N8340L12Q2897o0163k6744
6541B79857j70623J35197l1038k5995L8115M8810j9005j04690P9692k300n3779
6530A74241Q4946j1045o4738p7495L1552k3923k1214J50178N4779o4047j23309
6519A09925K01287r2710j20020J42775K7937o6509P3988k4203j27689r4985J44299
6508A74095q2261J9543j0730M8433M4082m452j6534m290J8369j9401k0477N8002
6496B04379L1785m9098O322N6477j8321n858m3526n2126N0903J148N8696J65409
6484D06190k22807J4876j174m832m0034j3101R3232L9605l4093j3619o2437l419
$$ y = [301311, 262932, 238214, 122473, 323177, 362725, 282086, 294864, 295875, 212329, 299849, 292681, 239356, 213017, 161382, 179020, 138387, 161903, 297083, 225215, 283555, 283867, 366764, 306601, 279857, 109234, 244431, 213393, 187398, 225513, 274323, 255318, 150628, 230320, 228020, 174241, 259187, 248142, 183404, 105909, 137461, 113538, 92324, 242502, 297281, 233234, 109925, 311212, 218502, 98482, 241257, 269194, 202685, 276673, 252470, 124781, 29796, 174095, 91834, 111377, 100647, 149080, 193162, 188710, 172176, 167886, 186255, 166854, 146377, 204379, 236164, 187066, 193388, 249865, 231544, 225686, 182160, 130034, 180937, 182085, 240781, 406190, 183383, 198259, 197085, 192253, 152219, 139118, 232350, 271955, 237862, 224243, 161806, 158387]
6472A58387P5616K5005j12425j6575L0876J2505Q526K9548K061J0140J6631o3898
6460A76397m4944J5615k5691J19672N045q6260O8699l4066j30348M8473L4277
6449A46869l4051J67618j21293R028m1390P4274r6398l7552l8418J92060l5041
6438A85706m1622L8867M72n5960l2656Q2553p3833r0485p4297N9290N0839J3671
6426F2545M6377K5794J3372j24823R3077N0272m0245R965J05307k0733q0703K6076
6414A66281j00681R27K4512J4007J12081l9682p1194m5841M957J04167m598n2239
6402A12697j6631n7804o4905J08750j0712P4562r1841j0052N4550M908K043q2839
6390B2726K8046O1192O3418J1079q4750J40414m5423m4783r2620o4791J69193
$$ y = [158387, 234003, 259008, 146583, 130008, 160884, 173389, 181915, 211463, 213524, 223664, 240295, 176397, 131453, 147068, 121377, 241049, 246094, 159834, 228533, 194467, 64119, 112592, 146869, 112818, 280436, 159143, 168171, 126781, 201055, 104657, 67105, 28687, 220747, 185706, 144084, 182951, 183423, 127463, 94807, 177360, 103527, 13042, -61255, -1965, 48874, 62545, 108922, 134716, 148088, 23265, 116342, 166614, 126369, 136334, 241641, 220908, 140205, 166281, 65600, 66527, 91039, 105046, 217127, 177445, 106251, 60410, 65367, 169534, 164936, 112697, 96066, 38262, -26643, 82107, 71395, 145957, 54116, 44064, 98614, 103522, 105565, 22726, 50772, 111964, 175382, 186461, 101711, 242125, 196702, 151919, 59299, -5492, 163701]
6379A63701j795j12739N6597j45761j6724P0472R5719j17891P892P2663q197K976
6367F6913J32240j4621n8118j02876k5808L4570N1642J06822o1287j8647J4289
6356A25119N6614l6304j32731k1632m4187L1242p2169L8705J65128O1731j01661
6345F9855j06663J7721P649J20421j27420P265P3772q2540L3359J29176q7412
6334E5183o8874J1791Q2987n8834M7614k5801R7317l6230M8757m2651k0809o7848
6322B2602m7828m3192J03389R0889n3043K4077r3002R5504r4054j9718Q300O61
6310e415P1569k47720J14184P4572J32535K0278k60997Q7502Q6916J9379l5545
6299E7258k3113P1944M8068p2280r6198J73697o9365n1636N5288N514j3267o104
$$ y = [163701, 161906, 49167, 105764, -39997, -56721, 13751, 109470, -8421, -529, 72134, 63937, 66913, 199153, 184532, 126414, 23538, -2270, 32300, 83942, 190764, 129477, 110830, 125119, 181733, 145429, 12698, -8934, -53121, -21879, -94048, -55343, 109785, 171516, 69855, -36808, -19087, -11438, 108983, -18437, -11172, 62600, -19940, 13419, 142595, 55183, -13691, -1900, 81087, 22253, 69867, 44066, 141383, 105153, 153910, 111259, 90450, 22602, -25226, -68418, 34971, 125860, 72817, 96894, 3892, 99396, 5342, -14376, -6076, -5415, 66154, -181566, -67382, 7190, 139725, 160003, -100994, -13492, 73424, 92803, 57258, 34145, 106089, 154157, 81877, -14321, 159376, 90011, 38375, 93663, 99177, 85910, 79806]
6287G9806l5202j7627L9282j6792K9735K6987m2779n8441q8751J9724R1395L4620
6275F1957j4495j09518R8186P1152J0632o4732o0672o0603J2585Q0339Q7690o4657
6263D7864k2423K222r6095N3208Q777P01L3443J0015l34o5069M0510M9060M9945
6250A11824j69683o615J55445m6758j8282j83452P7339J14926l2749L3889J18560
6239A54444j47792q9324J23889P6377j231o3055m1912N9691p730l3003m4198M6174
6227C2330q3934j11450J31259P1670j0710o3460J25798K9115o5503J14634o7653
6216A02096R658k0106m9213j26108M48Q6334k2694r2681M2500J2066L7052j02446
6204a23094m7102J79567l6632L3576N5739L5666j25658M7916m7629r0782Q4933
$$ y = [79806, 44604, 26977, 66259, 49467, 79202, 106189, 63410, 4969, -83782, -64058, 27337, 61957, 47462, -62056, 36130, 107282, 117914, 53182, -7490, -68093, -55508, 24831, 112521, 47864, 25441, 27663, -68432, -15224, -6447, -5746, 27697, 37712, 37378, -27691, 12819, 61879, 111824, -57859, -64474, 90971, 44213, 25931, -157521, -80182, 34744, 1995, 35884, 154444, 6652, -82672, 41217, 117594, 116363, 53308, 11396, 71087, 63357, 30354, -13844, 32330, -51604, -163054, -31795, 39875, 29165, -34295, 91503, 120618, 55115, 169749, 102096, 111754, 91648, 42435, -83673, -83225, 3109, -19585, -112266, -69766, -57700, -20648, -123094, -170196, 9371, -27261, 6315, 62054, 97720, -27938, 19978, -27651, -118433, -33500]
6193c3500K6698p1223o474m6338N1469M886J06268J369n7670L3109N3193j00974
6181c9187J8402j42416J01863q4531O3257M9260J5835K9930N9778n5639R635p238
6169A8949j3381J9449O1728m7843j7005K6691l0428p7179J139O0311J52890j34446
6157B0875j91813Q6613J17687R46k3584k9709N8692l3182j00998R3792K8106j1850
6145A5575n616J8424j54369Q7917P895J3257m8928M9289j5341J05635p1652Q5233
6133H7319l60P1718j36945j4880R3268m0599j1985P6922l2376j40843l0620J1118
6121f8263Q4748j04516L598R1521k0819j76211Q9188O2049j0225N8324j09373
6110i9979L3861R1183j12951J13183p013q0207N341m473K1579n4344N6075O8940
$$ y = [-33500, -6802, -78025, -84499, -130837, -79368, -74482, 31786, 33155, -24515, 8594, 61787, -39187, -20785, -163201, -61338, -145869, -82612, -33352, -17517, 12413, 72191, 16552, 26187, 18949, 5568, 25017, 86745, 38902, 21897, 48588, 18160, -59019, -57880, 2431, 155321, 20875, -170938, -84325, 33362, 34308, 10724, -18985, 39707, 6525, -94473, -681, 27425, 15575, 9959, 28383, -125986, -38069, -30174, -16917, -65845, -16556, -31897, 73738, 2086, 87319, 86959, 158677, 21732, 6852, 100120, 59521, 47536, 124458, 92082, -48761, -79381, -68263, 16485, -88031, -84433, 7088, -13731, -189942, -100754, -38705, -48930, 9394, -99979, -66118, 25065, -87886, 25297, 18284, -61923, -56582, -61055, -39476, -93820, -37745, 31195]
6098C1195m0061p7706j5666J18627Q5763l6731K7551o3654q012L6459m3615p3496
6086e9346N456j7637L8284m295j07814P7425J9759P4523M5192j14119k2979J46164
6074H0613l0921p9211K6505k5040O1303k7057Q1922m5795R607k5962P5389q9417
6062A1936j2536J00558k4549j79353k5136o8111O2390O3832Q3107m2590q1669
6051a12121L6128l8825R0534O388n7622M0001J78239j69508k8618P507N3069K0324
6039B5496n8390k7264p7226J78804j5370K6331l9494j29327J20242m9501L6781
6028h918K176Q1652j08393n000N9110j61149R2065J8277j24774N6778Q211l6394
6016a26359K8301P4617m8427k1287J34964l0440K6175j0768J06115j35825n3815
$$ y = [31195, -8866, -86572, -102238, 16389, 102152, 65421, 92972, 29318, 21306, 57765, 14150, -59346, -53890, -71527, -33243, -37538, -145352, -67927, -48168, 26355, 71547, -42572, -65551, 80613, 49692, -29519, -3014, -28054, 33249, 6192, 88114, 42319, 51926, 25964, 101353, 11936, -600, 99958, 75409, -103944, -129080, -197191, -134801, -70969, 12138, -30452, -112121, -75993, -114818, -24284, -17896, -75518, -35517, 142722, -26786, -55404, -47897, 5172, 25496, -32894, -60158, -137384, 41420, 26050, 52381, 12887, -116440, 3802, -45699, -8918, -6742, 74910, -33483, -38483, 20627, -140522, -48457, -30180, -154954, -98176, -89965, -126359, -98058, -23441, -71868, -93155, 41809, 11369, 37544, 26776, 132891, -2934, -56749]
6005e6749R4607j12451N0717l2814q0182k2233L3660J44986q6605n7341N3102
5994g1303J22858l2385L2792k1042N6788m3330k3687p4430j30498M1062L6699
5983a06476l5085L0257J24072p6054N2381l1627P3877j25945j2709N4754o7266
5972a19821P7521N2885p91j8912J06994r2981L600k1258J25600j09923p9613O37
5960g6062L471J16622r3949J46918n2837j2879Q997o401n5935J54486n6678j26448
5948e0695K8404J03356n8045l1356P1473M7688o0084J04001j98463J9619N2175
5937B8073n0711J35134L0810j45530m0450J56640q8376l3167O6157n9369l1644
5926c2433N6855r7672K8753J24160k1905j9452q0232O5060k2489M5174j1090J3191
$$ y = [-56749, 37858, -74593, -23876, -56690, -136872, -159105, -125445, 19541, -67064, -124405, -71303, 51555, 19170, 51962, 30920, 87708, 44378, 20691, -53739, -184237, -143175, -106476, -141561, -111304, 12768, -63286, -10905, -42532, 31345, -94600, -107309, -52555, -119821, -42300, 10585, 9794, -9118, 97876, 4895, 8495, -12763, 112837, 2914, -76699, -76062, -72591, 44031, -49918, 97000, 44163, 31284, 40281, 33880, -22055, 132431, 75753, -50695, -22291, 81065, 23020, -8336, 63137, 110825, 50741, 154742, -43721, -24102, 28073, -22638, 112496, 143306, -2224, -42674, 113966, 25590, -7577, 58580, -789, -32433, 24422, -73250, -44497, 79663, 57758, 38306, -41926, 23134, 645, 45819, 34729, 47920]
5914D7920l0541J4952k2890q5852n2349P5906q144m4369j4447Q9527Q024P9044
5902E6781j4882q0944K3595M3930K2374K0519n6800q9403n541o4586N5340J17508
5890B7891l4080o828k7565l3567K6500N1147J41195n3189n6200j67823J4616j6926
5878a34829K2362Q7871M7162J0814p072r405j6064l6005r364m9785N5034l3415
5866g2696N7188P8594r4859m9561L7517O339R5063m8264m0316L8171J13894j03043
5854A8027p716k0435J869j32872J2725O3317O1570J4364n8953L1246j1824j26048
5842a54730o2538J73063Q2591n3901j45115O5393l452j4863k8508K5438J68809
5831E2187j47366j0577J42397l9898q6379p8185J26401J08026K2793j38084K1191
$$ y = [47920, 17379, 32331, 9441, -76411, -128760, -52854, -60998, -105367, -119814, -30287, -22263, 56781, 41899, -39045, -15450, 28480, 50854, 71373, 14573, -74830, -80371, -144957, -89617, 27891, -6189, -13017, -40582, -74149, -47649, 3498, 144693, 91504, 35304, -132519, -117903, -134829, -112467, -24596, 22566, 33380, 26308, 16903, 839, -35166, -44530, -94315, -39281, -72696, -15508, 63086, -31773, -81334, -43817, -37478, 57585, 9321, -30995, 7176, 121070, 18027, 10311, -10124, -8255, -141127, -128402, -65085, -3515, 10849, -48104, -16858, -28682, -154730, -217268, -44205, 38386, -15515, -160630, -95237, -98689, -113552, -142060, -116622, 52187, -95179, -105756, 36641, -3257, -89636, -167821, -41420, 66606, 89399, -48685, -27494]
5820b7494Q546o9772j7269q015J61443q2158n9906l0631P0463p1209J0246M3667
5808g2089n6252K6216M8685q2179Q8449M7120j20129R2295n4794l338q0855J4138
5796a52733K7079p0155J59595Q3531J8759j16967j2092Q5876l0486m2051L1014
5785a8630L482k2684p0034l2771N6286l3701k9875P9945n6808P8687j15189N2136
5773a09156m4315j3351L3136r1433N4793J46115L4344p9610N6228j17128J888
5762a28489J1331R793R375k8813k27P667p5635O5257R8878R2695j60434Q6153
5750a2449j8766j18232J08907J5450j02393M441j2991L4725Q1278j42331k427
5739a64788N5668L5567p4771O9931r1586J04588M6152m4753m1774o9965N783Q110
$$ y = [-27494, -18948, -88720, -105989, -114004, 47439, -34719, -94625, -125256, -54793, -126002, -115756, -72089, -128341, -102125, -53440, -135619, -47170, -50, -120179, -27884, -82678, -86016, -166871, -152733, -125654, -195809, -36214, 47317, 66076, -50891, -62983, 22893, -7593, -49644, -18630, -15148, -37832, -107866, -140637, -84351, -118052, -147927, -67982, -124790, -46103, -161292, -109156, -153471, -166822, -133686, -225119, -170326, -24211, 10133, -69477, -13249, -130377, -128489, -117158, -107365, -97990, -126803, -127030, -119363, -194998, -129741, -30863, 61832, -98602, -12449, -31215, -149447, -40540, -25090, -127483, -123042, -136033, -101308, -20030, -162361, -164788, -109120, -73553, -148324, -78393, -169979, -65391, -19239, -63992, -105766, -175731, -169948, -161838]
5727a61838k7674L0610N5511Q2367j5936p138L2154j10678m7094J4940J24100
5716c0676j02482k6283k2629M6981J84628j0015k15595J06570j10445P334j4746
5705a87358J4673l0558J55200N349k3600j3387L0150N0242k2417q8197P0617r522
5693d8808j07233K9487L9276Q5130j3122m9854m1390j64104R1881P9176M1159
5682e8402j9170j8327j3808J08271P394K7353L6446m7342m3985m5449j35963j3244
5670b16226J39450J4507o7546J39414o4835q4049J27022p7837J4233l0022o5811
5659a71700J6351N1993R5546L3314j69250L0961J630N3278j8344r5957P4426p2070
5647a69822r060K23166q7236J3143j4843j33689q2144J04750O2098R2950j2024
$$ y = [-161838, -189512, -158902, -103391, -21024, -36960, -44098, -11944, -122622, -169716, -154776, -30676, -133158, -159441, -182070, -135089, 49539, 39524, -176071, -69501, -179946, -172612, -187358, -172685, -203243, -48043, -42694, -66294, -79681, -49531, 711, -21706, -109903, -39286, -48808, -156041, -126554, -87278, -2148, -15270, -65124, -106514, -270618, -178737, -99561, -58402, -77572, -95899, -109707, -1436, 5958, 33311, 69757, 22415, -21570, -67019, -202982, -216226, -76776, -62269, -129815, 9599, -55236, -139285, -12263, -90100, -75867, -105889, -171700, -155349, -103356, -7810, 25504, -143746, -112785, -111155, -57877, -76221, -172178, -97752, -169822, -178882, 44284, -42952, -29809, -44652, -178341, -260485, -155735, -93637, -687, -12711]
5636a2711j03677K7312L1198J263K9389J5388l4709o4285P38L7323Q1847m5210
5624c6134o9634j5552K9547q442j2136p2239n42r4957p779J70013j2036L5913
5612i3978M4111j9964o9733n954R3606n0735J15745j23878P2852m147m4695R936
5600g6834J2076r2520O8963l0668P1535r51j20795Q4149P2625k4398j15660Q2196
5588g0282j4969m815J2873J1732n2906q250R145p8403J02985N0784n5531N378
5576i2259Q731j5164L65q252K1072L6295j2048M2530j02477K1032J58988k1773
5564C7040l9771m9782O119J06426O1464n6694o9462o0196j8142j33806K3056J91412
5552b336M3861p0659k18735Q8354O4652P522j23852J20303P8817r1475m436P0679
$$ y = [-12711, -116388, -89076, -57878, -56615, -27226, -11838, -46547, -110832, -110094, -72771, 9076, -36134, -105768, -121320, -91773, -100215, -112351, -184590, -185132, -280089, -287868, -117855, -129891, -93978, -49867, -69831, -139564, -145518, -51912, -102647, 13098, -110780, -37928, -42075, -86770, -76834, -64758, -157278, -88315, -118983, -47448, -48399, -169194, -85045, -12420, -36818, -152478, -70282, -85251, -90066, -77193, -65461, -118367, -126617, -117472, -195875, -92890, -42106, -97637, -92259, -83528, -98692, -98327, -106579, -85507, -49212, -61260, -18730, -121207, -100175, 58813, 37040, -2731, -52513, -46394, 60032, 121496, 64802, -4660, -64856, -82998, -216804, -193748, -2336, 41525, -29134, -247869, -159515, -94863, -87341, -211193, -90890, -12073, -103548, -107984, -37305]
5540c7305p4887R091r7608q781J67262R0376M2828p7991o6139j06513j3503P3845
5528i9325O4408o4191R7437j71988J1750J29221j8960L3641j4697l9054k2585
5517i4343J6896o4512J312P3063m4590l0978N2288n8284J4193p410N486l5591
5505a72470n5272J28822p0301P9028K4403r7733P4429q6087p37N3414k3343O6470
5493g9377p511Q128K1120L703K2819q6201L884N1841J204j46450J65624n0854
5481i2070k5884P0163p717Q324q6574R448N3744J18999j18875o4279N0176j31590
5469b16135m647J38489J03751n7164K192q040L3222m6292q8046K8667j2410K3109
5457a03304n6242K9872J04045j19250R7637m4025K5374q6959O2953l2463P3702
$$ y = [-37305, -112192, -103101, -200709, -209490, -42228, 48148, 90976, 12985, -53154, -159667, -173170, -99325, -34917, -99108, -1671, -173659, -161909, -32688, -51648, -18007, -32704, -71758, -94343, -77447, -141959, -140647, -67584, -112174, -143152, -90864, -149148, -134955, -142365, -136879, -172470, -227742, -98920, -169221, -90193, -65790, -163523, -89094, -175181, -175918, -122504, -145847, -79377, -86888, -78760, -57640, -53937, -31118, -117319, -113435, -61594, -60390, -206840, -41216, -92070, -117954, -47791, -55508, -47184, -133758, -124310, -70566, 48433, -70442, -134721, -84545, -216135, -220782, -82293, 21458, -35706, -33514, -41554, -8332, -54624, -142670, -114003, -126413, -103304, -159546, -129674, -25629, -144879, -47242, -91267, -65893, -152852, -89899, -122362, -48660]
5446d8660R1834j17177k6911R8929n6862M3472N5708r3311J1158j5974L5768q7736
5434a09762J7868L6592M7952N1972r1387j53786L531L4789l5898R0989J42408
5423C5268j24939J8105K5946R3355j81890m8130J07826J25285q3766j2834P016
5412c8758j21745N4227P9030o8659k6497q7257m378L4310J68141o3889N2535O1599
5400C8659n0780o2123j7612R2355m196L6487j62650J6901J15861R624j63602O0044
5388i1032j9727M1797l2498j19176P5642Q6599l4890j4823R0216n8024K7056n9060
5376a07920j03986M2045R9889j27773L9712J40440q7931O1149k1526m7817N1387
5365f2331K8160r9551q697M8583J5944l3702O1877J7795j39047K7295M8675m2330
$$ y = [-48660, 43174, -74003, -100914, -1985, -58847, -15375, 40333, -52978, -41820, -57794, -22026, -109762, -91894, -55302, -7350, 44622, -46765, -200551, -197020, -162231, -198129, -107140, 35268, -89671, -71566, -45620, 47735, -134155, -182285, -74459, 50826, -32940, -45774, -38758, -160503, -106276, -27246, -95905, -122402, -209659, -214037, -179727, -11586, -75475, -22940, 38659, -12121, -74244, -91856, 499, -3697, 32790, -129860, -112959, 2902, 12526, -151076, -91032, -110759, -68962, -101460, -220636, -144994, -58395, -93285, -108108, -17892, -75916, -48860, -107920, -211906, -169861, -69972, -197745, -158033, -17593, -105524, -44375, -65901, -113718, -62331, -34171, -133722, -142419, -93836, -77892, -111594, -49717, -31922, -170969, -143674, -94999, -137329]
5353a37329M6338Q8429l3246j07926R1450N7109r5826J40961j9758j10843O9963
5342a0678k4430M9108q8115j468j3971k1242p2855M2708K7850P8539r2106n2461
5330a79121J90243k9247j5472j0512Q6518l1031o3481M626N687j6357P3087m5501
5318c0561m7962Q666r0701o055J34441K275l4600K8137n0555R2843P5509l7567
5306D3870q4151q4939k4372j9620J70399O5382q479j61117P8302R5707o1975q6417
5294g7410N9020m1993K6954O469K0434Q651j6444J48041m1638j06145o3491j7051
5282i4603k8623n624p2367J10788r415n291O2926l9918P0622L0206j2508j53125
5270a46932J57439Q357j13502N4061p7725K2586L6734m0411J02401J8863L4601
$$ y = [-137329, -90991, -2562, -35808, -143734, -52284, 4825, -91001, 49960, 30202, -80641, -10678, -35108, 14000, -74115, -75583, -89554, -110796, -183651, -140943, -113093, -34554, -126660, -179121, 11122, -18125, -33597, -44109, 42409, 11378, -52103, -47477, -41790, -58147, 14940, -30561, -78523, -69857, -160558, -166613, -32172, -29897, -64497, -36360, -86915, 5928, 81437, 43870, -40281, -125220, -149592, -169212, 1187, 66569, 58090, -103027, -24725, 70982, 9007, -77410, -18390, -60383, -33429, -26960, -6526, 2125, -14319, 133722, 92084, -14061, -77552, -94603, -123226, -128850, -201217, -90429, -99844, -105135, -42209, -82127, -11505, 18701, 6193, -146932, 10507, 18864, -94638, -40577, -118302, -95716, -58982, -99393, 3008, 21871, 56472]
5259E6472j95045K9965Q5427l8697N478J5303j08008M9539R2845k973N852m3852
5247d7694R4677j96225O9784J45885r4410k7547K1751m8270J8262n9667M1115
5236h2339P4387j04161k7491P2166j12528N8882m2168l5749O6385J6086K4335
5225i2195o1955p7512J32334J4302m271L4424m2342M0403K0618j02887K7944r4342
5213b05479L6075j05907J40619L7946m6026P5962j13249l1617M7773N1450J3678
5202i8775R2155p0261k0382p410k92J6141J4246r8917l0240J20267n0978R667
5190a24779J9147O5044l1073m2031J4178K9720K4992L0550l9304l379J5380l908
5178d5463m1398j7083O2481J678K1502J1901O436r226r8139n7102J40603l7055
$$ y = [56472, -138573, -108608, -23181, -61878, -56400, -41097, -149105, -99566, -6721, -9694, -3842, -47694, 46983, -149242, -79458, 66427, -27983, -55530, -33779, -82049, -63787, -123454, -82339, -7952, -112113, -139604, -67438, -179966, -121084, -163252, -199001, -132616, -116530, -92195, -154150, -231662, -99328, -85026, -89297, -54873, -97215, -56812, -36194, -139081, -111137, -205479, -169404, -275311, -134692, -96746, -142772, -66810, -180059, -211676, -163903, -112453, -98775, -6620, -76881, -97263, -104673, -104965, -88824, -74578, -173495, -203735, -83468, -134446, -124779, -105632, -40588, -71661, -113692, -99514, -69794, -44802, -14252, -53556, -56935, -41555, -45463, -86861, -103944, -41463, -39785, -18283, -6382, 54, -9172, -107311, -164413, -23810, -60865]
5166f0865m0166j00596K2577L2036j15245J17258J25710k1569J7773N1787r3431
5155f4731Q999L9405J3564j9944J5305o8483j44039N9432L0795J2282p99M3749
5143g4465Q376K6093K7341p4363O1536O964l8220N767o7715L5320j1895K4067
5131g1194O683n5481J09055l9509n4215n3432k7442N8277m2414J15904j31726
5120a85494p6311P4046K8887J13829j1863k1949J23297n5901O6867m0588j33199
5109a18379R3093J9335j55894P2572l8168n2766r657K4335J50259M5622p1463
5098d1111j57429J66525O269l0319j09781m8930R9781n0111n8323P5553Q8926
5087e8950K3559K9917k9161O684o7183l9419Q5289K1531o4863K0325M4725P988
$$ y = [-60865, -101031, -201627, -179050, -147014, -262259, -145001, -19291, -40860, -23087, 28700, -64731, -55732, -16327, -2763, -22707, -7402, -75885, -219924, -160492, -129697, -117415, -118214, -74465, -66089, -39996, -12655, -87018, -25482, -18518, -56738, -50971, -118686, -83366, -95261, -71194, -64511, -119992, -10937, -50446, -104661, -158093, -185535, -127258, -169672, -53768, -185494, -261805, -187759, -158872, -45043, -56906, -78855, 44442, -11459, 55408, 14820, -118379, -25286, -5951, -161845, -89273, -127441, -180207, -189864, -165529, -15270, 30352, -41111, -198540, -32015, -25746, -56065, -165846, -214776, -114995, -165106, -223429, -147876, -58950, -35391, -5474, -34635, -27951, -95134, -134553, -49264, -27733, -92596, -72271, -27546, -19558]
5075a9558q5485L46j5522J5688K6810o7871L5317J52043j8805K7731q8308L69
5063c7245K7637j45296o1029J03179O6249J2835q1738J37200k0801p1107n3434
5052a23550N7070J40380K9177m2859j33171m0474P6945O0932j45489P3054Q799
5041c9186o7521l4630P9472j2893N2191O457o9169j8557P619r0143R4708q329
5029i9981p9161J70578o2008n1174K0489J17992r6909p9730l9200P0438P1149
5018e7517p4840k7571J16972M6124l9651m2419J6263M585j01713l7677j1310R8766
5006a09988R5351o5539K4547j12880J8853P6312j73986M3713R0511J45443j50085
4995a17748O97N9542n6394j0279O7842j75L2940K8985j12687j4530J16133l0565
$$ y = [-19558, -105043, -104697, -120219, -104531, -77721, -145592, -110275, 41768, 22963, 50694, -37614, -37245, -9608, -154904, -215933, -112754, -46505, -33670, -115408, 21792, 991, -70116, -123550, -66480, 73900, 103077, 60218, -72953, -113427, -36482, 24450, -121039, -47985, -39186, -106707, -141337, -61865, -74758, -22567, -16110, -85279, -103836, -96217, -186360, -91652, -99981, -179142, -8564, -70572, -121746, -101257, 16735, -80174, -159904, -199104, -128666, -57517, -132357, -159928, -42956, 3168, -36483, -78902, -62639, -58054, -159767, -197444, -208754, -109988, -14637, -80176, -55629, -168509, -149656, -73344, -247330, -203617, -113106, 32337, -117748, -117051, -57509, -113903, -124182, -56340, -56515, -23575, 5410, -107277, -121807, -5674, -36239]
4983c6239j6349p3787Q8041J7141o8547K4133K2269p6536J08651p2575q9592j8078
4971a91468j1069N1941N9964k2619K4043l6591J7592O3735L7042j19824P743k8847
4959a48358j9297J35686J3077m2819j26274q8180J81973j1111R338q3648M6904
4948a32709L0855p9729J19165j27588J49493M7895k7506p4622L2080m0432k86
4937a03384J768j24850m1162J96317J11696j16026p1350J52514L0131j17815n2912
4926a35073M5462J2455M7787j9928J6104l8101n4906O8960k0667j08906j2245
4915a99058J52847L9919m9484Q3891j4581p7387N2663K6646k9786p0120Q4737
4904B87K6436o8243j97656J98417O444r2203R5129l7004k4781M0345P8924k1147
$$ y = [-36239, -52588, -126375, -38334, -21193, -89740, -65607, -43338, -119874, -11223, -83798, -173390, -191468, -202537, -150596, -90632, -113251, -89208, -125799, -108207, -44472, -7430, -127254, -119511, -148358, -167655, -31969, -18892, -61711, -187985, -276165, -94192, -105303, -95965, -179613, -132709, -101854, -181583, -62418, -190006, -40513, 7382, -20124, -94746, -62666, -103098, -103384, -101616, -226466, -267628, -71311, 40385, -75641, -146991, 5523, 35654, -82161, -135073, -89611, -77156, -29369, -49297, -33193, -71294, -126200, -57240, -77907, -186813, -199058, -46211, -6292, -55776, 28115, 13534, -63853, -11190, 15456, -14330, -84450, 287, 26723, -41520, -239176, -40759, -34315, -126518, -31389, -68393, -93174, -52829, 26095, 4948]
4892D948j30463q6495J05296O5410M5272j18576Q5548J5473m2607k1518Q6231
4881H519o7077J33885o4430j38443o0274P3528l6872M0316L7009O6905o0419J6833
4869e0520p0k2800O9446J0037o2691j83466O590K56038L0671p6920O3911j02702
4857f2476K1144m2785j494M3636L8928O1310n6569l8679j04071O4904L8868k0759
4845e8043l6838q2576N8985J21732Q0763r5610m9100j31183j497J3219O6389N6110
4833e7649q4026L7014J59642m2841k947J8308k26904Q7505Q4591n933n321r9455
4821a38016M0636J4223n5370K3291k2462N4313O9450m3177P4247j70015J86525
4810C3645K1538k26019l8919K1696j9248M6383L8694N7278L6470J09239j80817
$$ y = [4948, -125515, -212010, -106714, -41304, 3968, -114608, -29060, -13587, -56194, -77712, 8519, -58558, 75327, 10897, -127546, -187820, -114292, -151164, -110848, -73839, -6934, -67353, -50520, -50590, -73390, -3944, 6093, -56598, -240064, -233474, 22564, 53235, -23685, 40226, -62476, -41332, -84117, -85611, -41975, -3047, 58263, 1694, -36985, -141056, -76152, -37284, -58043, -94881, -177457, -118472, 3260, 84023, -11587, -60687, -191870, -193367, -180148, -113759, -57649, -141675, -104661, 54981, 12140, 9193, 27501, -199403, -111898, -27307, -33240, -38561, -138016, -97380, -83157, -138527, -115236, -137698, -83385, -13935, -57112, 17135, -152880, 33645, 55183, -170836, -209755, -188059, -207307, -160924, -122230, -64952, -28482, 80757, -100060]
4799a00060Q792N9041q4300J383J4403L6851j15191O691P002O2591J13803k15227
4787b04221r4712K00476N3221M234j8512j08961K9364M7165J46458l0582r2820
4776f8890J08280m6681k52m2349q5564P8250m633O4515l3412L7912j1802r8565
4764a03191o0472J8318r01m0552J01708J05942r3076l1145l6453J48492m2623
4753c3953k6884j5107o8096P669L5462L9242l1278O3039o7305L2960L4036l9610
4741f9825Q4535o130m2397J56478p9807J01882l9121o9879L733R6646K7899k1559
4729A42455N512j6551k02831J11085R8416p9993k0775M8227r532J6833j2120N8068
4717A38794l3851J0188k1918J43860O4820O2795K0336L6931n6793k7692M1780
$$ y = [-100060, -91268, -32227, -116527, -115144, -100741, -63890, -179081, -172390, -165388, -102797, 11006, -204221, -298933, -98457, -45236, -41002, -59514, -168475, -139111, -91946, 54512, 23930, -68890, 39390, -7291, -7543, -49892, -135456, -57206, -61839, 2676, -30736, 7176, -4626, -103191, -163663, -145345, -146246, -186798, -85090, 20852, -72224, -103369, -139822, 8670, -33953, -60837, -75944, -144040, -136371, -100909, -61667, -92945, -29906, -97211, -64251, -30215, -69825, 14710, 8580, -33817, 122661, 42854, 144736, 105615, 35736, 39469, 136115, 164014, 142455, 147967, 131416, -71415, 39670, 138086, 58093, 37318, 85545, 76013, 92846, 80726, 138794, 104943, 115131, 93213, 237073, 301893, 364688, 385024, 421955, 365162, 337470, 379250]
4706C79250J24952J01430j9100J19651K64714Q4471p5659o9024k8244O0796l2244
4695I10993r4318k48213p4906K7328K6731j13056M4496q2469P288K660l5724m9032
4683C21778K4974k2418J5399j0417q5933J32117J1342o4262L2701N6440M4902
4672D56623r1044j9244k8444J21063O3846J35807K8322j6280L8649Q3194O0623
4661H33115k1702M019K6351L153o8827J1890K1033o6014O9199P7801j2625N7473
4649I34866M8617L7478N30l1558J964p879n8032j588j07694M8619k1081n9825
4637G84417L721l519j730j3823P8782n0275J79485m1947q5519j37749L6899j54126
4625E94616j07686R2353o5748l924j52837N6526K4249p2704n7691N512j15752
$$ y = [379250, 504202, 605632, 586532, 706183, 970897, 1055368, 979709, 910685, 882441, 943237, 910993, 816675, 568462, 493556, 520884, 547615, 434559, 479055, 396586, 403874, 406534, 370810, 321778, 346752, 324334, 339733, 329316, 243383, 375500, 386842, 322580, 355281, 411721, 456623, 365579, 346335, 317891, 438954, 502800, 638607, 666929, 650649, 689298, 772492, 833115, 811413, 815432, 841783, 844936, 776109, 787999, 809032, 743018, 812217, 890018, 877393, 934866, 983483, 1020961, 1021491, 989933, 991897, 984018, 925986, 924398, 816704, 865323, 844242, 784417, 788138, 784619, 782889, 769066, 847848, 797573, 977058, 935111, 849592, 711843, 748742, 594616, 486930, 579283, 513535, 509611, 356774, 413300, 437549, 364845, 307154, 312666, 196914]
4614A96914j00894L7422J21458q9223J98135p4710k24091J6159J06384j9519j1045
4603A56990J7010l2725n3737J24719k5473j6094N838q9365m4612K7649n2378J69322
4591A87144p442j11634J19135l3107j22965Q3741P2841j21507L2773L4545q1879
4580E1645J04043Q7372j85310l857o8880N6928K0509J59491o8155n6455q4179
4569A3152J29402o0861m2924O2111j55553m7384R2755J3654p435K1251L5147O1082
4557A14397p3166N8482J3364j09204M8470k0023O7537O0593r3001L1023O8604
4546A67076N8755j57281j8398J8715k1587l8170l6412o7315P7656J36375m4679
4535G4735J3455n3972k6623J05141N47L7530k0393p050j098j17076L9274J9925
$$ y = [196914, 96020, 133442, 254900, 165677, 363812, 289102, 65011, 81170, 187554, 168035, 156990, 174000, 141275, 87538, 212257, 186784, 170690, 176528, 87163, 42551, 70200, 17822, 187144, 179702, 68068, 187203, 154096, 31131, 114872, 187713, 66206, 98979, 133524, 51645, 155688, 243060, 57750, 53893, -14987, 41941, 62450, 221941, 153786, 97331, 13152, 142554, 81693, 38769, 100880, -54673, -102057, -9302, 4352, -3083, 18168, 53315, 114397, 41231, 99713, 113077, 3873, 52343, 32320, 99857, 160450, 67449, 98472, 167076, 225831, 68550, 50152, 68867, 47280, 9110, -27302, -94617, -16961, 119414, 74735, 88190, 34218, 7595, 112736, 113283, 150813, 130420, 123370, 122272, 5196, 44470, 64395]
4523F4395j03140P5781R0963o7990n5478M7094L7612m0817k9018j9601j2137M5390
4511C3054P5937o079Q7856q7535l1159l725K6973K4205n9900p239Q3264r3416
4499D2236K008k8230J25724L0064j08841l3615L4502M6692k6491K661j11804J39583
4487A14489j28333P5400r247j7575O8223m6663P7338P369p3579J7850j37290J29107
4475G7089m3567J0643l3309P7090K0551n4686L2055j8296J4278k3861j13299j292
4463e6604J18556J4947M7046p1450j2254p1581j6347j1835Q4126M7255P542p1520
4451G881M2090O6250p4236N1018J46590j68552p0978j1153K1250p6945J69705
4440A02920J8165q6887m189N4493Q0919r2786Q1685m1823K5534M3658M6374j37824
$$ y = [64395, -38745, 37036, 127999, 60009, 4531, 51625, 89237, 48420, 19402, -199, -12336, 33054, 108991, 102912, 190768, 103233, 72074, 68349, 95322, 119527, 59627, 52388, 135652, 42236, 44244, 16014, 141738, 171802, 62961, 29346, 63848, 110540, 84049, 86710, -25094, 114489, -13844, 61556, 52309, 34734, 102957, 56294, 133632, 141001, 67422, 85272, -52018, 77089, 33522, 44165, 10856, 87946, 108497, 53811, 85866, 67570, 81848, 57987, -55312, -56604, 61952, 76899, 123945, 52495, 40241, -31340, -47687, -59522, 24604, 71859, 79401, 7881, 49971, 116221, 41985, 93003, 239593, 71041, 63, -11090, 10160, -66785, 102920, 121085, 34198, 30009, 84502, 165421, 72635, 154320, 112497, 138031, 181689, 228063, 90239]
4428I0239q0096K7004K97O6925o0147p4002j52391J15935J29426M4835j7646P7927
4416A68306p1340K7819l340k8875K5689n8987P6096M5497l4399o5154J4392n7342
4404C8362K8878J11656k0996k29428J5777l6855J06518N8826j8893k3474N0778
4393H1149j34629J17420N4478q2471J7239N3109o4239L8030Q8512j31484J47267
4382A84381m6746j01229R548J6739j72459L5248P8219m8839M6162k5909J40529
4371A15644n9324n7298l5287N1007q717N9219n0192L6085j5330r2563N3115L714
4359G3K3201n138l2437j6307K14972M0413j8100q0258K7580j07244n0787l8438
4347d2470Q2988n3656Q5313J4279k9764M8281j28308Q3939P0544r2987n7078l9130
$$ y = [90239, 10143, 37147, 37444, 104369, 44222, -29780, -182171, -66236, 63190, 108025, 90379, 168306, 96966, 124785, 121445, 92570, 118259, 59272, 135368, 180865, 146466, 81312, 95704, 38362, 67240, 178896, 157900, -71528, -55751, -92606, 13912, 72738, 53845, 30371, 81149, -53480, 63940, 118418, 35947, 53186, 106295, 42056, 80086, 168598, 37114, 184381, 137635, 36406, 45954, 62693, -109766, -74518, 3701, -45138, 1024, -24885, 115644, 56320, -978, -36265, 14742, 6025, 65244, 15052, 51137, 35807, -56756, -3641, 73, 23274, 18136, -14301, -30608, 184364, 224777, 206677, 126419, 153999, 46755, -4032, -42470, 40518, -13138, 72175, 86454, 56690, 104971, -23337, 60602, 131146, 38159, -18919, -58049]
4335e8049L5787j05388Q5151M3688J4315m5891l8643J49908k0932O2897J2750
4324A35593q6981k1180J21609k7572p4234j22387P1540q292J5925O0788m0061
4313B4748M3655j15688m3409P5520K0033j0772J71776q8619k8645l2812J6934
4302C2721k20r0787M9861n3625J30153R5375q85r7027q6953J1715J47577o4165
4290G3740r2925n932M4516j12695J26946j6457l1887J9668r7590J18015N6328
4279H1727j3248n4368K0458j5177N5677r1932J9851J11845L6798p6410k8387R5129
4267A41963q2740J3388N1748o5291Q6357j2093L3603k8341k7081M5017J3010j9906
4255A49634m565N6346l9598K5453j39021n6919R4773n7041N7793l5626M4578J15543
$$ y = [-58049, -22262, -127650, -42499, 1189, 15504, -30387, -69030, 80878, 59946, 122843, 135593, 48612, 27432, 149041, 121469, 47235, -75152, -3612, -11904, 4021, 64809, 24748, 68403, -47285, -90694, -15174, 4859, -5913, 165863, 77244, 48599, 15787, 32721, 32501, -58286, -8425, -62050, 68103, 163478, 162593, 65566, -21387, -9672, 137905, 73740, -19185, -25117, 19399, -93296, 33650, 17193, -14694, 4974, -92616, 25399, 81727, 68479, 14111, 34569, 19392, 75069, -16863, 2988, 114833, 151631, 75221, 46834, 141963, 59223, 72611, 124359, 59068, 145425, 133332, 166935, 138594, 111513, 156530, 169540, 149634, 145069, 201415, 161817, 187270, 48249, -8670, 86103, 29062, 86855, 51229, 95807, 211350]
4243B11350n6161L4714l0282P9953n7508L1296O937q984M3892Q0882k5856O319
4231C16552N4616J6359L6094N0840n6630l1328L3173P6729k6213J1512Q9729O4627
4219F36060O6200o8618m7344r9790J24092J42648n3837k8697J82119j2693J4302
4208H54442N0319R260o2287L7354j5584o0695J5610J7936N0170J14027K5078r2620
4196I43010j00052l9971N5752m2916n2442K8162k671M8191j07827L1837J486k7426
4184G35133j5044N0634j05679M244k418L5959M0875m4592r730k24175P5274n1803
4172D88678J2366O5448n2406j07153m497j09199o570J04330q5882l1703K9393
4161C02805M188m6185k8814J28723K6129m3390j32452L1983J391L8473L0944O3561
$$ y = [211350, 155189, 189903, 159621, 239574, 182066, 213362, 220299, 211315, 255207, 336089, 310233, 316552, 371168, 387527, 423621, 474461, 417831, 386503, 419676, 496405, 470192, 481704, 571433, 636060, 702260, 633642, 586298, 486508, 610600, 753248, 699411, 670714, 852833, 840140, 854442, 904761, 914021, 851734, 889088, 873504, 812809, 828419, 846355, 896525, 1010552, 1035630, 943010, 842958, 802987, 858739, 815823, 763381, 791543, 788872, 837063, 729236, 761073, 762559, 735133, 720089, 770723, 665044, 669288, 666870, 702829, 743704, 699112, 689382, 465207, 540481, 488678, 501044, 566492, 514086, 406933, 402436, 293237, 286667, 390997, 305115, 273412, 302805, 306993, 260808, 231994, 360717, 386846, 343456, 211004, 242987, 244378, 282851, 313795, 377356]
4149C77356j1811o5104j54113n6063J02907J19126j2171q2162k739j11528N7504
4138A61202q691j23206q2657J09494M8772J12207r289j54555N1793n6309K2472
4127G1233N5284J30429K8754n1373J2817l004L948j65010P0885j10956K8845j2562
4115E9290O1692R6124j23157n631M2208R8401l908n9082r4935J01526P4255p5843
4103A70940j6154P4310j27205j1933J7373M9456o7955M3001Q7053j30201R5590
4092A84275n4344J20184j6858j05078m530K1059n9794R2278k9523J78318K7403
4081C53390j86570N3200M982p6260j2598R5144J3984M9774q7146n7275J6722n792
4069A61555j7547M2776k7725J220k7717L2187J531L060J13074K7372l7683j31228
$$ y = [377356, 365545, 300441, 146328, 90265, 193172, 312298, 300127, 217965, 215226, 103698, 161202, 152511, 29305, -53352, 56142, 104914, 217121, 207832, 53277, 105070, 48761, 71233, 126517, 256946, 285700, 234327, 247144, 244140, 248088, 83078, 153963, 43007, 71852, 59290, 120982, 217106, 93949, 88318, 130526, 228927, 225019, 165937, 71002, 172528, 246783, 170940, 154786, 229096, 101891, 89958, 107331, 156787, 88832, 131833, 218886, 88685, 184275, 129931, 250115, 233257, 128179, 123649, 144708, 84914, 177192, 147669, 325987, 353390, 166820, 220020, 225002, 148742, 136144, 231288, 245272, 295046, 207900, 150625, 167347, 161555, 144008, 186784, 159059, 160279, 132562, 164749, 166280, 169340, 282414, 309786, 272103, 140875]
4057A40875j0215P7878o9402K5966J69833m8439q4989m83j28066L874K1553P4764
4045A73149j7164J3331M0757q103J01443p2149j13785J28762j09138M3229j5018
4034A65314k928P3488p8955K2810R9296M6495o7201R4678Q610j07434p8598M1898
4022B17473J94358q0666M6642n242n1108J60178m5695j42540J27156l9580j68282
4011B12694N1059J4182K4748J4764j04929m1453J43148O3287N2987j79493j8686
4000B32308J27714l5982r9688K9651k629l726j58921R8615P1002m5283J9301N6515
3988B88877L2675m3324N763k6592r6116Q7700M6182j30551J21590O8334q2267
3977B72271p9154N0734R319L3961l3187M4636n4828l1822J09236j284n4669j15679
$$ y = [140875, 130660, 208538, 139136, 165102, 334935, 286496, 201507, 201024, 72958, 76832, 98385, 173149, 155985, 169316, 210073, 201970, 303413, 231264, 117479, 246241, 137103, 180332, 165314, 162386, 235874, 156919, 179729, 279025, 325520, 258319, 352997, 361607, 254173, 175575, 217473, 411831, 331165, 377807, 372565, 321457, 481635, 435940, 293400, 420556, 380976, 212694, 263753, 277935, 302683, 317447, 212518, 171065, 314213, 377500, 430487, 250994, 232308, 360022, 324040, 224352, 254003, 251374, 247648, 88727, 187342, 258344, 213061, 232362, 288877, 321552, 278228, 283991, 257399, 161283, 248983, 295165, 164614, 286204, 354538, 272271, 193117, 243851, 253170, 287131, 253944, 298580, 243752, 211930, 321166, 319882, 265213, 149534]
3965A49534Q2217P5818j13799R7893J01909j72709k3019n6283j3593R6924k0390
3954B04502l7684O9300o9285j2446J48903o2939m5454J11508j16117L2244R4755
3943C17287k2955J01582r9086L0429M9675M1634j25623M4300M8796m9695R347
3932C45691K4085m9225J3884J37473p6950m8081P1191K7809j9888q4748k6150
3921C15091O0833N3947j01757p9435O2008J31811K6972j5477N5268j14434P0089
3910D64916J578O7760j0864L7463J8635Q7795j7837j20231n6687J47247q8364
3899E31411m7922l5993Q5686Q2303j4305J976r4314J04021M0724j15885L1816
3888E69518N9501R2079K0496q1237R3093m6064K605m9988J12026Q65o8723P6432
$$ y = [149534, 231751, 307569, 193770, 291663, 393572, 220863, 197844, 141561, 127968, 224892, 204502, 166818, 236118, 166833, 154387, 303290, 240351, 194897, 306405, 190288, 222532, 317287, 294332, 395914, 296828, 327257, 376932, 418566, 292943, 337243, 386039, 336344, 345691, 369776, 320551, 334435, 471908, 394958, 346877, 418068, 445877, 425989, 341241, 315091, 375924, 429871, 328114, 248679, 310687, 442498, 469470, 453993, 509261, 394827, 464916, 466494, 534254, 523390, 560853, 579488, 667283, 649446, 529215, 472528, 619775, 531411, 483489, 447496, 533182, 615485, 601180, 603156, 508842, 612863, 653587, 537702, 569518, 629019, 721098, 741594, 660357, 753450, 707386, 709991, 660003, 772029, 772894, 704171, 780603]
3876G80603J76356j09127P736O3238q051j0754J73704l6623m1737m423M3941J04901
3864A139764p7602Q0948M3598J1109Q2126J42520o338j9586R966O8637k0328Q8616
3852A543430K9255K2577J2426O634R1259J25132J6259J32815R5381m7356J70496
3841B198308L6671N5387J06670J95981J23640J63199K19066J82601P2112J14141
3831C467776K00066J84269K18931K03174J88047L51300J67386L42676K27025L19391
3821E870041L20849L67087K71455L55825N16707M35924N92618O26944N30372N07660
3811A0395482O67884P55912Q92775R19403R13101J243506J470688J515281J655232
3802B0429264J817858J805659J839559J875990J934885K011712K039343K094144
$$ y = [780603, 956959, 847832, 855568, 918806, 910755, 900001, 1073705, 1037082, 995345, 990922, 1034863, 1139764, 1062162, 1143110, 1186708, 1197817, 1279943, 1422463, 1416125, 1396539, 1406505, 1475142, 1454814, 1543430, 1572685, 1595262, 1607688, 1614322, 1705581, 1830713, 1846972, 1979787, 2075168, 2027812, 2198308, 2234979, 2290366, 2397036, 2593017, 2716657, 2879856, 3098922, 3281523, 3353635, 3467776, 3667842, 3852111, 4071042, 4274216, 4462263, 4813563, 4980949, 5323625, 5550650, 5870041, 6190890, 6557977, 6829432, 7185257, 7701964, 8137888, 8730506, 9357450, 9887822, 10395482, 11063366, 11819278, 12712053, 13631456, 14544557, 15788063, 17258751, 18774032, 20429264, 22247122, 24052781, 25892340, 27768330, 29703215, 31714927, 33754270, 35848414]
3794C5848414J669723J492806J210739J162133J029168R30016L65920j03171m66717
3785D3139031r51436j140894j206351j285892j709702j913389k085410j977821
3777C0868136j990871k029313j864394j991633k000621j805579j639801j670692
3769A5875232j411022j152053j015355r71066o47887p28506o13954n67242n12416
3760H255731l86460m83240l52537k45793m03030j97563l06769k17991j33755j26702
3750E401891k04271j88930k03339j73610q6150j43565j3767j27689j17688n5722
3740D087160j38193j20804N2363o690N1318j18672j27909j60412r7369k8034J51937
3729C544695k4003j46636p8702L1642n3940r8157j28603k03637R5325j6047J1198
$$ y = [35848414, 37518137, 39010943, 40221682, 41383815, 42412983, 43342999, 43708919, 43605748, 43139031, 42187595, 41046701, 39840350, 38554458, 36844756, 34931367, 32845957, 30868136, 28877265, 26847952, 24983558, 22991925, 20991304, 19185725, 17545924, 15875232, 14464210, 13312157, 12296802, 11325736, 10677849, 9949343, 9335389, 8768147, 8255731, 7869271, 7386031, 7033494, 6787701, 6384671, 6187108, 5880339, 5662348, 5528593, 5401891, 5197620, 5008690, 4805351, 4631741, 4545591, 4402026, 4388259, 4260570, 4142882, 4087160, 3948967, 3828163, 3880526, 3873836, 3925154, 3806482, 3678573, 3518161, 3420792, 3392758, 3544695, 3520692, 3374056, 3295354, 3326996, 3273056, 3174899, 3046296, 2842659, 2937984, 2921937, 2933135]
3718B933135M5433j41452r4566J36471p4267j08262j1490j04459M9082j9188P3391
3707B683828k34556j26886O855l1958Q515j28344o0135N2645p0797l6470p9265
3696A983432o1187M3759K1732q7997m3031r837j44070J74662j4602j05280k1205
3685A736376k3773m6211O3758j18628J10371J1156m3565K3659O81O6558j56964
3674A623418R4362P8276j99830M5932P7545n686r5847M2074M8539q9358R6281
3663A715706M3342r2877j540J0805j05262o9867P6695K16987L3136p1733j14379
3652A641013m3743L6848L2316Q3735m5236k2411J74327L3020j2096k7136N8967
3641A909604n902J6859Q1634K88j3272k05051N027J34391J2491J61826K6397n6165
$$ y = [2933135, 2978568, 2837116, 2742550, 2879021, 2804754, 2696492, 2685002, 2580543, 2629625, 2610437, 2683828, 2449272, 2322386, 2329241, 2297283, 2305798, 2177454, 2117319, 2169964, 2099167, 2062697, 1983432, 1922245, 1966004, 1987736, 1899739, 1856708, 1846871, 1702801, 1877463, 1862861, 1757581, 1736376, 1712603, 1666392, 1730150, 1611522, 1721893, 1733049, 1689484, 1713143, 1713824, 1780382, 1623418, 1717780, 1796056, 1596226, 1642158, 1719703, 1714017, 1618170, 1660244, 1708783, 1619425, 1715706, 1759048, 1666171, 1664631, 1675436, 1570174, 1500307, 1577002, 1793989, 1827125, 1755392, 1641013, 1597270, 1634118, 1666434, 1750169, 1704933, 1682522, 1856849, 1889869, 1877773, 1850637, 1909604, 1903702, 1920561, 2002195, 2002483, 1989211, 1784160, 1789187, 1923578, 1936069, 2097895, 2124292, 2068127]
3629B068127K17402L0398o2839R5943J15944p1106n7375O5990J00691k5636K432
3618B479971j5785R9943Q8260L0132O4287n4930R2035m898M1619J9291Q3156N8367
3606B981448R2198M5080L7292P4452J23735R988K039J0058L3207P217k8225J4556
3594C403045J38615j559J35058R7291O5011J6618L1901J14914K8406K38871J01547
3583D369718k1873J24005l9511J92507R7227R6102M5387O7479N2308K41542J27270
3572E352161L4875K46038R93R6873J99124J92640L1766K07486J36568J66158J89355
3561F854037K92965K72284Q8603K23220K93610L48334K52585K99065K92943L33943
3551I551589L89131L14760L75365N25541K90549M20080M94276N48347N50069O09438
$$ y = [2068127, 2285529, 2315927, 2253088, 2349031, 2464975, 2393869, 2336494, 2402484, 2503175, 2477539, 2479971, 2464186, 2564129, 2652389, 2682521, 2746808, 2691878, 2783913, 2779015, 2820634, 2839925, 2923081, 2981448, 3073646, 3118726, 3156018, 3230470, 3354205, 3364193, 3366232, 3376290, 3409497, 3416714, 3388489, 3403045, 3541660, 3540101, 3675159, 3772450, 3837461, 3854079, 3885980, 4000894, 4029300, 4268171, 4369718, 4347845, 4471850, 4432339, 4624846, 4722073, 4818175, 4863562, 4931041, 4983349, 5224891, 5352161, 5387036, 5633074, 5634067, 5730940, 5930064, 6122704, 6154470, 6361956, 6498524, 6664682, 6854037, 7147002, 7419286, 7507889, 7731109, 8024719, 8373053, 8625638, 8924703, 9217646, 9551589, 9940720, 10255480, 10630845, 11156386, 11446935, 11867015, 12361291, 12909638, 13459707, 14069145]
3541A4069145O20568O15916P30330P74537R32056P75811R15460Q97265J179873
3532B1510961J083402J138462J387805J341805J468568J820851J731393J841366
3524C3324613J990817K133127K250142K411234K554923K778828K912634L019474
3516E3375792L327675L396676L509415L869948L989964M116683M314840M338387
3508H4239380M352301M518184M853703M832760M709762M607674M573828M567098
3500A21254690M342907M156825L813270L713938L267965K854168K618842K215214
3492A48237819J811650J421440R81051K51651l14690q81511j273286j785088k162167
3483A46286869k340029k960959l149197l419196l623911m086257m257901m430221
$$ y = [14069145, 14689713, 15305629, 16035959, 16810496, 17742552, 18518363, 19433823, 20331088, 21510961, 22594363, 23732825, 25120630, 26462435, 27931003, 29751854, 31483247, 33324613, 35315430, 37448557, 39698699, 42109933, 44664856, 47443684, 50356318, 53375792, 56703467, 60100143, 63609558, 67479506, 71469470, 75586153, 79900993, 84239380, 88591681, 93109865, 97963568, 102796328, 107506090, 112113764, 116687592, 121254690, 125597597, 129754422, 133567692, 137281630, 140549595, 143403763, 146022605, 148237819, 150049469, 151470909, 152451960, 152703611, 152388921, 151507410, 150234124, 148449036, 146286869, 143946840, 140985881, 137836684, 134417488, 130793577, 126707320, 122449419, 118019198]
3475A18019198m624642m815955m636282m749881m722197m541369m524770m421140
3467H0982962m461161m180992l936172l795554l726354l416136l266752l102457
3459E1097384k731587k699021k529908k266383k214103k041726j774708j674378
3451C3165570j548807j524005j371058j254996j078260j073750j049937q26741
3443B3438016r00388o83804o87209o38375m63201p53909o52515n93076m19184
3434A7646355k95496m73319m96398n82863k77709m24197m17137l18189k29747
3425A4131300k67520l03991l59290k41814k42163p3159k31206l70277j26549j18963
3415A1796368r8172j75362j79543j66896j26904O4894q7747j05824q095l2236
$$ y = [118019198, 113394556, 108578601, 103942319, 99192438, 94470241, 89928872, 85404102, 80982962, 76521801, 72340809, 68404637, 64609083, 60882729, 57466593, 54199841, 51097384, 48365797, 45666776, 43136868, 40870485, 38656382, 36614656, 34839948, 33165570, 31616763, 30092758, 28721700, 27466704, 26388444, 25314694, 24264757, 23438016, 22537628, 21853824, 21166615, 20528240, 20065039, 19311130, 18658615, 18065539, 17646355, 17350859, 16877540, 16381142, 15798279, 15520570, 15096373, 14679236, 14361047, 14131300, 13863780, 13559789, 13200499, 12958685, 12716522, 12643363, 12412157, 12041880, 11915331, 11796368, 11698196, 11522834, 11343291, 11176395, 11049491, 11114385, 11026638, 10920814, 10912719, 10880483]
3405A0880483j75189j1083j8444o5704K6141n8723o8373O346o1886n2160M5180
3394A0446588J4598l9342N1170j2165q7933P8317J07058n034J06806M4280Q5160
3383A0789503P2197P0222L1369M2305l4646O9386J45093J45800P9450J02382O1660
3372A1574721Q3245J99494J05007J28788J91000J73650L1297K9322K15693K82650
3362A3014867J70760J45357K35970K03876K78857J68635J53352L70131K77646
3353A5019451K25441M28947M47538K82297L06570L66925L65163N07019M36606
3344A8385957N49611N70680N65577N29113P61496N94225O04338R02363R04219
3335B4367579J000536R93751R78870J067740J138378J264714J353181J489544
$$ y = [10880483, 10705294, 10694211, 10675767, 10610063, 10636204, 10577481, 10509108, 10515454, 10453568, 10401408, 10446588, 10461186, 10421844, 10473014, 10460849, 10372916, 10451233, 10558291, 10553257, 10660063, 10704343, 10789503, 10861700, 10931922, 10963291, 11005596, 10970950, 11040336, 11185429, 11331229, 11410679, 11513061, 11574721, 11657966, 11857460, 11962467, 12091255, 12282255, 12455905, 12487202, 12516524, 12732217, 13014867, 13185627, 13330984, 13566954, 13770830, 14049687, 14218322, 14371674, 14741805, 15019451, 15244892, 15673839, 16121377, 16403674, 16710244, 17077169, 17442332, 17949351, 18385957, 18935568, 19506248, 20071825, 20600938, 21362434, 21956659, 22560997, 23463360, 24367579, 25368115, 26361866, 27340736, 28408476, 29546854, 30811568, 32164749, 33654293]
3327C3654293J499135J449862J734809J612099J644214J889982K044222K149506
3319D7678122K246513K302060K672210K753967K922537K965255L243204L521882
3311G0305750L669297M015579M291203M445327M587102N091722N621257N919578
3303A07946815O599799P060216P845481Q544858R462937J0348964J1447735J2638934
3295A81895739J3944868J5298128J6831010J8275366J9659068K0594273K0823503
3288C07321955K0112569J8530434J5986296J2841887R433325O256588L643319
3281C94126373J199916o43718k221933l925656n743543q032693j0770026j3460463
3273C50528257j5988418j8083980j9635174k0050442j9930841j9278070j7930650
$$ y = [33654293, 35153428, 36603290, 38338099, 39950198, 41594412, 43484394, 45528616, 47678122, 49924635, 52226695, 54898905, 57652872, 60575409, 63540664, 66783868, 70305750, 73975047, 77990626, 82281829, 86727156, 91314258, 96405980, 102027237, 107946815, 114546614, 121606830, 129452311, 137997169, 147460106, 157809070, 169256805, 181895739, 195840607, 211138735, 227969745, 246245111, 265904179, 286498452, 307321955, 327434524, 345964958, 361951254, 374793141, 384226466, 390483054, 394126373, 395326289, 394682571, 392460638, 388534982, 382791439, 374758746, 363988720, 350528257, 334539839, 316455859, 296820685, 276770243, 256839402, 237561332, 219630682]
3266B19630682j6536146j5013091j3507058j2019292j0759988r556893q361051
3259A33877163p546061o632179n857353n200329m599738m025825l649486l157618
3251I3208574k851946k487023k100129j852201j509513j370991r26261p85217
3243G9325293p52070l43377r5014L292J29533J49463L18887L14302M61700N23137
3233H0035146L63510L92778J82749L20273L34671L42993K17988P8895M3693k38326
3223H2074370k81861k50920m80409l97301j68959k88783k14304j35980M6214Q5006
3213G9987073J57133L43147P42939R61026J138613J558442J809950K144521K681631
3204I1524475L139403L410014L991465M582187M904889N289484N550068O149592
$$ y = [219630682, 203094536, 188081445, 174574387, 162555095, 151795107, 142238214, 133877163, 126331102, 119698923, 113841570, 108641241, 104041503, 100015678, 96366192, 93208574, 90356628, 87869605, 85769476, 83917275, 82407762, 81036771, 80110510, 79325293, 78573223, 78229846, 78134832, 78138124, 78267657, 78417120, 78736007, 79050309, 79512009, 80035146, 80398656, 80791434, 80974183, 81294456, 81629127, 81972120, 82190108, 82269003, 82312696, 82074370, 81792509, 81541589, 81061180, 80663879, 80494920, 80206137, 79991833, 79855853, 79902067, 79987073, 80144206, 80487353, 81230292, 82191318, 83329931, 84888373, 86698323, 88842844, 91524475, 94663878, 98073892, 102065357, 106647544, 111552433, 116841917, 122391985, 128541577]
3196A28541577O112682O427906O527440O353120O255723O099054O055581N683722
3188A78056805N476336N206846M835428M333950L761394L185485K445347J789925
3180B09091516J365389Q74185P96466M17759L82001M85949L00221J90211j36826
3171B13766871l06214m66724r33321q60320j043308j151895j079653j194639j386248
3162B05344549j646141j957535k322541k993927l485274m126042m629002n217071
3154A78967016n438119n704714n964143o203661o321756o150052o256770o423621
3146A30504180o223480o297230o000864n920926n468831n133687m676194m311281
3138H6471687l692317l251147k802338k318480k133566j571216j430878j088997
$$ y = [128541577, 134654259, 141082165, 147609605, 153962725, 160218448, 166317502, 172373083, 178056805, 183533141, 188739987, 193575415, 197909365, 201670759, 204856244, 207301591, 209091516, 210456905, 211331090, 212127556, 212545315, 212927316, 213413265, 213713486, 213903697, 213766871, 213460657, 212993933, 212060612, 211200292, 210156984, 209005089, 207925436, 206730797, 205344549, 203698408, 201740873, 199418332, 196424405, 192939131, 188813089, 184184087, 178967016, 173528897, 167824183, 161860040, 155656379, 149334623, 143184571, 136927801, 130504180, 124280700, 117983470, 111982606, 106061680, 100592849, 95459162, 90782968, 86471687, 82779370, 79528223, 76725885, 74407405, 72273839, 70702623, 69271745, 68182748]
3130F8182748r22429p37257n79080n99508n25315m62157l70163m53708l94392
3121F3138739l76641n88195n54474o51990q10145j098350j209526j436719j444551
3112E4968148j751644j622508j574967j778910j646233j814903j912310j788907
3104D1077766j790549j690183j821663j734676j646581j574647j400266j496331
3096B7922870j311784j128308j107376r25087j003545q60440p66606o09310p23371
3087A9487043o49985o54267n61830n32708k85150l66822l69527n56229m36807
3078A5073718j54500l09821k57213k96845l29814k25604J7335k31889j54014j88894
3068A2942459k75279k81643j57439k30625j84743j24030j79628n9498k64595l60456
$$ y = [68182748, 67260319, 66523062, 65943982, 65344474, 64819159, 64357002, 63986839, 63533131, 63138739, 62762098, 62173903, 61619429, 60967439, 60157294, 59058944, 57849418, 56412699, 54968148, 53216504, 51593996, 50019029, 48240119, 46593886, 44778983, 42866673, 41077766, 39287217, 37597034, 35775371, 34040695, 32394114, 30819467, 29419201, 27922870, 26611086, 25482778, 24375402, 23450315, 22446770, 21586330, 20819724, 20210414, 19487043, 18837058, 18182791, 17620961, 17088253, 16803103, 16436281, 16066754, 15510525, 15073718, 14919218, 14609397, 14352184, 14055339, 13725525, 13499921, 13517256, 13285367, 13131353, 12942459, 12667180, 12385537, 12228098, 11997473, 11812730, 11688700, 11509072, 11449574, 11184979, 10824523]
3058A0824523j70318j87770j30844l25212j36631k18732k67811k54306k63116
3049H869783j69862j80932j97916k64521k64481j68102j67765j81606j66582q9902
3039G018114k18406k24111j4387j40942k3100k07463m5372j1308j80168j85983
3029E766874q6187n3838j15228j03029j7382k719j28150m1552q8070r4701n9479
3018D976539p5267q3825p7944l4384l6014m6452n4035o7439k63500N4539P991
3007D300209q9712k0031j5097o6952j867K4072j46269q1135n4097J2317p3713
2996C787725m2153K4987m3187J0133j39441o043m2311k3069J04809o8297q5609
2985C477544K09266j63596j53354L2319P72K2904j03491n0660R8827Q3704j0754
$$ y = [10824523, 10654205, 10466435, 10335591, 10010379, 9873748, 9655016, 9387205, 9132899, 8869783, 8699921, 8518989, 8321073, 8056552, 7792071, 7623969, 7456204, 7274598, 7108016, 7018114, 6799708, 6575597, 6561210, 6420268, 6397168, 6189705, 6144333, 6133025, 5952857, 5766874, 5680687, 5626849, 5511621, 5408592, 5391210, 5388491, 5260341, 5218789, 5130719, 5036018, 4976539, 4901272, 4817447, 4739503, 4705119, 4669105, 4622653, 4568618, 4501179, 4237679, 4292218, 4300209, 4210497, 4190466, 4175369, 4108417, 4106550, 4130622, 3984353, 3903218, 3849121, 3861438, 3787725, 3745572, 3770559, 3727372, 3737505, 3598064, 3592021, 3549710, 3526641, 3631450, 3563153, 3477544, 3686810, 3523214, 3369860, 3402179, 3402951, 3425855, 3322364, 3271704, 3370531, 3454235, 3443481]
2974C443481Q3794q1623k9229J15833Q4864l9183j25443R0035p1445j87845R4050
2963C377289p2O2985Q9793o137j32407j12923M904J2376j87962Q4456K202p2564
2951C121940J9320o6907o7127j1172Q1752j6054O8579j04932j45528k4608p0950
2940B784313P9558j03076o7033L6675p764j61084r9081P2979M5171k9499j49683
2929B401476n4559K3925j0015M206k6571j64689N1804k9703p5808K2488n0586
2918B091968j31326j39103J22046j7652k0139j624O0192k8209k8459l8669M7835
2907A916860o4294r4551J3935M3709j583j12920r5784q117J4715j75994O820J9664
2895A462460p6355q7865J28655m6391j352o1546m1757n0054n9450P5784M9327
$$ y = [3443481, 3527275, 3445652, 3416423, 3532256, 3617120, 3577937, 3452494, 3542529, 3471084, 3283239, 3377289, 3377217, 3440202, 3529995, 3523858, 3391451, 3278528, 3283432, 3295808, 3107846, 3192302, 3194504, 3121940, 3141260, 3074353, 3007226, 2996054, 3077806, 3061752, 3130331, 3025399, 2879871, 2855263, 2784313, 2863871, 2760795, 2693762, 2730437, 2722673, 2561589, 2462508, 2535487, 2580658, 2551159, 2401476, 2346917, 2370842, 2360827, 2365033, 2338462, 2173773, 2225577, 2195874, 2120066, 2142554, 2091968, 1960642, 1821539, 1943585, 1925933, 1905794, 1904170, 1964362, 1936153, 1907694, 1869025, 1916860, 1852566, 1758015, 1771950, 1815659, 1814076, 1701156, 1605372, 1597255, 1611970, 1435976, 1442796, 1462460, 1386105, 1298240, 1426895, 1380504, 1379152, 1317606, 1275849, 1225795, 1166345, 1242129, 1291456]
2884A291456n5125J1125j3927P58j00222j11940q787M4617J38382j19581K2084
2873A098840l9528J6066M5008K418j22677K20973R52j48696L9145M963K4393n5965
2861A085892J07838J1224j85856N2798j26616K0054Q3970j3559J671j01161p137
2850I29118J02249n7077r5514M5710K678N1114L2119j26710r5763P4649n721n8932
2838G97920j6801l2811R2148K055o5377J0258Q4069k7007l6295K0942j0684o86
2826H17731m7501L0060j02520P5174J72405o9672j34393j10042Q2863O6021j2912
2815G67214K5801m917J41061L9637j00859N5857j18955r4075N460p1997M5144
2804F89371P9614R941j13513J4810J4392n050J2082k5918m3022J41398L1473n3009
$$ y = [1291456, 1236331, 1247456, 1233529, 1234287, 1134065, 1022125, 1013338, 1057955, 1196337, 1076756, 1098840, 1059312, 1075378, 1120386, 1122804, 1000127, 1221100, 1222052, 1073356, 1112501, 1117464, 1141857, 1085892, 1193730, 1204954, 1019098, 1071896, 945280, 965334, 1049304, 1035745, 1037416, 936255, 929118, 1031367, 974290, 878776, 924486, 927164, 978278, 1010397, 883687, 787924, 862573, 856852, 797920, 781119, 748308, 840456, 842511, 777134, 787392, 871461, 844454, 808159, 829101, 818417, 817731, 770230, 800290, 697770, 772944, 945349, 875677, 741284, 631242, 714105, 780126, 767214, 793015, 788098, 929159, 968796, 867937, 923794, 804839, 710764, 716224, 644227, 689371, 768985, 778926, 665413, 680223, 694615, 689565, 701647, 675729, 632707, 774105, 805578, 752569]
2792G52569N0027j40677j4825p0812J0590J16241j40175J23507R766j2671q0038
2781F03502j60956j3656P7584J02163J8180L644J3207n3126q1066O0274K2232
2770E91982j5105P1820r6442L4333M2841n7649j20263J66192p8507l6125k8803
2759D74274l0210j9021m043p2989J49878m0176N7265R856r2876P0797J2899J7349
2747E33003l1903m6084l1701j62533O1041Q0825m4509J28889n5904J4496j11310
2736C34310P2499K6174p4441P2306N7694r3693r276L3620l5949q6963j7404P9806
2724C58683P3636j4526J12112j31282n524Q4393r2545P609J2102m9993P3173k8001
2712C99837o437L2249R126n2031r4446K3154Q3451m7208m6639J6598O66R3422
$$ y = [752569, 802596, 661919, 647094, 576282, 586872, 703113, 562938, 686445, 696211, 683540, 603502, 442546, 428890, 506474, 608637, 626817, 630461, 643668, 590542, 509476, 569750, 591982, 576877, 648697, 552255, 586588, 629429, 571780, 451517, 617709, 539202, 503077, 474274, 444064, 425043, 421000, 348011, 497889, 457713, 514978, 524834, 431958, 502755, 515654, 533003, 501100, 455016, 423315, 260782, 321823, 402648, 358139, 487028, 431124, 445620, 334310, 406809, 432983, 358542, 430848, 488542, 394849, 385573, 419193, 383244, 296281, 278877, 358683, 432319, 417793, 529905, 398623, 393099, 477492, 384947, 392556, 404658, 354665, 427838, 399837, 393400, 425649, 434775, 382744, 288298, 311452, 394903, 347695, 301056, 317654, 318320, 411742]
2700D11742o3889j05774Q4656M0155L0999L8791p021k7712r3892M6426p8558N8963
2688C34886P4065o4845p7356r408M1533p4331P9930j22546R4719L3174m7014K3801
2676B86608j073M1389j8249k3661j6943L1302p8685r464R8534p0294n6180l6994
2664A46290J33992M1683K3602j18807l7978j794O2067O7719O6928n2985P4732
2653D05449r6188O4032j017j01615Q2427j72677J06819M652L8066N0715L5317
2642D15980j4049o7246M9322L774k6842j71843J8184P8059o9664n887R1489M423
2630C05700j5183m4881k7540j45090O4444J38934j03399O5811K4544q1402j8318
2619A63620k501M10J63076j36247l4012o7617J89088j2475Q8432N879j33071m4319
$$ y = [411742, 347853, 242079, 326735, 366890, 397889, 436680, 429659, 401947, 308055, 354481, 275923, 334886, 408951, 344106, 266750, 257342, 298875, 224544, 304474, 181928, 276647, 309821, 262807, 286608, 285535, 326924, 308675, 285014, 268071, 299373, 220688, 211224, 309758, 239464, 183284, 146290, 280282, 321965, 345567, 226760, 188782, 186988, 249055, 316774, 383702, 330717, 405449, 309261, 373293, 372276, 270661, 353088, 180411, 287230, 291882, 329948, 380663, 415980, 401931, 334685, 384007, 387781, 360939, 189096, 207280, 285339, 215675, 209788, 301277, 305700, 290517, 245636, 218096, 73006, 137450, 276384, 172985, 238796, 263340, 181938, 163620, 161119, 161529, 324605, 188358, 154346, 86729, 275817, 263342, 351774, 357653, 224582, 180263]
2607A80263R0574k3224m3013m4080J6054K584j241o259J1255p0782r4998N7556
2595G4689M3635k6998j5770J26536L308O1512r743j0906Q8055j17092r7734Q2950
2583B02442j13715K9410N5632M4730j30589P186j9526M231J19495k9946N511K5981
2571B00842j7159k1643r7830N2716m8076n4234O5357J23612K1310p1884j3475
2560A39536n6568n4426K3425l108Q3063O5421l5604M8593q5493j06020J79566
2549A98385J0516J1073q1040j7390Q3689k3363n5272J2570l2213M357k686M0736
2537A49362J3601l7920R69P6404l5835m6937J37293o9848m1776o6768J51419j8437
2525B11527n0939l2170N6583j23198j17677J21494P5282M950P2752r8027n1714
$$ y = [180263, 270837, 247613, 204600, 160520, 176574, 179158, 177917, 171658, 182913, 112131, 17133, 74689, 118324, 91326, 75556, 202092, 205400, 266912, 257169, 246263, 334318, 217226, 119492, 202442, 88727, 118137, 173769, 218499, 87910, 95096, 75570, 79801, 199296, 169350, 174861, 200842, 183683, 162040, 64210, 116926, 68850, 14616, 79973, 203585, 224895, 153011, 139536, 82968, 28542, 51967, 48859, 131922, 197343, 161739, 210332, 124839, 18819, 198385, 208901, 219974, 138934, 121544, 205233, 181870, 126598, 139168, 106955, 111312, 108626, 149362, 162963, 125043, 126012, 202416, 166581, 119644, 256937, 187089, 145313, 78545, 229964, 211527, 160588, 128418, 185001, 61803, -55874, 65620, 140902, 145852, 218604, 120577, 68863]
2514F8863J01070k310k9590M940j50829N5449O4994r107q3464K9448j7605m8569
2502a6710Q3375J24595o4835M0776N2144r5279r1596j33396M4923J81646n3133
2491G2510R450L7309L1473j07590j04098j7758P3314P0045n8949N6717K186o2450
2479B159k3020J12800P4955N0037j22508j3561L9051m5354J959J003J11748p3120
2467A16149j743o232o2324M0882m4897l6750J8752q188J8018O716K9074k0283
2455D9174l2222J23189k254J27601m7810m2173j64864O1185p2375L2452J6355
2444D8258n3000k7101J3424J3719J07395P9167j26754j6848k6251P4415k1359
2433F5065Q6197o1541j5324q5422l565Q4020n1000M441l0130J8840p5547J4106
$$ y = [68863, 169933, 167623, 138033, 142973, -7856, 47593, 112587, 103480, 20016, 49464, 31859, -16710, 66665, 191260, 126425, 167201, 219345, 124066, 32470, -100926, -56003, 125643, 72510, 81960, 119269, 150742, 43152, -60946, -78704, -5390, 64655, 5706, 62423, 64609, 2159, -20861, 91939, 166894, 216931, 94423, 80862, 119913, 74559, 76518, 77521, 189269, 116149, 114406, 108174, 45850, 86732, 41835, 5085, 23837, 15649, 33667, 40383, 69457, 49174, 16952, 140141, 137887, 265488, 217678, 175505, 10641, 71826, -549, 31903, 48258, -4742, -31843, -18419, -4700, 102695, 181862, 55108, 38260, 12009, 86424, 65065, 151262, 89721, 74397, -11025, -14590, 69430, 18430, 22871, -7259, 11581, -63966, -49860]
2421d9860l7330J11991J20047m4842k5279l7540r7519N2134K0512l3389J3848
2410g227J12504J1612l5784q0863r700P5046p6244j6466O7133M647n4821K9765
2398A9602l1269m1127J39242O4403j00555j44278O0487L9836O0793j4751k1336
2387C1047m5l177q1888N5970J5779M7426r5448J05416J17305p6590m7038k2684
2375D6073p1582L2788K0439n5794M7790r3180J33042R9691J9751p9327m0702l8078
2363B0911j23923L0699J77647J6622l3764K176J6924j15636L7210o6415O8145
2352C0596K7640l2991M60m1054J299l6289n2376N5897J09806l2435m5071J2062
2340b456K7086N0314k0495j3689J0219q044K001J48630l5532l7115o5463j84O855
$$ y = [-49860, -87190, 24801, 144848, 100006, 74727, 37187, -60332, -8198, 12314, -21075, -7227, 105277, 116889, 81105, 242, -9458, 65588, -10656, -27122, 40011, 44658, -10163, 19602, -11667, -52794, 86448, 150851, 50296, -93982, -33495, 6341, 67134, 52383, 31047, 31002, 27825, -54063, 1907, 17686, 65112, -30336, 75080, 192385, 115795, 68757, 46073, -25509, 7279, 27718, -28076, 19714, -73466, 59576, 159267, 179018, 99691, 58989, 20911, -103012, -72313, 105334, 121956, 88192, 90368, 107292, -8344, 28866, -37549, 30596, 58236, 25245, 25705, -15349, -14050, -50339, -102715, -46818, 62988, 30553, -14518, -2456, 24630, 74944, 54449, 40760, 50979, 42935, 44936, 193566, 158034, 120919, 55456, 55272, 62127]
2327F2127l9551K7758j419j16767M916n6483J11197R6495p3734o09l7513J46358
2315A22775j10066j43608J73714O0262j06604j04174L1997p4963J14242O9824
2305C3399j50300N8467Q7419M4112k4678J9727p969r4998L4355n9152R6406L9677
2293G6465n6531p0021Q557O9892K71L5792j38732m8169Q0431m3778Q6168j7357
2281a7012n0985R2474L5706o2726j7724J06939m0504m7078J7277R7612j4964K1028
2269A20043j55191O4475O2044p3076O0070j05505j9824J14205o0946j0164O5130
2258F1261m7971K5095k3681M7063n7672o8969K384l2763P0030l302q3377l2506
2246a44408J59559l5930r9910O6047m9635K789J4471l0531J45040o9763J5925
$$ y = [62127, 22576, 50334, 48915, -67852, -62936, -119419, -8222, 88273, 14539, 13930, -23583, 122775, 12709, -130899, 42815, 103077, -3527, -107701, -75704, -150667, -36425, 33399, -116901, -58434, 28985, 73097, 48419, 68146, 60177, -34821, -466, -59618, 36788, 76465, 19934, -50087, -41530, 28362, 28633, 64425, -74307, -122476, -42045, -85823, 345, -17012, -67997, 24477, 60183, -2543, -20267, 86672, 46168, -910, 16367, 113979, 99015, 120043, -35148, 29327, 91371, 18295, 78365, -27140, -46964, 67241, 6295, -3869, 61261, 13290, 38385, 14704, 61767, 4095, -64874, -62490, -95253, -25223, -28525, -111902, -144408, 15151, -20779, -120689, -54642, -104277, -101488, -87017, -117548, 27492, -42271, -26346]
2235b6346R2959K2119j10335J11268r1748K925M2117J681L6177O248l2568m9946
2223D551j29757q0833J23373l0816M0966J22539k7286j7758K450Q058R668O6365
2211I1520K062j66300K3606N9211m0996R2021J7338j11397N2777l0046n2402l6057
2199i8663M1487M4962k4128J2818l8484P5882n7540j9596N8350N1023j12823L4175
2187c2537O8615J421N4965m2179J7965m1969L4992j6499m98q3790N9267p540r854
2174B359l3450M4330q9242J4229J13145p7307j06506R3250R222n3444P0232R4569
2162H1387L3181J0594N0291m5610j18106n5642M506N0758n7837L1468N564N2263
2150D2817M430L6863j4359n3922O7497p0865j6738K8234r4673Q4145n058j02605
$$ y = [-26346, 66613, 88732, -21603, 89665, -2083, 842, 42959, 44640, 80817, 87065, 54497, 4551, -125206, -206039, -82666, -113482, -72516, 50023, 22737, 4979, 7429, 15487, 25155, 91520, 93582, -72718, -49112, 10099, -30897, 61124, 78462, -32935, 19842, -10204, -62606, -98663, -57176, -12214, -36342, -23524, -62008, 13874, -43666, -63262, -4912, 46111, -66712, -32537, 36078, 37499, 92464, 50285, 68250, 26281, 61273, 44774, 44276, -39514, 19753, 12213, 2359, -31091, 13239, -76003, -61774, 51371, -25936, -132442, -39192, -29970, -83414, -13182, 81387, 114568, 125162, 175453, 129843, 11737, -43905, -39399, 11359, -46478, -15010, -9446, 42817, 47247, 84110, 69751, 15829, 83326, 12461, -4277, 23957, -70716, 13429, 8371, -94234]
2138i4234l3682J32509J01320k64K165L9024j35927m4981j3333J79883n0140r6980
2126a4640R4171p4087o2585j8456P3560r635O8090l9766q9024M844M9780M0832
2114B3084J1918r9352J08576q1836J27691k1715q7590m8305O9914k5184Q1508
2103E8709o814K1811j5375n0070L9190R6723k1672J9731M1474j24074l1109L424
2091C1948M5072k0774n3236J33446J39451R1143p5583j38943m3225O1291Q1605
2080B52195J13817j21226p326O9875j9517K29541K2437K9015N9397K085J2563
2069F42856P1400P4414J70555K22134J26090K1716o8489o3969j8472k01149j43315
2058H33771j70045o8544j31034o3723m0519m1749K629l7793k2968j6270J42027
$$ y = [-94234, -127916, 4593, 105913, 105649, 107814, 146838, 10911, -34070, -47403, 132480, 82340, -14640, 79531, 5444, -57141, -75597, -2037, -11672, 56418, 16652, -72372, -67528, -17748, 23084, 35002, -64350, 44226, -37610, 90081, 68366, -19224, -67529, 2385, -22799, 58709, 51895, 73706, 58331, 8261, 47451, 144174, 122502, 142233, 183707, 59633, 28524, 31948, 77020, 56246, 3010, 136456, 275907, 367050, 291467, 152524, 109299, 170590, 252195, 366012, 244786, 237460, 307335, 287818, 517359, 539796, 568811, 628208, 630293, 642856, 714256, 788670, 959225, 1181359, 1307449, 1329165, 1260676, 1196707, 1178235, 977086, 833771, 663726, 595182, 464148, 400425, 359906, 318157, 320786, 282993, 260025, 243755, 385782]
2047C85782q1479l3367R2523r4789M637j02081Q4157p0356j17215k2126q515J14364
2035A51535j7444m0904o0136O3516K9653n6460l9147q0018P1283q1008P0374Q4183
2023I5427l7758m1356l1877K3369l8095J51977m1102O9810r1387r9410o11K9620
2011a1393J20898p4752J0127n4563L4240J4058Q5660n6229j03748r318O4732m8385
1999b8673M6397m4668p0897J31877j23464k5939M1908P0754L142O1920Q2660l9514
1987A05503j14379J5773p7760P8157m9912M8034J02733M4360j00609p4715L4155
1976A1340m0542K0254o4713N9644K6726K4645Q0703j02777J07844n1417j80043
1965a08336J07480K3687j258j22506k2040k8106K3301k7564J13817N4555n9483
$$ y = [385782, 304303, 270936, 363459, 268670, 273307, 171226, 255383, 185027, 67812, 45686, 37171, 151535, 134091, 93187, 33051, 96567, 126220, 69760, 30613, -49405, 21878, -59130, 11244, 95427, 57669, 16313, -15564, 7805, -30290, 121687, 80585, 150395, 59008, -40402, -41013, -11393, 109505, 34753, 44880, -9683, 24557, 38615, 124275, 68046, -35702, -45020, 19712, -28673, 17724, -26944, -97841, 34036, -89428, -115367, -73459, -2705, 437, 62357, 145017, 105503, -8876, 6897, -70863, 7294, -42618, 5416, 108149, 152509, 51900, -22815, 11340, -29202, -8948, -73661, -14017, 12709, 37354, 118057, 15280, 123124, 71707, -108336, -856, 22831, 21573, -100933, -122973, -151079, -127778, -155342, -41525, 13030, -46453]
1954d6453j0682n4348k4673J14403k8197O1779J09150j02625m2526Q9030K3844
1943H8702l5949j08346l5195k983L4080R1659l6661J4753L1445p2742O333L7196
1931A2292r323N6714J876j5033r2585m4847l722O1904j13340R1080j15161p289
1919a77434J42974o459N730k2472P2830l0996j27084M7043M9605q8852J00817
1908c4298O277R4222r5773L0601m5260J221l8784K2264J7073p0318O7985O6996
1896B2206J6689l8063k7724J1046k0171P537K7541q8615P7933j6076l2005Q1163
1884B1461N124o1981O319k8834M8571L6031l8449n673Q6557k6000K1195p1019
1872f698r4021m997R5854j146O71Q7380m7422j09837M0020R4895j02173N6144
$$ y = [-46453, -57135, -111483, -136156, -21753, -49950, 11829, 120979, 18354, -24172, 64858, 88702, 52753, -55593, -90788, -93771, -59691, 31968, -4693, 10060, 41505, -31237, -24904, 12292, 2969, 59683, 61559, 46526, -46059, -90906, -94628, -32724, -146064, -54984, -170145, -177434, -34460, -40919, -35189, -57661, 15169, -15827, -142911, -95868, -46263, -135115, -34298, -28021, 66201, -29572, 1029, -44231, -43010, -81794, -59530, -42457, -112775, -44790, 22206, 38895, 832, -26892, -15846, -36017, -28480, -939, -89554, -11621, -27697, -59702, 21461, 26585, -35396, -29077, -57911, -9340, 26691, -11758, -17431, 69126, 43126, 64321, -6698, -100719, -105716, -9862, -11008, -10337, 77043, 29621, -80216, -40196, 54699, -47474, 8670]
1860H670j4183p4861P0303r2670n1980J6953J17924k1651K4793K9920l9532l087
1848b9401q7945k0586P6837N0914j0755n6545O277K8195P9504j58440J14153M6549
1836C8757N0380o4183P0966K049k10357Q8798O769k9581J1579Q2775r6494N0359
1824A817j07577M5391P2194k638K144L815k8995p7611L3332M8346j26315M8701
1812h7396m6542J03935p9039P5627O2664r39n3405j1206M0137k5837m7094j9677
1800h8772J6993k6872L5825K5062m4104l1215j2376K5236O0781Q9396o9639k3627
1788d3312J6551r2107J29725r0763j062j6355p8231R9456N2091o5727N1474o5365
1776a03625N9842n1816Q8129J20444q8431p5850L0704n1600N5352P036o4380j9405
$$ y = [8670, -5513, -80374, -10071, -102741, -154721, -137768, -19844, -41495, -16702, 13218, -26314, -29401, -117346, -137932, -61095, -10181, -20936, -77481, -71204, -43009, 36495, -121945, -7792, 38757, 89137, 24954, 95920, 97969, -112388, -23590, -16821, -46402, -34823, 47952, -48542, 1817, -105760, -60369, 11825, 9187, 11331, 15146, -13849, -91460, -58128, -9782, -136097, -87396, -133938, -30003, -109042, -33415, 29249, 28310, -25095, -36301, 3836, -22001, -69095, -88772, -71779, -98651, -62826, -37764, -81868, -113083, -125459, -100223, -39442, 49954, -19685, -43312, -26761, -118868, 10857, -79906, -80968, -97323, -175554, -76098, -24007, -89734, -38260, -103625, -43783, -95599, -7470, 112974, 24543, -51307, -20603, -72203, -16851, -9815, -74195, -93600]
1764i3600L4215j8227N1067O7577j6155q5187M5430J04654q0364R649L7139j49539
1752i3341O0364j00854o276J69248l7993o2731J38718p4949p4463j6550K1599
1741g7228J25465r0912J5501R144L0242m0254p792r6412J33656o5339M1663R135
1729a3131K8428n492o0388L8584n7949o0652N2130l96j00220J10547j01922j9394
1717a89855J63042M6733n6106j7160O8834o6362m1861q0724O6800j6989M4552
1706g9096l3191l9250O5873J0667p3893L9158J15750J4825l9503K055k4621L2482
1694h744k9932k4481l8270n6255N2495J01569j3925J10924l6488L6356l8591j71586
1682a16928J90348K829q0623k6619J84125p6656l9552k1920r000N9813n6193J7823
$$ y = [-93600, -59385, -77612, -26545, 41032, 24877, -60310, -14880, 89774, 9410, 19059, 56198, -93341, -32977, -133831, -140107, 29141, -8852, -71583, 67135, -7814, -82277, -98827, -77228, 48237, -42675, -27174, -18030, 12212, -28042, -35834, -132246, 1410, -63929, -22266, -13131, 15297, 9805, -50583, -11999, -69948, -130600, -78470, -78866, -179086, -68539, -170461, -189855, -26813, 19920, -36186, -53346, 15488, -50874, -92735, -173459, -106659, -123648, -79096, -112287, -151537, -85664, -74997, -148890, -109732, 6018, 20843, -18660, -16605, -41226, -8744, -38676, -63157, -101427, -157682, -105187, -3618, -17543, 93381, 56893, 93249, 54658, -116928, 73420, 76249, -4374, -30993, 153132, 76476, 36924, 15004, 6004, 65817, 9624, 27447]
1670B7447R2864j28100L1566L0912k6547k3176k3024J9786K5203K8843j6554j2217
1658B7003m4628M6803n4545K8091l3009Q717Q4655q8985R543m8323P2569j9052
1646a1161k5239j21048N5533O7340M2861j3820O0038J6173K6434p5599q3294Q4471
1634B2689j15618p4941J89982J1723j62708P4383j026R3296q3557j5444M7031
1623a4190k919m1261o3375L222R9639m2560R3661j24706l4769O2873K8904k8579
1611f4060N662L9986N6917p0520m003J9799l3786K3986j08503P2711J9221K3216
1599a9374r2228n431K8072o7522P9837r896j07960J27588N2273j08749n0446J10078
1587f3758O2736p6698P5684p266N3344N8103j53988n9757O6596N006l3386J15238
$$ y = [27447, 120311, -7789, 23777, 54689, 28142, 4966, -18058, 1728, 26931, 55774, 39220, 27003, -17625, 29178, -25367, 2724, -30285, -21568, 63087, -25898, -16355, -64678, 7891, -11161, -36400, -157448, -101915, -34575, 8286, -5534, 54504, 70677, 97111, 21512, -61782, 22689, -92929, -167870, 22112, 33835, -128873, -54490, -55516, 37780, -45777, -61221, -14190, -17109, -58370, -121745, -118523, -18884, -61444, 32217, -92489, -127258, -64385, -35481, -64060, -58398, -18412, 38505, -32015, -36018, -16219, -50005, -26019, -134522, -61811, -42590, -19374, -111602, -117033, -88961, -156483, -76646, -86542, -194502, -66914, -14641, -123390, -173836, -63758, -1022, -77720, -2036, -9302, 44042, 102145, -51843, -111600, -45004, -39998, -73384, 41854]
1575D1854N4196j72557n1220J29872p8491J01760K6366r9959k442O2547r341p622
1563e037k0062n6665O3113l8443J28326j09233J9177J89671o5471j31536l8910
1552f5070Q720k2685M5848K1247J17109j29095r8909M4022m9695l0155P3218J9201
1540f6244j3174N9554p8389N6802J36386r3411j08997J71770N328m6181J2946
1529C6390l8904n616q4142J20470j41776m6401J67487k6932o9384j37N3382P541
1517b8022m5940J45910j08778p5465J02675L643M8012k5471n2484l0582K1777
1506d4725O3315P346o5229m3067l3533M9945n94o3774R7860M7035Q9338n4568
1494D9349n449q2409k1520q459o4358N3792J2473r5322m3725Q2764R5405j6610
$$ y = [41854, 96050, -76507, -127727, 2145, -76346, 25414, 51780, -48179, -50621, 11926, 2585, -5037, -25099, -81764, -18651, -57094, 71232, -38001, -18824, 170847, 105376, -26160, -65070, -56350, -79035, -33187, -11940, 105169, -23926, -122835, -78813, -128508, -158663, -85445, -66244, -79418, -19864, -98253, -41451, 94935, 1524, -107473, 64297, 69625, 23444, 36390, -2514, -8130, -92272, 28198, -113578, -159979, 7508, -19424, -88808, -88945, -35563, -28022, -73962, 71948, -36830, -112295, -9620, -5977, 42035, 16564, -35920, -66502, -44725, 18590, 25936, -39293, -82360, -115893, -65948, -66542, -130316, -32456, 14579, 103917, 49349, 43900, -38509, -60029, -68488, -132846, -79054, -66581, -161903, -205628, -122864, -27459, -44069]
1482d4069m9777J1753K04253l7917o8967j23669K9885q546o152N1884p396R169
1470c9549p2480Q9599J4581P1627m0085J14211j39032j1437l8457M5035K4670
1459A8683k6643k2452K6974p0671L6473j8766L7690L0264j60j41407P7694n0515
1447a02836M0323J10894n5674Q508J26084k7004n1153p1267K0283m0205N4783
1436A2736k2480R906M4076r8087J0614o4182N5124M7750N8979n3645p44J9103
1424A9150Q313n5915J25491k431o3630l4200P0645j11353n2836m1248O1221P3022
1412c771J7645j30203K5647R8885K5500l6506j07070J11688j4227o0682q8280
1401a61374J77052N302L3333j07764r43K7723K6155M2756N725n0709Q8045j19414
$$ y = [-44069, -93846, -82093, 122160, 84243, 15276, -108393, -78508, -87054, -93206, -41322, -48718, -39549, -112029, -22430, -7849, 63778, 23693, 137904, -1128, -12565, -51022, -5987, 18683, -7960, -30412, -3438, -74109, -37636, -56402, -18712, 11552, 11392, -130015, -52321, -102836, -62513, 48381, -7293, 1215, 127299, 100295, 49142, -22125, -1842, -42047, 12736, -9744, 162, 44238, -53849, -43235, -107417, -52293, -4543, 54436, 791, 47, 19150, 27463, -28452, 97039, 94608, 30978, -3222, 67423, -43930, -96766, -138014, -76793, -3771, 13874, -116329, -90682, 8203, 33703, -2803, -109873, 1815, -12412, -73094, -161374, 15678, 20980, 54313, -53451, -54394, -26671, -516, 42240, 47965, -2744, 85301, -34113]
1389c4113p3840L5779p028O7875o1919L6471K8478l8635m3867J5335k3538J25717
1377B6715P8567J2844j97746n9385o0665K43358j43578j6311L5647k2655j0073
1366a13282m2490l9601J60519J14465L0229K7668j30372n3855m1673o8569Q5222
1355g1739R543j8461K6916j6150L7171m1079R178l5497P7488j1028p230j2006
1343e2894M0288k0482Q6290P3101j13891L3606n7745m7370j9422J13118K1530
1332E6129K5196J2281j2866j08338j09329R9620O5358j2026k8754J2968n0082
1321d9843J9239K0595n2287M8241p8219J5223j9195J29193r1991K1562j0577k7902
1309g5961J34199l4664j6671k6716J4182P1540J8427j1907M7530j32001K1784
$$ y = [-34113, -107953, -72174, -79202, -11327, -73246, -36775, -8297, -46932, -90799, -75464, -99002, 26715, 105282, 118126, -79620, -139005, -199670, 43688, -99890, -116201, -80554, -103209, -113282, -155772, -195373, -34854, 79611, 109840, 137508, 7136, -46719, -88392, -156961, -71739, -62196, -80657, -53741, -69891, -32720, -73799, -64621, -100118, -22630, -33658, -40888, -52894, -12606, -33088, 53202, 126303, 12412, 46018, -11727, -59097, -78519, 34599, 56129, 81325, 93606, 80740, -27598, -136927, -37307, 28051, 16025, -12729, 239, -49843, -30604, -10009, -62296, -14055, -92274, -77051, -96246, 32947, -59044, -37482, -48059, -75961, 58238, 23574, 6903, -19813, -5631, 65909, 84336, 72429, 119959, -12042, 9742]
1298I742k081l3761j20217K6438J4225J07102L6843o4088M4415J185r762k1716
1286a1675l7793m9273P5937q7638K4421P7774J29087j33994m7914m1925k0107
1275a23100P3370r3677P0912p5293O0214j5267n9607K4277R4078l361R501P8592
1263D0639K2079j64710J52525n3972L1747K3644j15515j7656O3991L438p5601
1252h9391K2689K0236m0531J04160j9300R9287j57037j6733M1946m9240J17629
1241C3715r880N337k5304q8295P513P0161P774o7229l4684M7469L5939l3296q202
1228e8982Q7298m5401P9066k0340p4296q6583Q820J03081k314N047K9653l0005
1216d956k5476L1441j36125P9309j0116q160M4618N7332Q89l3655R8606p6497
$$ y = [9742, 7661, -26100, -146317, -119879, -105654, 1448, 38291, -25797, 18618, 19803, 10041, -11675, -49468, -98741, -22804, -110442, -86021, -8247, 120840, -13154, -61068, -102993, -123100, -49730, -143407, -72495, -147788, -87574, -102841, -162448, -138171, -44093, -47454, -37953, 40639, 62718, -101992, 50533, -3439, 28308, 51952, -63563, -81219, -17228, -13790, -89391, -66702, -46466, -86997, 17163, -2137, 97150, -59887, -76620, -34674, -83914, 33715, 23835, 29172, 3868, -84427, -76914, -6753, 1021, -66208, -100892, -53423, -17484, -50780, -58982, 28316, -17085, 61981, 41641, -32655, -119238, -110418, -7337, -9651, -4604, 25049, -4956, -30432, 1009, -135116, -55807, -65923, -74083, -29465, 27867, 28756, -4899, 93707, 17210]
1204A7210j3636n0787J2840O0312k0910L3825l5526p3468P7566N9729j29049p2529
1192a34423R6496p4704m570o5612J65508O1394n1130L0184p7020m6794Q4214l0810
1180d7267q9225J16444J8747j582M4483j00122O6727N6298Q9422p0312L076q3138
1168C551l114p914n0345o0625q4510J6795P5212J20679n5617L7895j5278M5144
1156B1873j9204K930L041P826N9988r9552J24326j38070j03892O4170J10028m6489
1144a3025p7339N3786n7904K3P9164K7703J6946m9667j10936j9N079M5846n0092
1131a30435O9086P6025p4031o0279P7766L8800L4245K4455P279j60896P4722r376
1119c2639J6221O6928o3059K9264n0145L1050J12040m4311m3591L6714o5110O9676
$$ y = [17210, 3574, -47213, -34373, 25939, 5029, 38854, 3328, -70140, 7426, 67155, -61894, -134423, -37927, -112631, -117201, -182813, -17305, 44089, -7041, 23143, -53877, -100671, -16457, -47267, -136492, -20048, -1301, -2883, 41600, -58522, 8205, 64503, 153925, 83613, 86689, 3551, 437, -7477, -57822, -118447, -202957, -186162, -110950, 9729, -45888, -7993, -23271, 21873, 2669, 5599, 8640, 16466, 76454, -23098, 101228, -36842, -140734, -76564, 33464, -13025, -90364, -36578, -94482, -94459, -15295, 12408, 29354, -20313, -131249, -131268, -126189, -80343, -130435, -61349, 14676, -59355, -119634, -41868, -3068, 31177, 55632, 62911, -97985, -23263, -32639, -16418, 50510, -12549, 16715, -33430, -2380, 109660, 65349, 21758, 58472, -6638, 63038]
1107F3038j14218O6853j25157R0178k6263p1946J46651n5143P3875n2912O5045
1096F0001o8979j14023O0512J55046O4713m9879j05923o5711L9699j0215N3132
1085A8373j36934Q8324J4451J1412J0060M2845L4907j49766j9024j7790K1099
1074h2043o4005j7121N2978R1208k4085k2603l6047q1924M237K46116n490o5503
1062d282j7778L8431r394K5016j21175j343O0984o0870N8990n0630j9453L3872
1050f7632J1964M4814l6741r923l1509M7070m3699N7319k1506l3469L3261O8096
1038A8045l466J5170K094q7223l4420O4116R6219p1213j07062J30088r2j5796
1026F460o6599L6396J19324j3045L5934j12543J2757L6924j7787j52758Q4256
$$ y = [63038, -51180, 15673, -109484, -19306, -45569, -117515, 29136, -26007, 47868, -5044, 60001, -8978, -123001, -62489, 92557, 157270, 107391, 1468, -64243, -24544, -34759, 18373, -118561, -30237, -15786, -4374, 5686, 48531, 83438, -66328, -85352, -103142, -82043, -146048, -163169, -110191, -18983, -43068, -65671, -101718, -183642, -179405, 66711, 61221, -4282, -22060, 16371, 6977, 31993, -89182, -90525, -29541, -90411, -31421, -82051, -101504, -67632, -55668, -10854, -47595, -57518, -89027, -41957, -85656, -28337, -49843, -83312, -50051, 18045, 14579, 29749, 31843, -55380, -89800, -25684, 70535, -678, -107740, 22348, 22256, 6460, -60139, -23743, 95581, 82536, 118470, 5927, 18684, 55608, 37821, -114937, -30681]
1015c0681r5993J12794Q6657j2039j23788q0287O5700M9952N0590r2332j31738
1004b01165J53915l7019K3951J21746r4188m4428J5303j44N9561k9773q1291L11815
992A98283o3246j40592P863J06254n9815j64226J54758P4127j30350j1623k2206
981e0773j36003J06292K4030K4305r9211M0545R5087o7920J05446l1023J09338
970A20113n0150j00698q946J3460J8781j861p0918P4306P981J17487J5049j15307
958A9297l4530L2761o6059j4717N5616P475O117L6718j3352l2694K0275j868J41472
945A56511j46245M2582P7160m9349L2032R040j24080p94j21161p996R7819M4806
933A0325k663m0463L1214l5020n7239j0382N7109K3955n489R0877q9457O023Q9135
$$ y = [-30681, -126674, -13880, 72777, 60738, -63050, -143337, -77637, -27685, 22905, -69427, -201165, -47250, -84269, -60318, 61428, -32760, -77188, -61885, -62029, -2468, -32241, -113532, 198283, 135037, -5555, 2308, 108562, 48747, -115479, 39279, 113406, -16944, -28567, -50773, -186776, -80484, -56454, -32149, -131360, -90815, 4272, -63648, 41798, 10775, 120113, 69963, -30735, -39681, -26221, -7440, -9301, -80219, -5913, 2068, 119555, 134604, 19297, -15233, 17528, -48531, -63248, -7632, -157, 5960, 42678, 29326, -3368, 16907, 15039, 156511, 10266, 52848, 130008, 80659, 112691, 121731, -2349, -3143, -124304, -132300, -34481, 10325, 7662, -32801, -1587, -36607, -93846, -104228, -47119, -23164, -28653, 62224, -27233, -21210, 67925]
920F7925j41040k7091k0253O893L8134J2267Q6754k3123l9867q369N4801j6127
908i096M9824J0461l9714M606n6070L9426q3698N546J32851l0565M8133L7938
896A09642j6399o0065P8694k3870m0183j1274p5070l8577m4516J15791Q4864m2982
884C6055j0913J95200j17623l3051m5435l4022J8351K9451L902l0525q5481Q7014
872A2923Q771j1244k423q8037l6518J05050n4017R116O1560M0948J0713j07240
860e0398N9688k4655J08348n9611O506j12686J18402Q3742q9375n0450k7426K4711
848a3204J24384L3183K0287l7112j25132Q786J26298j00491r5578L3136q6601
837a12044Q9861J6753M3709K6117k8820N358j41264N073J48155N447j7413o0247
$$ y = [67925, -73115, -100206, -120459, -113566, -75432, -63165, 23589, 466, -39401, -47770, 7031, -9096, 40728, 51189, 11475, 16081, -39989, -563, -84261, -78715, 54136, 23571, 71704, 109642, 93243, 33178, 111872, 88002, 47819, 36545, -38525, -77102, -121618, -5827, 79037, 36055, 25142, 220342, 102719, 69668, 24233, -9789, 8562, 38013, 41915, 11390, -74091, 12923, 21694, 10450, 8027, -80010, -116528, -11478, -65495, -56379, 5181, 46129, 56842, -50398, 9290, -15365, 92983, 33372, 39878, -72808, 45594, 129336, 39961, -10489, -37915, -13204, 111180, 144363, 164650, 127538, 2406, 11192, 137490, 36999, -58579, -25443, -112044, -22183, -5430, 38279, 64396, 35576, 40934, -100330, -95257, 52898, 58345, 40932, -19315]
825a9315j2375J16965m1873L0825N6908o394j77419Q9298N2554r6204O1991k2026
813C2935J6813n6299J47810r7862j1130M1629m7033P9087l6470K5548j27564K06545
801A74009n2472J3713L7656l5886k38854n1341J97551m3588j5421N1662j5072
790B1957o0260K2963J123R901m7226M9983j4151q7516n5914J72000l7088R7481
778G3253k4136N3170j44719Q4054k3147o4706k2110N0893n3230j6965L4927J23396
766G0680n79L1107K872p1985p0798J4348J10579r6002J8446K5918J7139K4050
754G5775p1527j7652j5293O0044m9765P9143j6389J6216J7437j19832O9700k2346
742E511l6877J33821l3237p4458k7515l0731M6014L0377j4489Q2997J41833j42979
$$ y = [-19315, -31690, 85275, 43402, 74227, 131135, 124741, -52678, 36620, 89174, -7030, 54961, 32935, 49748, -6551, 141259, 43397, 32267, 73896, 26863, 105950, 69480, 95028, -32536, 174009, 121537, 135250, 172906, 137020, -101834, -153175, 44376, 788, -14633, 37029, 21957, -38303, -15340, -14217, -4316, -51542, -1559, -15710, -103226, -159140, 12860, -24228, 73253, 49117, 102287, -42432, 41622, 18475, -46231, -68341, -17448, -70678, -87643, -52716, 70680, 70101, 101208, 104080, 32095, -38703, -24355, 86224, -9778, 8668, 34586, 51725, 75775, 4248, -13404, -28697, 31347, -18418, 60725, 44336, 60552, 77989, -41843, 27857, 5511, -31366, 102455, 69218, -5240, -32755, -63486, -17472, 12905, -1584, 81413, 223246, 80267]
730H0267n7378j41948M9554R3979m987r7813J82896j00209O1216k0819o4738o415
718b6395o776R9969o6243P2358j670L9442p0433m6147n583M2836j2429J6794K9521
705F5244j5006j01598r3894J62387k8039J0503n1227M3384M1680l5934j26842
694a29342K0707R6656O8538l7671k3560j1131Q3292o8210l3197L9060J33061L4002
682A72205j14124m522R0097l1669p0255m7181o7346L7091L5615n8702L3574k1954
670d7171k7745n1668O5174J29918L1164o5274Q1917r8990q714N7251m6385L8440
658E7917l4151K7090m8647P0528l386l6158o6968j2447O2699m7797J15619L1849
646A16148K1049n8290r0788l0220l363L5903J00327P7908k5412j8964j22725J23133
$$ y = [80267, 22889, -119059, -69505, 24474, 19487, -78326, 104570, 4361, 65577, 44758, -19980, -26395, -33171, 66798, 555, 72913, 71243, 110685, 40252, -5895, -11478, 31358, 18929, 35723, 65244, 50238, -51360, -145254, 17133, -10906, -403, -51630, -8246, 33434, -2500, -129342, -108635, -11979, 56559, 18888, -4672, -15803, 67489, -721, -33918, 5142, 138203, 172205, 58081, 53559, 143656, 111987, 41732, -5449, -72795, -35704, -89, -58791, -25217, -47171, -74916, -126584, -61410, 68508, 99672, 34398, 116315, 17325, 8611, 65862, 19477, 57917, 23766, 50856, 2209, 72737, 69351, 33193, -33775, -46222, 16477, -31320, 84299, 116148, 137197, 78907, -11881, -42101, -45464, -9561, 90766, 168674, 143262, 124298, 1573, 124706]
634A24706j23803j6542O788p6336K174J34213j0191l9070O5574k4540n8902R093
622f836j4137o5965J5483O4375N5077O0416m4911l285m1728J1734n4930J16044
610I1337l7337j00852M1435K83j4486Q5006l3134m2795k8082O5148k9870M0028
598C6681l9083M069L8108q2955p4761J48688N7216j0117L8828j40439P275M4779
586B8289J21780j0734r6922M741q1283J044Q7386r8462n7053L6205K7659M3542
574F192k7882m0847J21500Q0458L2910p6329L0536j13028R5612j50983K3332N7348
562C8819m56J09657r2740K0462j49166J36989K8188j07096O6257L8649o4527J7435
550D2471l8575O9685k6146j13629n161n6280l3739J03153P0952n852M7807L0447
$$ y = [124706, 903, -15639, -8851, -85187, -83013, 51200, 41009, 1939, 67513, 42973, -15929, -6836, -20973, -86938, -71455, -7080, 47997, 108413, 63502, 60217, 18489, 30223, -24707, 91337, 54000, -46852, -5417, -5134, -19620, 65386, 32252, -10543, -38625, 26523, -3347, 36681, -2402, 1667, 39775, -43180, -117941, 30747, 87963, 77846, 116674, -23765, -16490, 28289, 150069, 139335, 42413, 47154, -34129, -33085, 54301, -44161, -101214, -65009, -37350, 6192, -21690, -62537, 58963, 139421, 172331, 96002, 126538, 13510, 109122, -41861, -18529, 38819, 38363, 148020, 55280, 75742, -73424, 63565, 91753, -15343, 50914, 89563, 25036, 42471, 3896, 73581, 47435, -66194, -71355, -127635, -161374, -58221, 12731, 6879, 54686, 85133]
538H5133k9330N7919p8735J5319J11994j52204m942O2303j34517k1319n4324P3402
526f9301J22603m0585N8337R819J3906K7386J5590M2074m5922K4601L3097m0404
514A51201q8411j53652n475Q4906J04698j699q0529L9211Q6450n6754J15629j35242
502F0333r105n4041J01261l2489J0851q7336L2244n5933m4821P37J56323M8833
490A26857k46304R4306J27680o4189k5696K8305L5194J1023n1036o1133J04318
479G9325k9912L1947j11343J6734J23755n8500r9332o9784P9149n6727K31354
468A36666m9946k745K8221k8552j26521O428q4473J70875n8232l0626O8046j07328
456g8187J7948K8351J04999k4772j38604N4867K3733l0749o6712l2236J27418
$$ y = [85133, 55803, 113722, 34987, 50306, 162300, 10096, 5154, 67457, -67060, -88379, -142703, -69301, 53302, 12717, 71054, 80873, 94779, 122165, 137755, 179829, 133907, 158508, 191605, 151201, 62790, -90862, -96337, -11431, 93267, 91568, 11039, 50250, 136700, 79946, 195575, 60333, 51228, -2813, 98448, 65959, 76810, -10526, 21718, -34215, -79036, -78299, 78024, 126857, -119447, -25141, 102539, 38350, 12654, 40959, 76153, 87176, 36140, -24993, 79325, 49413, 81360, -29983, -13249, 110506, 52006, -47326, -117110, -37961, -94688, 136666, 86720, 83975, 112196, 83644, -42877, -36449, -120922, 49953, -8279, -38905, 29141, -78187, -60239, -31888, 73111, 48339, -90265, -35398, -11665, -42414, -109126, -141362, -13944]
445a3944Q066l0721K0486n4194K9254J48572q5071j18293L9205R3238L8851l3999
433D1450m722j09027R4997m3092J0985l0663Q2372k0134M6168O8276o9983R554
421G6181K4066j9030m4778M5505K8476m8179j0090R2896k6879j04368m7226P8035
409D4609N2106r1270j27418J68237K8379J10425j82956l1971R1001n7862J2003
398A5283M7389K1094N2216m8693o2748j7174R3157j0696j39185O8430j3607p5781
386g0315O3906q060j4445k227J15709J9432p8728j3948L6396L4386N7225r4254
374D5077o0694M8446k4005j1721m2421J1422J21798q6919P4482R235J0692o8181
362B7211k269k4511n5851P9789J21552M0352n6832m8954j6806L069N1518J0823
$$ y = [-13944, -5878, -36599, -16113, -70307, -41053, 107519, 22448, -95845, -56640, 36598, 75449, 41450, 36728, -72299, 22698, -20394, -9409, -40072, 42300, 22166, 68334, 136610, 66627, 76181, 100247, 81217, 36439, 81944, 110420, 62241, 52151, 145047, 118168, 13800, -33426, 44609, 96715, 5445, -121973, 46264, 74643, 185068, 2112, -29859, 61142, 3280, 15283, 62672, 83766, 135982, 87289, 24541, 7367, 100524, 89828, -49357, 19073, 5466, -70315, -6409, -14469, -28914, -31141, 84568, 104000, 25272, 11324, 47720, 82106, 139331, 45077, -15617, 32829, 8824, -2897, -45318, -33896, 87902, 983, 75465, 84700, 95392, 27211, 24942, 431, -55420, 24369, 145921, 186273, 129441, 80487, 63681, 66750, 118268, 129091]
350A29091p9720l0041o7670J04196k6741O0278o1586l9216Q51Q8972j04957J380
338b5163o333o7714j00604J31960L4669N1177J9645j6688k05277J82300P2289
327G0261J0053J27491j14745k5953m0398L9784p8288l0791P6360m1336l5598J15062
315G1902J6733p1739Q4467L5705n9835n0498l974l5424P5750O8715j30952P0003
303G0853L353j23417N7629O0833m6367l9031N3781R045n8342J05971m3175O4201
291A15334o6890j01876k9610M3356R8640P577j16321o837O0527J07808L414j8210
279I6912m9284r5367N2453M4765p2476Q3750K3000n6887P0572k1611L3764M0440
267A50031k8636j80422j0178Q7014j9951M5689j5048q3914Q0052k8696Q9115k1963
$$ y = [129091, 49371, 19330, -48340, 55856, 29115, 89393, 27807, -11409, -10558, 78414, -26543, -25163, -31496, -99210, -199814, -67854, -33185, 17992, 37637, 20949, -184328, -2028, 70261, 80314, 207805, 93060, 67107, 26709, 66493, -11795, -42586, 33774, -7562, -43160, 71902, 88635, 16896, 101363, 137068, 77233, 26735, 22761, -12663, 63087, 131802, 850, 70853, 74206, -49211, 8418, 69251, 22884, -16147, 37634, 46679, -11663, 94308, 51133, 115334, 48444, -53432, -83042, -39686, 58954, 66531, -49790, -56627, 3900, 111708, 115122, 96912, 47628, -47739, 4714, 49479, -22997, 60753, 83753, 26866, 97438, 75827, 109591, 150031, 121395, -59027, -69205, 17809, -2142, 43547, 28499, -55415, 24637, -4059, 85056, 63093]
255F3093k8967J0676n7875N5332M5214J3952l1599o6430l8085J10897N3300L806
243A33314o6569J0758o5378N5537M5876j2277j37893K8475L1606L7268p555N584
231E8746o3946J5615m1751K5831R5556n1187Q2416p5756L9158j312R1281q6547
219H8104o1137m3582K6099J04902r7578L0134N4091m5946q9703N490K1795J6525
207I194l3961N0089K7047L0443L4374j48475N1203k3902p112N705J28609p4191
195D9023p4781K8677K0009L7712l9513J24372j41163R1950J16917j65975q7725
184d0497K9406K3212m7594L8020J5621P0922l3111J7225j12186j8432Q0023n6508
172c3899k5693o906Q568O6417J00143l8327O5071j00288r3747R0096O2037l1358
$$ y = [63093, 34126, 44802, -13073, 42259, 87473, 101425, 69826, 3396, -34689, 76208, 129508, 133314, 66745, 77503, 12125, 67662, 113538, 101261, -36632, -8157, 23449, 60717, 53162, 58746, -5200, 10415, -31336, -5505, 90051, 38864, 121280, 45524, 84682, 83370, 174651, 88104, 26967, -16615, 9484, 114386, 16808, 46942, 101033, 55087, -34616, -29126, -7331, 9194, -24767, 25322, 52369, 82812, 117186, -31289, 19914, -3988, -11100, -5395, 123214, 49023, -25758, 2919, 22928, 60640, 21127, 145499, 4336, 96286, 213203, 47228, -40497, -11091, 12121, -35473, 2547, 18168, 89090, 55979, 73204, -38982, -57414, 22609, -33899, -59592, -66498, -57930, 8487, 108630, 70303, 135374, 35086, -58661, 31435, 93472, 62114]
160F2114P825P223l3497M3001O1471r2476m5884L2211Q5369r0321p7619k4206
148f4789Q6016q0556O9309R5725q7737m1563J08314r4731M6963n2620j8745j6083
136e0497k3239O8538L3352Q3250j35260J25001l0431J5817k6492p5819O2548J25869
124A72637m0016j31688J7905J5676J1502m1147M2217J1024l4498M8910J05735
113A78257l4964p6726K5267j25189O4424L6501j7263n7363L0818K4694J335m8604
101A187j1609P4605j7996k4081o2104O660J15237L646L5190r1093k1235l2142
89b3735J4857l8239P4589O7790l9136L9899j3754p6296p505P7770Q21q1937M337
76e39k5900J2998R143j0500P2976O8406p2452P1452q0077j0724J8520m8442k0668
$$ y = [62114, 69939, 77162, 43665, 86666, 148137, 55661, 9777, 41988, 127357, 37036, -40583, -64789, 21227, -59329, 9980, 105705, 17968, -23595, 84719, -10012, 36951, -15669, -34414, -50497, -73736, -5198, 28154, 111404, -23856, 101145, 70714, 86531, 60039, -15780, 46768, 172637, 132621, 933, 18838, 34514, 46016, 4869, 47086, 58110, 23612, 72522, 178257, 143293, 66567, 91834, -33355, 31069, 67570, 50307, -7056, 23762, 48456, 49791, 1187, -10422, 64183, 46187, 22106, -39998, -33338, 81899, 85545, 120735, 29642, 8407, -23735, -8878, -47117, 27472, 95262, 56126, 96025, 82271, 5975, -1530, 76240, 77061, -4876, -539, -26439, -13441, -4298, -14798, 58178, 126584, 54132, 125584, 45507, 34783, 53303, 4861, -15807]
63a5807R5474j23546l2070M139N9471J22540n2446L896J8475J861j54695J11285
51C8577k1903L6689K6314n0336l7953M610K2159R9804M764q4211o49l6277o661
38e073J957L6112r947n6355P2210J06371j7237k770L1338n7300L4808j31530M7822
25E0406M8045o8845R4080p7237l8557L0875R0045l8167l8194k5438o8097M5133
13D049m268L3676j00185M2905O1922j5809q0513P7037k1100Q3863j5025n3225
1A3327K877
0A6204
$$ y = [-15807, 79667, -43879, -75949, -71810, -12339, 110201, 57755, 61651, 80126, 81987, -72708, 38577, 16674, 53363, 79677, 29341, -8612, -4002, 18157, 117961, 122725, 38514, 37865, 1588, -5073, -3116, 32996, 23049, -33306, 38904, 145275, 128038, 125268, 156606, 99306, 134114, 2584, 50406, 98451, 29606, 123686, 46449, 7892, 38767, 128812, 90645, 52451, 27013, -41084, 4049, -219, 33457, -66728, -23823, 38099, 22290, -58223, 18814, -2286, 81577, 66552, 13327, 16204]
$$ Imaginary data points
##PAGE= N=2
##DATA TABLE= (X++(I..I)), XYDATA
16383a600815O3593l2857M0097M6775j1486J01112l7350J665p2792J65167J0960
16372a325931P5929M6151k405p1489n8255J00655M7128L029N9497O0193L8194
16361a027304k6093q4971J03954j8308J8772R6177m6120N3652l1835L858J00019
16350h58199j2208M2060O3239j1776j1679M3220P146n8523J15463k1441K8036
$$ y = [-1600815, -1537222, -1570079, -1529982, -1483207, -1494693, -1393581, -1430931, -1429266, -1502058, -1336891, -1325931, -1250002, -1203851, -1206256, -1277745, -1336000, -1235345, -1188217, -1185188, -1125691, -1065498, -1027304, -1053397, -1138368, -1034414, -1052722, -1033950, -937773, -983893, -930241, -962076, -958218, -858199, -870407, -828347, -765108, -776884, -788563, -745343, -738197, -796720, -681257, -702698, -674662]
$$ [...]
##END NTUPLES=NMR SPECTRUM
##END=
