##TITLE=1H_CA-9283
 DMSO-d6
 8 sc, 
 6.9.2024
##JCAMPDX= 6.0         $$ Bruker NMR JCAMP-DX V2.0
##DATA TYPE= NMR SPECTRUM
##DATA CLASS= NTUPLES
##ORIGIN= UXNMR, Bruker Analytische Messtechnik GmbH
##OWNER= root
$$ XWIN-NMR		Version 3.5
$$ Fri Sep  6 13:49:00 2024 Russian Standard Time (UT+4h)  she@DPX200
##.OBSERVE FREQUENCY= 200.1318
##.OBSERVE NUCLEUS= ^1H
##.ACQUISITION MODE= SIMULTANEOUS
##.ACQUISITION SCHEME= undefined
##.AVERAGES= 8
##.DIGITISER RES= 18
##SPECTROMETER/DATA SYSTEM= spect
##.PULSE SEQUENCE= zg30
##.SOLVENT NAME= CDCl3
##.SHIFT REFERENCE= (INTERNAL, CDCl3, 0, 20.9488)
##AUDIT TRAIL= $$ (NUMBER, WHEN, WHO, WHERE, WHAT)
$$ ##TITLE= Audit trail, XWIN-NMR		Version 3.5
$$ ##JCAMPDX= 5.01
$$ ##ORIGIN= Bruker BioSpin GmbH
$$ ##OWNER= she
$$ F:/spectra/data/she/nmr/H-F/1/pdata/1/auditp.txt
$$ ##AUDIT TRAIL=  $$ (NUMBER, WHEN, WHO, WHERE, WHAT)
(   1,<2024-09-06 13:48:04.25 +0400>,<she>,<DPX200>,
      <created by zg, POWCHK disabled, PULCHK disabled
       configuration hash MD5:
       00 E9 B6 7A A2 85 ED C7 34 08 36 98 17 FE 4E 26
       data hash MD5: 16K
       F8 60 56 E1 4F F4 8A C3 A8 48 37 1F 0B 86 86 9F>)
(   2,<2024-09-06 13:48:07.68 +0400>,<she>,<DPX200>,
      <Start of raw data processing
       efp BC_mod = 2 LB = 0.24 FT_mod = 6 PKNL = 1 PHC0 = -26154.23 PHC1 = 14.98748 SI = 16K 
       data hash MD5: 16K
       0F CE 17 01 93 B2 A9 7C 14 B8 F9 C4 90 F0 89 42>)
(   3,<2024-09-06 13:48:27.56 +0400>,<she>,<DPX200>,
      <pk PHC0 = 155.0415 PHC1 = 0.9999999 
       data hash MD5: 16K
       B0 4D 0A 5B 66 B5 C9 B0 AF B4 21 D6 8E E2 73 7B>)
(   4,<2024-09-06 13:48:31.56 +0400>,<she>,<DPX200>,
      <abs ABSG = 5 
       data hash MD5: 16K
       6C 18 A4 46 9B E5 C4 2C 41 DF D6 B2 1E 86 FB 0C>)
$$ ##END=
$$ 
$$ hash MD5
$$ D4 52 E9 83 53 66 A8 40 97 F5 F5 22 04 EC CC 83
##$RELAX= 
##$RELAX= 
##$RELAX= 
##$RELAX= 
##$RELAX= 
##$RELAX= 
$$ Bruker specific parameters
$$ --------------------------
##$DU= <F:/spectra>
##$EXPNO= 1
##$NAME= <H-F>
##$PROCNO= 1
##$TYPE= <nmr>
##$USER= <she>
##$AMP= (0..31)
100 100 100 100 100 100 100 100 100 100 100 100 100 100 100 100 100 100 
100 100 100 100 100 100 100 100 100 100 100 100 100 100 
##$AQSEQ= 0
##$AQ_mod= 1
##$AUNM= <au_zg>
##$AUTOPOS= <>
##$BF1= 200.13
##$BF2= 200.13
##$BF3= 200.13
##$BF4= 200.13
##$BF5= 200.13
##$BF6= 200.13
##$BF7= 200.13
##$BF8= 200.13
##$BYTORDA= 1
##$CFDGTYP= 0
##$CFRGTYP= 5
##$CHEMSTR= <none>
##$CNST= (0..31)
1 1 145 1 1 1 1 1 1 1 1 1 1 1 1 1 1 1 1 1 1 1 1 1 1 1 1 1 1 1 1 1 
##$CPDPRG= <>
##$CPDPRG1= <>
##$CPDPRG2= <>
##$CPDPRG3= <>
##$CPDPRG4= <mlev>
##$CPDPRG5= <mlev>
##$CPDPRG6= <mlev>
##$CPDPRG7= <mlev>
##$CPDPRG8= <mlev>
##$CPDPRGB= <>
##$CPDPRGT= <>
##$D= (0..31)
0 1.2 0 0 0 0 0 0 0 0.06 0 0.03 0 0 0 0 0.0002 0 0 0 0 0 0 0 0 0 0 0 0 
0 0 0 
##$DATE= 1725616083
##$DBL= (0..7)
120 120 120 120 120 120 120 120 
##$DBP= (0..7)
150 150 150 150 150 150 150 150 
##$DBP07= 0
##$DBPNAM0= <>
##$DBPNAM1= <>
##$DBPNAM2= <>
##$DBPNAM3= <>
##$DBPNAM4= <>
$$ [...]
##$SUBNAM3= <"">
##$SUBNAM4= <"">
##$SUBNAM5= <"">
##$SUBNAM6= <"">
##$SUBNAM7= <"">
##$SUBNAM8= <"">
##$SUBNAM9= <"">
##$SW= 24.0689170037331
##$SWIBOX= (0..15)
0 0 2 0 0 0 0 0 0 0 0 0 0 0 0 0 
##$SW_h= 4816.95568400771
##$TD= 16384
##$TD0= 1
##$TE= 0
##$TE2= 300
##$TE3= 300
##$TEG= 300
##$TL= (0..7)
0 120 120 120 120 120 120 120 
##$TP= (0..7)
150 150 150 150 150 150 150 150 
##$TP07= 0
##$TPNAME0= <>
##$TPNAME1= <>
##$TPNAME2= <>
##$TPNAME3= <>
##$TPNAME4= <>
##$TPNAME5= <>
##$TPNAME6= <>
##$TPNAME7= <>
##$TPOAL= (0..7)
0.5 0.5 0.5 0.5 0.5 0.5 0.5 0.5 
##$TPOFFS= (0..7)
0 0 0 0 0 0 0 0 
##$TUNHIN= 0
##$TUNHOUT= 0
##$TUNXOUT= 0
##$USERA1= <user>
##$USERA2= <user>
##$USERA3= <user>
##$USERA4= <user>
##$USERA5= <user>
##$V9= 5
##$VALIST= <valist>
##$VCLIST= <CCCCCCCCCCCCCCC>
##$VD= 0
##$VDLIST= <DDDDDDDDDDDDDDD>
##$VPLIST= <PPPPPPPPPPPPPPP>
##$VTLIST= <TTTTTTTTTTTTTTT>
##$WBST= 1024
##$WBSW= 4
##$XGAIN= (0..3)
0 0 0 0 
##$XL= 0
##$YL= 0
##$YMAX_a= 668049
##$YMIN_a= -651963
##$ZGOPTNS= <>
##$ZL1= 120
##$ZL2= 120
##$ZL3= 120
##$ZL4= 120
##$ABSF1= 20.94884
##$ABSF2= -3.120293
##$ABSG= 5
##$ABSL= 3
##$ALPHA= 0
##$AQORDER= 0
##$ASSFAC= 0
##$ASSFACI= 0
##$ASSFACX= 0
##$ASSWID= 0
##$AUNMP= <proc_1d>
##$AZFE= 0.1
##$AZFW= 0.1
##$BCFW= 0
##$BC_mod= 2
##$BYTORDP= 0
##$COROFFS= 0
##$CY= -3
##$DATMOD= 1
##$DC= 0
##$DFILT= <>
##$DTYPP= 0
##$F1P= 0
##$F2P= 0
##$FCOR= 1
##$FTSIZE= 16384
##$FT_mod= 6
##$GAMMA= 0
##$GB= 0
##$INTBC= 1
##$INTSCL= 3.70164e-10
##$ISEN= 128
##$LB= 0.24
##$LEV0= 0
##$LPBIN= 0
##$MAXI= 10000
##$MC2= 0
##$MEAN= 0
##$ME_mod= 0
##$MI= 1.114404
##$NCOEF= 0
##$NC_proc= -5
##$NLEV= 6
##$NOISF1= 3.799351
##$NOISF2= 2.8
##$NSP= 0
##$NTH_PI= 0
##$NZP= 0
##$OFFSET= 20.94884
##$PC= 1
##$PHC0= -25999.19
##$PHC1= 15.98748
##$PH_mod= 1
##$PKNL= yes
##$PPARMOD= 0
##$PSCAL= 0
##$PSIGN= 0
##$REVERSE= no
##$SF= 200.13001598612
##$SI= 16384
##$SIGF1= 3
##$SIGF2= 2
##$SINO= 5.538805
##$SIOLD= 16384
##$SREGLST= <1H.CDCl3>
##$SSB= 0
##$STSI= 16384
##$STSR= 0
##$SW_p= 4816.95568400771
##$SYMM= 0
##$S_DEV= 0
##$TDeff= 16384
##$TDoff= 0
##$TI= <>
##$TILT= no
##$TM1= 0
##$TM2= 0
##$TOPLEV= 0
##$USERP1= <user>
##$USERP2= <user>
##$USERP3= <user>
##$USERP4= <user>
##$USERP5= <user>
##$WDW= 1
##$XDIM= 16384
##$YMAX_p= 393961741
##$YMIN_p= -161908
$$ End of Bruker specific parameters
$$ ---------------------------------
##NTUPLES= NMR SPECTRUM
##VAR_NAME=  FREQUENCY,     SPECTRUM/REAL,   SPECTRUM/IMAG
##SYMBOL=    X,             R,               I
##VAR_TYPE=  INDEPENDENT,   DEPENDENT,       DEPENDENT
##VAR_FORM=  AFFN,          ASDF,            ASDF
##VAR_DIM=   16384,         16384,           16384
##UNITS=     HZ,            ARBITRARY UNITS, ARBITRARY UNITS
##FACTOR=    0.29402158847633, 1,            1
##FIRST=     4192.49152150946, 0,            0
##LAST=      -624.464162498249, 0,           0
##MIN=       -624.464162498249, -161908,     0
##MAX=       4192.49152150946, 393961741,    0
$$ Real data points
##PAGE= N=1
##DATA TABLE= (X++(R..R)), XYDATA
$$ [...]
5726D3345J370L6434r269n5637Q341O1102m6879R809O1379k6905n1732o4489J5173
$$ 43345 44715 81149 71880 16243 24584 85686 38807 48616 109995 83090 31358 -33131 -17958
5713a7958M4552J8891k1710j17882K2922o219J3018K6773k987L500J18613n0193
$$ -17958 26594 45485 23775 -94107 -71185 -77404 -64386 -37613 -40600 -37100 81513 31320
5701C1320n5269K6140l8697l1362Q2878M741K1534r9946K2753J20005m8155k5594
$$ 31320 -23949 2191 -36506 -67868 15010 19751 41285 -58661 -35908 84097 35942 10348
5689A0348r376j6625k7640J02935o1020J2253K7198k8465k5012o593K5196O1725
$$ 10348 972 -15653 -43293 59642 -1378 10875 38073 9608 -15404 -21997 3199 64924
5677F4924l6907K3916Q42k4943J0345M5321k4145k1715k9935J2860o978P5031
$$ 64924 28017 51933 52775 27832 38177 83498 59353 37638 7703 20563 13585 88616
5665H8616m3833l2133P992n5044K483l587M9428J01388o2686p1540K3686N423
$$ 88616 44783 12650 20642 -34402 -31919 -35506 13922 115310 52624 -18916 4770 10193
5653A0193m894o1621K5018l6351O5996L7825j7557j1531J1248L6498k8013K0018
$$ 10193 5299 -56322 -31304 -67655 -1659 36166 18609 7078 18326 54824 26811 46829
5641D6829m3556J5429r358J1922k0740O5829K0492o5345J1576j1288L5781J2902
$$ 46829 3273 18702 9344 21266 526 66355 86847 21502 33078 21790 57571 70473
5629G0473n196q931L089p9302Q747r255m1365M2664r308L3410K1491J4680p9168
$$ 70473 65277 56346 59435 -19867 -11120 -20375 -61740 -19076 -28384 5026 26517 41197 -37971
5616c7971O0210r5160O0728j3966k6561O65Q997L4324l3261P505k5051N8697K9452
$$ -37971 22239 -72921 -12193 -26159 -52720 -52055 -43058 -8734 -41995 -34490 -59541 -844 28608
5603B8608j8473N8294k7175K5283p4121k7971Q9356m4176j4665M9807J13396j13375
$$ 28608 10135 68429 41254 66537 -7584 -35555 53801 9625 -5040 44767 158163 44788
5591D4788j2524J229N215k712n3056N5543k0383P738K6071j3966O124K7762l4445
$$ 44788 32264 33493 38708 35996 -17060 38483 18100 25838 51909 37943 44067 71829 37384
5578C7384q3920M0597o922M7463p4057N7694O6642k0801M7478j07605O626L9329
$$ 37384 -46536 -5939 -12861 34602 -39455 18239 84881 64080 111558 3953 10579 49908
5566D9908l5367J227Q948L6818j14627m4525N2470P2875j3758p170K3038p993
$$ 49908 14541 15768 24716 61534 -53093 -97618 -45148 27727 13969 6799 29837 21844
5554B1844m0939K2311O349l3219L2998m4898K7642L9583n1277K0779O6847J3019
$$ 21844 -19095 3216 9565 -23654 9344 -35554 -7912 31671 -19606 1173 68020 81039
5542H1039n5286J6132k5456M0043O8l3430l7653r718R0878O8714n5985n3717O0379
$$ 81039 25753 41885 16429 56472 56540 23110 -14543 -24261 66617 135331 79346 25629 86008
5529H6008o5015o3365N7680m1714k4555K0850N159J6900M9688l5050J6062j790
$$ 86008 20993 -42372 15308 -26406 -50961 -30111 -24952 -8052 41636 6586 22648 20858
5517B0858m4690Q770J1125M6316k7260o2308N4624o136k7993p22K7553l7100K8362
$$ 20858 -23832 -15062 -3937 42379 15119 -47189 7435 1299 -26694 -27416 137 -36963 -8601
5504h601J03853q3423q352L9063L4921q109J8996J9862k9853l4974M9862l6033
$$ -8601 95252 11829 3477 42540 77461 69352 88348 108210 78357 43383 93245 57212
5492E7212K4457j1802m9919j2299P8523O7707q4399p6167J8375J1190R180j6759
$$ 57212 81669 69867 19948 7649 86172 153879 69480 -6687 11688 22878 32058 15299
5480A5299P981m9566K4736j1757k2395J7442N7564l7686l965Q1873o9557p494
$$ 15299 23280 -26286 -1550 -13307 -35702 -18260 39304 1618 -2347 79526 9969 2475
5468B475l3166P4337R499J5182o9029K5682P425j0688M7885p1270j4943L8990
$$ 2475 -30691 43646 53145 68327 -702 24980 32405 21717 69602 -1668 -16611 22379
5456B2379M4219P025L1539p1598K7773j196k2656j4586K177P769k2345n740l6305
$$ 22379 66598 73623 105162 33564 61337 60141 37485 22899 25076 32845 10500 4760 -31545
5443c1545K1697q482K0142O1424M0684p1446n7191N4263j8808O333N2592Q55n9091
$$ -31545 -9848 -18330 1812 63236 103920 32474 -24717 29546 10738 17071 69663 70518 11427
5430A1427L1127l6478N2370K2743r570J267n4680Q755J9218l7297K3807l7477
$$ 11427 42554 6076 58446 81189 71619 72886 18206 26961 46179 8882 32689 -4788
5418d788J00076K4765l3380n6264k7182J04517J700L3094j02559K0055p1825l4415
$$ -4788 95288 120053 86673 30409 3227 107744 109444 142538 39979 60034 -11791 -46206
5406d6206R0177N9388n6398m4750K9154R820R0444j3893q1576k2361J7502l272
$$ -46206 43971 103359 46961 2211 31365 41185 131629 117736 36160 13799 31301 28029
5394B8029j06j2823L67L0588M6866l570p759j3037l6837P394j7446J02382j10711
$$ 28029 27923 15100 15467 46055 92921 89351 81592 68555 31718 39112 21666 124048 13337
5381A3337N4308l7110r623N2506j7866N1488m0159k40p9214R346m8712M6926R231
$$ 13337 67645 30535 20912 73418 55552 107040 66881 66641 -12573 -3227 -51939 -5013 4218
5368D218M2621P6277q499N838J1563m6436r1913J1169L9396l7562J836N4203K2356
$$ 4218 46839 123116 114617 120455 132018 85582 -6331 4838 44234 6672 8508 62711 85067
5355H5067K9822m6022m000k8250P2162n845J8328R066k3796j6755J0694k7933
$$ 85067 114889 68867 64867 36617 108779 102934 121262 130328 106532 89777 100471 72538
5343G2538R171M9577j11979o8267K9262J00951O5283m2138l8505J1062k266m6087
$$ 72538 81709 131286 19307 -48960 -19698 81253 146536 104398 65893 76955 74689 28602
5331B8602O245k0031J8096K507n1159L2677O269K3419K5740l738Q036L5939J9817
$$ 28602 34847 14816 32912 35419 -15740 16937 23206 46625 72365 68627 76663 112602 132419
5318A32419n5923J8936j3315m5373j749M845J01412k7492n7449j2399M6187K846
$$ 132419 76496 95432 82117 36744 34995 39840 141252 113760 56311 43912 90099 92945
5306I2945o3961J4274J4901K2744M2477l2887k6494l1334K1199k3014N3009J4090
$$ 92945 28984 43258 58159 80903 123380 90493 63999 32665 53864 30850 83859 97949
5294I7949l8244n832K440K9061K8744j6774N5545p4847m3475J6128n236P5152
$$ 97949 59705 53873 56313 85374 114118 97344 152889 78042 34567 50695 45459 120611
5282A20611j5263l0117K3017M2119n7170n4277K1635L7020l6994n1100J3164J22376
$$ 120611 105348 75231 98248 140367 83197 28920 50555 87575 50581 -519 12645 135021
5270A35021j2319l6037L2582o8245n3659l7001J01153N919M0932o392k9587O5098
$$ 135021 122702 86665 119247 51002 -2657 -39658 61495 67414 108346 101954 72367 137465
5258A37465j0348l4984l6541l059K4829J00630o9374j14224K8222J00358K1250
$$ 137465 127117 92133 55592 52533 77362 177992 108618 -5606 22616 122974 144224
5247A44224j0284r2463N3256K8512m3634K2471K3331q1651L9656l5959j498Q6206
$$ 144224 133940 41477 94733 123245 79611 102082 125413 43762 83418 47459 45961 132167
5235A32167K3082k7727j0093Q561L0489j105n1249O2095n115m8506J2885N8982
$$ 132167 155249 127522 117429 125990 156479 155374 104125 166220 161105 112599 125484 184466
5223A84466j6858o294J6646j5339m3018m9058k15j8681O590O0088L7302p8664
$$ 184466 167608 161314 177960 162621 119603 70545 70330 51649 58239 118327 155629 76965
5211G6965M527Q5770r7909N9403o3095K4689R8811p4925J3881k5751j1835L4018
$$ 76965 81492 167262 69353 128756 65661 90350 189161 114236 128117 102366 90531 124549
5199A24549q6218J8780K1288P4162M3310J1308Q622o5898n2152j8601R5222k7426
$$ 124549 38331 57111 78399 152561 195871 207179 215801 149903 97751 79150 174372 146946
5187A46946p925M6088m9815K5495p9179K0141P3841l6101m0228N2077n8084P0262
$$ 146946 139021 185109 135294 160789 81610 101751 175592 139491 99263 151340 93256 163518
5175A63518R680n1667M7009J066j7937K8419j0733L854O942J995L66k8904P1249
$$ 163518 173198 121531 168540 169606 151669 180088 169355 173209 180151 182146 182512 153608 224857
5162B24857k274n8873Q499J3968L8628J6322L651M8203L260j7809j0756K6933
$$ 224857 222583 163710 172209 186177 224805 241127 244778 292981 296241 278432 267676 294609
5150B94609n4004L5423j0846N3729o6421N24J1190O9544P0866o0967j5309p6580
$$ 294609 240605 276028 265182 318911 252490 253014 264204 333748 404614 343647 328338 251758
5138B51758N8411M3316L0455j9468m9544O4000l6078l9390j3469O4286P080k8579
$$ 251758 310169 353485 383940 364472 314928 378928 342850 303460 289991 354277 361357 332778
5126C32778l8310P6094l1117j1299K9955o0957k1805L5321M9523K9540p3903j6263
$$ 332778 294468 370562 339445 328146 358101 297144 275339 310660 360183 389723 315820 299557
5114B99557L4336j0713J8717j09593J03107J1119j1625J5723m1204k5646K5521
$$ 299557 333893 323180 341897 232304 335411 346530 334905 350628 309424 283778 309299
5103C09299l0251J6872R187k283M989r241l8845N3620N0586p7132M7975l5215
$$ 309299 279048 295920 305107 302824 307813 298572 259727 313347 363933 286801 334776 299561
5091B99561q389o265p0065m3700J1680j0871l8334N3881J5784K2645m1567J2341
$$ 299561 291172 284907 214842 171142 182822 171951 133617 187498 203282 225927 184360 196701
5079A96701O5042l0112r8885O8781J9272o4511J12323j00588m243m135L7458M120
$$ 196701 261743 231631 132746 201527 220799 156288 268611 168023 163780 159645 197103 201223
5067B01223L5371o830j0791L4751L995n3436J5509j2892J0828m8097N6163k0320
$$ 201223 236594 229764 218973 253724 257719 204283 219792 206900 217728 169631 225794 205474
5055B05474j0817o9503O6479M7880p1471K2023j8404K2191K8016j7716M448M4482
$$ 205474 194657 125154 191633 239513 168042 190065 171661 193852 221868 204152 208600 253082
5043B53082l5103K5992J5270p7933N7391K7945q1534J5534L3020K8083j31790
$$ 253082 217979 243971 259241 181308 238699 266644 185110 200644 233664 261747 129957
5032A29957M2950j0467L6923k6258J01971q4931j3536M0772k2336P9845q7232
$$ 129957 172907 162440 199363 173105 275076 190145 176609 217381 195045 274890 187658
5021A87658j3964p050L7966L1812q7399K3700O1899p703k508J6515J9058m8241
$$ 187658 173694 166644 204610 236422 149023 172723 234622 226919 224411 240926 259984 211743
5009B11743M260Q0391m3341n8186N4661K9644m0067O84n6215L4128j078N8198
$$ 211743 216003 296394 253053 194867 249528 279172 239105 239789 183574 217702 216624 274822
4997B74822o3732K6859O3382l9106k8592K5726k328k6100o653k6236J106M0889
$$ 274822 211090 237949 301331 262225 233633 259359 257031 230931 224278 198042 199148 240037
4985B40037L6430r030j7740M781m306l6765K9428l3105M7886j4767n0322L345
$$ 240037 276467 267437 249697 254478 250172 213407 242835 209730 257616 242849 192527 195872
4973A95872M5102K8245l4919l8307K6077m95Q978j0522j9328L0405k4448L6564
$$ 195872 240974 269219 234300 195993 222070 221575 230553 220031 200703 231108 206660 243224
4961B43224K4901k7630K1551J0096l6023L8513l1491K5243M0002n3297Q260Q2649
$$ 243224 268125 240495 262046 272142 236119 274632 243141 268384 308386 255089 263349 345998
4949C45998n3857k5237R900M384M3441k1571q013J20316n9888m1455k9211L8761
$$ 345998 292141 266904 276804 281188 324629 303058 295045 415361 355473 314018 284807 323568
4937C23568O8731L6284j02765j290j6967j7220N9245j2257j5746j9854k4411J6102
$$ 323568 392299 428583 325818 324528 307561 290341 349586 337329 321583 301729 277318 293420
4925B93420o672K2268Q940q469K1037j1873M7062j26953R5887j0755Q477k6738
$$ 293420 286748 309016 317956 309487 330524 318651 365713 238760 334647 323892 332369 305631
4913C05631j8944k0102K1276P7467M896r2784O7493k5930k829J2816J9178Q341
$$ 305631 286687 266585 287861 365328 370224 277440 344933 319003 316174 328990 348168 356509
4901C56509L944n1722L0233N6437n8008k4669N9425K2469p2503l6921j2383O3858
$$ 356509 360453 308731 338964 395401 337393 312724 372149 394618 322115 285194 272811 336669
4889C36669J9625L7181M8468o9911Q9168p6138k3582k7009J84R20N7276k5476
$$ 336669 356294 393475 441943 372032 461200 385062 361480 334471 334655 335575 392851 367375
4877C67375l0507M3036M5118J1328Q708n7761l2383J2170Q825J5320k7885J31521
$$ 367375 336868 379904 425022 436350 445058 387297 354914 367084 375909 391229 363344 494865
4865D94865o8516o9655O192M7433M2095J3979m1639p1623K6247M2206K4476K2884
$$ 494865 426349 356694 362886 410319 452414 466393 424754 353131 379378 421584 446060 468944
4853D68944R948p703l8797j706O9515j2878o8081K7385m5788K7935J1226k3615
$$ 468944 478892 471189 432392 430686 500201 487323 419242 446627 400839 428774 440000 416385
4841D16385J4933l6838J8098N4485l0983l8970K4810R2447O8046o3123l5688Q0556
$$ 416385 431318 394480 412578 467063 436080 397110 421920 514367 582413 519290 483602 564158
4829E64158n7025m7442J1680m0717M2164L8732m6850K2941L9369j4026p1566L5320
$$ 564158 507133 459691 471371 430654 472818 511550 464700 487641 527010 512984 441418 476738
4817D76738M2466K4474l2557n0814J6336K6335j8643j3227L0497J4230j362J14594
$$ 476738 519204 543678 511121 460307 476643 502978 484335 471108 501605 515835 514473 629067
4805F29067L9071n9675j5291J4717j960l4552m3073N1331J9749l7287L7480K5922
$$ 629067 668138 608463 593172 607889 605929 571377 528304 579635 599384 562097 599577 625499
4793F25499o0387P3641q2857N1550l0135M0477N2343m6468K2438Q8731K941j50490
$$ 625499 565112 638753 555896 607446 577311 617788 670131 623663 646101 734832 737773 587283
4781E87283K3076O7620k1492J9143J9487r763K940o7589L3554N7488k6387L972
$$ 587283 610359 677979 656487 675630 695117 685354 688294 620705 654259 711747 685360 689332
4769F89332J5466l1544j3711M1178O775M7433j3043J6894n050l4644N77K7906
$$ 689332 704798 673254 659543 700721 707496 754929 741886 758780 753730 719086 719663 747569
4757G47569r017J5397M7243L8897j759m6166j902K9671O6466j0273J3841o3492
$$ 747569 738552 753949 801192 840089 838330 792164 790262 819933 886399 876126 889967 826475
4745H26475M8361l7973n8550J05536J2595J0859j0550j7136J3427L1258j9761
$$ 826475 874836 836863 778313 883849 896444 907303 896753 879617 893044 924302 904541
4734I04541O5218L6564p5062l663J2382j2669L3925N3689n2707K7132k791M963
$$ 904541 969759 1006323 931261 927598 939980 927311 961236 1014925 962218 989350 986559 991522
4722I91522P6375l6561o6575P5498J3903O7808Q880k4232J6281j7411K0775N8473
$$ 991522 1067897 1031336 964761 1040259 1054162 1121970 1130850 1106618 1122899 1105488 1126263 1184736
4710A184736q8296R667J5858L8186m1019j1001j7697L6999M5333N6570m487l169
$$ 1184736 1096440 1106107 1121965 1160151 1119132 1108131 1090434 1127433 1172766 1229336 1224849 1221680
4698A221680Q451M2383o1957L7991N6290N0727K4784J3238j299o6266K0130J03810
$$ 1221680 1230131 1272514 1210557 1248548 1304838 1355565 1380349 1393587 1392288 1326022 1346152 1449962
4686A449962N2654p5641M3235Q8972j3661l741J9114m424O7914n3085q894N44
$$ 1449962 1502616 1426975 1470210 1559182 1545521 1541780 1560894 1556470 1624384 1571299 1562405 1562949
4674A562949Q9035K5039m0111n0188N4569N5768O9536M228J6219m5917P010P0716
$$ 1562949 1651984 1677023 1636912 1586724 1641293 1697061 1766597 1770825 1787044 1741127 1748137 1818853
4662A818853L1907j2923K332k6352M8531M1356M6914M9423N953p714K9520J16686
$$ 1818853 1850760 1837837 1840169 1813817 1862348 1903704 1950618 2000041 2005994 1998280 2027800 2144486
4650B144486p3079L0057N8813J6582j4971k2100k3976M6842R8619L0490r690J12055
$$ 2144486 2071407 2101464 2160277 2176859 2161888 2139788 2115812 2162654 2261273 2291763 2282073 2394128
4638B394128k2367J9399n2730J11400L8678q6O2460r177J22505r619L7268m1359
$$ 2394128 2371761 2391160 2338430 2449830 2488508 2488422 2550882 2541705 2664210 2654591 2691859 2650500
4626B650500M5677L5627N1433P492K8698J35173P1285k427j5274O189J7801L966
$$ 2650500 2696177 2731804 2783237 2790729 2819427 2954600 3025885 3023458 3008184 3014373 3032174 3036140
4614C036140Q4396J0377L0993Q4628J3479O6893K0535m451R0191N2027J02042
$$ 3036140 3120536 3130913 3161906 3246534 3260013 3326906 3347441 3342990 3433181 3485208 3587250
4603C587250Q011R1394N7960j0287P6088N5973J5136M7320J40612q341K6332M0590
$$ 3587250 3595261 3686655 3744615 3734328 3810416 3866389 3881525 3928845 4069457 4061116 4087448 4128038
4591D128038N5952R3939J06553N0131M8831P9270M6993L1441J18022Q2853N5185
$$ 4128038 4183990 4277929 4384482 4434613 4483444 4562714 4609707 4641148 4759170 4842023 4897208
4580D897208K5452R8461P9425Q5498R8640J06418Q7244Q1402J37229L2372K8915
$$ 4897208 4922660 5021121 5100546 5186044 5284684 5391102 5478346 5559748 5696977 5729349 5758264
4569E758264P9876J08394J05936M0108J79720J46993Q2938J07275O9037J07004
$$ 5758264 5838140 5946534 6052470 6092578 6272298 6419291 6502229 6609504 6678541 6785545
4559F785545J39278K20898J02794J55759J09807J38329J22026R4705J35472J57223
$$ 6785545 6924823 7145721 7248515 7404274 7514081 7652410 7774436 7869141 8004613 8161836
4549H161836J54267J95101J25238J35505K13899J44650J82217K76438J49452K01149
$$ 8161836 8316103 8511204 8636442 8771947 8985846 9130496 9312713 9589151 9738603 9939752
4539I939752K57513K27442K02885K27830K41788K58052K87410K42100K18174M08953
$$ 9939752 10197265 10424707 10627592 10855422 11097210 11355262 11642672 11884772 12102946 12511899
4529A2511899L49917K49622L10538L95872M29245L91988M17676M58284L93999
$$ 12511899 12861816 13111438 13421976 13817848 14247093 14639081 15056757 15515041 15909040
4520A5909040M63693M92170N17616N58862O10670O23545O03286O46442O06597
$$ 15909040 16372733 16864903 17382519 17941381 18552051 19175596 19778882 20425324 21031921
4511B1031921O87087P95632P84062P65038R22654Q81399R33237R02870R41005
$$ 21031921 21719008 22514640 23298702 24063740 24986394 25867793 26801030 27703900 28644905
4502B8644905J045509J133843J187335J150191J342989J263881J311305J423190
$$ 28644905 29690414 30824257 32011592 33161783 34504772 35768653 37079958 38503148
4494C8503148J370869J598548J578822J589611J754128J904847J975361K037454
$$ 38503148 39874017 41472565 43051387 44640998 46395126 48299973 50275334 52312788
4486E2312788K133474K297980K363031K468511K765167K873830L063173L280075
$$ 52312788 54446262 56744242 59107273 61575784 64340951 67214781 70277954 73558029
4478G3558029L376423L555966L805652M039782M288020M495548M816167N240138
$$ 73558029 76934452 80490418 84296070 88335852 92623872 97119420 101935587 107175725
4470A07175725N368455N713657O237293O551989O904768P389592P684282Q112247
$$ 107175725 112544180 118257837 124495130 131047119 137951887 145341479 153025761 161138008
4462A61138008Q459065Q542453Q589015Q480284Q101419P479962O411820N323992
$$ 161138008 169597073 178139526 186728541 195208825 203310244 210790206 217202026 222526018
4454B22526018L646289J944317R9548j791123l722745n362969o679085p720453
$$ 222526018 226172307 228116624 228216172 226425049 222702304 217339335 210660250 202939797
4446B02939797q474557r058899r135297r039450r008347q735938q205298p834622
$$ 202939797 194465240 185406341 176271044 167231594 158223247 149487309 141282011 133447389
4438A33447389p471916o995085o403162o109696n610478n218405m901763m549037
$$ 133447389 125975473 118980388 112577226 106467530 100857052 95638647 90736884 86187847
4430H6187847m260458l965943l719570l471503l164057l064807k929916k714564
$$ 86187847 81927389 77961446 74241876 70770373 67606316 64541509 61611593 58897029
4422E8897029k478242k346025k313966k067969j957519j905889j770638j775760
$$ 58897029 56418787 54072762 51758796 49690827 47733308 45827419 44056781 42281021
4414D2281021j623872j421401j407110j381789j276975j226001j129003j080346
$$ 42281021 40657149 39235748 37828638 36446849 35169874 33943873 32814870 31734524
4406C1734524j055192r84993r65367q91399q64564p62029p56659p55622p59271
$$ 31734524 30679332 29694339 28728972 27837573 26973009 26210980 25454321 24698699 23939428
4397B3939428p68084p28564o11240o97838n67144n52556o65861m69690n26013
$$ 23939428 23171344 22442780 21831540 21133702 20566558 20014002 19348141 18878451 18352438
4388A8352438n90289n42334m07138m60786m54108m33453l63430m26316l71764
$$ 18352438 17762149 17219815 16812677 16351891 15897783 15464330 15100900 14674584 14302820
4379A4302820k94691m06725l94593l36703l32664m06596l41688l14784k33791
$$ 14302820 14008129 13601404 13206811 12870108 12537444 12130848 11789160 11474376 11240585
4370A1240585k86462l24496j90978k56736k75096k21334k16393k69143l45234
$$ 11240585 10954123 10629627 10438649 10181913 9906817 9685483 9469090 9199947 8854713
4361H854713j94547j70307k06746k10136k06401m3636k20426j59005j83866j72988
$$ 8854713 8660166 8489859 8283113 8072977 7866576 7822940 7602514 7443509 7259643 7086655
4351G086655k29108j22331j08917r2235j37985q5351j51057j60873j08319j21267
$$ 7086655 6857547 6735216 6626299 6534064 6396079 6310728 6159671 5998798 5890479 5769212
4341E769212o7576j26162r3067j41720q5308o9023l7859p2559j63879n4477o6330
$$ 5769212 5701636 5575474 5482407 5340687 5255379 5186356 5148497 5075938 4912059 4857582 4791252
4330D791252r7199m8587j33202j27360m0448n5701n7601o2779q1579l9025q1934
$$ 4791252 4694053 4645466 4512264 4384904 4344456 4288755 4231154 4168375 4086796 4047771 3965837
4319C965837l3435j04889j11280L1303o8344o5457l225l3840q0032o6453M556
$$ 3965837 3932402 3827513 3716233 3747536 3679192 3613735 3610510 3576670 3496638 3430185 3434741
4308C434741j21195m55m3451o122q1776r8443J8158n6857j29349l3593j4412n6499
$$ 3434741 3313546 3313091 3269640 3263518 3181742 3083299 3101457 3044600 2915251 2881658 2867246 2810747
4296B810747j47368n0040L108L7013o4897j0013q1564n9437o714l3733n2125j547
$$ 2810747 2663379 2613339 2616447 2653460 2588563 2578550 2496986 2437549 2430835 2397102 2344977 2343430
4284B343430m6388n2200l933q7482l735l6561m4336j9537O83n2430j8294j0702
$$ 2343430 2297042 2244842 2240909 2153427 2149692 2113131 2068795 2049258 2049941 1997511 1979217 1968515
4272A968515l4824k6461N6998p2129q9418L2704q49l891m9757k3442J0438q0424
$$ 1968515 1933691 1907230 1964228 1892099 1802681 1835385 1834536 1830645 1780888 1757446 1767884 1687460
4260A687460L7627p0108n517K7278m5214l5238m4050P4956k6180o4362l022J8533
$$ 1687460 1725087 1654979 1649462 1676740 1631526 1596288 1552238 1627194 1601014 1536652 1533630 1552163
4248A552163k4085j16740m3032J13894R6667o4626p3050m148N592j50305R06J9523
$$ 1552163 1528078 1411338 1368306 1482200 1578867 1514241 1441191 1437043 1442635 1292330 1293236 1312759
4236A312759k0430Q8474j7954j10656L0102L0677J7204p1192n6893o5147K792
$$ 1312759 1292329 1380803 1362849 1252193 1282295 1312972 1330176 1258984 1202091 1136944 1139736
4225A139736O0805p6851k1026P73j8526L1357k531k2064m8888k0474Q0978m2119
$$ 1139736 1200541 1123690 1102664 1103437 1084911 1116268 1113737 1091673 1042785 1022311 1103289 1061170
4213A061170P804k8583l8507k3358p6046J9898M5804l356J0702p1686j6351M3739
$$ 1061170 1068974 1040391 1001884 978526 902480 922378 968182 964826 975528 903842 887491 931230
4201I31230O9248k3641q739r062n3109l2777K0476j1045l5046K3060J7626k8162
$$ 931230 1000478 976837 968098 959036 905927 873150 893626 882581 847535 870595 888221 860059
4189H60059p1550J31498k8811q8753K9791J5776r1519n1602J17513K2987r8691
$$ 860059 788509 920007 891196 802443 832234 848010 756491 704889 822402 845389 746698
4178G46698O062n159n7690O6044K5097L9627j5847j03772L7513J2909k1980O7287
$$ 746698 752760 747601 689911 755955 781052 820679 804832 701060 738573 751482 729502 796789
4166G96789m6349q848J0340L5748o2539n454j1k2804k609L2868j11997Q838L1047
$$ 796789 750440 741592 751932 787680 725141 719687 719676 696872 694263 727131 615134 623972 655019
4153F55019L3138r047k6413L4767j07474K5634J0707N6145q5854K7922J8743n853
$$ 655019 688157 679110 652697 687464 579990 605624 616331 672476 586622 614544 633287 627434
4141F27434L9620q4900p012R833L4775l1278L9492P546r4346l3552j4808N4098
$$ 627434 667054 582154 575142 584975 619750 588472 627964 635510 541164 507612 492804 546902
4129E46902j0458j6891o8110M3566O1086j00582P0577R3038j314l4770o7668j991
$$ 546902 536444 519553 451443 495009 556095 455513 526090 619128 617814 583044 515376 513385
4117E13385j9081n7020L7292L7812m2149l4704J0847q568M4098l1151O233K027
$$ 513385 494304 437284 474576 512388 470239 435535 446382 437814 481912 450761 456994 459021
4105D59021k3898L9836K3051j7847L5625J8138n9237j5516j5935P1181m7484j0494
$$ 459021 435123 474959 498010 480163 515788 533926 474689 459173 443238 514419 466935 456441
4093D56441M816J2817k2308o2382J8319L6055r938j6701K6275N05K2966N1404
$$ 456441 461257 474074 451766 389384 407703 443758 433820 417119 443394 443899 466865 518269
4081E18269o3227q4771J6455O4Q0839m8904q0940J11853m9962N2973Q397J0830
$$ 518269 455042 370271 386726 386790 467629 418725 337785 449638 399676 452649 461046 471876
4069D71876j24159N6734L5557p2664l2403N590m1521O87N7618L2670k4820j2106
$$ 471876 347717 404451 440008 367344 334941 340531 299010 299697 357315 389985 365165 353059
4057C53059l41K1340O0641J6268l3021o1248M4080M142K1855P078l1641m7140
$$ 353059 352718 374058 434699 450967 417946 356698 400778 404920 426775 433853 402212 355072
4045C55072N6681m649j2311o445M4649k2711M2388l0593n5309j1206M6136N6724
$$ 355072 411753 407104 394793 388348 432997 410286 452674 422081 366772 355566 401702 458426
4033D58426j1767K3011j4660r324J103j2567Q8389j1863p1566J7684o0994N0946
$$ 458426 446659 469670 455010 445686 446789 434222 522611 510748 439182 456866 395872 446818
4021D46818J14104k4927L0023k3260K4285k6679q3068K5978m874j7130M2602m1642
$$ 446818 560922 535995 566018 542758 567043 540364 457296 483274 478400 461270 503872 462230
4009D62230k3105L3067n1650K199N1164J8094Q861k6488j08577l0471L6217k3006
$$ 462230 439125 472192 420542 422741 473905 491999 500860 474372 365795 335324 371541 348535
3997C48535J7385j6585J654m1274L6815j3771N8138p0960O2529l1647m5129l6866
$$ 348535 365920 349335 350989 309715 346530 332759 390897 319937 382466 350819 305690 268824
3985B68824P6698O0179q357M3557q1725N4072o9224J9702q417j03076o086P0708
$$ 268824 345522 405701 397344 440901 359176 413248 344024 363726 355309 252233 246147 316855
3973C16855j6597J2539j3887Q9424O480m1889K7700K2654q1278l83r442L9355
$$ 316855 300258 312797 298910 388334 394814 352925 380625 403279 322001 321618 312176 351531
3961C51531n346o296L5249l8521j115K6731m5130N4698O9883p9592k4401K2406
$$ 351531 346185 339889 375138 336617 335502 362233 317103 371801 441684 362092 337691 360097
3949C60097J8709l0284M6773l032k2635p784J0587Q538N246n6723N7443N3745
$$ 360097 378806 348522 395295 392263 369628 361844 372431 380969 386215 329492 386935 440680
3937D40680j0355p8430M4062J5238M3448L2816n4579L39p3579L1073L2528L2254
$$ 440680 430325 351895 395957 411195 454643 487459 432880 433219 359640 390713 423241 455495
3925D55495j6826O5222l1544K4424k9076o4531K3827n706K4665k3111j7175R0006
$$ 455495 438669 503891 472347 496771 467695 403164 426991 421285 445950 422839 405664 495670
3913D95670j6136o5981o304O6216J6486k8360L7432k0122k9331K2603k4195m937
$$ 495670 479534 413553 407249 473465 489951 461591 499023 478901 449570 472173 447978 443041
3901D43041p2818J06604M7976l6253o1272P7207m6131Q6682K6475q8723N6948
$$ 443041 370223 476827 524803 488550 427278 504485 458354 545036 571511 482788 539736
3890E39736j3199l4363P944L0933O9807J5823k7642P0037m9081m4573N5553O6800
$$ 539736 526537 492174 500118 531051 600858 616681 589039 659076 609995 565422 620975 687775
3878F87775n0754O309J4392m6974l8070O0439J2592Q2623r440L5942o5930N7151
$$ 687775 637021 643330 657722 610748 572678 633117 645709 728332 718892 754834 688904 746055
3866G46055Q3584L6607N167k2768r699Q6030J7849k5988K3047M4741Q275k0260
$$ 746055 829639 866246 871413 848645 838946 924976 942825 916837 939884 984625 992900 972640
3854I72640Q0848J3953J1717L2650J45433L3020l6849N0738L2156J43863R1845
$$ 972640 1053488 1067441 1079158 1111808 1257241 1290261 1253412 1304150 1336306 1480169 1572014
3843A572014R718k2420M2540J80275N7440k0374J02988L2721P2814J01057J46047
$$ 1572014 1581732 1559312 1601852 1782127 1839567 1819193 1922181 1954902 2027716 2128773 2274820
3832B274820J03600O5012J17402O6727J07064M0739J67720J58411J84406J35372
$$ 2274820 2378420 2443432 2560834 2627561 2734625 2775364 2943084 3101495 3285901 3421273
3822C421273J55776K49175J36083J03485K41409K84755J96963J97483L09960L15783
$$ 3421273 3577049 3826224 3962307 4065792 4307201 4591956 4788919 4986402 5296362 5612145
3812E612145L43142L02296M54757L70127M59718O67845O24116P34919P70575R74249
$$ 5612145 5955287 6257583 6712340 7082467 7542185 8210030 8834146 9569065 10339640 11313889
3802A1313889J096729J195615J371155J335495J189432J313179J388440J440778
$$ 11313889 12410618 13606233 14977388 16312883 17502315 18815494 20203934 21644712
3794B1644712J498153J491990J103970Q39800P12991P62455Q02979O73736K71978
$$ 21644712 23142865 24634855 25738825 26578625 27291616 28054071 28857050 29530786 29802764
3785B9802764k67327p32578r69021q22885p59693j000778j260790j418233j583768
$$ 29802764 29535437 28802859 27833838 27010953 26251260 25250482 23989692 22571459 20987691
3776B0987691j598467j430476j254817j278839j361592j329253j217658j180646
$$ 20987691 19389224 17958748 16703931 15425092 14063500 12734247 11516589 10335943
3768A0335943q94046q01069p01230o50036n27170m27569l94478k69379m16713
$$ 10335943 9441897 8640828 7939598 7289562 6762392 6334823 5940345 5670966 5254253
3759E254253l38998k66957k34624j61640j88827k03281j03971j76338j44198q6064
$$ 5254253 4915255 4648298 4413674 4252034 4063207 3859926 3755955 3579617 3435419 3349355
3749C349355j33323j02759j34642j36599j05840p8026p5910r3391Q762r2211j43540
$$ 3349355 3216032 3113273 2978631 2842032 2736192 2658166 2582256 2488865 2497627 2405416 2261876
3738B261876j08728p5545k0561l6061o9891p3684k6565n4037j5717p4791k5419
$$ 2261876 2153148 2077603 2057042 2020981 1951090 1877406 1850841 1796804 1781087 1706296 1680877
3727A680877j3126r7951q2745L3259k2096o9127m6884n6900k6386M9066L0979
$$ 1680877 1667751 1569800 1487055 1520314 1498218 1429091 1382207 1325307 1298921 1347987 1378966
3716A378966k8203q1930O981k413o1715p3216O736q3053n6145M5824K1213N6168
$$ 1378966 1350763 1268833 1275814 1273401 1211686 1138470 1145206 1062153 1006008 1051832 1073045 1129213
3704A129213n0472k2788j8077q833q694J1309J7592r0803K6590L1982l1382p4012
$$ 1129213 1078741 1055953 1037876 1029043 1020349 1031658 1049250 958447 985037 1017019 985637 911625
3692I11625M190J8211l8891n0626l8499k4946M2061O1199J800n5379J1221J5556
$$ 911625 915815 934026 895135 844509 806010 781064 823125 884324 886124 830745 841966 857522
3680H57522n8082l3089L1574K4010m2474R4686l814j4597l1785p1400J10734K5981
$$ 857522 799440 766351 797925 821935 779461 874147 870333 855736 823951 752551 863285 889266
3668H89266k5527K0983r663j015o2494l6316N0650J0701J4902n0764P8618N9940
$$ 889266 863739 884722 875059 874044 811550 775234 825884 836585 851487 800723 879341 939281
3656I39281k1768p1937j2639R4852j6578O06K226o9563l8451J16332j6598j7379
$$ 939281 917513 845576 832937 927789 911211 911817 914043 844480 806029 922361 905763 888384
3644H88384J9978K0180j4169J8004P2484J1955Q2358n2631o5108J6131l0214k8609
$$ 888384 908362 928542 914373 932377 1004861 1016816 1099174 1046543 981435 997566 967352 938743
3632I38743O1779J06246n2877j0109p1080O0089L3315j594K1010M5805J6486k0947
$$ 938743 1000522 1106768 1053891 1043782 972702 1032791 1066106 1064512 1085522 1131327 1147813 1126866
3620A126866q510J8886M4182O275O2710M2363O058m7266M2378Q2236J2945J4531
$$ 1126866 1118356 1137242 1181424 1187699 1250409 1292772 1298830 1251564 1293942 1376178 1389123 1403654
3608A403654Q8396L6973K3079k397j2593P5694O5206L2569J9125M0004J27860
$$ 1403654 1492050 1529023 1552102 1549705 1537112 1612806 1678012 1710581 1729706 1769710 1897570
3597A897570Q7601P5458L8527L9040J02562M27N8051J26112J83012O3683K5206
$$ 1897570 1985171 2060629 2099156 2138196 2240758 2241185 2299236 2425348 2608360 2672043 2697249
3586B697249J14616J22263P5140J27900J55756Q2340J33037J89132J61673J54094
$$ 2697249 2811865 2934128 3009268 3137168 3292924 3375264 3508301 3697433 3859106 4013200
3576D013200K27295J23420K17505K59201J56079K51784K48321L00215L25824L80598
$$ 4013200 4240495 4363915 4581420 4840621 4996700 5248484 5496805 5797020 6122844 6503442
3566F503442K57496L44563N21939L95993M07428N01050M48131N25814O13796O84016
$$ 6503442 6760938 7105501 7627440 8023433 8430861 8931911 9380042 9905856 10519652 11203668
3556A1203668O36441O72800P52095P52158R42582R65265R30280R15132R76688
$$ 11203668 11840109 12512909 13265004 14017162 14959744 15925009 16855289 17770421 18747109
3547A8747109J016395J093288J027275J039226J076672J124120J230552J234999
$$ 18747109 19763504 20856792 21884067 22923293 23999965 25124085 26354637 27589636
3539B7589636J161947J168456R54477Q08905P67163O69476O32148O51720O61499
$$ 27589636 28751583 29920039 30874516 31683421 32450584 33120060 33752208 34403928 35065427
3530C5065427O55911N93576L74891J66365k1269k00322m22049n99623n66929n65360
$$ 35065427 35721338 36314914 36689805 36856170 36834901 36634579 36212530 35612907 35045978 34480618
3520C4480618o66454n78980o49471q03066q81366j077682j175732j232482j231424
$$ 34480618 33814164 33235184 32585713 31782647 30901281 29823599 28647867 27415385 26183961
3511B6183961j273155j163544j123984j104748j028971j111457r64380j147876
$$ 26183961 24910806 23747262 22623278 21518530 20489559 19378102 18413722 17265846
3503A7265846j020275r55970r14028q94316q20485p42750o78926p26318n87782
$$ 17265846 16245571 15289601 14375573 13481257 12660772 11918022 11239096 10512778 9924996
3494I924996n02180o18639m72784m79146m01452m22557l47265m05168k25557l68597
$$ 9924996 9422816 8804177 8331393 7852247 7450795 7028238 6680973 6275805 6050248 5681651
3484E681651k65599k23844k29225j46704j82974j50179j51607j89957j87321o4338
$$ 5681651 5416052 5192208 4962983 4816279 4633305 4483126 4331519 4141562 3954241 3889903
3474C889903j33714j39006m9840j89105j29376r7791k5726j37271j24794N587
$$ 3889903 3756189 3617183 3567343 3378238 3248862 3151071 3125345 2988074 2863280 2868867
3464B868867n8243r6133n7096l9501q0020m9643k5237l0219r6679j1778m9836
$$ 2868867 2810624 2714491 2657395 2617894 2537874 2488231 2462994 2432775 2336096 2324318 2274482
3453B274482o2131j45442j60m366l1257j12993O1962r419j53504M6002Q036j26196
$$ 2274482 2212351 2066909 2066749 2062383 2031126 1918133 1980095 1970676 1817172 1863174 1871210 1745014
3441A745014o698P6242n2991R874q809M0445l5238m3414Q3973J0688l5684o652
$$ 1745014 1738316 1814558 1761567 1771441 1762632 1803077 1767839 1724425 1808398 1819086 1783402 1776750
3429A776750o0020O4756o024o716k4067l5089L5126k4337M3976l5293k3320j7158
$$ 1776750 1716730 1781486 1775462 1768746 1744679 1709590 1744716 1720379 1764355 1729062 1705742 1688584
3417A688584L2556L1850j14953o429l96k737m0007n42m7192l9350R2967l5301
$$ 1688584 1721140 1752990 1638037 1631608 1631212 1628475 1588468 1587926 1540734 1501384 1594351 1559050
3405A559050l4832p9605k2603K8269r1572k6752N5759p7491N5903l8201p4461
$$ 1559050 1524218 1444613 1422010 1450279 1358707 1331955 1387714 1310223 1366126 1327925 1253464
3394A253464K567N9906K8105p0447j3920M1118R9600n1690l4393N2084j0642O642
$$ 1253464 1256031 1315937 1344042 1273595 1259675 1300793 1400393 1348703 1314310 1366394 1355752 1362394
3382A362394k4367j898L3226N8062J696n6725m0190j4020Q7457K2164k3889m176
$$ 1362394 1338027 1336129 1369355 1427417 1429113 1372388 1332198 1318178 1405635 1427799 1403910 1399734
3370A399734j3980M7049n4807k9444J8168K2665O2391r508M7268m6088K4521k6053
$$ 1399734 1385754 1432803 1377996 1348552 1366720 1389385 1451776 1442268 1489536 1443448 1467969 1441916
3358A441916j7127P6417O565p9827M6702J19281l0912k0657O759M9738J4514K4317
$$ 1441916 1424789 1501206 1507771 1427944 1474646 1593927 1563015 1542358 1549117 1598855 1613369 1637686
3346A637686k5448J00258l8696J4163K4922J2939M2895Q095M2468L2058k531M5100
$$ 1637686 1612238 1712496 1673800 1687963 1712885 1725824 1768719 1776814 1819282 1851340 1848809 1893909
3334A893909K7704K4778N3939J8470J0516L5147O1414p6527M9049n9435J7628
$$ 1893909 1921613 1946391 2000330 2018800 2029316 2064463 2125877 2049350 2098399 2038964 2056592
3323B056592J60362K1928m042N3497R724J16635L3737J0054N5668L17O3701O7811
$$ 2056592 2216954 2238882 2234840 2288337 2298061 2414696 2448433 2458487 2514155 2514472 2578173 2645984
3311B645984O2790Q330O1095L5671J04383R9531J5656N1413J09471M5146k1832
$$ 2645984 2708774 2717104 2778199 2813870 2918253 3017784 3033440 3084853 3194324 3239470 3217638
3300C217638J09873J33860P8736J8705N3288N6888R3052N7773O5069P4963K6687
$$ 3217638 3327511 3461371 3540107 3558812 3612100 3668988 3762040 3819813 3884882 3959845 3986532
3289C986532O3303J01201R1787L4898N2336O3130R1024Q4238L9461J21019O4364
$$ 3986532 4049835 4151036 4242823 4277721 4330057 4393187 4484211 4568449 4607910 4728929 4793293
3278D793293j8881J18133J30938J9961J13127M5254J24377J10697j8342J10852
$$ 4793293 4774412 4892545 5023483 5043444 5156571 5201825 5326202 5436899 5418557 5529409
3268E529409J59377J57057J50597K20092J37348J40484J58583K27577K53267J61135
$$ 5529409 5688786 5845843 5996440 6216532 6353880 6494364 6652947 6880524 7133791 7294926
3258G294926K73132K66626K51388L06769L79114L15364L26164L51325L11949L98648
$$ 7294926 7568058 7834684 8086072 8392841 8771955 9087319 9413483 9764808 10076757 10475405
3248A0475405L71457L97847L68606L72279M49668N00356N29624N59928N97870
$$ 10475405 10846862 11244709 11613315 11985594 12435262 12935618 13465242 14025170 14623040
3239A4623040O17499N24308O51708P63367P28500Q67690Q95164R88829R80567
$$ 14623040 15240539 15764847 16416555 17179922 17908422 18776112 19671276 20660105 21640672
3230B1640672R78083J188236J222535J470724J482143J502604J839255J927089
$$ 21640672 22618755 23806991 25029526 26500250 27982393 29484997 31324252 33251341
3222C3251341K200674K417100K633301K987464L276863L593233L915564M236563
$$ 33251341 35452015 37869115 40502416 43489880 46766743 50359976 54275540 58512103
3214E8512103M446250M581309M626195M401452M002946L405557K597175J938591
$$ 58512103 62958353 67539662 72165857 76567309 80570255 83975812 86572987 88511578
3206H8511578J246541N44893K54879j32442k50416n76614q49172j203723j900882
$$ 88511578 89758119 90303012 90557891 90425449 90175033 89598419 88749247 87545524 85644642
3197H5644642k489995l143577l712205m199314m444469m468522m357535m288432
$$ 85644642 83154647 80011070 76298865 72099551 67655082 63186560 58829025 54540593
3189E4540593l993002l665325l233878l069211k741606k463181k136723j885861
$$ 54540593 50547591 46882266 43648388 40579177 37837571 35374390 33237667 31351806
3181C1351806j756055j561245j400801j214368j083459j033763q99035p27452
$$ 31351806 29595751 28034506 26633705 25419337 24335878 23302115 22403080 21675628
3173B1675628p20378o58877o46262m86393n22105m44059l68332l34168l26891
$$ 21675628 20955250 20296373 19650111 19163718 18641613 18197554 17829222 17495054 17168163
3164A7168163k84052m29189k32736j43544k65539k77819j32253k38534j41495
$$ 17168163 16884111 16454922 16222186 16078642 15813103 15535284 15403031 15164497 15023002
3155A5023002j19969j28032j06799j16603p5341j90691J5862q1198N3789o7441
$$ 15023002 14903033 14775001 14668202 14551599 14476258 14285567 14301429 14220231 14274020 14206579
3145A4206579Q3078J19554M9107R8672J23134K22594J59263J56912K76594K86625
$$ 14206579 14289657 14409211 14458318 14556990 14680124 14902718 15061981 15218893 15495487 15782112
3135A5782112L12572K94055L27515M76522M73634N40658N65453O77852Q43358
$$ 15782112 16094684 16388739 16716254 17192776 17666410 18207068 18772521 19450373 20293731
3126B0293731Q40984R02124R33117J208054J258609J187344J248102J380415J295641
$$ 20293731 21134715 22036839 22969956 24178010 25436619 26623963 27872065 29252480 30548121
3117C0548121J095227R22960P53377N23133K78724J33269M2108K6047o4235M4767
$$ 30548121 31643348 32566308 33319685 33842818 34121542 34254811 34296919 34322966 34258731 34303498
3107C4303498J81650L34899M50930M70079P62888Q86281Q98605J080077J229564
$$ 34303498 34485148 34820047 35270977 35741056 36503944 37390225 38288830 39368907 40598471
3098D0598471J488688J494574J806517J961820K191548K423031K718648L063504
$$ 40598471 42087159 43581733 45388250 47350070 49541618 51964649 54683297 57746801
3090E7746801L275183L609018M243029M605832N156168N673859O247380O784380
$$ 57746801 61021984 64631002 68874031 73479863 78636031 84309890 90557270 97341650
3082I7341650P239940P545290P650610P476513O935781O241624N335585M194763
$$ 97341650 104581590 112126880 119777490 127254003 134189784 140431408 145766993 149961756
3074A49961756L082108K074180J052972L89396j20828o58906j093562j505995
$$ 149961756 153043864 155118044 156171016 156560412 156439584 155780678 154687116 153181121
3066A53181121k068566k658335l482010m236475n162005n815391o569488o872523
$$ 153181121 151112555 148454220 144972210 140735735 135573730 129758339 123188851 116316328
3058A16316328p086294p110106o876336o579899o197834n648740n252927m813884
$$ 116316328 109230034 102119928 95243592 88663693 82465859 76817119 71564192 66750308
3050F6750308m168881l779240l388485k975146k798485k395862k126130j920788
$$ 66750308 62581427 58802187 55413702 52438556 49640071 47244209 45118079 43197291
3042D3197291j698731j527383j316850j147828j029811q43922p27611n38431l64180
$$ 43197291 41498560 39971177 38654327 37506499 36476688 35632766 34905155 34366724 34002544
3033C4002544k63460j15917o0120J51005J16558K57849K33846K59075P2411j84473
$$ 34002544 33739084 33623167 33563047 33714052 33830610 34088459 34322305 34581380 34653791 34469318
3023C4469318k41259m74262p94627r36156j023891r65147r57027j013442q95504
$$ 34469318 34228059 33753797 32959170 32023014 30999123 30033976 29076949 28063507 27168003
3014B7168003q95589p25993o62465n57235n22336l99622l70223l15264k07953
$$ 27168003 26272414 25546421 24883956 24326721 23804385 23404763 23034540 22719276 22511323
3005B2511323j82275r494K2496N402k8264J01424K55600K51113K54871L35441
$$ 22511323 22329048 22319554 22342050 22347452 22319188 22420612 22676212 22927325 23182196 23517637
2995B3517637L36992L60021L73638L88310M72047N47798N65969N97546N63840
$$ 23517637 23854629 24214650 24588288 24976598 25448645 25996443 26562412 27159958 27723798
2986B7723798O79619O81644P03796Q16716Q20514Q36680J015542J093189J157685
$$ 27723798 28403417 29085061 29788857 30605573 31426087 32262767 33278309 34371498 35529183
2977C5529183J176073J202554J399035J512039J558401J776457J906409K072499
$$ 35529183 36705256 37907810 39306845 40818884 42377285 44153742 46060151 48132650
2969D8132650K200898K413850K676158K860646L223544L427560L915682M358778
$$ 48132650 50333548 52747398 55423556 58284202 61507746 64935306 68850988 73209766
2961G3209766M756193N302048N873029O452887P129803P797654Q444170Q884744
$$ 73209766 77965959 83268007 89141036 95593923 102723726 110521380 118965550 127850294
2953A27850294R145185Q999167Q565227P745981O376469N044048L518331K170767
$$ 127850294 136995479 145994646 154559873 162305854 168682323 173726371 177244702 179415469
2945A79415469J053430L10472k84773q11732j449138k166258l392113m639996
$$ 179415469 180468899 180779371 180494598 179682866 178233728 176067470 172675357 168035361
2937A68035361o055775p410993q301939r058791r264654r140486q894006q279717
$$ 168035361 161979586 154568593 146266654 137207863 127943209 118802723 109908717 101629000
2929A01629000p627609p047297o287999n712956n109575m584516m169732l672768
$$ 101629000 94001391 86954094 80666095 74953139 69843564 65259048 61089316 57416548
2921E7416548l260783k977187k687418k428370k174408k110712j916420j761811
$$ 57416548 54155765 51178578 48491160 46062790 43888382 41777670 39861250 38099439
2913C8099439j513294j331791j290966j230355j118925j017864r47786p90446
$$ 38099439 36586145 35254354 33963388 32733033 31614108 30596244 29648458 28858012
2905B8858012p76655o49509p56439n56984m96593m88683m33662l58955k71557
$$ 28858012 28081357 27431848 26675409 26118425 25621832 25133149 24699487 24340532 24068975
2896B4068975l55924k56706j59783j08456l7851k4549J00634K18106K24914K46822
$$ 24068975 23713051 23456345 23296562 23188106 23150255 23125706 23226340 23444446 23669360 23916182
2886B3916182L31116M14187L51564L71388L40146L50346J14525J0030q519j92070
$$ 23916182 24247298 24661485 25013049 25384437 25724583 26074929 26189454 26199484 26190965 25998895
2876B5998895l30424l44878m33256l68030l86262k29752k95791j52816M2758K3822
$$ 25998895 25668471 25323593 24890337 24522307 24136045 23906293 23610502 23457686 23500444 23524266
2866B3524266K01422J86550L38178K95408M24873N69497N07028O76971P17119
$$ 23524266 23725688 23912238 24250416 24545824 24970697 25540194 26047222 26724193 27441312
2857B7441312Q29238Q78494R39518R46351J110117J230697J381993J484150J606247
$$ 27441312 28270550 29149044 30088562 31034913 32145030 33375727 34757720 36241870 37848117
2848C7848117J902011K070913K353830K632661K822323K941417L048484K862489
$$ 37848117 39750128 41821041 44174871 46807532 49629855 52571272 55619756 58482245
2840E8482245K755793K418381K064093J613440R65592M41966n4789n61640q40272
$$ 58482245 61238038 63656419 65720512 67333952 68299544 68741510 68686721 68125081 67284809
2831F7284809r54306r89399p47112n32567k18049K12996L64374O02438P57046
$$ 67284809 66330503 65341104 64593992 64061425 63843376 64056372 64420746 65023184 65780230
2822F5780230N36468K46157k87463q44613j374983k041011k609421k970834l087815
$$ 65780230 66316698 66562855 66275392 65430779 64055796 62014785 59405364 56434530 53346715
2813E3346715l104843l112960l188516l057193k734716k559142k260679j981743
$$ 53346715 50241872 47128912 43940396 40883203 38148487 35589345 33328666 31346923
2805C1346923j895055j563047j373240j311506j145348j014189q75096q33745
$$ 31346923 29451868 27888821 26515581 25204075 24058727 23044538 22169442 21335697
2797B1335697o74210o34982m60549l87335l13613k87219j66832r8429M7304k0588
$$ 21335697 20661487 20026505 19565956 19178621 18865008 18577789 18410957 18312528 18359832 18339244
2787A8339244o6881m6077N3038j488P3906J49696K26619K82135R5293L8823m7742
$$ 18339244 18272363 18226286 18279324 18277836 18351742 18501438 18728057 19010192 19105485 19144308 19096566
2776A9096566j73057l82120n40016n99520n63958p07117o97509n99562m81460
$$ 19096566 18923509 18541389 18001373 17401853 16837895 16130778 15433269 14833707 14352247
2767A4352247n43402m01083n29366l02714l78045l71603l36980l14811k63559
$$ 14352247 13808845 13407762 12878396 12575682 12197637 11826034 11489054 11174243 10910684
2758A0910684k40974k52216j76050j47021k26779r9733j80111j29793j84357J7303
$$ 10910684 10669710 10417494 10241444 10094423 9867644 9767911 9587800 9458007 9273650 9290953
2748I290953J9136n7170p0757n7189K8271K0975K8779p6440M9733R6120R395N3562
$$ 9290953 9310089 9252919 9182162 9124973 9153244 9174219 9202998 9126558 9176291 9272411 9281806 9335368
2736I335368K1545M9695J1208P4339j4637N7189K545N6124R6303N0297N4373Q2554
$$ 9335368 9356913 9406608 9417816 9492155 9477518 9534707 9537252 9593376 9689679 9739976 9794349 9876903
2724I876903R2451J49688J21714R3512J25264P8553J73320J89072K48120J77494
$$ 9876903 9969354 10119042 10240756 10334268 10459532 10538085 10711405 10900477 11148597 11326091
2714A1326091K58172J75016J60242K57052K84436L41864K84192L30425M43540
$$ 11326091 11584263 11759279 11919521 12176573 12461009 12802873 13087065 13417490 13861030
2705A3861030L31676M72938N33863L26402M95927N53333N53258O64484N56162
$$ 13861030 14192706 14665644 15199507 15525909 16021836 16575169 17128427 17792911 18349073
2696A8349073O58951P17135P85990Q63683Q45109J018058R70929J063560J136867
$$ 18349073 19008024 19725159 20511149 21374832 22219941 23237999 24208928 25272488 26409355
2687B6409355J027853J079540J096300J074975J143233J274783J259496J402175
$$ 26409355 27437208 28516748 29613048 30688023 31831256 33106039 34365535 35767710
2679C5767710J486472J574450J625167J724736J931915K244366K238219K453062
$$ 35767710 37254182 38828632 40453799 42178535 44110450 46354816 48593035 51046097
2671E1046097K783576K960525L151154L385379L631426L815604L983109M226639
$$ 51046097 53829673 56790198 59941352 63326731 66958157 70773761 74756870 78983509
2663G8983509M539360M836330N282505N734420O398382P260501Q123766R112042
$$ 78983509 83522869 88359199 93641704 99376124 105774506 113035007 121158773 130270815
2655A30270815J0374543J1793054J3588453J5747416J8047575K0746088K3738636
$$ 130270815 140645358 152438412 166026865 181774281 199821856 220567944 244306580
2648B44306580K6631709K8918326L0256827K8922518K2929095J1996686k135433
$$ 244306580 270938289 299856615 330113442 359035960 381965055 393961741 391826308
2641C91826308j5067803k4510857k9494106l0391530k8776515k6299398k3439378
$$ 391826308 376758505 352247648 322753542 292362012 263585497 237286099 213846721
2634B13846721k0762939j8360455j6291757j4329717j2543983j1027954r513624
$$ 213846721 193083782 174723327 158431570 144101853 131557870 120529916 111016292
2627A11016292q307483p353399o415744n624808n177337m604075m245698l884075
$$ 111016292 102708809 95355410 88939666 83314858 78137521 73533446 69287748 65403673
2619F5403673l593698l276337l045294k827164k577892k424283k354764k119166
$$ 65403673 61809975 58533638 55488344 52661180 50083288 47659005 45304241 43185075
2611D3185075j951465j840337j774712j602008j454879j438833j349155j196904
$$ 43185075 41233610 39393273 37618561 36016553 34561674 33122841 31773686 30576782
2603C0576782j183231j146179r12452r42736r30171p90132p50912p22725o89505
$$ 30576782 29393551 28247372 27334920 26392184 25462013 24671881 23920969 23198244 22508739
2594B2508739o76754o99655p27994o07859o50531n80854n46532o55031n21116
$$ 22508739 21831985 21132330 20404336 19796477 19145946 18565092 18018560 17363529 16842413
2585A6842413m20359m54245m00798m57625m22519m02707m23650l75830l86098
$$ 16842413 16422054 15967809 15567011 15109386 14686867 14284160 13860510 13484680 13098582
2576A3098582l81849l77683l98954k20570k25582l53465l26911k28806m02875
$$ 13098582 12716733 12339050 11940096 11719526 11493944 11140479 10813568 10584762 10181887
2567A0181887k31314k58763m18879j11613k40830j84990j89376k26040k37719
$$ 10181887 9950573 9691810 9272931 9161318 8920488 8735498 8546122 8320082 8082363
2558H082363k73794j35756k37579k79500k82891j50640j22210j53719k94707q5788
$$ 8082363 7808569 7672813 7435234 7155734 6872843 6722203 6599993 6446274 6151567 6065779
2548F065779j57362j54024r9486j25260r7388o0182k01582j18633k6112n5351
$$ 6065779 5908417 5754393 5654907 5529647 5432259 5372077 5170495 5051862 5025750 4970399
2538D970399j59244o1994l0872q3018j61222q3973l4645q7003k9877r8139p2442
$$ 4970399 4811155 4749161 4718289 4635271 4474049 4390076 4355431 4268428 4238551 4140412 4067970
2527D067970r7529N5808o2800l2997p9855m811j12828p7682k2605r1771j05305
$$ 4067970 3970441 4026249 3963449 3930452 3850597 3845786 3732958 3655276 3632671 3540900 3435595
2516C435595m7649q041l2734j24484m0575l3280q5954K4725j0634l2259m6563
$$ 3435595 3387946 3379905 3347171 3222687 3182112 3148832 3062878 3087603 3076969 3044710 2998147
2505B998147k7692o8847m9400p700q5533q931j9779p0435l6531J6260o5262p5380
$$ 2998147 2970455 2901608 2852208 2844508 2758975 2750044 2730265 2659830 2623299 2639559 2574297 2498917
2493B498917n0613M9878j9125q3573o0518p1110l6844o1092j7556O4347j15935
$$ 2498917 2448304 2498182 2479057 2395484 2334966 2263856 2227012 2165920 2148364 2212711 2096776
2482B096776o354m3342k4807j8927o6877k6739L4470q6374n207K5075o6817j1744
$$ 2096776 2090422 2047080 2022273 2003346 1936469 1909730 1944200 1857826 1852619 1877694 1810877 1799133
2470A799133N3485L899j05961J13149r271Q955J0334J4171q3727M3264q569m2991
$$ 1799133 1852618 1856517 1750556 1863705 1854434 1863389 1873723 1887894 1804167 1847431 1838862 1795871
2458A795871k3073M8749l2493o9953J07193l2284J029l6290M8022J4377O1698
$$ 1795871 1772798 1821547 1789054 1719101 1826294 1794010 1795039 1758749 1806771 1821148 1882846
2447A882846M9416N0386K8099m4636M8333n255Q2074J10843J1792J7165J86917
$$ 1882846 1932262 1982648 2010747 1966111 2014444 2009189 2091263 2202106 2213898 2231063 2417980
2436B417980J37098R8639L8567J55852J13164o6216O5344k330L3991j30327k02291
$$ 2417980 2555078 2653717 2692284 2848136 2961300 2895084 2960428 2958098 2992089 2861762 2659471
2425B659471j50279j05443j77305j12646j06219k0229j63632r2750r7164j47361
$$ 2659471 2509192 2403749 2226444 2113798 2007579 1987350 1823718 1730968 1633804 1486443
2415A486443N0451j07291l4850l0042j04068k3702K2587k0818J2961j5331j02188
$$ 1486443 1536894 1429603 1394753 1364711 1260643 1236941 1259528 1238710 1251671 1236340 1134152
2404A134152M394j7877k297l5861K5816k2976r0470n8889J2572J03723m4360n5402
$$ 1134152 1138546 1120669 1118372 1082511 1108327 1085351 994881 935992 948564 1052287 1007927 952525
2392I52525p3081J9600k25q9137J05289K7205o3138q0227j0336M5331n7086o3206
$$ 952525 879444 899044 898819 809682 914971 942176 879038 798811 788475 833806 776720 713514
2380G13514j1106R7193m2000K9920L7959j5858r5564j0215P6336k5339n1129L902
$$ 713514 702408 799601 757601 787521 825480 809622 714058 703843 780179 754840 703711 707613
2368G07613J3756J6205k5992l8611l627j4904r121r707o838O925j1422K3450l916
$$ 707613 721369 737574 711582 672971 669344 654440 645319 635612 628774 635699 624277 647727 643811
2355F43811q352l4550m9532K9670l2020m6255O9318P893n8570k3204L0629k426
$$ 643811 635459 600909 551377 581047 549027 502772 572090 579983 521413 498209 528838 526412
2343E26412O3885K4456j3011l8946L431J2741j4201O445j1018K63N3818r4635
$$ 526412 590297 614753 601742 562796 566227 578968 564767 571212 560194 560457 614275 519640
2331E19640J8453k8743K3737M989l2337o7878k1726Q668j214O1429l7414n0237
$$ 519640 538093 509350 533087 538076 505739 437861 416135 424803 423589 485018 447604 397367
2319C97367o8396M4246L2597j3776m0744j8369j865J9618j8323L9391r439l5222
$$ 397367 328971 373217 405814 392038 351294 332925 331060 350678 332355 371746 362307 327085
2307C27085k6783M838J15315M308m3298L3783m7119q3613J15718n1430J6929R328
$$ 327085 300302 305140 420455 424763 381465 415248 368129 284516 400234 348804 365733 375061
2295C75061l9373J2882N8096K2492j9152m3294j5364n7959M0680m0777M0348P8433
$$ 375061 335688 348570 406666 429158 410006 366712 351348 293389 334069 293292 333640 412073
2283D12073j12576r118M5590k3867q4182O1144K1956j7553j9822K9903P7676k4248
$$ 412073 299497 290379 335969 312102 227920 289064 311020 293467 273645 303548 381224 356976
2271C56976n1675K8482n9299K4384K6444K9148o2586J165l4127J7031N3484l6254
$$ 356976 305301 333783 274484 298868 325312 354460 291874 293039 258912 275943 329427 293173
2259B93173k4678o1730m7220J07446L422J5225o0753L4809n5546j8567J6328k4285
$$ 293173 268495 206765 159545 266991 270413 285638 224885 259694 204148 185581 201909 177624
2247A77624J42524j6980r618j2375N1542o6785j3201P95n7545N2531j5518p1336
$$ 177624 320148 303168 293550 281175 332717 265932 252731 253526 195981 248512 232994 161658
2235A61658L2031K2062J5686k3044N6045m757n1997L2824p2538M9336l3558O6845
$$ 161658 193689 215751 231437 208393 264438 259681 207684 240508 167970 217306 183748 250593
2223B50593q422J2704K4953K1197m3625j5245p6043J8463M0065R965j1045N4281
$$ 250593 242171 254875 279828 301025 257400 242155 166112 184575 224640 234605 223560 277841
2211B77841m4172l0505J0896k4524m4353P12Q7109K5202m2537P321n7938J2427
$$ 277841 233669 203164 214060 189536 145183 145895 233004 258206 215669 222990 165052 177479
2199A77479j8214K0862j8859j6214k0726o105P0456M4585K3375j03512J23658
$$ 177479 159265 180127 161268 145054 124328 118223 188679 233264 256639 153127 276785
2188B76785j3618q7760R761j5603L5572n2661m7583K1327M2097K5598Q294r8345
$$ 276785 263167 175407 185168 169565 205137 152476 104893 126220 168317 193915 202209 103864
2176A03864M5519N4715L2255j7712m4943O6759n8734k4310Q6433l145q8470P7918
$$ 103864 149383 204098 236353 218641 173698 240457 181723 157413 243846 240701 152231 230149
2164B30149p7591J2308j4374L6536l3105J7348o878N71J0908l4073k055N4119
$$ 230149 152558 164866 150492 187028 153923 171271 164393 164964 175872 141799 139744 193863
2152A93863j06873P1625j7289n8009L7635j9675k360N8089J9912p4859M2216L6025
$$ 193863 86990 158615 141326 83317 120952 101277 98917 157006 176918 102059 144275 180300
2140A80300n4056N9673J2216k2581j1432K9476N966q6040j1212O9230J5638J0777
$$ 180300 126244 185917 198133 175552 164120 193596 199562 113522 102310 171540 187178 197955
2128A97955j48704R3392J28439p4581m3102n5832k6015N2447o4865R267M4386
$$ 197955 49251 142643 271082 196501 153399 97567 71552 123999 59134 68401 112787
2117A12787k5120P1780K1953j6948n3627j6117k6222P5896K6392p677J6168J5104
$$ 112787 87667 159447 181400 164452 110825 94708 68486 144382 170774 163097 179265 194369
2105A94369M056q2738n480k2871q88P9129r665m273J8318n6026N9807j2950j0112
$$ 194369 198425 115687 110207 87336 86448 165577 155912 151639 169957 113931 173738 160788 150676
2092A50676k6499L1504L235p331j0843j190R358j9953O0368o2559j8731N3870
$$ 150676 124177 155681 158916 151585 140742 139552 148910 128957 189325 126766 108035 161905
2080A61905J1696n4218K2206K5249P1222O866n2721n8280R1569R9345O5834L0216
$$ 161905 173601 119383 141589 166838 238060 244926 192205 133925 225494 324839 390673 420889
2068D20889K9985q6404P128o5182r5817L2761P4284q3626k9733m9403n6245K6912
$$ 420889 450874 364470 371598 306416 210599 243360 317644 234018 204285 154882 98637 125549
2056A25549p654K4908m3775J5975J8310O45Q9926p0664p2517j278k5127r713J19992
$$ 125549 117895 142803 99028 115003 133313 133958 223884 153220 80703 79425 54298 44585 164577
2043A64577L3255j39882j6486R3872k5709m6967k4232r139j9827O6802j4494Q2632
$$ 164577 197832 57950 41464 135336 109627 62660 38428 29289 9462 76264 61770 144402
2031A44402L9985r1133k0147j5939J3217k8034K6263m3200m0091O4658o942n720
$$ 144402 184387 93254 73107 57168 70385 42351 68614 25414 -14677 49981 43039 37319
2019C7319J4554m8413L054l266N798M4893R5848l6468n5329m2999M5123J1230
$$ 37319 51873 3460 6514 3248 9046 53939 149787 113319 57990 14991 60114 71344
2007G1344J1268K6787r0318M1953N9443p0371M3969j848l2017j6964K1327p995
$$ 71344 82612 109399 19081 61034 120477 50106 94075 92227 60210 43246 64573 56578
1995E6578K7099K7153j1329q7035P6598O460m8222l2405J2876L9098P551j4727
$$ 56578 83677 110830 99501 12466 89064 95524 47302 14897 27773 66871 74422 59695
1983E9695J3351r6998M6413K6973M6536K6664l4373M1668r5761J1862K5236O6691
$$ 59695 73046 -23952 22461 49434 95970 122634 88261 129929 34168 46030 71266 137957
1971A37957J3930n1866o5419Q0929n8035K7319l4786k8925J2161M2562n5042M9107
$$ 137957 151887 100021 34602 115531 57496 84815 50029 21104 33265 75827 20785 69892
1959F9892k3420K3144p060k3562L1804M550j7964L5647l9499n8339R4359p3862
$$ 69892 46472 69616 62556 38994 70798 75348 57384 93031 53532 -4807 89552 15690
1947A5690j3637J4948P1275j0937k588j677K3974N438j5899p0014n655J6047p2263
$$ 15690 2053 17001 88276 77339 74751 73074 97048 102486 86587 16573 10918 26965 -45298
1934d5298O2950P227r689N401k0127N1860l7785p417K9399j3394l4791n230P5414
$$ -45298 17652 24879 15190 20591 464 52324 14539 7122 36521 23127 -11664 -16894 58520
1921E8520M1580n1502k7358N2708l4065q756j6237J2910K0996K3951L6890k4069
$$ 58520 100100 48598 21240 73948 39883 31127 14890 27800 48796 72747 109637 85568
1909H5568l9495o240j27264K3411L0854J9485K6930k2475j9519Q0133j5374N0635
$$ 85568 46073 39833 -87431 -64020 -33166 -13681 13249 -9226 -28745 51388 36014 86649
1897H6649r766p5930O6986n1782N3782k5077L2947p5414j0505j1627L2561L3508
$$ 86649 76883 953 67939 16157 69939 44862 77809 2395 -8110 -19737 12824 46332
1885D6332j8674J7198m3777j3336J8988N9241l5128J2597j5451J8975J1323L870
$$ 46332 27658 44856 1079 -12257 6731 65972 30844 43441 27990 46965 58288 62158
1873F2158N1353p7768j68l3700j7665N5078N9950l9039r335n3358m592K5827L5759
$$ 62158 113511 35743 35575 1875 -15790 39288 99238 60199 50864 -2494 -7086 18741 54500
1860E4500k5363j656k2832J02616o2304k3280O3612n096O279q8150j6937Q7013
$$ 54500 29137 27481 4649 107265 44961 21681 85293 80197 86476 -1674 -18611 68402
1848F8402j9156m3076K3994j851M2298R591N329K7502n0810k0024p440j8931J9953
$$ 68402 49246 6170 30164 28313 70611 80202 85531 113033 62223 42199 34759 15828 35781
1835C5781l8315L9337l1092J5379j6018l6707O7473L5206m7275j9419J8436P2446
$$ 35781 -2534 36803 5711 21090 5072 -31635 35838 71044 23769 4350 22786 95232
1823I5232q910p0031l6991j2033K7177L3731j61399P8122N8210m3374O4739M5562
$$ 95232 86322 16291 -20700 -32733 -5556 28175 -133224 -55102 3108 -40266 24473 70035
1811G0035l4690N1167J1208p2961r182j7645K9734l6630N8989l4101K76o018r264
$$ 70035 35345 86512 97720 24759 15577 -2068 27666 -8964 50025 15924 16200 10182 918
1798I18J924O043N3308m1994J60j0763L7086J971l6868k2234K3281k947j8754
$$ 918 2842 8885 62193 20199 20359 9596 46682 48653 11785 -10449 12832 9885 -8869
1785h869j1385N2942k8102Q76N2116k5392L3296o4729k2442J7409J05857j04376
$$ -8869 -20254 32688 4586 5462 57578 32186 65482 753 -21689 -4280 101577 -2799
1773b799K5638m4744l7398L7691J9609J3272k6724r858K172k5255K6172J2169
$$ -2799 22839 -21905 -59303 -21612 -2003 11269 -15455 -25313 -23141 -48396 -22224 -10055
1761a0055n3711N5233M092k9070n773Q414O9450K4599o6235M2220J5131n0095
$$ -10055 -63766 -8533 -4441 -33511 -39284 -30870 38580 63179 -3056 39164 54295 4200
1749D200r9611N4535K9016q186L4018o0700m1251N0550J7929l5765K3386O3419
$$ 4200 -95411 -40876 -11860 -20046 13972 -46728 -87979 -37429 -19500 -55265 -31879 31540
1737C1540Q775m0949m3036O8282K4429q164K9707p28p4696L3817j2762o76M5957
$$ 31540 40315 -634 -43670 24612 49041 40877 70584 69856 -4840 28977 16215 15539 61496
1724F1496o9835K8938m0313q3622J08899k032m1693Q8187l491m9988K8135p583
$$ 61496 -8339 20599 -19714 -103336 5563 3531 -38162 50025 46534 -3454 24681 17098
1712A7098n4596j868k9855K6191J0606O602M1227r2431K9821L1663J7753R17N1657
$$ 17098 -37498 -39366 -69221 -43030 -32424 -25822 15405 -77026 -47205 -15542 2211 3128 54785
1699E4785J3523j3071J5598m8494j00799P164N0921L0771p3552J13896K4355o1360
$$ 54785 68308 55237 70835 22341 -78458 -71294 -20373 10398 -63154 50742 75097 13737
1687A3737M4766p9502m6119M3865L5806o3103j6661P1531p767L2118n6298m7975
$$ 13737 58503 -20999 -67118 -23253 12553 -50550 -67211 4320 -3447 28671 -27627 -75602
1675g5602M7849J8126k3199J756j0215K1837j7424K3300N6035n8260J692q6564
$$ -75602 -27753 -9627 -32826 -31070 -41285 -19448 -36872 -13572 42463 -15797 -14105 -100669
1663a00669L1449k5246O8165K7707L44m104J2168j0551L354M6229o5177J3032
$$ -100669 -69220 -94466 -26301 1406 1750 -2354 9814 -737 2617 48846 -16331 -3299
1651c299L4011k9933K1730l213J8266K2001n578K5649j7296q3567k1441Q923P4472
$$ -3299 30712 779 22509 19296 37562 59563 53985 79634 62338 -21229 -42670 -33747 40725
1638D0725m9124K8029o974N337N1700j1849J5634p52N2713n9008q9067J4553O121
$$ 40725 -8399 19630 12656 17993 69693 57844 73478 72726 125439 66431 -22636 -8083 -1962
1625a962K6744K4673j392J7727n0955l7175K315P1078j8489o4206k4258m271m01
$$ -1962 24782 49455 48063 65790 14835 -22340 -20025 51053 32564 -31642 -55900 -60171 -60572
1612f0572K6055J9211L8342j0388o4583k1184L8841N5744K7193J8595k5872l6202
$$ -60572 -34517 -15306 23036 12648 -51935 -73119 -34278 21466 48659 67254 41382 5180
1600E180j2843n9736M2590n9774N0955O6016J3160k5894n8351k5255j6019L9506
$$ 5180 -7663 -67399 -24809 -84583 -33628 32388 45548 19654 -38697 -63952 -79971 -40465
1588d0465J8097K1077k4239K0822O087j3080l0595n36k5467N6106L6322j3777
$$ -40465 -22368 -1291 -25530 -4708 1379 -11701 -42296 -42832 -68299 -12193 24129 10352
1576A0352p3053M0445j3034J00808q1986N6983k6512m8231M6258m5601L2205j3125
$$ 10352 -62701 -22256 -35290 65518 -16468 40515 14003 -34228 12030 -33571 -1366 -14491
1564a4491K218J2713M0015K8579L745k4890j5252Q54L2384p6395q903l5228K2719
$$ -14491 -12273 440 40455 69034 72779 47889 32637 33491 65875 -10520 -19423 -54651 -31932
1551c1932l8165p537k903N3369N7747n6255L4223m7390q530M0591N4931j0135
$$ -31932 -70097 -77634 -80537 -27168 30579 -25676 8547 -38843 -47373 -6782 48149 38014
1539C8014o3444p6539R9871r629j4206j2811Q380j5891O1615k3777J132O1425
$$ 38014 -25430 -101969 -2098 -11727 -25933 -38744 -30364 -46255 15360 -8417 -7285 54140
1527E4140q0663l4596M5740N218q4879J55920j18121n4939M0084O8398o980k004
$$ 54140 -26523 -61119 -15379 -10161 -95040 60880 -57241 -112180 -72096 -3698 -10678 -12682
1515a2682n4106J1526J24831m3096j03842L8565l2125Q5275j0136p4523P6266
$$ -12682 -66788 -55262 69569 26473 -77369 -38804 -70929 14346 4210 -70313 5953
1504E953n0125K0437l2280P4181r7815K6773Q2099n4916O3188q685j4164k0557
$$ 5953 -44172 -23735 -56015 18166 -79649 -52876 29223 -25693 37495 28810 14646 -5911
1492e911k9864m4456L5817m399O50J6226j2891J2615L4088l6167k176n3914k0849
$$ -5911 -35775 -80231 -44414 -48813 -48163 -31937 -44828 -32213 1875 -34292 -36468 -90382 -111231
1479a11231O9420j6418R6292K1350p8091N3607P922k4191k3075M477J8662j276
$$ -111231 -41811 -58229 38063 59413 -18678 34929 42851 18660 -4415 62 18724 17448
1467A7448J6241m884k7321J424K8513r4414k3117Q1418K8589m409m5253M0855
$$ 17448 33689 28805 1484 2908 31421 -62993 -86110 -4692 23897 19488 -25765 15090
1455A5090j855k5890n2822m0798N7326P6085K3181o2973J1308J8287j0381J4123
$$ 15090 13235 -12655 -65477 -106275 -48949 27136 50317 -12656 -1348 16939 6558 20681
1443B0681j216P69o4103Q2600m7075j0180P8922p1704K8157P1366n3891n7818
$$ 20681 19465 20234 -43869 38731 -8344 -18524 60398 -11306 16851 88217 34326 -23492
1431b3492O1269O5232l5506k2322j04781M6895M3874l0602P056k8235m4442p0704
$$ -23492 37777 103009 67503 45181 -59600 -12705 31169 567 7623 -20612 -65054 -135758
1419a35758J19930L3057n1420J2189m5447k8707L8722P2637R288L58j8063j6447
$$ -135758 -15828 17229 -34191 -22002 -67449 -96156 -57434 15203 24491 24849 6786 -9661
1407i661Q2667k4385r6360L0585o321O6819j03071M2684K8172j5201j0637k0708
$$ -9661 73006 48621 -47739 -17154 -23475 43344 -59727 -17043 11129 -4072 -14709 -35417
1395c5417M9010J0639l0064p4098K5160l4496M6170N2326l381m5249N8046o701
$$ -35417 13593 24232 -5832 -79930 -54770 -89266 -43096 9230 5849 -39400 18646 11945
1383A1945k3833L8259j0213p2179K2064l8697j7139m685O5450K4770m573M356
$$ 11945 -11888 26371 16158 -56021 -33957 -72654 -89793 -94478 -29028 -4258 -8831 -4475
1371d475j0830l8681K5970N1789L2045k0189m3518o9342N2455O2796k9024k1572
$$ -4475 -15305 -53986 -28016 23773 55818 35629 -7889 -77231 -24776 38020 8996 -12576
1359a2576K4754M7999p1544l2905N5231N645o1693K2022l752k2821K4301j4250
$$ -12576 12178 60177 -11367 -44272 10959 16604 -45089 -23067 -26819 -49640 -25339 -39589
1347c9589L1509l1209k2108M048j4381m5516N2408l757R7995k583R935k7140j407
$$ -39589 -8080 -39289 -61397 -57349 -71730 -117246 -64838 -68595 29400 26817 36752 9612 8205
1334H205k0228P947K8482J6114R791N767n5682j9614J5036n5378j7799N7313L0482
$$ 8205 -12023 -4076 24406 40520 50311 56078 396 -19218 -4182 -59560 -77359 -20046 10436
1321A0436J7291K7168k0701K5593J4039j9879j06N9996k4852r2208j6669j6078
$$ 10436 27727 54895 34194 59787 73826 53947 53841 113837 88985 -3223 -19892 -35970
1309c5970k2195N2070n5346J08961j0943k3190P84r505K5023m7810K7491j9870
$$ -35970 -58165 -6095 -61441 47520 36577 13387 14171 4666 29689 -18121 9370 -10500
1297a0500k611N9952l1545m8383M7074K907o6613M1615m386M3271k1930k8598
$$ -10500 -13111 46841 15296 -33087 13987 16894 -49719 -8104 -12490 30781 8851 -19747
1285a9747N2254J4391r92k0746l7101l1281k3274L9458J4043m7469p568P0250
$$ -19747 32507 46898 45906 25160 -11941 -43222 -66496 -27038 -12995 -60464 -68032 2218
1273B218j787m2623P1138M629k3306L4781j01245j3022J6811O3661L7707L963
$$ 2218 431 -42192 28946 33575 10269 45050 -56195 -69217 -52406 11255 48962 52925
1261E2925o9621K7540k7383j767k6569J880j525K4870K8942M8512m247n4178q336
$$ 52925 -16696 10844 -16539 -18306 -44875 -42995 -44520 -19650 9292 57804 53557 -621 -8957
1248h957N2792l5908l5987k7986j2833N9149q681P8037K2523p1522q7604J67785
$$ -8957 43835 7927 -28060 -56046 -68879 -9730 -18411 59626 82149 10627 -76977 90808
1236I0808n688l2201L4419j5148r2730l3238K1791k1727L5223L5669N241J3420
$$ 90808 85120 52919 87338 72190 -20540 -53778 -31987 -53714 -18491 17178 22419 35839
1224C5839p7478l1063Q4117J328J3614j6948o4589O8377L5818l0827l9289m7294
$$ 35839 -41639 -72702 11415 12743 26357 9409 -55180 13197 49015 18188 -21101 -68395
1212f8395N2639n106r132R1578j8439l39l5201n6666N0711L4310J1197o9547L6226
$$ -68395 -15756 -20862 -29994 61584 43145 42806 7605 -49061 1650 35960 47157 -22390 13836
1199A3836k400n8510N4016P257j7310L9167m0505k9348M7665j5561o2857L8714
$$ 13836 11436 -47074 6942 14199 -3111 36056 -4449 -33797 13868 -1693 -64550 -25836
1187b5836J9766l8469P7092o2326K8897q0474Q718p19M3230q621J3774j4040m608
$$ -25836 -6070 -44539 32553 -29773 -876 -81350 -72632 -73351 -30121 -38742 -24968 -39008 -43616
1174d3616N8555k7454J06897r4512k0141J5407n571j9742N4726P551k0729o826
$$ -43616 14939 -12515 94382 -130 -20271 -4864 -10435 -30177 24549 32100 11371 4545
1162D545N5280K8351m8250o7067p6019K8670M1976k4406l761J3767O6893k8216
$$ 4545 59825 88176 39926 -27141 -103160 -74490 -32514 -56920 -60681 -46914 19979 -8237
1150h237L1771n2422K8164J5281o4816N9735K5226m5353O9886K864q8851l99O8841
$$ -8237 23534 -28888 -724 14557 -50259 9476 34702 -10651 59235 62099 -26752 -27151 41690
1137D1690l8279k5079O3647K9915k4228m9075J0342K0638m5429k4035P1996m582
$$ 41690 3411 -21668 41979 71894 47666 -1409 8933 29571 -15858 -39893 32103 27521
1125B7521P138n3514k69L9181L144K9924o9952L1838n053M0365J6854q2717Q0449
$$ 27521 34659 -18855 -19124 20057 23201 53125 -16827 15011 9958 50323 67177 -15540 64909
1112F4909m0464r1428q299K3286j1587N2539n3450k1441p33k2409N3555m9908
$$ 64909 24445 -66983 -75282 -51996 -63583 -11044 -64494 -85935 -86668 -109077 -55522 -105430
1100a05430M1862P1579l6396N7463J2085o0540k8287N948R026K2673p3173J09116
$$ -105430 -63568 8011 -28385 29078 41163 -19377 -47664 -41716 -32690 -10017 -83190 25926
1088B5926J8293l9234m4634M3662J9124l8443L0414L4084N8821l301n0622p6824
$$ 25926 44219 4985 -39649 4013 23137 -15306 15108 49192 108013 104712 54090 -22734
1076b2734J061J3778j4410R0292R151k7952n2932K7970j7398l3087Q507k3875
$$ -22734 -21673 -7895 -22305 67987 77138 49186 -3746 24224 6826 -26261 -17754 -41629
1064d1629Q118L6509j7922J0059J1404j5918j4867L1077n3463P4505K8017m1350
$$ -41629 -33511 2998 -14924 -4865 6539 -9379 -24246 6831 -46632 27873 55890 14540
1052A4540N0138J7217j6094n6518n546L8635r4145j3794j3559P0958J21253n3794
$$ 14540 64678 81895 65801 9283 3737 42372 -51773 -65567 -79126 -8168 113085 59291
1040E9291l8638m2812J7174K6947M8191L4525n2599j58019K8207P2693M6537j6213
$$ 59291 20653 -22159 -4985 21962 70153 104678 52079 -105940 -77733 -5040 41497 25284
1028B5284m7107K3698L5155q3324N8634l8099J8843L3185n8617n449O6241r3416
$$ 25284 -21823 1875 37030 -46294 12340 -25759 -6916 26269 -32348 -37797 28444 -64972
1016f4972Q390j930n0242M8546P95k0687l946J2443O6606K6973J4211k0655o8960
$$ -64972 -56582 -58512 -108754 -60208 -59413 -80100 -84046 -71603 -4997 21976 36187 15532 -53428
1003e3428n955K6161m728K7642N1774L1651L5826k6146q007m0814n7366O9124
$$ -53428 -59383 -33222 -37950 -10308 41466 73117 108943 82797 74790 33976 -23390 45734
991D5734k7564j05173R6864j689r3001L0124n10P12K6418P8945k442n8279J2600
$$ 45734 18170 -87003 9861 8172 -84829 -54705 -55215 -54503 -28085 50860 48418 -9861 2739
978B739K0589L2970M161p3587K9467l7718j13231j6783P9630L2487J794O7708
$$ 2739 23328 56298 60459 -13128 16339 -21379 -134610 -151393 -71763 -39276 -37482 30226
966C0226j9873p1355L5280J1738K448o1649J9349m308Q2202l210l2147p856p521
$$ 30226 10353 -61002 -25722 -13984 -11536 -73185 -53836 -58144 24058 20848 -11299 -19155 -26676
953b6676J01208J8641L0975q9463l4425k4585N4734k5119n7010l9772Q8981K3999
$$ -26676 74532 93173 124148 34685 260 -24325 30409 5290 -51720 -91492 -2511 21488
941B1488J5985q5068Q760M8405j1651j796N3496j6396K5382o0872n132o16n0225
$$ 21488 37473 -47595 -38835 9570 -2081 -3877 49619 33223 58605 -2267 -7399 -8015 -58240
928e8240Q8353k231R754j1375J7461r934o8047j155P3210p015n6507j7709K4651
$$ -58240 30113 27882 37636 26261 43722 33788 -34259 -35414 37796 30781 -25726 -43435 -18784
915a8784M918m7298K8793L3380K916l705L0786p0332o822Q2872n603m5362M5408
$$ -18784 -13866 -61164 -32371 1009 3925 220 31006 -39326 -46148 36724 31121 -14241 31167
902C1167k9118n6924L4083j5766R3720l6817M7730K176p4729l5871j2162j4150
$$ 31167 2049 -54875 -20792 -36558 57162 20345 68075 70251 -4478 -40349 -52511 -66661
890f6661N4965L1398L8695o7283P148k0123J7712k8193K6N1740k9470r402O437
$$ -66661 -11696 19702 58397 -8886 -1738 -21861 -4149 -32342 -32316 19424 -10046 -19448 -13011
877a3011l0663O8085k5795j1905J8686Q150o9374K7902L7523m2841J0564L1128
$$ -13011 -43674 24411 -1384 -13289 5397 13547 -55827 -27925 9598 -33243 -22679 8449
865H449n689l0581K1833n745p1655P725N1307J1967J9666J2479j62m6592J744
$$ 8449 2760 -27821 -5988 -11733 -83388 -75663 -24356 -12389 7277 19756 19594 -26998 -25254
852b5254L0551l7064n631o201j5660K6955n2063M5007N266L2809N617n4515m751
$$ -25254 5297 -31767 -37398 -43599 -59259 -32304 -84367 -39360 -34094 -1285 4332 -50183 -54934
839e4934R7943k0316l3167o2538L5414K1830k9657n4690J50939j7085l8400q3258
$$ -54934 43009 22693 -10474 -73012 -37598 -15768 -45425 -100115 50824 33739 -4661 -87919
827h7919O7942K5641R711k5619j4975n3321M5886j916L6117l8320m084Q0283k2562
$$ -87919 -19977 5664 15375 -10244 -25219 -78540 -32654 -34570 1547 -36773 -40857 39426 16864
814A6864J7368k5705K2764j4073N1555p1913m0123M4285k249K6756j5m2344J1948
$$ 16864 34232 8527 31291 17218 68773 -3140 -43263 1022 -1227 25529 25514 -16830 -4882
801d882k8362k3835k0821M5548M2408q2307K0783j9517k2972N2666n953N0444
$$ -4882 -33244 -57079 -77900 -32352 10056 -72251 -51468 -70985 -93957 -41291 -47244 3200
789C200k1458K3592J0953n530K5886m2744r57N0568k0213J1264O802j8535j01981
$$ 3200 -18258 5334 16287 10757 36643 -6101 -7058 43510 23297 34561 41363 22828 -79153
776g9153O5695J01016m9204Q128o512m1596L3222P3828j7922j03732J5672M2002
$$ -79153 -13458 87558 38354 46482 39970 -1626 31596 105424 87502 -16230 -558 41444
764D1444j2841o7033M4760j4586K7593k1622l9096P2998J0579l1314k9363j2599
$$ 41444 28603 -38430 6330 -8256 19337 -2285 -41381 31617 42196 10882 -18481 -31080
752c1080j0220M1427n1238J5701K525N6200Q2138n0775k2895l0158J7225n36q694
$$ -31080 -41300 127 -51111 -35410 -32885 23315 105453 54678 31783 1625 18850 18314 9620
739I620m1558M6846J11469l8807j9524j292j0998r1643m208L7122P022M7478m4448
$$ 9620 -31938 14908 126377 87570 68046 66754 55756 -35887 -40095 -2973 4049 51527 7079
726G079K6522l7150n6797q5254J60425M7765j14265O1606O2841k7377o4599l0573
$$ 7079 33601 -3549 -60346 -145600 14825 62590 -51675 9931 72772 45395 -19204 -49777
714d9777N7881M1326K6378n5057q9357K4598L6585j0654k9389J2560r025K2972
$$ -49777 8104 49430 75808 20751 -68606 -44008 -7423 -18077 -47466 -34906 -43931 -20959
702b0959p7570M1783J16132p7956j9212M5093j6928n9283J24594k5527L942K151
$$ -20959 -98529 -56746 59386 -18570 -37782 7311 -9617 -68900 55694 30167 34109 36260
690C6260L139J5591q0643n6710R5154j7335M624L0650l3015K3700k9856j2544
$$ 36260 39399 54990 -25653 -82363 12791 -4544 80 30730 -2285 21415 -8441 -20985
678b0985O805o099O6026J623j0636m1590K1483N1577N4257m3047n0428n7266Q794
$$ -20985 -14180 -20279 45747 47370 36734 -4856 16627 68204 122461 79414 28986 -28280 -19486
665a9486k5728l0448Q1219q221J0702j6879l4702M2601N5187m6185J4339j6077
$$ -19486 -45214 -75662 5557 -2664 8038 -8841 -43543 -942 54245 8060 22399 6322
653F322O6024o9974M6196K1682R4107q3050l0658L5429n3418l1775j3493n817
$$ 6322 72346 2372 48568 70250 164357 81307 50649 86078 32660 885 -12608 -18425
641a8425Q1790l6298j0185L390m3854K1263m87K5429J3509O1036K7989r4076k3802
$$ -18425 63365 27067 16882 20272 -23582 -2319 -2806 22623 36132 97168 125157 31081 7279
628G279p5735R1628L048p969O6691q7257j622n4020L1925k5435j7841M2891L4727
$$ 7279 -68456 23172 26220 18251 84942 -2315 -3937 -57957 -26032 -51467 -69308 -26417 8310
615H310M8957k2202l6153M6579m4873q1637K5405M4283M5287N01K2768k0747J76
$$ 8310 57267 35065 -1088 45491 618 -81019 -55614 -11331 33956 34457 57225 36478 36654
602C6654k6623j1157N4311p53m3537j174j2894l742J0866O789K5329p9861m0886
$$ 36654 10031 -1126 53185 52432 8895 7721 -5173 -8915 1951 8740 34069 -45792 -86678
589h6678P336R9703l9012r3506P2015l3757l0072N9789j81Q6803o3599J6331J6293
$$ -86678 -79342 20361 -18651 -112157 -40142 -73899 -103971 -44182 -44363 42440 -21159 -4828 11465
576A1465K824q2361m8057J25674M8552K6811r6352K0679P3759K250j00640k6448
$$ 11465 14289 -68072 -116129 9545 58097 84908 -11444 9235 82994 85244 -15396 -41844
564d1844M2294L3026o1830J29869n1993J0319k4282m9613J6665n7617N467M4777
$$ -41844 450 33476 -28354 101515 49522 59841 35559 -14054 2611 -55006 -49539 -4762
552d762O52O8359N9975o1324o5919m6418N2344K2009P2124n3309j02430j154N7560
$$ -4762 -4110 64249 124224 62900 -3019 -49437 2907 24916 97040 43731 -58699 -59853 -2293
539b293K1617n6087K3823p402L6172o9101l6310J02783m0706m2948L3885N5215
$$ -2293 19324 -36763 -12940 -20342 15830 -53271 -89581 13202 -27504 -70452 -36567 18648
527A8648Q406m5339l389O2970p1017L8489K1618j3370M8145p710j17117K0291
$$ 18648 27054 -18285 -21674 41296 -29721 8768 30386 17016 65161 57451 -59666 -39375
515c9375Q4425m0178k8266J23864k37n2632l6353k3232m9399J02394r646k9195
$$ -39375 45050 4872 -23394 100470 100233 47601 11248 -11984 -61383 41011 31365 2170
503B170M1802m5680n0848J9573N3001l3119j646N0394m4975M2062N699m3843O2217
$$ 2170 43972 -1708 -52556 -32983 20018 -13101 -14747 35647 -9328 32734 38433 -5410 56807
490E6807J0179J7672K1116m8024L4850j3096j28306J9129Q3539o7642m6125M2748
$$ 56807 66986 84658 105774 57750 92600 79504 -48802 -29673 53866 -13776 -59901 -17153
478a7153j041N1605J5518l7686n5438j8854O0216K694M3431k0431l896k2698q4668
$$ -17153 -18194 33411 48929 11243 -44195 -63049 -2833 -139 43292 22861 18965 -3733 -88401
465h8401o36N8732N3142j6911j05497P1292K926n5975Q5041k6361n0467N7095
$$ -88401 -89037 -30305 22837 5926 -99571 -28279 -25353 -81328 3713 -22648 -73115 -16020
453a6020L3313j4148n0101N7543n1956M9616m6909M5348K9443q4179j7025L5188
$$ -16020 17293 3145 -46956 10587 -41369 8247 -38662 6686 36129 -48050 -65075 -29887
441b9887P8039k9897L4363m1185L0857j6501K6647p773q8163J1019R0954l6978
$$ -29887 48152 18255 52618 11433 42290 25789 52436 44663 -43500 -32481 58473 21495
429B1495J41116o7455j01731j8808m3428m7377J05724K4525j8772K8463R038l2972
$$ 21495 162611 95156 -6575 -25383 -68811 -116188 -10464 14061 -4711 23752 32790 -182
417a82l0080j8384M7519L8372J5653J1946o8036q1218N3510J8568j7220M9122
$$ -182 -30262 -48646 -1127 37245 52898 64844 -3192 -84410 -30900 -12332 -29552 19570
405A9570L8579K4375r3467M6659j343j730J0219K9188Q602j5783k637J418k3179
$$ 19570 58149 82524 -10943 35716 34373 32643 42862 72050 80652 64869 62232 63650 40471
392D0471l8799K8955j9770N4654q5476O4929L4344q1746q518L8765m155M3720
$$ 40471 1672 30627 10857 65511 -19965 44964 79308 -2438 -10956 27809 23654 67374
380F7374L2198o6418m4612r2881M0046O1919J1381k8350K9822M7760m7431k9053
$$ 67374 99572 33154 -11458 -104339 -64293 -2374 9007 -19343 10479 58239 10808 -18245
368a8245O0027p7656j2203J7553M707m2821j6832O9839M1959J3634l9865O5443
$$ -18245 41782 -35874 -48077 -30524 -25817 -68638 -85470 -15631 26328 39962 97 65540
356F5540k7733k5104l0897J6077J1724J8528L6657l0090o804k055M7403L1368
$$ 65540 37807 12703 -18194 -2117 9607 28135 64792 34702 27898 25843 73246 104614
344A04614l5879o3856J3540L921J9431j2508m813P527r044N6503n3818N9154j7348
$$ 104614 68735 4879 18419 22340 41771 29263 24450 31977 22933 79436 25618 84772 67424
331F7424j1950N409J0346n8599k5102K9350M2554o784m9171K2082o1241l0815
$$ 67424 55474 60883 71229 12630 -12472 16878 59432 52648 3477 25559 -35682 -66497
319f6497M2821J3957O1674O9860n9915n08l4054m1144N218J3860n917Q1489l5884
$$ -66497 -23676 -9719 51955 121815 61900 61392 27338 -13806 -8588 5272 -645 80844 44960
306D4960N5225k9748o0652k5435J2897L3685O7182m3444n0380Q906K1382p0288
$$ 44960 100185 70437 9785 -15650 -2753 30932 98114 54670 4290 13196 34578 -35710
294c5710l2763M4998J3101m733J7386K9887L3546m5081L2267k4169j4402N5137
$$ -35710 -68473 -23475 -10374 -15107 2279 32166 65712 20631 52898 28729 14327 69464
282F9464p4120k672Q484R284j6562j8098l4901M6075O7640m2530q81N7660l2162
$$ 69464 -4656 -7328 1156 10440 -6122 -24220 -59121 -13046 54594 12064 11183 68843 36681
269C6681L928L992m6213J06809j4656r3704L2170L7914k7302o914J3376j6155
$$ 36681 40609 44601 -1612 105197 90541 -3163 29007 66921 39619 32705 46081 29926
257B9926l2738K1287J0727k8384N1055L6127m2310j05186M4319m707n578N0073
$$ 29926 -2812 18475 29202 818 51873 88000 45690 -59496 -15177 -19884 -25462 24611
245B4611n9529L936L1916M5705J2256K3593l9656m1998l6544M5682M5951j8788
$$ 24611 -34918 -30982 934 46639 58895 82488 42832 834 -35710 9972 55923 37135
233C7135l475n4503M1649j1842K6985k0101L9973n7045J5326K7260L0501k0631
$$ 37135 33660 -20843 20806 8964 35949 15848 55821 -1224 14102 41362 71863 51232
221E1232o5153j6310L5175L5004n8068l5275K0073P3065L3681p3907K2673m1076
$$ 51232 -13921 -30231 4944 39948 -18120 -53395 -33322 39743 73424 -483 22190 -18886
209a8886l0953N5029k589M180J5386M4828L2059O404k1160o2930j7547J7054l2742
$$ -18886 -49839 5190 2601 6781 22167 66995 99054 105458 84298 21368 3821 20875 -11867
196a1867l931J3350K1589J5316o397j528L6720k547k1592M1980j01856P35k5497
$$ -11867 -15798 -2448 19141 34457 28060 26532 63252 60705 39113 81093 -20763 -20028 -45525
183d5525l5908M8038L3612N6856l2719N6354j069k1813l0014K0274k1539j1454
$$ -45525 -81433 -33395 217 57073 24354 80708 79639 57826 27812 48086 26547 15093
171A5093J7728K2321j678k3312m0790J4260L5759k1452k0249N4027o9908L165
$$ 15093 32821 55142 53464 30152 -10638 3622 39381 17929 -2320 51707 -18201 -15036
159a5036L8956j2750R1043l7172k0770l0447n011l5876N7126N1606o0066l6974
$$ -15036 23920 11170 102213 65041 44271 13824 8813 -27063 30063 81669 21603 -15371
147a5371M9726k793K7661p6437Q553K1529K0961j8806j0583J10201q1174k5014
$$ -15371 34355 31562 59223 -17214 -8661 12868 33829 15023 4440 114641 33467 8453
135H453k9011R741K8000J3037n629k1892J1564K1396n2141P1704o9924L0550l3301
$$ 8453 -20558 -10817 17183 30220 24591 2699 14263 35659 -16482 55222 -14702 15848 -17453
122a7453m3183N711k5633P6696k3929k1521R6461q009k4329K5420K7561J2465
$$ -17453 -60636 -54925 -80558 -3862 -27791 -49312 47149 39140 14811 40231 67792 80257
110H0257m2745O100L5455j0151j4770P689q0410O3577m7797K0816J5586k7915
$$ 80257 37512 43612 79067 68916 54146 61835 -18575 45002 -2795 18021 33607 5692
98E692j4526N3575N802n321J895p1506L2552K3287n4961L4297J8048r2729J10158
$$ 5692 -8834 44741 50543 45222 47117 -24389 8163 31450 -23511 10786 28834 -63895 46263
85D6263n9773J0299p098L2188L1819n8396N6247k343k0646n760J5621l3435j8609
$$ 46263 -13510 -3211 -10309 21879 53698 -4698 51549 49206 28560 22800 38421 4986 -13623
72a3623N9760M6519r8870j5327L5597J9999L9408m1159o248n1317J6401L5955
$$ -13623 46137 92656 -6214 -21541 14056 34055 73463 32304 26056 -25261 -8860 27095
60B7095j47P154M944j0696j0349J0179K3600j8966k9638k0797k7428J8385L5110
$$ 27095 26948 34102 39046 28350 18001 28180 51780 32814 3176 -17621 -45049 -26664 8446
47H446r806l0684l563K1129L6644m4051L2166N879K9833N9231m5776l863p415
$$ 8446 -1360 -32044 -35607 -14478 22166 -21885 10281 16160 45993 105224 59448 55585 48170
34D8170j224r238L2877k2591j823J0428l5444j9636m982L483J8600K6050j397
$$ 48170 46946 37708 70585 47994 46171 56599 21155 1519 -3463 20 18620 44670 43273
21D3273j777j4934k9619o1027N3553L5494q332k233j6605K9311n1040k0668Q3977
$$ 43273 41496 26562 -3057 -64084 -10531 24963 16631 14398 -2207 27104 -23936 -44604 39373
8C9373l6282J2885L6490k3508M0328l9218n0084M0631
$$ 39373 3091 15976 52466 28958 69286 30068 -20016 20615
0B0615
$$ 20615
$$ Imaginary data points
##PAGE= N=2
##DATA TABLE= (X++(I..I)), XYDATA
16383a803536K2266Q7192J8968k609m099l045K3322M3704O9674l978M1900j7582
$$ -1803536 -1781270 -1694078 -1675110 -1677719 -1681818 -1684863 -1661541 -1617837 -1548163 -1552141 -1510241 -1527823
16371a527823M0981j67K5586L7024l95o714j550M6898M3810M4209m9690O3271
$$ -1527823 -1486842 -1487009 -1461423 -1424399 -1424794 -1431508 -1433058 -1386160 -1342350 -1298141 -1347831 -1284560
16359a284560M4642n174K4880P946M9243o178j8672O4726J4245l1246K8682J5956
$$ -1284560 -1239918 -1245092 -1220212 -1212266 -1163023 -1169201 -1187873 -1123147 -1108902 -1140148 -1111466 -1095510
16347a095510J2300N6489M1036M5077l3828K5987M6342M3164m169m8421M1698
$$ -1095510 -1083210 -1026721 -985685 -940608 -974436 -948449 -902107 -858943 -863112 -911533 -869835
16336h69835K0120N3924L271M3832J6663k007K5432M5191q754O218k8962L688
$$ -869835 -849715 -795791 -792520 -748688 -732025 -734032 -708600 -663409 -672163 -665945 -694907 -691219
16324f91219L6130L4195N6969M6929m5337Q1145l5946N9133K3111j3014P811P7526
$$ -691219 -655089 -620894 -563925 -516996 -562333 -481188 -517134 -458001 -434890 -447904 -440093 -362567
16312c62567L5854K309J1654J9081K2772j3760k0631m1665J8100L9492P6054j4810
$$ -362567 -326713 -324404 -312750 -293669 -270897 -284657 -305288 -346953 -328853 -289361 -213307 -228117
16300b28117O9431Q4468P385j3445K4241j3413K7096P6806o3009l4329O6456J9503
$$ -228117 -158686 -74218 -66833 -80278 -56037 -69450 -42354 34452 -28557 -62886 3570 23073
16288B3073R974p184N7017J9358l7902L7939p77M0646k4283M1791L2255j8113
$$ 23073 33047 25863 82880 102238 64336 102275 101498 142144 117861 159652 191907 173794
16276A73794j6785j6743J2213K2334M5069l4858J09118N1458p2593K3118n672
$$ 173794 157009 140266 152479 174813 219882 185024 294142 345600 273007 296125 290453
16265B90453l2935P0235q341M4739O6819k3353R8531k2411k8925K4394L0809L1257
$$ 290453 257518 327753 319412 364151 430970 407617 506148 483737 454812 479206 510015 541272
16253E41272l0811K7817K7150l2961l3608M7170m81L6037O5128m516K1601k5507
$$ 541272 510461 538278 565428 532467 498859 546029 545548 581585 646713 642197 663798 638291
16241F38291M470K8564J3730K6292J3822k8246O5619K971m2413l1162l172J10676
$$ 638291 642761 671325 685055 711347 725169 696923 762542 765513 723100 691938 688766 799442
16229G99442P4850j3581q4082o597N1750L2929J1177M0036o1339q206j6286J00770
$$ 799442 874292 860711 776629 770032 821782 854711 865888 905924 844585 836379 820093 920863
16217I20863m0512k9300r730P9012M9926L7115K1927n9367K3691J8793J0497j9927
$$ 920863 880351 851051 841321 920333 970259 1007374 1029301 969934 993625 1012418 1022915 1002988
16205A002988M2231J5516K1534n7751n5537K3640M5083M7037j5641l112j287L1231
$$ 1002988 1045219 1060735 1082269 1024518 968981 992621 1037704 1084741 1069100 1065988 1064701 1095932
16193A095932K1796o846K6926j7418k974j7733j529J9061L9680R0473J653o9008
$$ 1095932 1117728 1110882 1137808 1120390 1117416 1099683 1098154 1117215 1156895 1247368 1249021 1180013
16181A180013J882M8183m9311J6391L2378L2511p2729K2808J39j9364O732l6556
$$ 1180013 1181895 1230078 1180767 1197158 1229536 1262047 1189318 1212126 1212265 1192901 1199633 1163077
16169A163077K1724R4839q595R279J6310j5605o0416O9085N1262J8226l2558p5902
$$ 1163077 1184801 1279640 1271045 1280324 1296634 1281029 1220613 1289698 1340960 1359186 1326628 1250726
16157A250726j3845Q1622R0885p2336j2406p908m3299J485J9277Q1023M6142j7059
$$ 1250726 1236881 1318503 1409388 1337052 1324646 1316738 1273439 1274924 1294201 1375224 1421366 1404307
16145A404307M602k0132L4536k855k5168k8987P3420J1136m0996L4135J3657J7946
$$ 1404307 1408909 1388777 1423313 1420458 1395290 1366303 1439723 1450859 1409863 1443998 1457655 1475601
16133A475601M9552P490q6671j4473N8252J8285j1412o0727L7806j6207k1626
$$ 1475601 1525153 1532643 1445972 1431499 1489751 1508036 1496624 1435897 1473703 1457496 1435870
16122A435870L1977N4396j03468L3296k7659k1895J0344L6455N4139K3240p7103
$$ 1435870 1467847 1522243 1418775 1452071 1424412 1402517 1412861 1449316 1503455 1526695 1449592
16111A449592K7667l3039J2765N7167R496K7146j6432O323N4769k8756l9028O0280
$$ 1449592 1477259 1444220 1456985 1514152 1523648 1550794 1534362 1540685 1595454 1566698 1527670 1587950
16099A587950o2894k3934m9586j9916R5606O7133j7431l2885k3361n4148P5640
$$ 1587950 1525056 1501122 1451536 1431620 1527226 1594359 1576928 1544043 1520682 1466534 1542174
16088A542174K4981m7653K4029j0066k4914O045N6128m506m6276k7149L8092O2880
$$ 1542174 1567155 1519502 1543531 1533465 1508551 1514596 1570724 1566218 1519942 1492793 1530885 1593765
16076A593765j3718m3297N68j6091L8870J3997l0218K9713k6187J1080j8101n429
$$ 1593765 1580047 1536750 1537318 1521227 1560097 1574094 1543876 1573589 1547402 1558482 1540381 1534952
16064A534952L5616J6737p9799m4747K0014K4191K7813k7311j9221K0318M7101
$$ 1534952 1570568 1587305 1507506 1462759 1482773 1506964 1534777 1507466 1488245 1508563 1555664
16053A555664K5629j9851R1415l4547K9533p0453L7125J4365l8830m98l7331Q7810
$$ 1555664 1581293 1561442 1652857 1618310 1647843 1577390 1614515 1628880 1590050 1589552 1552221 1640031
16041A640031r1187K5551k5529J6892M7659O9360o4387j25290M6859R796N5974
$$ 1640031 1548844 1574395 1548866 1565758 1613417 1682777 1618390 1493100 1539959 1549755 1605729
16030A605729j996j7117N2066m5750m645j0177J4866o817L8455L2742k7326l9866
$$ 1605729 1603733 1586616 1638682 1592932 1588287 1578110 1592976 1586159 1624614 1657356 1630030 1590164
16018A590164o4166K6056P5655q1932o625P7922q8930O6515m601n2487j3240l4090
$$ 1590164 1525998 1552054 1627709 1545777 1539152 1617074 1528144 1594659 1590058 1537571 1524331 1490241
16006A490241P0786O8894J7718q4709l406R698O779j05501J10886P8672m854k4876
$$ 1490241 1561027 1629921 1647639 1562930 1559524 1569222 1576001 1470500 1581386 1660058 1655204 1630328
15994A630328M4963n169q1383J6043J784n7089P4367M8407O475o6748K4362p0673
$$ 1630328 1675291 1670122 1588739 1604782 1606566 1549477 1623844 1672251 1678726 1611978 1636340 1565667
15982A565667j6922J1010L5123K6893j05582M6671m9237J9256L5464N1126m0737
$$ 1565667 1548745 1559755 1594878 1621771 1516189 1562860 1513623 1532879 1568343 1619469 1578732
15971A578732k3965J0995M5345J0208m6591N9809L6786p1907m0032L456j2232
$$ 1578732 1554767 1565762 1611107 1621315 1574724 1634533 1671319 1599412 1559380 1562836 1550604
15960A550604N5957L145p215K5413n0023J5635O0336p4619j1052J5672o7631o084
$$ 1550604 1606561 1609706 1602491 1627904 1577881 1593516 1653852 1579233 1568181 1583853 1516222 1510138
15948A510138J01698N4339N3514m5012k7829K7527n2264O0057l4210j6528j8286
$$ 1510138 1611836 1666175 1719689 1674677 1646848 1674375 1622111 1682168 1647958 1631430 1613144
15937A613144L8491j4276j7266k2567p6103L1399k4218L0806J0549K5150L3302
$$ 1613144 1651635 1637359 1620093 1597526 1521423 1552822 1528604 1559410 1569959 1595109 1628411
15926A628411M589k3484l7593k424N183J2561p920P1180j6636k002L0778m3551
$$ 1628411 1633000 1609516 1571923 1569499 1574682 1587243 1579323 1650503 1633867 1631865 1662643 1619092
15914A619092R537j7110M1734J8669l3058m2233n5785J7766O4298k8471l9690
$$ 1619092 1628629 1611519 1653253 1671922 1638864 1596631 1540846 1558612 1622910 1594439 1554749
15903A554749L9452M0814m3166J7692K8927r084J0726m3811L0567L1756K0396
$$ 1554749 1594201 1635015 1591849 1609541 1638468 1629384 1640110 1596299 1626866 1658622 1679018
15892A679018m8964N9472j7733q0213j022J116K8840l0354O3031m7479m2892K0512
$$ 1679018 1630054 1689526 1671793 1591580 1590558 1591674 1620514 1590160 1653191 1605712 1562820 1583332
15880A583332N1546O7827n4792M388n1840m6729m5285L3254j7625J07338k9674
$$ 1583332 1634878 1702705 1647913 1652301 1600461 1553732 1508447 1541701 1524076 1631414 1601740
15869A601740O5480Q586j0497p251m1014o737O250l1616L0180p42Q4287m6244
$$ 1601740 1667220 1675806 1665309 1658058 1617044 1610307 1616557 1584941 1615121 1614379 1698666 1652422
15857A652422j8458M4982K3100k9734L8812M6578q3669l2611p5028N5363J5334
$$ 1652422 1633964 1678946 1702046 1672312 1711124 1757702 1674033 1641422 1566394 1621757 1637091
15846A637091J4772l7602L7843J547l4587l0001M7360J0786q9121l580J02890
$$ 1637091 1651863 1614261 1652104 1653651 1619064 1589063 1636423 1647209 1558088 1554508 1657398
15835A657398k1779L5369j9291n1793l9460P6132J7518J6741j3163K1282J865
$$ 1657398 1635619 1670988 1651697 1599904 1560444 1636576 1654094 1670835 1657672 1678954 1680819
15824A680819m3893M0914l3830l3634n3356N1257J1426o6198P9685j4606l216
$$ 1680819 1636926 1677840 1644010 1610376 1557020 1608277 1619703 1553505 1633190 1618584 1615368
15813A615368O0855l4865o8026Q0334r190o6917K8380J5946K0062p1242j0697
$$ 1615368 1676223 1641358 1573332 1653666 1644476 1577559 1605939 1621885 1641947 1570705 1560008
15802A560008J4333K6910M0664N5652k6240l7665J1311J9948M7412o4813k9519
$$ 1560008 1574341 1601251 1641915 1697567 1671327 1633662 1644973 1664921 1712333 1647520 1618001
15791A618001m763J723K0089N2024o1998J7374l6332k874K0672j3135J0782m0752
$$ 1618001 1613238 1614961 1635050 1687074 1625076 1642450 1606118 1603244 1623916 1610781 1621563 1580811
15779A580811L9036M0343K5956J463p5106l7471M4356M4930q745n0044j6486j4737
$$ 1580811 1619847 1660190 1686146 1687609 1612503 1575032 1619388 1664318 1655573 1605529 1589043 1574306
15767A574306P000l272N600M4836k3477l2226M0577O5612k4041j0698K6901K9111
$$ 1574306 1581306 1578034 1583634 1628470 1604993 1572767 1613344 1678956 1654915 1644217 1671118 1700229
15755A700229m1297m0240J3412O81j7756m9377K7897M9488k7928j100k8923r16
$$ 1700229 1658932 1618692 1632104 1632785 1615029 1565652 1593549 1643037 1615109 1614009 1585086 1584170
15743A584170R1869o0863q132N8953J0186M666P933r8164M4198O2070j4353j06754
$$ 1584170 1676039 1615176 1607044 1665997 1676183 1680849 1688782 1590618 1634816 1696886 1682533 1575779
15731A575779n0134Q2797N626L6644k8359p7228K2603L8836Q3022J1045j4186
$$ 1575779 1525645 1608442 1614068 1650712 1622353 1545125 1567728 1606564 1689586 1700631 1686445
15720A686445P707p8112j8996j8114m9041Q7610l95r448J6325L2538k0495l4004
$$ 1686445 1694152 1616040 1597044 1578930 1529889 1617499 1617104 1607656 1623981 1656519 1636024 1602020
15708A602020o6551M1770P9833N1687K7391J4136o0385o7053k9297R6976L186
$$ 1602020 1535469 1577239 1657072 1708759 1736150 1750286 1689901 1622848 1593551 1690527 1693713
15697A693713r7421L6699p292L2836l3131o5804k3169J02324O438k9450L0906
$$ 1693713 1596292 1632991 1625699 1658535 1625404 1559600 1536431 1638755 1645193 1615743 1646649
15686A646649K5166O907r90k7594j6836Q9634k1890o0653N5326j8950k0150L1568
$$ 1646649 1671815 1678722 1677732 1650138 1633302 1722936 1701046 1640393 1695719 1676769 1656619 1688187
15674A688187m2541K9186n5137j0149R2816L3773m186p691j23504j6856P7876
$$ 1688187 1645646 1674832 1619695 1609546 1702362 1736135 1731949 1724258 1600754 1583898 1661774
15663A661774K9271N5229l6858L1219p8451k1641J5245j2766m2794L19n5978P3476
$$ 1661774 1691045 1746274 1709416 1740635 1662184 1640543 1655788 1643022 1600228 1600547 1544569 1618045
15651A618045k2099L9659n7113N3926m6916p0848L9793N7515M5298Q97l604K9198
$$ 1618045 1595946 1635605 1578492 1632418 1585502 1514654 1554447 1611962 1657260 1658157 1654553 1683751
15639A683751l3509k8432q220O82N5246o3143K5422k2463M3960O80r9078P7780
$$ 1683751 1650242 1621810 1613590 1614272 1669518 1606375 1631797 1609334 1653294 1653974 1554896 1632676
15627A632676P5438o3998Q374l1095J0900N085L6085k436J1427q130j2810n9072
$$ 1632676 1708114 1644116 1652490 1621395 1632295 1637380 1673465 1671029 1682456 1674326 1661516 1602444
$$ [...]
##END NTUPLES=NMR SPECTRUM
##END=
