##TITLE=1H_CA-9281-1
 CDCl3
 8 sc, 
 5.9.2024
##JCAMPDX= 6.0         $$ Bruker NMR JCAMP-DX V2.0
##DATA TYPE= NMR SPECTRUM
##DATA CLASS= NTUPLES
##ORIGIN= UXNMR, Bruker Analytische Messtechnik GmbH
##OWNER= root
$$ XWIN-NMR		Version 3.5
$$ Thu Sep  5 13:57:26 2024 Russian Standard Time (UT+4h)  she@DPX200
##.OBSERVE FREQUENCY= 200.1318
##.OBSERVE NUCLEUS= ^1H
##.ACQUISITION MODE= SIMULTANEOUS
##.ACQUISITION SCHEME= undefined
##.AVERAGES= 8
##.DIGITISER RES= 18
##SPECTROMETER/DATA SYSTEM= spect
##.PULSE SEQUENCE= zg30
##.SOLVENT NAME= CDCl3
##.SHIFT REFERENCE= (INTERNAL, CDCl3, 0, 20.9753)
##AUDIT TRAIL= $$ (NUMBER, WHEN, WHO, WHERE, WHAT)
$$ ##TITLE= Audit trail, XWIN-NMR		Version 3.5
$$ ##JCAMPDX= 5.01
$$ ##ORIGIN= Bruker BioSpin GmbH
$$ ##OWNER= she
$$ F:/spectra/data/she/nmr/H-F/1/pdata/1/auditp.txt
$$ ##AUDIT TRAIL=  $$ (NUMBER, WHEN, WHO, WHERE, WHAT)
(   1,<2024-09-05 13:55:35.32 +0400>,<she>,<DPX200>,
      <created by zg, POWCHK disabled, PULCHK disabled
       configuration hash MD5:
       00 E9 B6 7A A2 85 ED C7 34 08 36 98 17 FE 4E 26
       data hash MD5: 16K
       8D 29 48 B6 C3 57 41 2D F9 B0 2F EA DE F1 71 3F>)
(   2,<2024-09-05 13:55:37.73 +0400>,<she>,<DPX200>,
      <Start of raw data processing
       efp BC_mod = 2 LB = 0.24 FT_mod = 6 PKNL = 1 PHC0 = -25994.65 PHC1 = 14.78748 SI = 16K 
       data hash MD5: 16K
       98 96 18 B7 51 7B 35 95 A5 E8 DD 7B D3 63 A9 46>)
(   3,<2024-09-05 13:56:15.81 +0400>,<she>,<DPX200>,
      <pk PHC0 = 2.138619 PHC1 = -3.400001 
       data hash MD5: 16K
       6E 65 B8 3F C4 3D 73 FF 21 29 0B E9 5E 4F 70 A3>)
(   4,<2024-09-05 13:56:19.75 +0400>,<she>,<DPX200>,
      <abs ABSG = 5 
       data hash MD5: 16K
       C7 42 B1 82 99 A7 11 A6 91 FF A8 15 62 35 FD 38>)
$$ ##END=
$$ 
$$ hash MD5
$$ 91 4D AF F1 52 67 A5 39 1C 7F DD 61 D5 D6 2C 27
##$RELAX= 
##$RELAX= 
##$RELAX= 
##$RELAX= 
##$RELAX= 
##$RELAX= 
$$ Bruker specific parameters
$$ --------------------------
##$DU= <F:/spectra>
##$EXPNO= 1
##$NAME= <H-F>
##$PROCNO= 1
##$TYPE= <nmr>
##$USER= <she>
##$AMP= (0..31)
100 100 100 100 100 100 100 100 100 100 100 100 100 100 100 100 100 100 
100 100 100 100 100 100 100 100 100 100 100 100 100 100 
##$AQSEQ= 0
##$AQ_mod= 1
##$AUNM= <au_zg>
##$AUTOPOS= <>
##$BF1= 200.13
##$BF2= 200.13
##$BF3= 200.13
##$BF4= 200.13
##$BF5= 200.13
##$BF6= 200.13
##$BF7= 200.13
##$BF8= 200.13
##$BYTORDA= 1
##$CFDGTYP= 0
##$CFRGTYP= 5
##$CHEMSTR= <none>
##$CNST= (0..31)
1 1 145 1 1 1 1 1 1 1 1 1 1 1 1 1 1 1 1 1 1 1 1 1 1 1 1 1 1 1 1 1 
##$CPDPRG= <>
##$CPDPRG1= <>
##$CPDPRG2= <>
##$CPDPRG3= <>
##$CPDPRG4= <mlev>
##$CPDPRG5= <mlev>
##$CPDPRG6= <mlev>
##$CPDPRG7= <mlev>
##$CPDPRG8= <mlev>
##$CPDPRGB= <>
##$CPDPRGT= <>
##$D= (0..31)
0 1.2 0 0 0 0 0 0 0 0.06 0 0.03 0 0 0 0 0.0002 0 0 0 0 0 0 0 0 0 0 0 0 
0 0 0 
##$DATE= 1725530134
##$DBL= (0..7)
120 120 120 120 120 120 120 120 
##$DBP= (0..7)
150 150 150 150 150 150 150 150 
##$DBP07= 0
##$DBPNAM0= <>
##$DBPNAM1= <>
##$DBPNAM2= <>
##$DBPNAM3= <>
##$DBPNAM4= <>
$$ [...]
##$SUBNAM3= <"">
##$SUBNAM4= <"">
##$SUBNAM5= <"">
##$SUBNAM6= <"">
##$SUBNAM7= <"">
##$SUBNAM8= <"">
##$SUBNAM9= <"">
##$SW= 24.0689170037331
##$SWIBOX= (0..15)
0 0 2 0 0 0 0 0 0 0 0 0 0 0 0 0 
##$SW_h= 4816.95568400771
##$TD= 16384
##$TD0= 1
##$TE= 0
##$TE2= 300
##$TE3= 300
##$TEG= 300
##$TL= (0..7)
0 120 120 120 120 120 120 120 
##$TP= (0..7)
150 150 150 150 150 150 150 150 
##$TP07= 0
##$TPNAME0= <>
##$TPNAME1= <>
##$TPNAME2= <>
##$TPNAME3= <>
##$TPNAME4= <>
##$TPNAME5= <>
##$TPNAME6= <>
##$TPNAME7= <>
##$TPOAL= (0..7)
0.5 0.5 0.5 0.5 0.5 0.5 0.5 0.5 
##$TPOFFS= (0..7)
0 0 0 0 0 0 0 0 
##$TUNHIN= 0
##$TUNHOUT= 0
##$TUNXOUT= 0
##$USERA1= <user>
##$USERA2= <user>
##$USERA3= <user>
##$USERA4= <user>
##$USERA5= <user>
##$V9= 5
##$VALIST= <valist>
##$VCLIST= <CCCCCCCCCCCCCCC>
##$VD= 0
##$VDLIST= <DDDDDDDDDDDDDDD>
##$VPLIST= <PPPPPPPPPPPPPPP>
##$VTLIST= <TTTTTTTTTTTTTTT>
##$WBST= 1024
##$WBSW= 4
##$XGAIN= (0..3)
0 0 0 0 
##$XL= 0
##$YL= 0
##$YMAX_a= 245530
##$YMIN_a= -206494
##$ZGOPTNS= <>
##$ZL1= 120
##$ZL2= 120
##$ZL3= 120
##$ZL4= 120
##$ABSF1= 20.9694
##$ABSF2= -3.099731
##$ABSG= 5
##$ABSL= 3
##$ALPHA= 0
##$AQORDER= 0
##$ASSFAC= 0
##$ASSFACI= 0
##$ASSFACX= 0
##$ASSWID= 0
##$AUNMP= <proc_1d>
##$AZFE= 0.1
##$AZFW= 0.1
##$BCFW= 0
##$BC_mod= 2
##$BYTORDP= 0
##$COROFFS= 0
##$CY= -3
##$DATMOD= 1
##$DC= 0
##$DFILT= <>
##$DTYPP= 0
##$F1P= 0
##$F2P= 0
##$FCOR= 1
##$FTSIZE= 16384
##$FT_mod= 6
##$GAMMA= 0
##$GB= 0
##$INTBC= 1
##$INTSCL= 3.70164e-10
##$ISEN= 128
##$LB= 0.24
##$LEV0= 0
##$LPBIN= 0
##$MAXI= 10000
##$MC2= 0
##$MEAN= 0
##$ME_mod= 0
##$MI= 1.114404
##$NCOEF= 0
##$NC_proc= -7
##$NLEV= 6
##$NOISF1= 3.799351
##$NOISF2= 2.8
##$NSP= 0
##$NTH_PI= 0
##$NZP= 0
##$OFFSET= 20.97528
##$PC= 1
##$PHC0= -25992.51
##$PHC1= 11.38748
##$PH_mod= 1
##$PKNL= yes
##$PPARMOD= 0
##$PSCAL= 0
##$PSIGN= 0
##$REVERSE= no
##$SF= 200.130010692995
##$SI= 16384
##$SIGF1= 3
##$SIGF2= 2
##$SINO= 5.538805
##$SIOLD= 16384
##$SREGLST= <1H.CDCl3>
##$SSB= 0
##$STSI= 16384
##$STSR= 0
##$SW_p= 4816.95568400771
##$SYMM= 0
##$S_DEV= 0
##$TDeff= 16384
##$TDoff= 0
##$TI= <>
##$TILT= no
##$TM1= 0
##$TM2= 0
##$TOPLEV= 0
##$USERP1= <user>
##$USERP2= <user>
##$USERP3= <user>
##$USERP4= <user>
##$USERP5= <user>
##$WDW= 1
##$XDIM= 16384
##$YMAX_p= 456046728
##$YMIN_p= -785366
$$ End of Bruker specific parameters
$$ ---------------------------------
##NTUPLES= NMR SPECTRUM
##VAR_NAME=  FREQUENCY,     SPECTRUM/REAL,   SPECTRUM/IMAG
##SYMBOL=    X,             R,               I
##VAR_TYPE=  INDEPENDENT,   DEPENDENT,       DEPENDENT
##VAR_FORM=  AFFN,          ASDF,            ASDF
##VAR_DIM=   16384,         16384,           16384
##UNITS=     HZ,            ARBITRARY UNITS, ARBITRARY UNITS
##FACTOR=    0.29402158847633, 1,            1
##FIRST=     4197.78316313135, 0,            0
##LAST=      -619.172520876365, 0,           0
##MIN=       -619.172520876365, -785366,     0
##MAX=       4197.78316313135, 456046728,    0
$$ Real data points
##PAGE= N=1
##DATA TABLE= (X++(R..R)), XYDATA
$$ [...]
6549C88021k60891J81463J26782q0625M543n0409k45246j073n1374J35498L24885
6538D71574o9882j06914J5941k7263j45847J72871L1922j14799j01280n07475
6528c81152K77467J63159J26271P8256r7906k43690R2274K63836j90852j09864
6518b2201N2438J24021p218j81545L67880L2497r6214j23734j43717J76490O6418
6507B45115m2948J73120r2719o0944q1456J37242j8092r8399k14337J44022r1057
6496d53J46735N0301k44551O1671j95078M25820J42097j41767K5071R1289m7077
6485C14058j37419k38248r3465L29245J70172r9708j69416O0362k51721L27326
6475B11186l0130k43557J65756J39754J467k6485L2838k49540K76260M735R2350
$$ y = [388021, 127130, 308593, 435375, 354750, 359293, 308884, 63638, 62565, 11191, 146689, 471574, 401692, 294778, 310719, 283456, 137609, 310480, 342402, 227603, 126323, -381152, -103685, 59474, 185745, 264001, 166095, -77595, 14679, 278515, 87663, -22201, 30237, 154258, 147040, -34505, 333375, 365872, 269658, 145924, 2207, 178697, 245115, 202167, 375287, 282568, 221624, 140168, 277410, 259318, 160919, -53418, 90604, -453, 146282, 196583, -47968, 13703, -181375, 244445, 386542, 244775, 269846, 361135, 314058, 176639, -61609, -155074, 174171, 344343, 244635, 75219, 135581, -116140, 211186, 181056, -62501, 103255, 243009, 244476, 217991, 250829, 1289, 277549, 282284, 374634]
6464C74634j20285J910j66575j23133K22817j32407L71715l14600k83998L17485
6454A47563r484k8228r2369k0668J0990p2508J45599J38584k66599j04562K23436
6443G1754J05528j61996j67367k07958M66713j01798j16456L50991J1460k75j83277
6432F7319j64983o973M7196n6594k72774K17395k48143Q2680K51181K59426j02672
6421G3058j58339R5881N3350j02365L40988m53869J34884K51607j19830k31786
6411a16421j08272l81131J54276K35995N2804P9292k43213L29747o087j20414
6401a23424m8886K99471L3502n3309p9264l16380K22696J85743k81264K24929
6391F3814n4398J66099j07896p8173Q8985j93210K07761j22928M9525J65941j62723
$$ y = [374634, 254349, 256259, 89684, -33449, 189368, 56961, 428676, 114076, -169922, 147563, 138079, 109851, 17482, -3186, 7804, -64704, 80895, 219479, -47120, -151682, 71754, 177282, 15286, -152081, -360039, 106674, 4876, -111580, 239411, 250871, 250596, 67319, -97664, -104637, -57441, -114035, -386809, -169414, -417557, -334877, -83696, 175730, 73058, -85281, 10600, 63950, -38415, 302573, -151296, -16412, 235195, 115365, -116421, -224693, -605824, -451548, -215553, -162749, -83457, -326670, 3077, -3010, -123424, -172310, 127161, 160663, 107354, 28090, -288290, -65594, 120149, -161115, 63814, 9416, 175515, 67619, -10554, 78431, -114779, 92982, -29946, 19579, 185520, 22797]
6380B2797k81888K66903J22360m97627J42344K11321K17966p7906J52417m10850
6370a32163K9187J3612j2091j98304l466K3933K70255m398q6540R9636N4331j36680
6358h2688O0951j24474J0317k48285k2441m7007P8888J47186M9274J45816J8250
6347a4213n4706j66093R8402K62367j57320j03968l35692n9094L27559J26118
6337g6640m7623R9787j036l18525L1164P5506J04628K44096m1321m28226M12426
6326E4236j41837K22387k92334m8990L31082l67015k89113M5040J76641L35382
6316B5479J23403m67608K43498j17728n7228M0909q8523K32513j19416k6098k08747
6305d19546Q0150L48303j79348Q7104J9917l2391K34259n4269k01121R8292k03900
$$ y = [22797, -259091, 7812, 130172, -367455, -225111, -13790, 204176, 126270, 278687, -132163, -102976, -89364, -101455, -299759, -303225, -279292, -9037, -13435, -99975, -339, 53992, -82688, -21737, -146211, -135894, -384179, -406620, -453627, -374739, -227553, -178279, -32463, -14213, -68919, -235012, -136610, 125757, -31563, -135531, -471223, -530317, -202758, -76640, -124263, -24476, -25512, -344037, -312873, -237367, -132739, 111357, 70036, -358190, 54236, -87601, 134786, -157548, -206538, 124544, -242471, -531584, -486544, -309903, 25479, 148882, -318726, -75228, -192956, -250184, -209275, -297798, -65285, -184701, -210799, -419546, -339396, 8907, -170441, -83337, -63420, -95811, 138448, 84179, -116942, -18650, -222550]
6294b22550k53077J22203J55163O9332k9943k2192j71858O0252J07136J72460
6284a3074K974m68176J12777j69400l5717L36756M093L01763J48002l66230j04232
6273b50464O2671k0328m0977L9806K07238j00907j10148K0262J42360r9104K42612
6262I3021N2090R0867j26721p6274k23089j47567q734L73412m13954m6771L72280
6251f1440P8603m20487j0470P1744K39795k6043k07363o4501K99937k37951J93134
6240a45042j04645k69608J79414K28885j86742o828k042L6434J34383k0169P8677
6229g7283j82636J9703K913j32101L18163J34116l37185j51394Q7179M20330K5252
6218A27057k57950R6491p8406m24529N10018J05080J41132l46125P0572k87604
$$ y = [-222550, -475627, -353424, -198261, -128929, -158872, -181064, -352922, -292670, -185534, -13074, -10100, -478276, -365499, -534899, -570616, -233860, -229767, 71996, 219998, -146232, -250464, -187793, -208121, -249098, -209292, -2054, -102961, -213109, -192847, -50487, -149591, 93021, 145111, 235978, 109257, 32983, -190106, -337673, -346407, 27005, -386949, -433720, -61440, 17163, -403324, -413794, -342050, -102255, -128298, -335661, -400162, -100225, -338176, -145042, -249687, -519295, -339881, -110996, -297738, -304566, -306608, -270174, -135791, -155960, -77283, -259919, -240216, -237303, -369404, -51241, 82875, -254310, -405704, -318525, 101805, 127057, -130893, -34402, -112808, -537337, -27319, 77761, 218893, -127232, -56660, -344264]
6208c44264L71185r5300M9321k08805J84288K0332k34253K513J29807r3105p2085
6197b90366J16860j77733J36335j10920l7271J56130J78164l17148L12695j05708
6187a38962J24842k66056k22105J76661j02688K58929K14382Q8744j09084M4010
6177F8673j79P4923q4253j45063j23208J56898K61525j27562l67815P4632J31107
6166h0322k85463l0921K56633j94672L9257m622j27585J73829J94774J68087j13647
6155d652J20569k66710N555K1485j14532K47030O845k65513r7236J8527O9703
6144b58929K55310n7375m02142J62452J91907L7427j38331k43421O3051R8308
6134b91743L07543J3590j6094k68011J59590k2173j26546j09254M80175l54221
$$ y = [-344264, 26921, -68379, -19058, -227863, -43575, -23243, -257496, -254983, -125176, -218281, -290366, -173506, -351239, -214904, -325824, -363095, -206965, -28801, -345949, -33254, -138962, -14120, -280176, -502281, -325620, -428308, -169379, 45003, 133747, 24663, 68673, 68494, 143417, 59164, -85899, -209107, -52209, 209316, 81754, -286061, -211429, -80322, -365785, -396706, -140073, -334745, -295488, -300110, -427695, -253866, -59092, 108995, -4652, 115917, -150793, -145238, -123753, -238285, 8745, 15590, -249923, -347159, -328632, -258929, -3619, -60994, -463136, -300684, -108777, -71350, -209681, -453102, -390051, -291743, 15800, 29390, 13296, -254715, -95125, -117298, -243844, -353098, 127077, -227144]
6124b27144j04217J05423j29861L19742K62586Q480m26752J11335l5345j22785
6114b38538p970k35400M514K33335O7737j037Q0698j09069j15780P1519K22383
6103b7608k46609J32306k4986j7498n8758k101P7490J34133j27447M8204L5424
6092g7450j7431j20838j6029L43527k93262M3782Q4730L0456l07135m3622o9452
6081d42724J8112K12237K26265L5441o39l56639k9684J31461J63880n04238o8483
6070f15011J52270K04176J37931p9941l55396L25970N5370N8751J87149k52411
6060a81142P2770q2304j75224j6233J76331j17335K40112J13737l86476Q1054
6050b74710p4098J7486p7263K39035J5718j44518J57008J27992j9851m7239p7550
$$ y = [-227144, -331361, -225938, -355799, -36057, 226529, 235009, -191743, -80408, -115753, -238538, -246508, -481908, -477394, -244059, -176322, -177359, -96661, -205730, -321510, -249991, -27608, -274217, -141911, -166897, -184395, -243153, -245254, -167764, -33631, -161078, -112874, -77450, -94881, -215719, -231748, 111779, -181483, -137701, -52971, -22515, -329650, -373272, -442724, -424612, -212375, 13890, 49331, 48692, -307947, -337631, -206170, -42290, -546528, -615011, -462741, -258565, -120634, -200575, -555971, -230001, -174631, -115880, 71269, -181142, -108372, -190676, -365900, -382133, -205802, -323137, -83025, 30712, -355764, -274710, -348808, -331322, -408585, -169550, -153832, -298350, -141342, -13350, -33201, -80440, -157990]
6039a57990M4018k07216k07664K64951K5777n846J10286n4719j17375M0421r5159
6028c60516o1658K32285r0022J16467r6530k22606J52077L7108m5758J1930k7249
6017c54472j31174K17244l18376J01420M18620o3148p7323J4109k62994k7960
6007d84054j19143L88807J07093k7453J10183l0714k56885n8656l2048j33942
5997e36812M57737M1830l23738K52810J19094L8077j84815n5774j06817J3852
5987b84556K20123K879k4189k73832R5564K87238j82610l14766J25276j41095
5977d89968k3842J13992J91787m5557r7955R7000J43624j892J50115j38068K18036
5966A17272J1737l6901l46084m1805J48032j46236K12481k40837K35685j35186
$$ y = [-157990, -113972, -321188, -528852, -263901, -238124, -243970, -133684, -188403, -305778, -265357, -360516, -422174, -189889, -279911, -163444, -259974, -482580, -330503, -293395, -339153, -327223, -354472, -485646, -268402, -586778, -485358, -66738, -129886, -207209, -193100, -456094, -484054, -603197, -214390, -107297, -134750, -24567, -55281, -312166, -370822, -402870, -536812, -79075, -37245, -360983, -108173, 10921, 48998, -135817, -191591, -298408, -284556, -64433, -61554, -85743, -359575, -264011, 23227, -159383, -474149, -348873, -489968, -513810, -399818, -208031, -253588, -351543, -254543, -110919, -112811, 37304, -100764, 117272, 129009, 92108, -253976, -295781, -147749, -293985, -81504, -322341, -86656, -221842]
5956b21842r2724k41081j0552M24349k40564J96215j12793j86314Q712J32415
5946c44179J45664o3812R5503m7064J11855K2230J4096k00844j91226j77482M16137
5935b19122L27882k92230R427j08294J71148J39957Q6798j24157m8713J9966K31954
5924A94616L6743m42543L52310j39032j0769k78207j81601J50255K97723K8180
5914G675l25382j79723L60813J74132k054l08060l38489L37037N0055r8124p9302
5903d01422K97180j21901j75915R1640o4318j4399J44710K23158p0807J09864
5893A7790k05789J17840j4344l57362K92568q688k00357M81004r6464j19511J3516
5882g9797L7569k85425L92785J92637k05256J83016j27252O8319j61304L35325
$$ y = [-221842, -314566, -555647, -566199, -141850, -382414, -186199, -298992, -485306, -476594, -344179, -198515, -262327, -166824, -213888, -102033, -79803, -65707, -266551, -457777, -635259, -219122, 108760, -183470, -174043, -282337, -111189, 28768, 115566, -8591, -57304, -37338, 194616, 231359, -211184, 141126, 2094, -8675, -286882, -468483, -318228, -20505, 7675, -317707, -497430, -136617, 37515, 35461, -272599, -611088, -274051, -223996, -322120, -401422, -104242, -226143, -402058, -310418, -374736, -389135, -244425, -21267, -92074, 17790, -187999, -70159, -84503, -441865, -149297, -157985, -358342, 122662, 26198, -93313, -79797, -42228, -327653, 65132, 257769, 52513, 235529, 108277, 176596, 15292, 350617]
5872C50617Q5667k21285p8680L54751K32955n29880K8791J25717R2158p33J665
5861D41743J48888j61195J23924K13446N19755k74848J40551J90792N53947L07357
5851B204360M62729P2285M40232K70310J94224k18614l17503m34321o35430k08188
5841A830084k58353j63229m56743J7819j50482j7881k72738p0738K7706l87751
5831I7694O5080R5965j36426J49479O5969L96M4388p2474j52705M5193o7339J07920
5819B43140k57515m9295n4931J48038J45343j96683J05213J10147k10282N0593
5809C3768o5180o1098m600J1338k68537K5782K17089J06731m63119K48430K93705
5798G4309p0746J71654j65802p5823j78607q1158j01941L32935J38402j31171
$$ y = [350617, 436284, 214999, 136319, 491070, 724025, 194145, 222936, 348653, 440811, 440078, 441743, 590631, 429436, 553360, 766806, 1286561, 1011713, 1152264, 1343056, 1897003, 2204360, 2667089, 2739374, 3179606, 3449916, 3644140, 3425526, 3108023, 2673702, 2038272, 1830084, 1571731, 1408502, 951759, 969578, 819096, 801215, 528477, 457739, 485445, 97694, 162774, 258739, 122313, 271792, 337761, 338157, 382545, 310071, 157366, 202559, 135220, 243140, -14375, -63670, -118601, 29437, 174780, -21903, 83310, 193457, -16825, 33768, -31412, -92510, -97110, -85772, -354309, -328527, -111438, -4707, -467826, -219396, 74309, 3563, 175217, 9415, -66408, -245015, -326173, -428114, -95179, 43223, -87948]
5788h7948K14517l89265l59558L48197j41301k20892O51048o3603j30131J13445
5778f5491O8959K23300r9383m06208o8278Q8181j1994K99231j19539k11760j58770
5767d61752j8910p3804M9732K61649K68234j20152n3070K57223o4915k06676J55801
5756f640j73810j36905l11397L22952J06912K58784p1714j92757P3863l07848
5746d38560j19904J15728K60019J16882k03429j887K34814k23316m92424J88580
5736e63497J31536L30306k56113J26959L93747m13517J68044J14815p7579k01265
5726b46564Q3142o7236J38624k70927j25053K10813j3304O5182j58082q3502q7525
5715e54432o5352j65582M58783j54507Q1056j17137O1978M93213l48759L6563
$$ y = [-87948, 126569, -262696, -622254, -274057, -415358, -636250, 14798, -48805, -178936, -65491, 3468, 226768, 127385, -278823, -347101, -258920, -270914, 28317, -91222, -302982, -461752, -480662, -554466, -504734, -243085, 25149, -95003, -148073, 109150, 44235, -162441, -6640, -180450, -317355, -628752, -305800, -198888, 59896, -11818, -204575, -130712, -438560, -558464, -442736, -182717, -65835, -269264, -271151, -36337, -259653, -752077, -563497, -431961, -101655, -357768, -230809, 162938, -250579, -82535, 32280, -45299, -246564, -163422, -230658, -92034, -362961, -488014, -277201, -290505, -225323, -383405, -466907, -554432, -619784, -785366, -326583, -481090, -400034, -517171, -455193, 38020, -310739, -274176]
5705b74176j02783J7748l3855K79641n7611J4057k26774q3282j65962L35636K06180
5694i1181M991k04624j92041L16277o1547j1051K24360p8833j39493K72615j94084
5683a54611j66734K634O9950J21495J22445k29127j19359M1674M9479Q8216j01614
5672b75552j94967K43080R493J93408M016P921J89787k08895J95862k74890j52214
5661b62951k8558J15645J72515K53108N1193m62909J4369J60723j65043j35150
5651b87058K27387k26678K21672J96159m56643j13705J58716M8449l16638O2829
5641d85510L61696j62608j39172J5025K18980n8717p1070j03731J31978L58191
5631F5062j72367Q3196k02592l7961M1811L9011j53254J18059K71875k13638k9774
$$ y = [-274176, -376959, -359211, -393066, -113425, -171036, -156979, -383753, -467035, -632997, -297361, -91181, -86190, -290814, -482855, -166578, -228125, -239176, -14816, -93649, -233142, 39473, -154611, -321345, -318711, -248761, -127266, -4821, -233948, -353307, -311633, -262154, -173938, -275552, -470519, -227439, -217946, -24538, -20522, -12601, 177186, -31709, 164153, -110737, -262951, -291509, -175864, -3349, 249759, 300952, -161957, -147588, 13135, -151908, -287058, -59671, -286349, -64677, 131482, -325161, -438866, -280150, -231701, -548339, -485510, -123814, -286422, -425594, -410569, -191589, -250306, -321376, -425107, -293129, 65062, -107305, -24109, -226701, -264662, -222851, -183840, -337094, -219035, 52840, -160798, -190572]
5620a90572J13186J46078j86213j55611J53697K1374L2137o127K97636j01664
5610A23921J94406j81138k0072L87701J05509n3956k60862j64538L4544J76459
5600C41974l34392j46579K04139k09208J2760L84264k5520k55058k34445J93041
5590f9024J90638j75836M1495k01591J67208n5192j95781k10154J34009Q6200
5580b88028m158K44240j45230R5617O9736J20647j84934J32638R4180j49470k34139
5569b48901P5589k3999Q2873o4835j03564l8751j82613K40615J31310p4746M5887
5558a61135J913K12928O0954k23029K46925m7298q5049J83380j88140q9814J11173
5547B2808j14471k1414N0538l28835J60942K11877j39377O7289R4238J1467j35315
$$ y = [-190572, -77386, 68692, -117521, -273132, -119435, -98061, -65924, -72051, 225585, 123921, 318327, 137189, 117117, 504818, 610327, 556371, 295509, 130971, 165515, 341974, 7582, -138997, 65142, -144066, -131306, 252958, 227438, -27620, -262065, -69024, 121614, -54222, -12727, -214318, -47110, -102302, -298083, -508237, -374228, -288028, -292186, -47946, -193176, -97559, -27823, 92824, -92110, 40528, 134708, -14762, -248901, -173312, -197311, -114438, -179273, -282837, -321588, -504201, -263586, -132276, -207022, -161135, -159222, 53706, 114660, -108369, 138556, 91258, 6209, 189589, 1449, -88365, 22808, -91663, -113077, -62539, -391374, -230432, -18555, -157932, -90643, 3595, 15062, -120253]
5536a20253k61793j87148K10337L65968J4826p3969P0291j64732L02203J5824
5526A71554r2711K86286j9765j70026Q3083q2281k4544K81953o5463p1284K2666
5515C19468j63043j42309J04923j53166K25670j12428k04371K53268J34825p0696
5505A92141j38363k23790K96074J07094k94071J28389J59559P2159j01198k71036
5495g3042J20353r5517k33815P4367j07390Q9699K6511L19033m9403l98381N1783
5484b75802j66007J12052L59996N8077n7641J2503k10979J87834L15051q4259
5474B50825j28236o9014J54243k59599j48762J95902M3926j57387K1747K6720
5464f9635P8707j16799p622L91248j73220j40273R1462j29212J5303Q9200K4764
$$ y = [-120253, -382046, -569194, -358857, 7111, 21937, -52032, 18259, -146473, 155730, 171554, 78843, 365129, 345364, 175338, 258421, 176140, 151596, 433549, 368086, 296802, 319468, 156425, 14116, 119039, -34127, 191543, 79115, -125256, 128012, 262837, 192141, 53778, -170012, 126062, 233156, -60915, 67474, 227033, 299192, 197994, -73042, 47311, -48206, -282021, -207654, -315044, -225345, -198834, 120199, 70796, -327585, -275802, -441809, -329757, 30239, 88316, 30675, 43178, -167801, 20033, 335084, 250825, 122589, 53575, 207818, -51781, -200543, -4641, 39285, -118102, -96355, -69635, 9072, -107727, -115349, 275899, 102679, -37594, 53868, -75344, -60041, 29159, 53923]
5453E3923J87981r8367k80904N2104k65607J68654r220K0053M71755M1058m9187
5442B92243m5995r0146m8795R5505j87915K86575O8021O2617k25756J80022m31353
5431d4977j6801N9138K9072M25486K15270j92694l30865P0573J20760O3516J17733
5420E16211K01411Q0470m1829j23207j87837N216j29558p6279L15820k61865K8598
5409C27151J69102J68947j57573k0765K01568l89777j96269L76882j10171p661
5399C61434j4086P6205K61905R4010k56992K89560N3801m15328J34873J30169
5389G15551j6430M82892j64885m5953J07691N7254k07519L1329O9705N0818K72002
5378A352455P5158p5400j1910R7145K55652M3507J76364L28051k8859k07779M9162
$$ y = [53923, 241904, 143537, -137367, -85263, -350870, -182216, -191436, -171383, 300372, 341430, 292243, 246248, 156102, 107307, 202812, 14897, 301472, 369493, 432110, 206354, 386376, -44977, -61778, -2640, 26432, 451918, 667188, 474494, 143629, 214202, 334962, 398478, 516211, 717622, 798092, 756263, 633056, 445219, 450435, 320877, 244598, 560418, 298553, 327151, 496253, 665200, 507627, 486862, 688430, 298653, 102384, 479266, 369095, 361434, 347348, 423553, 685458, 779468, 522476, 812036, 865837, 450509, 585382, 715551, 699121, 1182013, 1017128, 971175, 1078866, 1136120, 928601, 959930, 1029635, 1080453, 1352455, 1427613, 1352213, 1340303, 1437448, 1693100, 1736607, 1912971, 2241022, 2212163, 2004384, 2053546]
5367B053546K14108L1220M52840J28720J1862k10133L25817M86964J73494K21508
5357C889946j91456N60877J91813M0772L9778J69724L40717L65079J73463N6304
5347E637017N88192K00117K95356M13033K91481N97605P61018N27609O44760P26109
5337A0682297N40642P82421O27458M94239O15906R51194J203613J002020J209664
5328A8109454J285902J619249J396007J371049K229327K045102K294880L003547
5320C3354517L581459L961642M711076N753405O617456O426832N623750M735535
5312G4765672K408482q0741k663170m675803n976484o538796o165219n484788
5304D5589153n167520m397619l861524l128394k927993k604392j830557j279602
$$ y = [2053546, 2267654, 2298874, 2751714, 2880434, 2892296, 2682163, 3007980, 3494944, 3668438, 3889946, 3698490, 4259367, 4451180, 4491952, 4531730, 4701454, 5042171, 5407250, 5580713, 5637017, 6225209, 6425326, 6720682, 7133715, 7425196, 8022801, 8783819, 9311428, 9956188, 10682297, 11222939, 12005360, 12632818, 13127057, 13742963, 14694157, 15897770, 16899790, 18109454, 19395356, 21014605, 22410612, 23781661, 26010988, 28056090, 30350970, 33354517, 36935976, 40897618, 45608694, 51362099, 57979555, 64406387, 70030137, 74765672, 77174154, 77093413, 74430243, 69754440, 63777956, 57239160, 51073941, 45589153, 40421633, 36024014, 32162490, 29034096, 26106103, 23501711, 21671154, 20391552]
5296B0391552j811327j609930j277602p92070j177173j198484o98474q90946n44918
5287A0390628o42424k98868p35765q07878o08999j71093p2993k23696n20181m74703
5277E834028l68273J69357l07722l21745M1553l41835k31847m530j61249l11523
5267C996214j95611k63560L5044j76244k12100O1022K10136o44208J62874M219
5257B977786j55401j00632j40734j20043q065q0990o7068l3528Q3611k28700l06487
5246A819749J04957r98j73487p8222l9570J43465j08101k35549r3355N5588j35033
5235A259444k21320M2020o1146j26928J7528J53778J50252k27924j85596m0753
5225G59355n2667K79823j14129r5057j04884R7404L75831k19182m93531J17223
$$ y = [20391552, 18580225, 16970295, 15692693, 14900623, 13723450, 12524966, 11826492, 10935546, 10390628, 9748204, 9449336, 8713571, 7905693, 7296694, 7125601, 7052608, 6828912, 6308731, 5834028, 5465755, 5635112, 5327390, 5005645, 5047198, 4705363, 4473516, 4468986, 4307737, 3996214, 3800603, 3537043, 3572087, 3395843, 3183743, 3244765, 3454901, 2810693, 2973567, 2977786, 2822385, 2721753, 2581019, 2460976, 2452911, 2371921, 2304853, 2271325, 2354936, 2126236, 1819749, 1924706, 1923708, 1750221, 1671999, 1632429, 1775894, 1667793, 1432244, 1338889, 1394477, 1259444, 1038124, 1080144, 1018998, 892070, 909598, 1063376, 1213628, 985704, 800108, 759355, 706688, 986511, 872382, 777325, 672441, 769845, 1145676, 926494, 432963, 550186]
5215E50186J60129M0835j82147j58158J85987n1562q8876J14529L0678J09282
5205G10883j2458J39461k67954j00217k44139K94107j37368m4809l4696M3432
5195C46242J43496j53786M7431p5111N1680j64095k9108R5381q9016M06546k49993
5184C29667j2887o6367J06617K6175j40825M3900J28764n3584Q1032P7185n37291
5173a7614Q7614K99432k24518O6774L77297k03684P3941K63510q5802r4470j33706
5162D08774j0163l474l2952R4536P1249J71016q9637k67643j08941L33551p4084
5151D92232K6119J50336J04610j2560L1339j1804J38188j47397j25385m1424p813
5140E96441K24642j69499m7627J91862k03339j82246m226M9417q6999K6407J9152
$$ y = [550186, 710315, 751150, 569003, 410845, 596832, 545270, 456394, 570923, 601601, 710883, 698425, 837886, 569932, 469715, 225576, 519683, 382315, 337506, 302810, 346242, 489738, 335952, 383383, 308272, 359952, 195857, 166749, 262130, 173114, 579660, 329667, 316780, 250413, 357030, 383205, 242380, 286280, 415044, 361460, 442492, 519677, -17614, 70000, 369432, 144914, 211688, 588985, 385301, 459242, 722752, 636950, 542480, 408774, 398611, 395137, 362185, 456721, 527970, 698986, 609349, 341706, 232765, 566316, 492232, 518351, 668687, 773297, 760737, 792076, 780272, 918460, 771063, 645678, 604254, 596441, 821083, 651584, 603957, 795819, 592480, 410234, 406008, 455425, 368426, 394833, 413985]
5129D13985L6818j38649J52237M4597J1398n6254j07014n7126J05835l34623K08941
5118B80145K3635k6819j120J07906l53603M4982J65481N805j39204N3741K49989
5107D10938p9894J03254p82J95150L0285j69145j61834j77572k74327L21030K14018
5096D11121L9017l97818K54086M6575j91290k84028K17147O039J45729P7082K7129
5085C50789k01900j11747j27744j5838m2540j18063K57861K16483n3831l95898
5075b42428L95159k35333j94688M99Q5941N70184k92676K05560k62999J99109
5065B28328k61650K090J46147k31799J22540r0751j30118L13711J06395Q912K6175
5054B39980j74931j44630r2804K57071j71111J22653j7726k09947r6333J15623
$$ y = [413985, 450803, 312154, 464391, 508988, 520386, 464132, 357118, 299992, 405827, 71204, 280145, 303780, 276961, 275841, 383747, 30144, 75126, 240607, 246412, 107208, 160949, 410938, 331044, 434298, 433516, 628666, 658951, 489806, 327972, 150400, -123927, 197103, 411121, 450138, 52320, 306406, 352981, 161691, -122337, 94810, 100849, 246578, 323660, 350789, 148889, 37142, -90602, -106440, -148980, -267043, -9182, 207301, 153470, -242428, 152731, -82602, -277290, -276791, -190850, 379334, 86658, 292218, 29219, 228328, -33322, -31232, 114915, -116884, 5656, -85095, -215213, 98498, 204893, 213805, 239980, 65049, -79581, -172385, 84686, -86425, 36228, 18502, -191445, -287778, -172155]
5044a72155J13703Q2045L8160p3254j44025K59988m15218n3087L70800k5627q6203
5033a04873K69333k17501O9558j42515j10733Q3795J61917J75895K24458r9313
5023C10021k21947J49550j85133L1929k36969k7748Q0212J85049M0254r2197J3074
5012D6095K06189k77552P3780O9207l84227J45229k0478r1235J05750q0008P6705
5001a30545j38987q034J70539j45347K89482K7983j40094l4530j78388M0781K76964
4990B9824r1651j68926K58841n01592j38759M47050K62951l37251J33704J46655
4980D0846N5208j27462n3607n5245k50021j01444K96043M5142L144K15567l38497
4969b70326K46624k11861R805k63513J86489j30207J09867L37222j44617P8648
$$ y = [-172155, -58452, 23593, 61753, -11501, -155526, 104462, -310756, -363843, 6957, -18670, -104873, 164460, -53041, 16517, -125998, -236731, -152936, 8981, 184876, 409334, 310021, 88074, 237624, 52491, 84420, -152549, -180297, -100085, 84964, 125218, 33021, 46095, 252284, -25268, 48512, 117719, -266508, -121279, -141757, -232992, -127242, -207250, -130545, -269532, -277566, -107027, -252374, 37108, 65091, -75003, -109533, -287921, -247140, 29824, -61827, -230753, 28088, -473504, -612263, -165213, 97738, -239513, -105809, 40846, 96054, -31408, -85015, -140260, -390281, -491725, -195682, -150540, -147396, 68171, -270326, -23702, -235563, -225758, -489271, -302782, -432989, -323122, 14100, -130517, -51869]
4959e1869Q6183o7592r573j12720j67365J28535M05008j1220k14044j00411K18684
4948A03616o5333J31464j42887k6724J25952l14481K83713O9447J6386p2025o7192
4937D1936K07277K42933m98883l19506l0244K86784J80834o8542j55514J53216
4927D0291j11960j75174K99604n6252j93022L05604l3185k63585J41314p5528
4917a21893O4426o898K0839K25249k64786L6181K67043l16084p3976p0380M62751
4906B22472J83728k07815q1536Q4790j14474J65200m5560L3452j3995R6026m3695
4895B78593n40r1425P0173R8539q9616J50559k53832K81241M3402K18381o6030
4884F39445r7108r4219N2285L8476M76707q5651l52535J69151R8812k4761k4777
$$ y = [-51869, 34314, -33278, -42851, -155571, -322936, -194401, 210607, 199387, -14657, -115068, 103616, 38283, 169747, 26860, 136, 126088, -188393, 95320, 164767, 181153, 109128, 41936, 249213, 492146, -6737, -326243, -356487, -69703, 111131, 42589, -112925, 40291, -71669, -246843, 52761, -3491, -196513, 109091, 75906, -187679, -46365, -121893, -57467, -64365, -43526, 181723, -83063, -46882, 220161, -95923, -169899, -240279, 222472, 406200, 198385, 116849, 201639, 87165, 252365, 206805, 240257, 226262, 322288, 278593, 278053, 186628, 256801, 355340, 265724, 416283, 162451, 443692, 487094, 705475, 639445, 542337, 448118, 500403, 538879, 1015586, 929935, 577400, 746551, 845363, 820602, 795825]
4873G95825j56708M4887Q3226m26732m2194j42873N7133L14332r8522j2460j00781
4862C15133j41027l5762J22964N135j56084r256o1796k6421j621K68779M1612
4851C21656p1641j35969j57168k47446O29101j16985k8627l79920Q2464j6100
4841a20635n491J95370j71764p0000k00190M40276k04779J13243J03993K05652
4831B85675l02676j42626O2552o0720p9239N0991M7343j66971L3682J84835J71083
4820H3929j40236k05392L99666M5919k13750k72861M52662N2066k27116J64440
4810A39327j30253K45639j22820k29711L2193k44302q8519l2683M01591J66559
4800A37021P8287o52179J43932L37175n3489K52244j00818j62504J51359m53664
$$ y = [795825, 639117, 684004, 767230, 340498, 298304, 155431, 212564, 526896, 428374, 415914, 315133, 174106, 138344, 261308, 266443, 110359, 101103, 39307, 12886, 11265, 280044, 321656, 250015, 114046, -43122, -290568, 338533, 221548, 192921, -186999, -104535, -120635, -126126, 69244, -102520, -172520, -372710, 67566, -137213, -23970, 80023, 285675, -17001, -159627, -97075, -157795, -237034, -186043, -138700, -305671, -271989, -87154, 83929, -56307, -261699, 137967, 183886, -29864, -302725, 149937, 202003, -25113, 139327, 9074, 254713, 131893, -97818, -65625, -309927, -398446, -431129, -29538, 137021, 215308, -436871, -292939, 44236, -9253, 242991, 142173, -20331, 131028, -322636]
4790c22636O1480j42222k7256L34208m4433L23444L9586L6378k65873n6453k2151
4779h5928L6051j27764j67946L16025J2483q8301j23922J99937j75776q0806J54189
4768a31758J03349j9308K22104O1764p8047l6669j77102J35953l45670o3767r8842
4757d27993J99152M7843O4310l5004J7514q1760O025N0065j81273K92809J37725
4746H9413j07481P8949j11878o1715J47031L03913l11876k56807j52141K00631
4736a81961J00707N8934L3255j56171N303J64364n3664J49327j47807J08629p1843
4725I073k45174j3981L04778O4433J4978M05827l11481k82052q3515n4987J1744
4714a80357K4494m2720k385p4950m1587j20801K7690J68412R0490J14640l0876
$$ y = [-322636, -261156, -403378, -430634, -96426, -140859, 182585, 222171, 258549, -7324, -63777, -85928, -49877, -177641, -345587, -29562, -17079, -105380, -229302, -29365, -205141, -285947, -131758, -28409, -47717, 174387, 236151, 158104, 121435, -55667, 80286, -265384, -329151, -427993, -228841, -180998, -116688, -151692, -134178, -215938, -209913, -159848, -341121, -48312, 89413, -18068, 60881, -50997, -112712, 34319, 338232, 26356, -230451, -382592, -181961, -81254, -22320, 10935, -145236, -139933, 24431, -29233, 120094, -27713, 80916, 9073, -236101, -250082, 54696, 119129, 134107, 539934, 228453, -53599, -137114, -192101, -180357, -155863, -198583, -200968, -275918, -317505, -438306, -410616, -242204, -151714, -37074, -67950]
4703f7950K7560j35864n609L10414J74790k77366P0104k72625N5728J4854K0768
4692h5196p9552l0670P9532P8293l4220P4410J52632n6149j95438j84858R5994
4681a85222J69393r1032m4561j15525l3981K41971r3454K98008j59373j5922J06230
4670G6532l50897L55416M24891K4010k84434l6194O1670k21627q1415L63640J96775
4659E28367m16120O4978J44556O5603k03249k8473K27723k66327m14716L01568
4649C910L33812r1358j57779M0056Q3047J94787l67866j83759J02934k45662J29892
4638a57986O9270p4114O2K66204J40490j04396j44720R1961l1574k4308M27885
4627D58774N6182R4172O208K00823J04390j04430N804k64791o4561R6073k03710
$$ y = [-67950, -40390, -176254, -181863, 128551, 303341, 25975, 96079, -176546, -120818, -105964, -85196, -164748, -195418, -115886, -37593, -71813, 2597, 155229, 99080, -96358, -281216, -185222, -15829, -106861, -151422, -266947, -300928, -58957, -152411, 145597, -13776, -29698, 76532, -274365, 81051, 505942, 529952, 245518, 209324, 270994, 49367, -32048, 331592, 528367, 112247, 177225, 321781, 387384, 184135, 155662, 383385, 117058, -297658, 3910, 337722, 246364, 88585, 128641, 211688, 406475, 38609, -145150, -42216, -287878, -157986, -88716, -162830, -162768, 103436, 243926, 139530, -5190, 86771, 55197, 30889, 458774, 514956, 609128, 615336, 816159, 920549, 816119, 821923, 557132, 492571, 588644, 384934]
4616C84934L98022L39313j6382l53690k5567N9765j68130J42123R8135K10329
4606A068852K7476J6626K45864J30181J05918L2756m1785p7908J10439K12878
4596A831297j17203K96413L2967k81027J43765l04703P3924l79562M2891k8478
4586A310284O3544R4859o9576M32256p1459j16602M97035J62726L9175K14004
4576B556246k9061j21091M04478q9394L12172M60147L08949k81423k86322m325
4566C230376l02127k98322J65821l37072K50012J11244q6800k9227q8536J9757
4556B635126m28052R4898K78377N8794P2008J44864o4437L96604M42939L93641
4546D024762J09686L92269k63732k39099j07512j5279k29962l1920L15744K1520
$$ y = [384934, 782956, 1122269, 1105887, 752197, 726630, 786395, 618265, 760388, 858523, 1068852, 1096328, 1112954, 1358818, 1488999, 1594917, 1627673, 1585888, 1507980, 1618419, 1831297, 1714094, 2010507, 2043474, 1762447, 1906212, 1601509, 1675433, 1295871, 1338762, 1310284, 1373828, 1468687, 1399111, 1831367, 1759908, 1643306, 2140341, 2303067, 2342242, 2556246, 2527185, 2406094, 2810572, 2721178, 3033350, 3493497, 3802446, 3521023, 3234701, 3230376, 2928249, 2629927, 2795748, 2458676, 2708688, 2819932, 2733132, 2703905, 2615369, 2635126, 2207074, 2301972, 2580349, 2639143, 2711151, 2856015, 2791578, 3188182, 3631121, 4024762, 4134448, 4526717, 4262985, 4023886, 3916374, 3901095, 3671133, 3639213, 3954957, 3976477]
4536C976477J80415j65456k26085o59537j19081l6356n80423J21916n9475J60002
4526B592397k15925O8439O7154J51935J19824K20895n23632j41779o9676M44149
4516B713781P3283P5798L64755N10858K87710j94372o62596l05143k37677N2524
4506B678921J58832k56239N3192k69196k96022q9047n6539l29260o6671k38662
4496A289309K7157J50835j50497J08192Q2928M30731o6074j53735j18096M66097
4486B066847k918m19346K19644l44379K00713J67013P6978j98463k60749m678
4476A500662j83369l35737P7650j16809k86617M8134l5683q1199M1793Q9220K6001
4465G44046j66329N3434n05603Q3198L45542N1630k1049J29857o5914k68946L02761
$$ y = [3976477, 4156892, 3991436, 3765351, 3105814, 2986733, 2950377, 2369954, 2491870, 2432395, 2592397, 2376472, 2444911, 2512065, 2664000, 2783824, 3004719, 2481087, 2339308, 2269632, 2713781, 2787064, 2862862, 3227617, 3738475, 4026185, 3831813, 3169217, 2864074, 2626397, 2678921, 2837753, 2581514, 2634706, 2365510, 2069488, 1980441, 1923902, 1594642, 1527971, 1289309, 1316466, 1467301, 1316804, 1424996, 1507924, 1938655, 1872581, 1718846, 1600750, 2066847, 2063929, 1644583, 1864227, 1519848, 1720561, 1887574, 1964552, 1766089, 1505340, 1500662, 1317293, 981556, 1059206, 942397, 655780, 703914, 668231, 587032, 628825, 718045, 744046, 577717, 631151, 125548, 208746, 554288, 605918, 584869, 714726, 648812, 379866, 682627]
4454F82627o4980k78522N4411J12941N8076k18011j39837J29658n5732J36688
4444D17319j01447m114J35547r8852m865m68766J47072J38345k20943M12556M6760
4433C98612L7079j13796m82568K28282J67792R2498k54296j14649J37345K2585
4423A18884j10119l44954N39242L0385m4203j3985l18622K72690K13059J0597
4413C52974l6636m34362Q4410J32275k03185P8198L25712j05536K05116j36309
4403B62657l32717N4312P1389k31470J79912K07535q3489l2512k62696R7493j6363
4392h5949N5394k48917M6827J97108J33654n2208j45440L6938j32816J60928J76905
4381A42424k94382Q8758N2018K56539q7217j22966m59957M11533P8503j1352p5047
$$ y = [682627, 617647, 339125, 393536, 506477, 564553, 346542, 206705, 336363, 280631, 417319, 315872, 311758, 447305, 348453, 343588, -125178, 21894, 160239, -60704, 351852, 398612, 435691, 321895, -160673, 67609, 235401, 327899, 73603, -41046, 96299, 118884, 8765, -336189, 203053, 233438, 189235, 175250, -143372, 129318, 342377, 352974, 316338, -118024, -33614, 98661, -104524, -26326, 299386, 193850, 398966, 262657, -70060, -15748, 55641, -175829, 4083, 211618, 128129, 95617, -167079, -69586, -85949, -30555, -279472, -232645, -35537, 98117, 45909, -99531, -62593, -195409, -34481, 142424, -151958, -63200, -11182, 245357, 158140, 35174, -424783, -13250, 65253, 53901, -21146]
4370b1146O5923J0965j43874L52464k54033j99885K99689K5405q1475k59257o6071
4359b71295L08973Q3550P3543l5204k53072J44179O1785n7744k66458L748o5459
4348b73454P4331K87108L3170k29536m6898L47498M2149j80814j85885K99282
4338A66951K6060j85522K7519J17017l46359J58436K36765j59970l7553p3510
4328g0166j04832k11837J3214L47171j00608J6708J83904l69129J66174J56913
4318B7512j54198K03900M6703J85486j64334n3089j54806K88267j32120j21406
4308b8085N6200m8134k87461K21906J89503N3817k06366O9101j69566J40599l09418
4297c17904R2470K97762j35195j65208p4679P6757P9242j67850n9075L20678m8892
$$ y = [-21146, 44777, 55742, -88132, 264332, 10299, -189586, 110103, 135508, 54033, -205224, -271295, 37678, 121228, 194771, 159567, -93505, 50674, 112459, 54715, -211743, -207995, -273454, -199123, 87985, 121155, -108381, -155279, 192219, 234368, 53554, -132331, 166951, 193011, 7489, 35008, 152025, -194334, -35898, 200867, 40897, 3344, -70166, -174998, -386835, -373621, -26450, -127058, -110350, 73554, -295575, -129401, 27512, -126686, 77214, 123917, 309403, 145069, 91980, -62826, 225441, 93321, -28085, 28115, -20019, -307480, -85574, 103929, 157746, -48620, 20481, -149085, -8486, -317904, -225434, 72328, -62867, -228075, -302754, -225997, -146755, -314605, -373680, -53002, -101894]
4286a01894J8714k3826K46450J45609j75577J33133J4778l575q2944q7401J66292
4275B49759l21712R3510l14893k15629L01808K86387q1469l1296J3318j27925
4265a48142K788M1411K23329j6678j30281J59153r7274R6943k6560k5482l50050
4254b70843M00644n0598j58560K84529k66907k48800J83255j19278j04790J73378
4244a77970L78449l09188k53188N8527J84330M1241O288K75883p4198j21442k30734
4233b22002r1269J86635J75032j22231J44996J69099j62280j1612l7277k18853
4223a89762l28927K98239L23699j53476Q8196J37762j69144j30526J3750n1690
4213a61879j30920j61534J10670l0781o3904j0273P3982J83533J74183l9688j47457
$$ y = [-101894, -83180, -107006, 139444, 285053, 109476, 242609, 257387, 253812, 170868, 83467, 249759, -71953, 21557, -293336, -508965, -207157, 79230, -2239, -33535, -20217, -148142, -145354, -103943, 119386, 102708, -27573, 131580, 34306, 131249, 104689, 79207, -270843, 129801, 79203, -79357, 205172, -61735, -310535, -127280, -246558, -351348, -177970, 200479, -108709, -361897, -303370, -119040, -77799, -71511, 204372, 130174, 8732, -222002, -313271, -126636, 48396, -73835, 71161, 240260, 77980, 66368, 29091, -189762, -518689, -220450, 103249, -50227, 37969, 175731, 6587, -123939, -110189, -161879, -292799, -454333, -343663, -374444, -438348, -448621, -374639, -191106, -16923, -56611, -204068]
4202b04068k1881L29303j81765k94411J02900n9498J62456K9007J28374o4193
4192g3776j67348l3658K11878J21446n5215j8149j19901K02756j84766k3638J39753
4181f18N7095m33275L06186K53213l14632j82319K35527q0050k5027P164p8734
4170b55470J40613L0514k14909J97228J7123J51084j37757L4962P3650j77122
4160a40084J09869l9418o7310J43127P3250k96942R0397k28893K98172J79341
4150A21509k16400J26222m9048m6383j14271m7051N4497k53157K5105J56107J46446
4139i6424j71480K8898J18039K47628J0163o3909q4829j27317J78104J71306j7323
4128A92856l10937m5392j20483p0173K09212K92107j82122J18509k13730j98476
$$ y = [-204068, -225949, 103354, -78411, -372822, -269922, -329420, -166964, -137957, -9583, -73776, -241124, -274782, -62904, 58542, 3327, -14822, -134723, 68033, -116733, -140371, -618, 56477, -376798, -70612, 182601, -132031, -314350, -78823, -158873, -183900, -176736, -255470, -114857, -84343, -299252, -102024, -84901, 66183, -71574, -36612, 37038, -140084, -30215, -69633, -136943, 6184, 79434, -217508, -127111, -356004, -57832, 121509, -94891, 31331, -17717, -64100, -178371, -225422, -170925, -424082, -398977, -242870, -96424, -267904, -239006, -120967, 126661, 136824, 72915, -11914, -139231, 38873, 210179, 192856, -118081, -163473, -283956, -354129, -144917, 147190, -34932, 83577, -130153, -328629]
4118c28629J40998o7830J47872J28364j23610J87548o127l43642K20649J46644
4108A02237r4867R0979m9270J6357j36456J2280P9425O3774K16431k92385k17999
4097b09494O5432J45350j19515J86363M865P7438j44488P6467j51934L23498j96663
4086E7319n1486n9088J56817j29183J8241m1143m03083J46810r8840O6240J08557
4075b28839J61000r8450j14340J28508r7676l5380R6710K48982J292j43777l9916
4064a21886j20223K12803K5901J05219J33563r0312j60301r0064J638j17289Q8709
4053a32242L58998k19248K25146k05263l01364J71189K38297J27276j06800j12377
4043D3612J39962q7644j93842K02185j11531r8485j4665j70359J44057P1886L11881
$$ y = [-328629, -187631, -255461, -107589, 20775, -102835, 84713, 78586, -265056, -44407, 102237, 7370, 98349, 49079, 65436, -71020, -58740, 20685, 84459, 300890, 8505, -209494, -144062, 1288, -118227, 68136, 73001, 150439, 5951, 82418, -69516, 253982, 57319, 5833, -53255, 103562, -25621, -7380, -48523, -451606, -304796, -403636, -337396, -228839, -67839, -166289, -280629, -152121, -249797, -285177, -188467, 60515, 61807, -81970, -121886, -242109, -29306, -3405, 101814, 235377, 145065, -15236, -105300, -103662, -220951, -132242, 226756, 7508, 232654, 27391, -273973, -102784, 135513, 262789, 155989, 43612, 183574, 95930, -97912, 104273, -7258, -105743, -120408, -290767, -146710, -74824, 237057]
4032B37057l26096p9553L25394k01915o1488J23078j17787J93070P996k31561
4022a31805j6244J16903J96122j70575L2779J17971l01625j25674L52202q9850
4012a9796n26187L1581K94019J88678P3103j27986O0977L2392L03225r0415R085
4001B28676N6695J51063l32420l08489J73797j28304k56199l046K65493m2195
3991a94929J14699J40385n925R8105j8549o9715n6292j82507J77145J17351Q9796
3980B09564K2591l13766l06569J57902J79860R2165J6651q7125k43907K4973Q7272
3969a60389P8590p5036J9899L11632m9097o2759J32007j9338j04595j25917J54171
3958I9168K1809k31680L7577J77050k49505m4035J06976R7752K63935k17197K94560
$$ y = [237057, -89039, -168592, 156802, -45113, -106601, 16477, -101310, 91760, 99756, -131805, -148049, -31146, 164976, -5599, 27180, 145151, -156474, -282148, 70054, -19796, -545983, -514402, -220383, -31705, 41398, -86588, -25611, 6781, 310006, 219591, 228676, 285371, 436434, 104014, -204475, -30678, -158982, -415181, -418227, -152734, -194929, -80230, 60155, 54230, 152335, 133786, 64071, 7779, -174728, 2417, 119768, 209564, 232155, -81611, -388180, -230278, -50418, 41747, 58398, -28727, -272634, -247661, -160389, -81799, -156835, -136936, 174696, 125599, 62840, 194847, 175509, 70914, -55003, 99168, 120977, -110703, -73126, 103924, -145581, -189616, -82640, 15112, 279047, 61850, 356410]
3947C56410q4771j00342m912k25229J73225k07304K54447K81922o7102r7780k78627
3936f3J10372J3865J18814j6083o9832j04023j16894L14815l4651J05895J16204
3925D38419L761J29722R6782j75422Q2435J88685L9547J0692K84169L1692l59550
3914G70932n49358J5166J38869j79335j06893K17372j6090j84838J50018k07430
3904D8413J69843j18221k04148K11484n116k05049J71513n101j14788O2469K28719
3893B40018j63890p1334J91471j50893J22356K13929j96306j36917J24390J95784
3883C68608j77257q9273j08105J14035J0335J60204j09209r7949J02458l6572
3873A37275L9821k4768J3999m792m5349o2144j9699o0976K96412k0411j19229
$$ y = [356410, 271639, 171297, 166385, -58844, 114381, -92923, 161524, 443446, 376344, 278564, -63, 110309, 124174, 242988, 226905, 157073, 53050, -63844, 250971, 216320, 322215, 438419, 442180, 571902, 668684, 493262, 575697, 764382, 803929, 814621, 1098790, 1130482, 770932, 221574, 236740, 375609, 196274, 89381, 306753, 290663, 105825, 255843, 48413, 218256, 100035, -104113, 107371, 102255, -102794, 68719, 63618, -51170, 11299, 240018, 76128, 4794, 196265, 45372, 167728, 381657, 185351, 48434, 172824, 368608, 191351, 102078, -6027, 108008, 118343, 278547, 169338, 71389, 173847, 137275, 177096, 152328, 166327, 161535, 116186, 54042, 34343, -26633, 269779, 249368, 130139]
3862A30139j08811l7280K84106L36251J51670k90143j80735m7418o6883m951K90267
3851D56212k02741J46178P4354k84663k45981K35357N2918l9286j18663p5101
3841a416o5934L191L25510J03788j91562K770J62994l2064J34347q8907J1621
3830C64338r9385P8083Q3771K10311L9870k44989J90484p6895k36385K15376o8961
3819D55618K3815j17973J20322m1323R4248K1086j51616o2182K04024J12439J47429
3808H05887k90669p796J20736M282k0451J79405K28658o4592p5412p4345j06074
3797F99629J78982J00433R6090J90839j94973J36869p2865K26490J19820n31959
3787I49355M12850Q6445l4313K07581J22603M2119K26918K22000Q2486M709K9698
$$ y = [130139, 21328, -15952, 268154, 604405, 756075, 465932, 285197, 237779, 170896, 165945, 456212, 253471, 399649, 474003, 189340, -56641, 178716, 231634, 192348, 73685, -1416, -67350, -64159, 261351, 365139, 173577, 176347, 339341, 307277, 441624, 352717, 364338, 264953, 343036, 426807, 637118, 676988, 431999, 622483, 545588, 309203, 524579, 455618, 479433, 361460, 481782, 440459, 534707, 555793, 404177, 341995, 546019, 658458, 805887, 515218, 507422, 628158, 632440, 611989, 791394, 1020052, 955460, 880048, 805703, 699629, 878611, 979044, 1075134, 1265973, 1071000, 1207869, 1135004, 1361494, 1481314, 949355, 1362205, 1448650, 1414337, 1621918, 1744521, 1786640, 2013558, 2235558, 2318044, 2322753, 2352451]
3776B352451L37856J06632P0265K62675M57237K4045o47788J48615K29013l33759
3766C007242j07655k09349r9924j43938K37724l25961j51690J2208O7383Q9998
3756B376038K7351k9906o8078o4817L4922j70178M48776K76411O4756k7252j10088
3745B757935L4386q2669K17625P0005M1102M70764j96905K90875P4551K43815
3735C921484K33992R4450N09929k75576L79213K40080M19086M74491J54286N96677
3725F748112K67358p8027M46944N40341L67155O07291L91794K97314M58134N83708
3715A0630124R61427J020866J039328J131405J005926K049593K211701K172679
3707B2223049K752714L752222M714132O373332Q184783R111350N422381j754403
$$ y = [2352451, 2690307, 2796939, 2867204, 3129879, 3587116, 3611161, 2963373, 3111988, 3341001, 3007242, 2899587, 2690238, 2590314, 2446376, 2684100, 2358139, 2206449, 2218657, 2286040, 2376038, 2403389, 2373483, 2305405, 2240588, 2275510, 2105332, 2554108, 2830519, 2895275, 2868023, 2757935, 2792321, 2709652, 2927277, 2997282, 3038384, 3509148, 3312243, 3603118, 3677669, 3921484, 4155476, 4249926, 4759855, 4484279, 4863492, 5103572, 5522658, 5997149, 6151435, 6748112, 7015470, 6937443, 7384387, 7924728, 8291883, 8899174, 9290968, 9588282, 10046416, 10630124, 11591551, 12612417, 13651745, 14783150, 15789076, 17838669, 20050370, 22223049, 24975763, 28727985, 33442117, 39815449, 48000232, 57111582, 62533963, 60779560]
3699F0779560p515333r248878p234361n875975m143177l456927k624081k230051
3691A8450777j781957j887306j306026j012422q37879j073607n63060o93930l84263
3682H910327n54389o62066m21774l81486j17428n96672O877l78021k55504j62722
3672E387142J1035j45676j26413k76355j53256J605K15584n4478j80559k6652
3662D651977L38412m89677j10087K85346M7812q9868j80717L43400o8126O6587
3652D795059l7847j09903N1394L20592M7886J35567m9935p2768j97429L6277j54308
3641D764585q5709p0879j9842J37492J19494J29803l9347k49850K76449j1104
3631D951092p8706j43636L16804K92739n2659L08424K77860K91454J13979N63737
$$ y = [60779560, 53264227, 44015349, 36780988, 30905013, 26761836, 23304909, 20680828, 18450777, 16668820, 14781514, 13475488, 12463066, 11625187, 10551580, 9988520, 9294590, 8910327, 8355938, 7693872, 7272098, 6890612, 6773184, 6176512, 6183389, 5805368, 5549864, 5387142, 5398177, 5252501, 5126088, 4849733, 4696477, 4698082, 4913666, 4859188, 4678629, 4651977, 4990389, 4500712, 4390625, 4675971, 4723783, 4633915, 4453198, 4796598, 4728472, 4795059, 4757212, 4647309, 4698703, 5019295, 5067181, 5202748, 5152813, 5080045, 4882616, 4918893, 4764585, 4678876, 4607997, 4588155, 4725647, 4845141, 4974944, 4935597, 4685747, 4962196, 4951092, 4872386, 4728750, 5045554, 5338293, 5285634, 5594058, 5871918, 6163372, 6277351, 6841088]
3621F841088N55974M15826Q09438J456080J406601J460827J635517N04244o51518
3612A4434077j529267j657748j104798j210069m66651k88990j69798m45216o30915
3603F930625m52563p1947j53480k16745k21028j82427L2930n4867j99472k82900
3593E128126L76097j21826r5526r442L18275j69213k95752J92891M5663K07348
3583E576641j73408J86048k19537K8243K09539J33415r4873M3347j5384j19942
3573E554089J9952M14547L00007Q8121L2565J22365J71068Q7148J8578M80331
3563G288771K00949J02558J99515J43044N117J1783L43004L47574J60325Q6283
3553H888923M40066K75039J0610N10685M50778O49862L99942K59328N57477P11913
$$ y = [6841088, 7397062, 7812888, 8622326, 10078406, 11485007, 12945834, 14581351, 15085595, 14434077, 12904810, 11247062, 10142264, 8932195, 8465544, 8176554, 8006756, 7561540, 6930625, 6478062, 6406115, 6252635, 6035890, 5814862, 5632435, 5665365, 5610498, 5411026, 5128126, 5504223, 5382397, 5286871, 5277429, 5595704, 5426491, 5130739, 5323630, 5369293, 5576641, 5403233, 5589281, 5369744, 5397987, 5607526, 5740941, 5646068, 5689415, 5674031, 5554089, 5574041, 5988588, 6288595, 6376716, 6409281, 6531646, 6702714, 6789862, 6808440, 7288771, 7489720, 7592278, 7791793, 7934837, 7939954, 7951737, 8294741, 8642315, 8802640, 8888923, 9328989, 9604028, 9614638, 10125323, 10576101, 11225963, 11625905, 11885233, 12442710, 13154623]
3543A3154623K66057M81208P26896M19427N26465O27349P06228R33547R52502
3534A8794302J107783J160181Q56759P10262J140434J092412O28450J320885Q80776
3525B7692244J243634J234684J129891J331402J592073J456460J634339K330510
3517C9645237K153110J995033K851036K266819K795445L071848L176101L256992
3509F1211621L292934L521686L686962L935952M207985M375348M802176N291374
3501I4326038N615689O030649O775275P292651Q309368Q768007J0348209J1685506
3493A59151392J3296018J5101406J7181305J9972557K2546937K5789638K9156656
3486C02195909L2660820L5459545L5888596L2255253J7586605m503485k5171619
$$ y = [13154623, 13420680, 13901888, 14628784, 15048211, 15574676, 16202025, 16908253, 17841800, 18794302, 19902085, 21062266, 21919025, 22629287, 23769721, 24862133, 25490583, 26811468, 27692244, 28935878, 30170562, 31300453, 32631855, 34223928, 35680388, 37314727, 39645237, 41798347, 43793380, 46644416, 48911235, 51706680, 54778528, 57954629, 61211621, 64504555, 68026241, 71713203, 75649155, 79857140, 84232488, 89034664, 94326038, 99941727, 105972376, 112747651, 120040302, 128349670, 137117677, 147465886, 159151392, 172447410, 187548816, 204730121, 224702678, 247249615, 273039253, 302195909, 334856729, 370316274, 406204870, 438460123, 456046728, 451543243, 426371624]
3479D26371624l8112807m0745250l8023549l3060511k9141173k5384131k1731920
3472B00172283j8795695j6278430j3994544j2840649j1679025j0070571q205482
3465A08307887p504907o449135n948898n100204n038755m439677m225835l475293
3457F6125183l312717l015634l143670l215505k364948k375662k325928j984714
3449D4386405j686844j944423j580475j031209j503777j914038j342763j015558
3441C2367318r94480j030376j371172j014634q70742j079745o37214r37769p76155
3432B3655031p39957o08588n96901q76581o77193n99889p22831o42476n39050
3423A7651565k32831m53314m62477l15947p91933l43477k65401m66406l50300
$$ y = [426371624, 388258817, 347513567, 309490018, 276429507, 247288334, 221904203, 200172283, 181376588, 165098158, 151103614, 138262965, 126583940, 116513369, 108307887, 100802980, 94353845, 88404947, 83304743, 78265988, 73826311, 69600476, 66125183, 62812466, 59796832, 56653162, 53437657, 51072709, 48697047, 46371119, 44386405, 42699561, 40755138, 39174663, 38143454, 36639677, 34725639, 33382876, 32367318, 31372838, 30342462, 28971290, 27956656, 27085914, 26006169, 25368955, 24431186, 23655031, 22915074, 22306486, 21709585, 20833004, 20155811, 19555922, 18833091, 18190615, 17651565, 17418734, 16965420, 16502943, 16186996, 15395063, 15051586, 14786185, 14319779, 13969479]
3414A3969479m24034l91310o17229o31261m56709l68275k56204j66983l64874
3405A0292600q3044j26181o54601j68597L4700n39303k04847o8880k49756k92348
3395G939743J56058j97798l36835l70498j25999j04338l03594k48378j88396K27835
3385F447800n36447p3078j36148q5227l1032o198o6996m00148k01296P6439k05616
3374D782053O4677j50266P0143j95547j67920j80729q9252N3492p0706l40787
3364C775158j56324R0270k54684J74660j84485k98052K24623k74138J72440K27261
3354C496729n46125n7660l3097r8910m5465K57792M3992K45477J803J60543p7830
3343C347249j01377M3878k6421K01003m77274k53028J38542j05047R1705J29492
$$ y = [13969479, 13545445, 13154135, 12536906, 11905645, 11448936, 11080661, 10824457, 10657474, 10292600, 10209556, 10083375, 9428774, 9260177, 9294877, 8755574, 8550727, 8481847, 8232091, 7939743, 8095801, 7898003, 7561168, 7190670, 7064671, 6960333, 6656739, 6408361, 6219965, 6447800, 5911353, 5838275, 5702127, 5616900, 5585868, 5579670, 5512674, 5112526, 4911230, 4987669, 4782053, 4846730, 4696464, 4766607, 4571060, 4403140, 4222411, 4133159, 4186651, 4115945, 3775158, 3618834, 3709104, 3454420, 3629080, 3444595, 3146543, 3371166, 3097028, 3269468, 3496729, 2950604, 2892944, 2859847, 2760937, 2715472, 2973264, 3017256, 3262733, 3264536, 3425079, 3347249, 3245872, 3289750, 3263329, 3464332, 2987058, 2734030, 2872572, 2767525, 2859230, 2988722]
3333B988722R5728J9496j54378J68486R6763l42634j67485j50083J00344j58444
3323B496515K91530k87672q2471P8276j03936k3319L6103O0032K25431p3907k25605
3312B390977j3661J72587r2913j91873p4886J68574p3791k6168R5771n4491j20841
3301B179285j96452J03713q4889n919J32173k26529j70334L60421o5449j55180
3291A870840K17679q2699o8565j48022K35394N2265L70550l4763k76560m4117
3281B092002L48717j90636k64504L20119o1477L6142Q3878J0463K72157n0422
3271B596439K37337K06261J08359K18139j26143K22430K46528J66982l06577M49249
3261D019004j893o26333k26010L1350l56987k4268k55604N367P9105k05300k96894
$$ y = [2988722, 3084450, 3103946, 2949568, 3118054, 3214817, 2872183, 2704698, 2554615, 2654959, 2496515, 2788045, 2500373, 2417902, 2496178, 2392242, 2368923, 2405026, 2465058, 2690489, 2616582, 2390977, 2377316, 2549903, 2456990, 2265117, 2190231, 2358805, 2285014, 2258846, 2354617, 2300126, 2179285, 1982833, 2086546, 2001657, 1995738, 2127911, 1901382, 1731048, 2091469, 2026020, 1870840, 2088519, 2005820, 1937255, 1789233, 2024627, 2076892, 2447442, 2412679, 2136119, 2092002, 2440719, 2250083, 1985579, 2305698, 2244221, 2280363, 2364241, 2374704, 2646861, 2596439, 2833776, 3040037, 3148396, 3366535, 3240392, 3462822, 3709350, 3876332, 3569755, 4019004, 4017111, 3390778, 3164768, 3196118, 2839131, 2814863, 2559259, 2564626, 2643731, 2438431, 2141537]
3250B141537k3718l42816j04865J59132p3804k25027L41340j24300j92128L4519
3240A589870o1240O4604j72550k08149k01143p600K27896m56495J2541j24535
3230F63199K00290K80356j82030J99583O5439m41413J97318J57863J07297Q5991
3220A333893k19282k70843J20222p4324L2983o4897m1906K46836j0441j55513
3210H96728J83492P1085o1939O1008k359M7983R0710j72553k9139k98771k9056
3199G57189K87942P3443k3942l11792k6904P1637k24061n4614L24757J0238K94212
3188A178105n36636J53653J8678J08807m0222j65675J26402j22295j99062N36395
3178A058150j92853j93839J38974l9412K9559l0213Q7361j30551L2904J36268
$$ y = [2141537, 2117819, 1775003, 1670138, 1829270, 1755466, 1530439, 1871779, 1747479, 1555351, 1589870, 1528630, 1593234, 1420684, 1212535, 1011392, 1003792, 1231688, 775193, 787734, 663199, 863489, 1143845, 961815, 1161398, 1226837, 785424, 982742, 1140605, 1247902, 1333893, 1114611, 843768, 963990, 889666, 922649, 857752, 815846, 1062682, 1052241, 896728, 1080220, 1151305, 1089366, 1150374, 1148015, 1195998, 1286708, 1114155, 1085016, 786245, 757189, 1045131, 1118574, 1094632, 782840, 755936, 827573, 603512, 548898, 873655, 883893, 1178105, 641469, 795122, 813800, 922607, 882385, 716710, 843112, 720817, 521755, 1058150, 865297, 671458, 810432, 771020, 800579, 770366, 857727, 727176, 760080, 896348]
3168H96348k92926M7191J5962j85885K77502k33561K36026J44707J1027j75828
3158G40563o1003k2022K31517L55212j48557j29721k59055l0649j15876M5072
3148F05481J0093J91080R492J84134k51173m03397L6498M85069l5844k7032l05395
3137D99006J02407l6457Q7687J96999j72459K73588j32679m15117Q3288J67218
3127F53481L8558k716R6896L1776M3033r984k5820o4584K99j44132J20196N7073
3115G94076l25750J69975k4051R4621q4354P9090J79717J02456L27313l90595
3105I22498j97335J82239j26106l35070K2511K52093K15578q2196j24972J25667
3095H54907j90620R8365J1103p7815m1092J24465j32203p0439J63406j14212n3313
$$ y = [896348, 603422, 650613, 666575, 480690, 758192, 524631, 760657, 905364, 916391, 740563, 679560, 657538, 889055, 1244267, 1095710, 965989, 706934, 676285, 560409, 605481, 615574, 806654, 816146, 1000280, 749107, 345710, 382208, 867277, 831433, 804401, 499006, 601413, 564956, 652643, 849642, 677183, 950771, 818092, 402975, 486263, 653481, 692039, 689323, 786219, 817995, 861028, 851044, 825224, 760640, 760939, 616807, 737003, 794076, 468326, 638301, 614250, 708871, 624517, 703607, 883324, 985780, 1313093, 922498, 725163, 907402, 781296, 446226, 468737, 720830, 936408, 854212, 729240, 854907, 664287, 762652, 773755, 695940, 654848, 779313, 647110, 576671, 740077, 625865, 572552]
3084E72552K65946J2663j7099K30632n723j15545j76091J55437K6424j64132R5552
3073H80616K06945k99856l7901J01929P7249j00243j355P4467J03819K0779k81742
3062G44707M9611L3619j54869l6316K15456k24807l8123k59350K87959N0511L8375
3051G06773K33431j6308j65913k8199j48973K61238J69435k14531l9555K34377
3041I91775k68331J38156L4126j44449k82953K34331j63080J99089L16357J12122
3031A167143Q2645l08801k19834N3589J49025j28493J97451J8745q4651J50586
3021A077405j38914M0096O9415j11055K41072O4084L3026j1439O271J33548O3584
3010A467093j13109n5839K19473J38520o5916L58697J18142J32946k45049q5913
$$ y = [572552, 838498, 851161, 834062, 1064694, 1058971, 943426, 767335, 922772, 949196, 785064, 880616, 1087561, 787705, 749804, 851733, 928982, 828739, 827384, 901851, 1005670, 1026449, 744707, 794318, 827937, 673068, 636752, 852208, 627401, 589278, 329928, 617887, 668398, 706773, 940204, 923896, 757983, 729784, 580811, 842049, 1011484, 796953, 757398, 991775, 723444, 861600, 895726, 751277, 468324, 702655, 539575, 738664, 1055021, 1167143, 1249788, 940987, 721153, 774742, 923767, 795274, 992725, 1011470, 926819, 1077405, 938491, 978587, 1048002, 936947, 1178019, 1242103, 1275129, 1263690, 1269961, 1403509, 1467093, 1353984, 1298145, 1517618, 1656138, 1590222, 1948919, 2067061, 2200007, 1954958, 1869045]
3000A869045P4796J80615q8137K62016N4034P5676K85614M40257R9698k99523
2990B954091N0147J20142K60246L30620J69428k34324J68315N6011N18826L99169
2980D792671M86871J96786K22605P09744J109334O19614Q25038J351350R61984
2971A1275997Q69941l09591p15512n37105o54983o63336J60040L49506L09084
2962A0084041K90064L65645K90568K13964j62840k77301J46819O32271J09916
2953A1693147J96230M02911J227518J515597J748403J411310N90789r33861k468315
2944A5383729k367143j847175j323463n32782l84726r41848m92691m06127l78758
2935F709016l50864l34103k6930L02999j20952l771M71516O7014N67380P30331
$$ y = [1869045, 1943841, 2124456, 2036319, 2298335, 2352369, 2428045, 2713659, 3153916, 3253614, 2954091, 3004238, 3124380, 3384626, 3715246, 3884674, 3650350, 3818665, 3874676, 4393502, 4792671, 5279542, 5476328, 5698933, 6408677, 7518011, 8137625, 8962663, 10314013, 11275997, 12145938, 11836347, 11120835, 10583730, 9928747, 9265411, 9425451, 9774957, 10084041, 10374105, 10739750, 11030318, 11244282, 11081442, 10804141, 10950960, 11583231, 11693147, 11889377, 12292288, 13519806, 15035403, 16783806, 18195116, 18785905, 17852044, 15383729, 13016586, 11169411, 9845948, 9313166, 8928440, 7986592, 7493901, 7087774, 6709016, 6358152, 6024049, 5997119, 6300118, 6179166, 6175395, 6646911, 6713925, 7281305, 8011636]
2925H011636O44064R31020K66046l10856r77604r81693j091110o23676p26387
2916E141440o03365j67183L344l90096l13025k77842j79614J4697k55091k57928
2906B715337j94313p4385R0885o2890j94787j34163O6878J20745j55834k1174
2896B156299l52226n2498k33983J51101l841r065n2411O7230l06001k80864R0990
2885A174731L68656j8150q1087m39957K31383K54762j92825l28047j74430L03815
2875A098851q6764j83135j83930K96938o2799k02093L05226j13727j04972l6405
2865G27190q0080L49171k15989M8265p0076J70395J53248r521j21612K9247K8001
2854A008239j6810j24339Q7525n43238K38894Q8094k44886R0065k42975K78073
$$ y = [8011636, 8655700, 9586720, 9852766, 9541910, 8564306, 7582613, 6491503, 5867827, 5141440, 4538075, 4370892, 4374236, 3984140, 3671115, 3393273, 3213659, 3228356, 2973265, 2715337, 2521024, 2446639, 2537524, 2474634, 2279847, 2145684, 2212562, 2333307, 2177473, 2156299, 1804073, 1751575, 1517592, 1668693, 1664852, 1655787, 1603376, 1670606, 1364605, 1083741, 1174731, 1543387, 1525237, 1444150, 1004193, 1235576, 1490338, 1297513, 969466, 795036, 1098851, 1012087, 828952, 645022, 941960, 879161, 677068, 982294, 868567, 763595, 727190, 647110, 996281, 780292, 828557, 758481, 928876, 1082124, 1072603, 950991, 980238, 1008239, 991429, 867090, 954615, 411377, 650271, 738365, 493479, 583544, 340569, 618642]
2844F18642j84554R2483L4975j30164j80293J14729L66136k9179j92605K8874
2834E39044k23200K87324J83268m11254J24823N5608q2219J26769l60885j63690
2824G5588M54539J9480o074k75253J31178k67928N9405J87540j84140j02863n369
2813H6103K07237q711l99255J02844M6676j14571j18918M750k26180K77474N06225
2802C63674j43983Q1518M5295j32636k31678J77767J45006Q5208R8295j36717
2792C51749j54657J67548O070n6427q9138J36970j80295K53148L68700k55967
2782E47701r5776r3123k82729N23406K66725k31446j07838k02083K26998K30902
2772G82737K9896k55672m121j76547J74566r8304J40431j73455k87874J06801
$$ y = [618642, 434088, 526571, 561546, 431382, 251089, 365818, 731954, 702775, 510170, 539044, 315844, 603168, 786436, 375182, 500005, 555613, 473394, 600163, 239278, 75588, 530127, 549607, 543533, 268280, 399458, 131530, 190935, 378475, 194335, 91472, 86103, 293340, 284629, -114626, -11782, 34894, -79677, -198595, -193845, -420025, -142551, 363674, 219691, 301209, 346504, 213868, -17810, 159957, 304963, 390171, 488466, 351749, 197092, 364640, 370710, 314283, 225145, 362115, 181820, 434968, 803668, 547701, 451925, 358802, 76073, 599479, 866204, 634758, 526920, 324837, 551835, 782737, 812633, 556961, 552840, 376293, 550859, 452555, 592986, 419531, 131657, 238458]
2762B38458k7264K38358K52777l95918k22382N93263j21852J36894j73845J78441
2752F96930p6365k52937J80453K81362K17892k35197j55087J0384J8853j91777
2742D94511m44394L65700J71528j77248Q3623K67998r6200k6971j10249j53048
2732C75250K53722J7529J18108k93481J86619R5765q8153J12652l23977J79194
2722F33228M6694N0647J6396J11082j10493O76L52889j84983k17398j10555K7197
2711F15380J86264j65442j47485L23983R2854J06485k19513P687l6168K59215
2701A023260k70109l82137L38549J52747k88538j50714P603j72674J36456K18035
2691F12478L7702M4261R4322j10479k77480L9697J75333q6334L6822k20014j64469
$$ y = [238458, 211194, 449552, 702329, 306411, 84029, 677292, 555440, 692334, 518489, 696930, 620565, 367628, 548081, 829443, 1047335, 812138, 657051, 667435, 686288, 494511, 50117, 415817, 587345, 410097, 493720, 761718, 665518, 638547, 528298, 375250, 628972, 646501, 764609, 471128, 657747, 753512, 665359, 778011, 454034, 633228, 679922, 730569, 746965, 858047, 747554, 748230, 1101119, 916136, 698738, 588183, 615380, 801644, 636202, 488717, 812700, 905554, 1012039, 792526, 800213, 764045, 1023260, 753151, 371014, 709563, 862310, 573772, 423058, 430661, 257987, 394443, 612478, 650180, 694441, 788763, 678284, 400804, 440501, 615834, 529500, 566322, 346308, 181839]
2680A81839K24614K6407l9341k6556M2128m2050J97501k8261j13715o9866q5328
2669B67372k8468o1577M311M66635j21176l43584J63318Q6061k04653n0762N8660
2658B36137n9961J85377j31257q7134l30856J41532N6292Q7103K69504k1825K49096
2647E94008J4233k97333k43954J65372P2390l65993Q4490q5270l9264L50577l58674
2636a09418K1000O5252j96716K71862L7706L6528k65850M8651J06764n4346p495
2625d6062o0856k55878J58605N01276l70239l76268K29188K36653m8706J51565
2615A19278j8742N9164J2604j22169L3734N1823k33711L179k27981J33794L00819
2604A11792M9381J0809j13797M30890l65785j23611p2912L08373k56591j87655
$$ y = [181839, 406453, 432860, 393519, 366963, 409091, 367041, 564542, 536281, 422566, 352700, 267372, 238904, 177327, 181638, 648273, 527097, 183513, 346831, 432892, 228239, 177477, 236137, 176176, 361553, 230296, 143162, -187694, -46162, 10130, 97233, 366737, 344912, 594008, 608241, 310908, 66954, 232326, 304716, -61277, 23213, -62057, -101321, 249256, -109418, -88418, -23166, -219882, 51980, 89686, 126214, -139636, -90985, 15779, -38567, -46062, -106918, -362796, -204191, 297085, -73154, -449422, -220234, 16419, -32287, 119278, 100536, 159700, 172304, 50135, 83869, 135692, -98019, -94840, -322821, -189027, 111792, 161173, 171982, 58185, 489075, 123290, -321, -73233, 235140, -21451, -209106]
2594b09106K20811k45695N0101J74589n5453j3755L07262k19313o97J07136j27975
2583a2095r7795O52j19384M7955J37677l58138K44953P6312o1778J08876j20789
2572a53554o5188J09427q578J00327j54428J00480o531O9621k87581P8370K35237
2561A7602j23040M273r1613J98192l05607o2564K92870R3255l62769K43768N6439
2550c9194Q089k27706j20109N6656P3647J74581K09300j16846j22776R6261m8983
2539e7080k70947m4186J31412J45946m7743l6441j77955m9900K71800l0954J41955
2528b4093M8630j53874J62775J54698k21913q1112J50598r812l982k77811R3563
2517a62333M28322k39615k17884J1649k17529K98306R3945j57780p2111K7354
$$ y = [-209106, 11705, -233990, -183889, -9300, -64753, -78508, 228754, 9441, 8744, 115880, -12095, -109890, -109238, -228622, -180667, -42990, -401128, -156175, -79863, -141641, -32765, -153554, -218742, -109315, -117893, -17566, -171994, -71514, -78045, -8424, -296005, -217635, 17602, -105438, -101165, -192778, 5414, -300193, -362757, -69887, 23368, -339401, -95633, -39194, -31105, -258811, -378920, -322264, -248617, -74036, 135264, 18418, -104358, -8097, -57080, -328027, -372213, -240801, -94855, -142598, -179039, -356994, -406894, -135094, -166048, -24093, 24537, -129337, 33438, 188136, -33777, -114889, 35709, 25897, 21915, -255896, -162333, 265989, 26374, -191510, -179861, -397390, -99084, -5139, -162919, -235030, -207676]
2507b07676J75229j09028r9629L54841j1701j76630J75864O9654j53878r5388
2497g8342j55452Q2417J12807j53766L55954j15954J06379j60147j74791K49645
2487F8750j7466q9397K61118k06786j17662J68089j3793K31819j31271j93072
2477c9671J55550J15220R326p0773J35076k35160j90289K65651r762R8388Q2438
2466C15994L0909Q3423l14235Q1087J89920k46342k05042K00763L79685m49521
2456F6641k8834k05210J48372L59509q6945l5053j22102k07531o8224J04334M05063
2445C30020J28122m51367P5152Q8244p0776q8943n0584K70489l12339J45714j1765
2434E1967K9559j68736M1459J78181K66599k41639j15115j07608o7783J63087
$$ y = [-207676, -32447, -141475, -241104, 113737, 102036, -74594, 101270, 170924, 17046, -78342, -233794, -151377, -38570, -192336, 163618, 47664, 154043, -6104, -180895, 68750, 51284, -38113, 223005, 16219, -101443, 66646, 52853, 284672, 153401, -39671, 115879, 231099, 240425, 169652, 304728, 69568, -120721, 144930, 135168, 233556, 315994, 346903, 430326, 116091, 197178, 387098, 140756, -64286, 136477, 516162, 66641, 37807, -167403, -19031, 340478, 253533, 218480, 96378, -111153, -179377, -75043, 330020, 458142, 6775, 81927, 170171, 99395, 10452, -40132, 230357, -81982, 63732, 51967, 81526, -87210, -45751, 132430, 399029, 157390, 42275, -65333, -133116, 29971]
2424B9971j34299j41888j06153M16922m2884N6826P8446J6812l08025q8572R0724
2413a32120K48499k57656l9612J1156k45968l848K65151R5029K58513l68596J0598
2402a58854O7811J28846k39084p9805J75855j84717M2502j67845l7797K81368
2392a71720j14286L65590P0467R8040k26192M3408J6310j12994k830L07856l658
2381B69991l58429K43341k78259J15978k6417l40657K27718j85694J94990J99097
2371F1659k59387J18869o6919j48898M7262J88855k27894J52405m6101N4242k75557
2360d01464n1565K95330k6068j47159K13715P2592r5894k5896j02328L43789j125
2349G3927k18067j49324O118L26473K31022M2840n12710P4534K36970N0306O2234
$$ y = [29971, -104328, -246216, -352369, 64553, 21669, 78495, 156941, 173753, -134272, -222844, -132120, 116379, -141277, -180889, -169733, -415701, -419549, -154398, -59369, 199144, -169452, -158854, -91043, 37803, -201281, -281086, -105231, -289948, -247446, -415291, -453088, -171720, -286006, 79584, 150051, 248091, 21899, 65307, 81617, -31377, -34207, 273649, 269991, -88438, 154903, -123356, -7378, -33795, -374452, -146734, -332428, -137438, 61659, -197728, -78859, -145778, -294676, -247414, -58559, -286453, -134048, -180149, -125907, -401464, -453029, -157699, -183767, -330926, -117211, -44619, -140513, -166409, -268737, 75052, 73927, -144140, -293464, -287346, 39127, 270149, 312989, -199721, -125187, 111783, 162089, 224323]
2338B24323k8490m56726J55247K0005J82522L3435j28300M3707j67157P6384J89091
2327A44041j86917j54979K42632j20666K58901J74750j49572j91657J66920m1443
2317A42010J51362N6633J7387n6480m16974J44139K94766j06449k24012M84823
2307D87205p1297M7874k1329m62058K76494n9404l56489Q7870q2784J9423J74878
2296D0383J33067j58424r606O9006j12606k4105j69043J40417K63439q1264Q7105
2285A78369Q433k12128N0848J21273j36014n399M3361j32831J09153M8545k43375
2274a69765K65760l85946R7013L03351j59242p2370j38470J71115p5350J11238
2264e2666j257K12790l5057j58656n1788j6006Q3038O540j3560k08039K60892
$$ y = [224323, 195833, -260893, -105646, -85641, 96881, 130316, 2016, 45723, -121434, -45050, 144041, -42876, -197855, 44777, -75889, 183012, 357762, 208190, 16533, 183453, 142010, 293372, 350005, 367392, 310912, -106062, 38077, 332843, 226394, 2382, 487205, 415908, 463782, 442453, -19605, 256889, 197485, -159004, -71134, -153918, -134495, 40383, 173450, 15026, 5420, 74426, -38180, -62285, -231328, -90911, 172528, 91264, 178369, 186802, -25326, 25522, 146795, 10781, 5382, 48743, -84088, 25065, 73610, -169765, 95995, -289951, -192938, 110413, -48829, -121199, -259669, -88554, -163904, -52666, -53923, 158867, 123810, -34846, -86634, -102640, -19602, -13062, -26622, -234661, 26231]
2253B6231K8698o0545n0741o7311J74899J43979k21295J08315J08609p6800J40801
2242B54840j81026k60882J00762K27282m4601O5156m01696J50373m1396N77184
2232D45996k39375L2958N1338p018r1598j59980K47531l38730Q7711J22729J85436
2221C36998r6720l11901J16352k67383j69454L43397K39910J39372J51995Q9725
2211E72291j87858N1933m64661N4791M19198k04543k63119K32091N6862p3391
2201A93594K4948q7670L71612j87420M11355j72269k57198l9752m0365m9637k646
2190A64552K35895o5069K42789j96424j481p6491l5207o703J11635K39131N8015
2179F70642q6966L87327l35789Q2078j01498k03702L43929J04586l23608J5639
$$ y = [26231, 54929, -5616, -56357, -123668, 51231, 195210, -26085, 82230, 190839, 114039, 254840, 73814, -187068, -86306, 140976, 96375, 161531, -240165, -89792, -131188, 445996, 206621, 239579, 290917, 283899, 192301, 32321, 279852, -58878, 28833, 151562, 336998, 240278, -71623, 44729, -222654, -392108, -48711, 191199, 330571, 482566, 572291, 384433, 436366, -28295, 26496, 445694, 241151, -21968, 210123, 266985, 193594, 218542, 130872, 502484, 315064, 726419, 554150, 296952, 257200, 216835, 167198, 164552, 400447, 335378, 578167, 381743, 380262, 303771, 268564, 261861, 373496, 612627, 670642, 583676, 971003, 635214, 717292, 615794, 412092, 756021, 860607, 536999, 552638]
2169E52638Q6672J24764R5040K59962j23460J29240J75514j70488M2668J1162
2159A183712L66272J64376J36831R2857M1436k03220M23618r9954K5864J81161
2149B312953J1845R2781M2135L11038j02630R5710K9973L70910L02741L88626
2139C856082M25229K65418K78815J62881M40440k7446M12627M22951M07878L82409
2129G027284N98716L99286K94293M89569L93892O26708N71969N89502J158489
2120A2149708Q80469J273060J286770J596348J423635J453930J570211K564891
2112B4199022L140482M019215M772842P386044R517439J2798032J0660494L28557
2104G6822127q348431j3471710j0921069p414473n715599m233363l088200k716131
$$ y = [552638, 639310, 764074, 859114, 1119076, 995616, 1124856, 1300370, 1129882, 1172550, 1183712, 1549984, 1714360, 1851191, 1944048, 1985484, 1782264, 2205882, 2105928, 2131792, 2312953, 2324798, 2417579, 2459714, 2770752, 2668122, 2763832, 2793805, 3164715, 3467456, 3856082, 4281311, 4546729, 4825544, 4988425, 5428865, 5401419, 5814046, 6236997, 6644875, 7027284, 7626000, 8025286, 8319579, 8809148, 9203040, 9829748, 10401717, 10991219, 12149708, 13030177, 14303237, 15590007, 17186355, 18609990, 20063920, 21634131, 24199022, 27339504, 31358719, 36131561, 43517605, 53035044, 65833076, 76493570, 76822127, 68473696, 55001986, 44080917, 36666444, 30950845, 26717482, 23629282, 20913151]
2096B0913151k176831j804086j298552j336874j689234j581918r09933q39927
2088I275796n89874p00099n26823n08047l68950m20796k93717l15509k82345n30471
2078D739165j18348k11076j60900j84273l23402k44004j3004m8018r2388J7696
2068C361448o02713j93737K92669l77356j01347n3983J61771j24438k82659n0074
2058B029581k1524p0798j17161k6595k42716J19710J71945j55130k52653j49054
2048A285605k5069K09814J59256k50652J21626l4752o6349k4449j09371O3216
2038A328875m63162l593J93869q9501j13986j56694j79719K78397r9287l8724
2028F56475J44741J42912j00688q211l32722k5421L1106M5805R9606j12264P7236
$$ y = [20913151, 18736320, 16932234, 15633682, 14296808, 12607574, 11025656, 10115723, 9275796, 8685922, 7985823, 7459000, 6950953, 6582003, 6161207, 5867490, 5551981, 5269636, 4739165, 4620817, 4409741, 4248841, 4064568, 3741166, 3497162, 3484158, 3436140, 3343752, 3361448, 2758735, 2564998, 2857667, 2480311, 2378964, 2324981, 2486752, 2362314, 2079655, 2029581, 2008057, 1937259, 1820098, 1793503, 1550787, 1670497, 1842442, 1687312, 1434659, 1285605, 1260536, 1470350, 1629606, 1378954, 1500580, 1465828, 1399479, 1375030, 1265659, 1328875, 865713, 862120, 1055989, 966488, 852502, 695808, 516089, 794486, 695199, 656475, 801216, 944128, 843440, 835229, 502507, 477086, 508192, 553997, 653603, 541339, 618575]
2017F18575l38906j71439L17342J66359k45861j25052n2308J43159J34865j11896
2007C34838p16O938o229l7362M5180J5629k3568j93061K7469J08560j11222L047
1995A69503O8258J23506k10272J78529j34573j61849p9871J37406K57223k67396
1985H0464k28237j42K95941r5542m270k45479J78617J08515m959k38945M22365
1974B68328J68840k44477o0774J55502o7236Q989k54474J04326J12281j32823
1964E8482l0002M059J36012m9900j20135J04451q7505K0415Q5954j75559J72881
1953A19153k75898j5304L06301J25156O3335j82989M8460j65480j88830L73303
1943B07207O7501l08056L6271J5785J0304j26503n5195N03J29487L6059k83949
$$ y = [618575, 279669, 108230, 425572, 591931, 346070, 221018, 168710, 311869, 446734, 334838, 334122, 341060, 334831, 297469, 342649, 358278, 334710, 141649, 169118, 277678, 166456, 169503, 237761, 361267, 150995, 329524, 194951, 33102, -46769, 90637, 347860, 80464, -147773, -147915, 148026, 52484, 48214, -197265, -18648, 89867, 84908, -154037, 268328, 437168, 192691, 131917, 287419, 220183, 229172, -25302, 79024, 191305, 58482, 28480, 32539, 168551, 118651, -1484, 102967, 15462, 35877, 121831, -53728, 119153, -156745, -172049, 134252, 259408, 322743, 139754, 188214, 22734, -166096, 207207, 274708, -33348, 2923, 18708, 29012, -97491, -152686, -152183, -22696, 13363, -270586]
1932b70586J82003j8127J8485n1128k8369J42807J15855k38977P3127r7771R7297
1921g5384K27501j41269J7269J49583j5319R2307j49822Q9856l6310k20980K08251
1910A45683J16413p3191M91201k96610q0678J36613O2498M6873k28678p3551k3895
1899B22678j42827J52079J11568J7882j46691j26835m7012j2305j05482k2409
1889i9354j6803j06674q9678J44871K74615Q4464k70301p9600p4597j55128K03003
1878a85182J38049J41754j76955j82121L6830k5166L10885q1692M2498O7786j01689
1867a5003j53525J23182J08736j2492j04851j19915K98686j07917k02816J47419
1857c8496k83331K28087L54703l23954j04633L5638J79737l24198n6388L030R4241
$$ y = [-270586, -88583, -106710, -88225, -139353, -167722, -24915, 90940, -148037, -74910, -172681, -75384, 152117, 10848, 28117, 177700, 162381, 254688, 104866, 194722, 158412, -62568, 145683, 262096, 188905, 680106, 383496, 302818, 439431, 501929, 548802, 320124, 246573, 222678, 79851, 231930, 343498, 361380, 214689, 87854, 40842, 28537, -76945, -99354, -116157, -222831, -312509, -167638, 106977, 191441, -78860, -158460, -233057, -388185, -185182, -47133, 94621, -82334, -264455, -227625, -252791, 58094, -23598, 18900, 86686, -15003, -168528, -45346, 63390, 50898, -53953, -173868, 124818, 16901, -185915, -38496, -321827, -93740, 260963, -62991, -167624, -131986, 47751, -276447, -332835, -329805, -235564]
1846b35564K14159k30415J85034J48106k24960o9567K41532J55201j40940j15014
1836g2428J788L27613k14486K10870k67947q3249k6064k82852O5358K73188M5316
1825b2893n3647l3433p4508K61570K18571k22658o2902M9115J35458k96250j8316
1814a19893K60497n2694l01197L02155p8846j97393j53530P9556n3931l5275J01518
1803b49033j62943N3968J12100L14424j91770j51176k0191J11390J22633k31976
1793b92574J32082j42387l67011N65911J03012l50565k4087L26823L5886k23792
1783b36702K75162K31916n81632L8735J81092R6456N9415J41412k28693j88645
1773b11484O3484J73018J12602q4407J97064j87687J04822p3738j77385M784N5361
$$ y = [-235564, -21405, -251820, -66786, 81320, -143640, -213207, 28325, 183526, 42586, -72428, -70640, 256973, 42487, 253357, -14590, -97839, -123903, -406755, -341397, -68209, -22893, -76540, -109973, -184481, 77089, 295660, 73002, 10100, 59215, 194673, -101577, -119893, 140604, 87910, -213287, 88868, 10022, -187371, -340901, -261345, -315276, -350551, -249033, -411976, -358008, -245908, 68516, -123254, -274430, -294621, -183231, -60598, -292574, -160492, -302879, -669890, -103979, -967, -351532, -375619, -48796, -12910, -236702, 38460, 270376, -311256, -272521, -91429, 5027, 64442, 205854, -22839, -211484, -148000, 25018, 137620, 53213, 250277, 62590, 167412, 93674, -83711, -78927, -23566]
1762b3566K2430J17075l7492p1635K24387j47680n67187M091K07561J56767Q1575
1751c3674m9301J62698R9591j04924k87897J16386j6597J13415r3558l6993J51478
1740B0624p2952L0024O0254K78689m48679Q7959J77302k73465j03273J86970j93984
1729b50531M5662J86204k45923J10523K67199r3134J17588q6616k36550m8688
1719b34266J05380N0311j99675J47871J50771k15980j41212J08852j45312j10405
1709d83665M945M68195p5763k85493J82726J53663n6275N7026p2123K63393n1326
1698A05303M6021m0582j28950n8295p4721q3808k40181j31984L62383K28510p0608
1687h6912j1523m1250p4898l14251M01394Q164k97559J81844J20309j37443P6566
$$ y = [-23566, -1136, 115939, 78447, 6812, 231199, 83519, -483668, -479577, -272016, -115249, -33674, -82975, 79723, 179314, 74390, -213507, -97121, -113718, -303, -93861, -130854, 20624, -52328, -22304, 37950, 316639, -132040, -44081, 133221, -140244, -243517, -56547, -250531, -204869, -18665, -264588, -154065, 113134, 20000, 137588, 50972, -185578, -234266, -128886, -78575, -278250, -130379, 20392, -195588, -336800, -227948, -373260, -483665, -478720, -10525, -86288, -371781, -189055, -35392, -91667, -34641, -106764, 156629, 105303, 151324, 110742, -18208, -76503, -151224, -235032, -475213, -607197, -244814, -16304, -86912, -98435, -139685, -214583, -528834, -127440, -119276, -416835, -234991, -114682, -252125, -175559]
1676a75559n1041j16445L61420j72454j09504Q01K33385j25979O2636k6211j06075
1665b25026l07220N9853L58318N8956J63505J94057q1847K174J128j05208k1419
1654I7271Q6455l51590k17100L33103j72329K34554q11j73916m327K7801R7369
1643d3520K743P2579K324j71836J29974j55640P8384j04131k58232N64238m26285
1632c09402j10015N73376j09636j08388P3142k54181j72678L58614l09923K47855
1622a21236K29642k93167Q0818K2312j07969J62392j61825l98030J65676k9473
1612d50860K94367R1204j96340M06419Q7602m58271K82752k47930q9024L3853
1602b46228J1801K16393n7369k35970K60138K2269L173J009k1354n594j63241
$$ y = [-175559, -226600, -343045, 18375, -154079, -263583, -262782, -29397, -155376, -92740, -118951, -225026, -532246, -472393, -114075, -55119, 108386, 302443, 220596, 222770, 223898, 118690, 97271, 183726, -167864, -384964, -51861, -224190, 10364, 9553, -164363, -168690, -140889, -43520, -40777, 31802, 34126, -137710, -7736, -163376, -84992, -189123, -447355, 116883, -309402, -419417, 153959, 44323, -64065, 9077, -245104, -417782, -59168, -369091, -121236, 108406, -184761, -103943, -81631, -189600, -27208, -189033, -587063, -421387, -450860, -156493, -65289, -261629, 144790, 232392, -225879, 56873, -191057, -280081, -246228, -234427, -18034, -75403, -311373, -51235, -28966, -25793, -24784, -46138, -51732, -214973]
1591b14973L16381k25632l5091m4494j25052Q54K1448p7170J26338n0320J76593
1580a31118L8363K47291j43821M46717k70912l89832J87261J25133k08846j33619
1570b33383J40246R4766o3829j14019K72903J3212J07020P842q8336K5137k38640
1559g7081K08030j72650l43779M71988l33780L09599J25977r0333N072q1908K28625
1548B49760j05439l5025j2371J75352k97638P4393K54294J58460n33556j35564
1538b07334k3305M1215r0923J84767L06393J6136l02501l19O1502k6586k99494
1527c40449J75248K15975j43334L2873q4458J82444k0166j24575K18975K7586
1517A40119k73133L63398k89478N2278J97075O2692j77675l00577J3994J63484
$$ y = [-214973, 101408, -124224, -159315, -203809, -328861, -328007, -306559, -383729, -257391, -307711, -131118, -92755, 154536, 10715, 457432, 186520, -203312, -16051, 109082, -99764, -233383, -93137, 1629, -62200, -176219, 96684, 109896, 216916, 224758, 136422, 161559, -77081, 130949, -41701, -385480, 86508, -247272, 62327, 188304, 97971, 103043, 21135, 249760, 144321, 109296, 96925, 272277, -25361, 49032, 303326, 461786, -71770, -207334, -230639, -189424, -280347, -95580, 210813, 226949, -75552, -75871, -14369, -40955, -340449, -165201, 50774, -92560, -59687, -144145, 38299, 18133, -106442, 112533, 140119, -133014, 230384, -59094, -6816, 190259, 252951, 75276, -225301, -211307, -47823]
1507d7823K39547p2234l49754M60421j53292j56653O5719j08483q6604q2365J05968
1496a85553r5674o376j74528J36935q121J02362K68061n2584j93888J34113q562
1485h3815K5068J70989l34623k6123p4635K83986j10529J20941J57442p5586j82464
1474a29349L3616j53539Q9169Q4505L1964J31409k7660n6925J63797k0434P0372
1463B16925l66221K9349M6757k10872K41091k8648o9250r368q0728O0284p194
1452a77875P3103K5737k8475J9673N5734j08622k11599J39084J34149k66550M7637
1441b98004j7863P1897Q1963p6497O0453J31085J28881j65678j35939M1462P2586
1430a05654N2134p5277l7323J77710l3757q3762o2561J52284k08964j74362k1131
$$ y = [-47823, 191724, 119490, -230264, 230157, 76865, -79788, -14069, -122552, -209156, -291521, -185553, -281227, -287603, -462131, -325196, -333317, -230955, 37106, -15478, -209366, -75253, -83815, -58747, 112242, -222381, -248504, -323139, -39153, -149682, -28741, 128701, 53115, -129349, -95733, -249272, -160103, -75598, -43634, 87775, 60115, 3190, 166987, 146553, 216925, -149296, -119947, -73190, -284062, -42971, -71619, -140869, -150237, -230965, -170681, -177875, -104772, -79035, -107510, -87837, -32103, -140725, -352324, -213240, -79091, -345641, -298004, -315867, -243970, -162007, -238504, -178051, -46966, 81915, -83763, -219702, -178240, -105654, -53520, -128797, -166120, 11590, -22167, -105929, -168490, -16206, -225170, -399532, -420663]
1419d20663J42812K84671j32139Q6029m3099o5023R786j8078R5380m3508j00233
1408b04065M6659l9810r035J42079l48739L72493r7609o2564O2880J87375K62983
1397C12647k13486k28865k60547j9829K19826j6728J99785j68622n0963j16364
1387c43146K24245l9761l2826l386o2615O1204J19831k18790r8285k63726J76909
1376d80346M57913j46688J52535L67269j90154n29407J60387k25599J83765J6788
1366b33537k14189M5456K07066J84499n35265N463L05232Q4202J2213J37019j15221
1355a17062l36386L59673k10633R4838l6832L746Q5091J11002N180p5585J67229
1344E0261k46071J24084O5432K36476j48620k33160M1498k45952J99564j9919
$$ y = [-420663, -277851, 6820, -125319, -39290, -82389, -147412, -137626, -155704, -60324, -103832, -204065, -157406, -197216, -206251, -64172, -412911, -40418, -138027, -200591, -137711, 49664, 312647, 99161, -129704, -390251, -410080, -190254, -206982, -7197, -175819, -226782, -343146, -118901, -158662, -191488, -194874, -257489, -196285, -76454, -295244, -393529, -657255, -480346, -22433, -169121, -16586, 350683, 160529, -368878, -208491, -434090, -250325, -233537, -447726, -402270, -195204, -10705, -545970, -540507, -235275, -151073, -138860, -1841, -117062, -453448, -93775, -304408, -209570, -246402, -242656, -157565, -46563, -41383, -116968, 50261, -195810, -71726, -6294, 230182, 81562, -151598, -110100, -356052, -156488, -176407]
1334a76407j8967q7318o3835L35386K79927j22347R2589o8155k93539J13719k03282
1323b12229O6747L68724k42746k85498K56523L28551j22940l27449j33823j29114
1313d33254L82240P7908N9487k37929r5636J14796Q1580K9534O615p4057j43170
1302b31886K31321O2042j80816q5430J91297k44899J14122l9437m8930K16538
1292a6078P3983J55395j22466l93826j33128J10072K68353K59530l36467K35500
1282A00868j1007j54248K36441j37281J7264j55970j20461q201j36506K19536
1272a49565J71180j15284K6168J10758m00080J60104q6764J18304m2983m1266
1262b49428K38497m8879R708n301K86381l2256k38870j09346M2347r6144n3818
$$ y = [-176407, -195374, -282692, -346527, -11141, 268786, 146439, 239028, 170873, -122666, -8947, -212229, -145482, 223242, -19504, -305002, -48479, 280072, 157132, -170317, -304140, -433254, -51014, 26894, 86381, -151548, -247184, -132388, -50808, -21274, -14659, -88716, -231886, -565, 61477, -119339, -204769, -13472, -258371, -144249, -183686, -232616, -16078, 57905, 213300, 90834, -302992, -436120, -326048, -57695, 201835, -134632, 100868, 89861, -64387, 172054, 34773, 52037, -103933, -224394, -232595, -369101, -149565, 21615, -93669, -67501, 43257, -356823, -196719, -283483, -165179, -208162, -249428, -10931, -59810, -50102, -55403, 230978, 198722, -40148, -149494, -107147, -203291, -257109]
1251b57109K49469J79078M440j3679j51765N4210J45096k00327k9416N3105r4870
1240f1768J7472m6669K116K5965j89375M1867N31607k92266K39414k42321O2493
1229H8535j37248j68801k6370p4815J71668J09336Q665k01198K2253L80088k04543
1218c2430j46704k14859q381p4807M49167L0989q7051k20840j86217L47535J5853
1207a27745J92694Q2556j14599M7287q6654k09104n3798L50754p2099q4792J89955
1196A14455k93271J50445j42866R0868k5310J2511J71760K085p4791M7998k23225
1185a69341j0563m4166K33241Q9788K48696l80917J85637n1995j16882J19159
1175A02657j24101J95615L0338n0719l17058r9931L2101M3144O3471K66011o7810
$$ y = [-257109, -7640, 171438, 175878, 162199, 10434, 64644, 209740, 9413, -20003, 33102, -61768, -44296, -90965, -88849, -62884, -252259, -210392, 321215, 28949, 268363, 26042, 88535, -48713, -217514, -243884, -318699, -147031, -37695, -29030, -230228, -207975, 172113, -32430, -179134, -393993, -402374, -477181, -28014, 2975, -84076, -304916, -491133, -143598, -127745, 64949, 147505, 32906, 80193, -6461, -215565, -269363, 81391, 9292, -75500, 114455, -178816, -28371, -171237, -80369, -105679, -93168, 78592, 80677, 5886, 53884, -169341, -179904, -224070, 9171, 98959, 347655, -33262, 152375, 100380, -16502, 102657, -21444, 174171, 204509, 153790, -163268, -263199, -231098, -187954, -124483, 141528, 73718]
1164G3718j30744m2553J4321R0877j21712K08102o9602J13514o739k15489P8862
1153g445Q2377m33004J08330K68943O4962k64520Q2155R3395p7580J01240j99027
1142a80174K25153j894O551j41498Q6257r4562N5662m8520k9446K7150K01302
1131A05981q0485J51686p7776n0138J02611k71439o949J79187L3321j54434k2979
1120i1414p5572M6443J977K2119o1197O1065J61989N5021K619J06393o9814k06812
1108d7183m9102J24351j82355q5297J23052K60429j70919O715J25735j25523K35757
1097B15660o3749o0867k37023m2330J06041j4342O5850K34874L08544o23786j30806
1086b41934J11111N6079n5416k46924J50266P5998p9111J63577J58703Q4778L54016
$$ y = [73718, -57026, -99579, -85258, 5619, -116093, 92009, 22407, 135921, 129182, -86307, -7445, 74932, -358072, -249742, 19201, 84163, -180357, -98202, -4807, -82387, 18853, -180174, 44979, 43085, 49636, -91862, -5605, -100167, -44505, -93025, -122471, -95321, 105981, 25496, 177182, 99406, 49268, 151879, -119560, -126509, 52678, 85999, -68435, -91414, -166986, -120543, -118566, -96447, -157644, -96579, 65410, 120431, 123050, 229443, 159629, -47183, -96285, 28066, -154289, -239586, -116534, 143895, -27024, -20309, 105426, -20097, 215660, 151911, 91044, -145979, -188309, -82268, -96610, -30760, 204114, 512658, -111128, -241934, -130823, -74744, -130160, -377084, -226818, -150820, -229931, -66354, 92349, 177127, 531143]
1075E31143l07596k71259K87287j1584m8785j85878q3078N3496J11158j14815
1065c9911L9745J48432j83656k56282L35064J47324M4918l25460Q5349l4907l42136
1054c81520L03834p5095j5955j58495K67023L8217j0055l17924J04016J56659
1044h9295r1118L9987K6284j21117J25909N4365J06258L04117j65233j80719m3785
1033c4347j49731K34898Q604n9626J70300j74304j73421j66709l8772K91504o8206
1022a59810M22467l7740p0648j92427j49608K35515Q8295l3330k98228K14215
1012A8701k96907Q8213J58745p3153J5319K28550P7164J03721m66735o6071J32908
1001g9545J07425q7957P9955k93647J00287L38308l06579k60350K05068J12491
$$ y = [531143, 223547, -47712, 239575, 227991, 179206, -6672, -89750, -36254, 74904, -39911, -166, 148266, -35390, -291672, 43392, 190716, 235634, -89826, -4477, -39384, -381520, -77686, -152781, -168736, -327231, -60208, -21991, -32046, -349970, -245954, -89295, -180413, -140426, -114142, -235259, -109350, -54985, 51273, 355390, 190157, 9438, -34347, -184078, 50820, 59424, -202, 170098, -4206, -177627, -344336, -383108, -91604, -159810, 262657, 224917, 154269, -38158, -187766, 47749, 136044, 102714, -195514, 18701, -278206, -189993, -31248, -104401, -89082, 139468, 216632, 320353, -146382, -212453, -79545, 27880, -60077, 19878, -273769, -173482, 164826, -141753, -402103, -197035, -84544]
991h4544J54998k31577k86965J07030L57713j9295j10879P2615l38277L18376
981f0805K03760j72999n9135l6032J272L5864j24135K22785l45825L7469K30680
970f7101r7357J51546j88757q5952Q1640J0627j80673k7933L17151j36930J45026
959g8713J93506J24336N0901j02324j88210J07922l44450K41130J04581j05365
949C314j9895K35424k58493j70086P2547K23175j21121q2199M6723j18622O8033
938a21200J22300K29543k93501j46583J3722K8902L8624q2155J02348N9641N897
927d2462j11885Q5384J89104M977j71612j93712K17211K22206k13142m1396R7202
916D1875j35052K43647Q2033k94886M1134k579p880Q7001q0423N4131l9815o4694
$$ y = [-84544, 70454, -161123, -448088, -341058, 16655, -2640, -113519, -40904, -379181, -60805, 142955, -30044, -89179, -125211, -123939, -88075, -212210, 10575, -335250, -297781, -67101, -164458, -12912, -201669, -287621, -205981, -195354, -376027, -403960, -86809, -223739, -78713, 114793, 239129, 290030, 187706, -504, 107418, -237032, 4098, 108679, 3314, -16581, 218843, -39650, -209736, -137189, 85986, -35135, -117334, -70611, -189233, -121200, 1100, 230643, -62858, -209441, -195719, -166817, -128193, -210348, -108000, -48359, -42462, -154347, -68963, 120141, 125118, -46494, -240206, -22995, 199211, -13931, -55327, 41875, -93177, 150470, 232503, -62383, -21249, -23828, -31708, 55293, -25130, 29001, -10814, -75508]
904g5508N9607k46776j21453J14719M4893J80535J1601J50618J0824k49133j56228
893b76301J2759K70082Q5558l88653k36177K31428K77225m3203q1653j6462J29609
882c5788J34920l02296q9402R0674l9726M89222q6516k32395L9562j6685J6128
871c2302k616j62858L07328K07994l71484m3704O4487N6523K3719j17938p4958
860a45809Q611K05009l55081J81243K72175j06236k6748J38161j14663P2668k47872
849a18542N53461m1866m64963J8334K15624k06145q3675K79287o4888p6448J00222
838A10401K274j20472O7737M27013k98130l0481k09639P7336K82844j07430K4371
827B25824j70620Q9907j59430O9048k62278O8110L63926J44040j71478k61973
$$ y = [-75508, -15901, -262677, -384130, -269411, -224518, -43983, -32382, 118236, 129060, -120073, -276301, -263542, 6540, 92098, -296555, -532732, -301304, -24079, -67282, -148935, -165397, -35788, 99132, -203164, -292566, -201892, -241618, 247604, 161088, -71307, -31745, -48430, -32302, -34918, -197776, 109552, 317546, -53938, -97642, -33155, 23368, 47087, -70851, -145809, -137198, 67811, -287270, -106027, 166148, 59912, 33164, 171325, 56662, 129330, -118542, 434919, 393053, -71910, -53576, 162048, -44097, -127772, 151515, 86627, 10179, 110401, 112675, -7797, 59940, 486953, 188823, 158342, -51297, 26039, 308883, 201453, 225824, 55204, 145111, -14319, 54729, -207549, -139439, 224487, 368527, 197049, -64924]
817f4924J43202M1369J5479J38789k71238j3893J00358L4665l14480K7835P8413
806h4425Q9180J25521K5151m6411J47452J79656k37689j03853J4084j19714j60152
795a71200J26814L34194j25771l08005J88814j47639K39580j04431o7314R5553
785F0595j19257p1180K04079j85719K1103L30321k88474q36O7092J9571K3819
774F1114J54112k91941K07096k46128m523J69813p2637j04953K20673P8572j49973
763B1225O7567J52607l10303J04111j13482R8842K48419j84342j52534K87943
753B20053J1622l2522m3539j22752r7700j14700j61310L6348p5239L90146j8497
742h090j50401n5179j96270J43982j19161K49465K55453n1520J80561J14414j04041
$$ y = [-64924, 78278, 119647, 135126, 273915, 2677, -11216, 89142, 123807, -190673, -162838, -84425, 4755, 130276, 155427, 109016, 256468, 436124, 198435, 94582, 108666, -11048, -171200, -44386, 289808, 164037, -143968, 44846, -102793, 136787, 32356, -34958, 60595, -58662, -129842, 74237, -111482, -90379, 239942, -48532, -49368, 17724, 37295, 61114, 215226, -76715, 130381, -115747, -120270, 49543, -23094, -128047, 92626, 171198, 21225, 88792, 241399, -68904, 35207, -78275, 20567, 268986, 84644, -67890, 220053, 231675, 199153, 155614, 32862, -64838, -179538, -340848, -304500, -379739, 10407, -8090, -158491, -213670, -409940, -265958, -385119, -135654, 119799, 68279, 248840, 363254, 259213]
731B59213j21665k7766o7532p2757J3014l52184p8251L78687Q3155O0593k15745
720a41238M8708R4133R8966k24811j15120O7240P5861L06005J76790k53460J86409
709C19483k49116p6366N28243m97794j77141K09011q9179q7619m1991J10730K96504
698B44765k43957M6230p4719j8352k03423k0606L40826L52407n52215K5315K84753
687A81024j71680M5306n6120l14948K20291K26817J91056J58809j79800M4385
677C45140n3955o2128J79872q6754j25771j39437N3031j33083L3401r8626L2830
666e5480J28559P390P2515j19918m5532J69924p7225l42875J00666M70924K8668
655C37616j51962j4243M6380j93157r5274L84086j72379m8345j20465J18924L22590
$$ y = [259213, 137548, 109782, 42250, -30507, -17493, -369677, -447928, -69241, 13914, 74507, -141238, -92530, 1603, 100569, -124242, -239362, -172122, -96261, 209744, 386534, 133074, 319483, 70367, -5999, 522244, 24450, -152691, 56320, -32859, -120478, -162469, -51739, 244765, 808, 47038, -27681, -46033, -249456, -270062, 70764, 423171, -129044, -103729, 181024, 9344, 54650, -1470, -316418, -96127, 130690, 321746, 480555, 300755, 345140, 291185, 229057, 408929, 322175, 196404, 56967, 109998, -23085, 10316, -88310, -55480, 73079, 80469, 152984, 33066, -12466, 157458, 80233, -262642, -161976, 308948, 337616, 185654, 171411, 217791, 24634, -70640, 313446, 141067, 92722, -27743, 91181, 413771]
644D13771j43916l50952k15441K90722K354J22702J7941J29596J93113k86455
634A73435k13245l6645j31485K24008j21589J67136J59309j80316l00730L27291
624F7169o4965L16063N391j00576J49578k74457m4518l12780M23983J28800j20024
613A73664q9315P1945Q9189l1621l2182k55443K8539m1128R071j94197k3943J98853
601i6568q5803k7186Q6136N7421j13767J91800J7609K71813k31089j64314K33212
590A39264o1821o1864j23433L79524l30471L03104J83004k55290j34540j52849
580a15372L1287L27703J61735k50509J96108m84010K87880N1434J21314j04729
570B22841P2802k57623n4109O2645J1918j19704L788K26137K44575q4305k75669
$$ y = [413771, 269855, -81097, -296538, -5816, -3462, 119240, 137181, 266777, 459890, 173435, -39810, -76455, -207940, 16068, -105521, 61615, 220924, 40608, -260122, 67169, 2204, 318267, 323658, 223082, 372660, 98203, 53685, -259095, 164888, 293688, 173664, 84349, 156294, 245483, 213862, 181680, -73763, -45224, -86352, -77281, -271478, -295421, -96568, -182371, -209557, -123421, -66000, -179767, 12033, 29642, 301455, 70366, -93948, 139264, 77443, 15579, -107854, 271670, -58801, 244303, 427307, 172017, 37477, -115372, -84085, 243618, 405353, 154844, 350952, -133058, 154822, 206256, 327570, 222841, 295643, 38020, -16089, 46556, 58474, -61230, -57442, 168695, 413270, 328965, 53296]
559E3296j27192J64201K19373l45994J35529O0546j03283K65K88214k68990k34079
548a58114k0225K8914J65392P9444j10798j4947k45564J64541L38748j11934k41035
537a25578N7897J22367k37128M6760J36719J79911o8062K60471J4468l97375k69925
526b79475J31036j3675J52072J4466K47015l8111K82812j42008l37291j75334
516a58493K04179j6878P3817j62000K1265J4524q7386K71795m2107o3247q6408
505c0939L63541K5738q8510m35509K53367N2440L31924k96588Q4937J45675l72873
494C3203R3815k91458J81978q1564J02247R8978N6587J37348m7001k17582o7108
483e57J42638L6190p3458J47398r1170o1633K23282l49211m9012n4007M43729
$$ y = [53296, -73896, 90305, 309678, -36316, 99213, 159759, 56476, 56741, 344955, 75965, -158114, -178339, -149425, 15967, 95411, -15387, -30334, -275898, -111357, 227391, 115457, -125578, -67681, 54686, -182442, -135682, 1037, 180948, 112886, 373357, 387825, -9550, -279475, -148439, -162114, -10042, 4424, 251439, 213328, 496140, 354132, 16841, -158493, 45686, 28808, 102625, -59375, -38110, -23586, -110972, 160823, 118716, 55469, -30939, 332602, 358340, 269830, -165679, 87688, 140128, 472052, 175464, 260401, 406076, 33203, 127018, -164440, 17538, -64026, 38221, 137199, 193786, 331134, 284133, 66551, -557, 142081, 178271, 104813, 252211, 161041, 99408, 322690, -26521, -75533, -129540, 314189]
472C14189O3590l40959o2275K05569j68494J76508j79078r3984N376L06636m99562
461b72484j47539K49995J69369L0610m69006N16682m174r3022k00968L94916j12776
450F1603m3118J15771J10191l03463J76201N6937k58775Q9433J37347k19883J99676
439A21920J25236j88971L8382j76620r6700k4886L73092k25597l1869J26268m9317
428i062j40100L22806j92859N2334j44783L6062J82955R0203R708j71009l541
417C2714M1190l3992r3709J17472n1444p5546J54509k51153N6805L34112l41386
406a10428N381M95953k16265J77856k44764l4531N2007K02559K51042m96619P7604
395A59795K22377n7820j30054N3618j29053K11569n0552m9337j4599l0615J9420
$$ y = [314189, 377779, 36820, -25455, 180114, 11620, 188128, 9050, -84934, -79558, 227078, -272484, -420023, -170028, -659, 29951, -439055, 77627, 73453, -19569, -220537, 174379, 61603, 18485, 134256, 244447, -59016, 117185, 174122, -84653, 4780, 142127, -77756, 121920, 247156, 58185, 96567, -80053, -176753, -201639, 171453, -54144, -86013, 40255, -9062, -149162, 173644, -19215, 33119, -111664, -75602, 107353, 197556, 207264, 36255, 32714, 73904, 39912, -53797, 63675, 12231, -63315, 91194, -159959, -103154, 230958, -110428, -105047, 390906, 174641, 352497, 107733, 73202, 125209, 327768, 578810, 82191, 159795, 382172, 324352, 194298, 247916, 118863, 330432, 279880, 230543, 215944, 185329, 204749]
384B04749K04593R881r5037k85423K07474j17089k06555p5417o8943k0082K51704
373I855K53926j25476j14421j40174J08082J23228J7454rj9717j64819k9759O9983
$$ y = [204749, 409342, 419223, 324186, 38763, 246237, 129148, -77407, -152824, -221767, -241849, 9855, 263781, 138305, 23884, -116290, -8208, 115020, 132474, 132465, 112748, -52071, -81830, -11847]
$$ [...]
##END NTUPLES=NMR SPECTRUM
##END=
