##TITLE=1H_CA-9280-2
 CDCl3
 8 sc, 
 2.9.2024
##JCAMPDX= 6.0         $$ Bruker NMR JCAMP-DX V2.0
##DATA TYPE= NMR SPECTRUM
##DATA CLASS= NTUPLES
##ORIGIN= UXNMR, Bruker Analytische Messtechnik GmbH
##OWNER= root
$$ XWIN-NMR		Version 3.5
$$ Mon Sep  2 14:02:36 2024 Russian Standard Time (UT+4h)  she@DPX200
##.OBSERVE FREQUENCY= 200.1318
##.OBSERVE NUCLEUS= ^1H
##.ACQUISITION MODE= SIMULTANEOUS
##.ACQUISITION SCHEME= undefined
##.AVERAGES= 8
##.DIGITISER RES= 18
##SPECTROMETER/DATA SYSTEM= spect
##.PULSE SEQUENCE= zg30
##.SOLVENT NAME= D2O
##.SHIFT REFERENCE= (INTERNAL, D2O, 0, 20.9782)
##AUDIT TRAIL= $$ (NUMBER, WHEN, WHO, WHERE, WHAT)
$$ ##TITLE= Audit trail, XWIN-NMR		Version 3.5
$$ ##JCAMPDX= 5.01
$$ ##ORIGIN= Bruker BioSpin GmbH
$$ ##OWNER= she
$$ F:/spectra/data/she/nmr/H-F/1/pdata/1/auditp.txt
$$ ##AUDIT TRAIL=  $$ (NUMBER, WHEN, WHO, WHERE, WHAT)
(   1,<2024-09-02 14:01:32.71 +0400>,<she>,<DPX200>,
      <created by zg, POWCHK disabled, PULCHK disabled
       configuration hash MD5:
       00 E9 B6 7A A2 85 ED C7 34 08 36 98 17 FE 4E 26
       data hash MD5: 16K
       BF A9 C8 D9 FD 8A 75 E8 2C 81 5C 51 4F 7E 9D 6C>)
(   2,<2024-09-02 14:01:35.12 +0400>,<she>,<DPX200>,
      <Start of raw data processing
       efp BC_mod = 2 LB = 0.24 FT_mod = 6 PKNL = 1 PHC0 = -25995.93 PHC1 = 12.58748 SI = 16K 
       data hash MD5: 16K
       B7 6E 0F 2D AF 68 A8 74 2A 00 62 4E BB 3F DD DC>)
(   3,<2024-09-02 14:01:53.48 +0400>,<she>,<DPX200>,
      <pk PHC0 = 6.762354 PHC1 = -4.400001 
       data hash MD5: 16K
       8F F5 C9 57 1D 83 22 94 B9 F4 1F 8D CC CD D5 6E>)
(   4,<2024-09-02 14:01:56.93 +0400>,<she>,<DPX200>,
      <abs ABSG = 5 
       data hash MD5: 16K
       84 CC 74 94 66 34 B3 84 BA A5 20 FB 74 59 03 54>)
$$ ##END=
$$ 
$$ hash MD5
$$ 3F AF 0E CE 19 64 5A B1 B9 50 63 D6 63 71 FF E1
##$RELAX= 
##$RELAX= 
##$RELAX= 
##$RELAX= 
##$RELAX= 
##$RELAX= 
$$ Bruker specific parameters
$$ --------------------------
##$DU= <F:/spectra>
##$EXPNO= 1
##$NAME= <H-F>
##$PROCNO= 1
##$TYPE= <nmr>
##$USER= <she>
##$AMP= (0..31)
100 100 100 100 100 100 100 100 100 100 100 100 100 100 100 100 100 100 
100 100 100 100 100 100 100 100 100 100 100 100 100 100 
##$AQSEQ= 0
##$AQ_mod= 1
##$AUNM= <au_zg>
##$AUTOPOS= <>
##$BF1= 200.13
##$BF2= 200.13
##$BF3= 200.13
##$BF4= 200.13
##$BF5= 200.13
##$BF6= 200.13
##$BF7= 200.13
##$BF8= 200.13
##$BYTORDA= 1
##$CFDGTYP= 0
##$CFRGTYP= 5
##$CHEMSTR= <none>
##$CNST= (0..31)
1 1 145 1 1 1 1 1 1 1 1 1 1 1 1 1 1 1 1 1 1 1 1 1 1 1 1 1 1 1 1 1 
##$CPDPRG= <>
##$CPDPRG1= <>
##$CPDPRG2= <>
##$CPDPRG3= <>
##$CPDPRG4= <mlev>
##$CPDPRG5= <mlev>
##$CPDPRG6= <mlev>
##$CPDPRG7= <mlev>
##$CPDPRG8= <mlev>
##$CPDPRGB= <>
##$CPDPRGT= <>
##$D= (0..31)
0 1.2 0 0 0 0 0 0 0 0.06 0 0.03 0 0 0 0 0.0002 0 0 0 0 0 0 0 0 0 0 0 0 
0 0 0 
##$DATE= 1725271292
##$DBL= (0..7)
120 120 120 120 120 120 120 120 
##$DBP= (0..7)
150 150 150 150 150 150 150 150 
##$DBP07= 0
##$DBPNAM0= <>
##$DBPNAM1= <>
##$DBPNAM2= <>
##$DBPNAM3= <>
##$DBPNAM4= <>
$$ [...]
##$SUBNAM3= <"">
##$SUBNAM4= <"">
##$SUBNAM5= <"">
##$SUBNAM6= <"">
##$SUBNAM7= <"">
##$SUBNAM8= <"">
##$SUBNAM9= <"">
##$SW= 24.0689170037331
##$SWIBOX= (0..15)
0 0 2 0 0 0 0 0 0 0 0 0 0 0 0 0 
##$SW_h= 4816.95568400771
##$TD= 16384
##$TD0= 1
##$TE= 0
##$TE2= 300
##$TE3= 300
##$TEG= 300
##$TL= (0..7)
0 120 120 120 120 120 120 120 
##$TP= (0..7)
150 150 150 150 150 150 150 150 
##$TP07= 0
##$TPNAME0= <>
##$TPNAME1= <>
##$TPNAME2= <>
##$TPNAME3= <>
##$TPNAME4= <>
##$TPNAME5= <>
##$TPNAME6= <>
##$TPNAME7= <>
##$TPOAL= (0..7)
0.5 0.5 0.5 0.5 0.5 0.5 0.5 0.5 
##$TPOFFS= (0..7)
0 0 0 0 0 0 0 0 
##$TUNHIN= 0
##$TUNHOUT= 0
##$TUNXOUT= 0
##$USERA1= <user>
##$USERA2= <user>
##$USERA3= <user>
##$USERA4= <user>
##$USERA5= <user>
##$V9= 5
##$VALIST= <valist>
##$VCLIST= <CCCCCCCCCCCCCCC>
##$VD= 0
##$VDLIST= <DDDDDDDDDDDDDDD>
##$VPLIST= <PPPPPPPPPPPPPPP>
##$VTLIST= <TTTTTTTTTTTTTTT>
##$WBST= 1024
##$WBSW= 4
##$XGAIN= (0..3)
0 0 0 0 
##$XL= 0
##$YL= 0
##$YMAX_a= 150247
##$YMIN_a= -131165
##$ZGOPTNS= <>
##$ZL1= 120
##$ZL2= 120
##$ZL3= 120
##$ZL4= 120
##$ABSF1= 20.97822
##$ABSF2= -3.090912
##$ABSG= 5
##$ABSL= 3
##$ALPHA= 0
##$AQORDER= 0
##$ASSFAC= 0
##$ASSFACI= 0
##$ASSFACX= 0
##$ASSWID= 0
##$AUNMP= <proc_1d>
##$AZFE= 0.1
##$AZFW= 0.1
##$BCFW= 0
##$BC_mod= 2
##$BYTORDP= 0
##$COROFFS= 0
##$CY= -3
##$DATMOD= 1
##$DC= 0
##$DFILT= <>
##$DTYPP= 0
##$F1P= 0
##$F2P= 0
##$FCOR= 1
##$FTSIZE= 16384
##$FT_mod= 6
##$GAMMA= 0
##$GB= 0
##$INTBC= 1
##$INTSCL= 3.70164e-10
##$ISEN= 128
##$LB= 0.24
##$LEV0= 0
##$LPBIN= 0
##$MAXI= 10000
##$MC2= 0
##$MEAN= 0
##$ME_mod= 0
##$MI= 1.114404
##$NCOEF= 0
##$NC_proc= -7
##$NLEV= 6
##$NOISF1= 3.799351
##$NOISF2= 2.8
##$NSP= 0
##$NTH_PI= 0
##$NZP= 0
##$OFFSET= 20.97822
##$PC= 1
##$PHC0= -25989.17
##$PHC1= 8.187479
##$PH_mod= 1
##$PKNL= yes
##$PPARMOD= 0
##$PSCAL= 0
##$PSIGN= 0
##$REVERSE= no
##$SF= 200.130010105606
##$SI= 16384
##$SIGF1= 3
##$SIGF2= 2
##$SINO= 5.538805
##$SIOLD= 16384
##$SREGLST= <1H.CDCl3>
##$SSB= 0
##$STSI= 16384
##$STSR= 0
##$SW_p= 4816.95568400771
##$SYMM= 0
##$S_DEV= 0
##$TDeff= 16384
##$TDoff= 0
##$TI= <>
##$TILT= no
##$TM1= 0
##$TM2= 0
##$TOPLEV= 0
##$USERP1= <user>
##$USERP2= <user>
##$USERP3= <user>
##$USERP4= <user>
##$USERP5= <user>
##$WDW= 1
##$XDIM= 16384
##$YMAX_p= 359559235
##$YMIN_p= -602855
$$ End of Bruker specific parameters
$$ ---------------------------------
##NTUPLES= NMR SPECTRUM
##VAR_NAME=  FREQUENCY,     SPECTRUM/REAL,   SPECTRUM/IMAG
##SYMBOL=    X,             R,               I
##VAR_TYPE=  INDEPENDENT,   DEPENDENT,       DEPENDENT
##VAR_FORM=  AFFN,          ASDF,            ASDF
##VAR_DIM=   16384,         16384,           16384
##UNITS=     HZ,            ARBITRARY UNITS, ARBITRARY UNITS
##FACTOR=    0.29402158847633, 1,            1
##FIRST=     4198.37137778818, 0,            0
##LAST=      -618.584306219526, 0,           0
##MIN=       -618.584306219526, -602855,     0
##MAX=       4198.37137778818, 359559235,    0
$$ Real data points
##PAGE= N=1
##DATA TABLE= (X++(R..R)), XYDATA
$$ [...]
6655A794607j71335J29499k23246J21043l08638K2499J14297l796j54850l0811
6645A289269k0436O8960J61866m9605J10653J11900r9997J20228m1141j9999K9526
6634A661224j01432L7484k40645N2230j78884K51211L1031j22361k03511J1621
6624A197968J25890j36606M5337R6189p7383l6393j05275J82028j08650j16588
6614A066517q8790m846J85609k33050K77324j30972J60946n8418j0765m5123J15431
6603A233863o4398j10066Q1361l796j04876J99818n469m0563j59807j77997R3887
6592I41957L8765j18657K2756K26871j18673K3956j14826n2229k6285K127J33307
6581I59069L2419J14300j9829r7495M0164l0752M5109l4751j31330r4118J33951
$$ plain form
6655 1794607 1623272 1752771 1529525 1650568 1341930 1364429 1478726 1474930 1320080 1289269
6645 1289269 1268833 1337793 1499659 1450054 1560707 1672607 1572610 1692838 1651697 1631698 1661224
6634 1661224 1559792 1597276 1356631 1408861 1229977 1481188 1512219 1389858 1186347 1197968
6624 1197968 1323858 1187252 1232589 1328778 1251395 1215002 1109727 1291755 1183105 1066517
6614 1066517 977727 972881 1158490 925440 1202764 1071792 1232738 1174320 1163555 1118432 1233863
6603 1233863 1169465 1059399 1140760 1136964 1032088 1231906 1226437 1185874 1026067 848070 941957
6592 941957 980722 862065 884821 1111692 993019 1016975 902149 849920 823635 825762 959069
6581 959069 991488 1105788 1085959 988464 1028628 997876 1042985 1008234 876904 782786 916737
6570I16737k2017k1469K1617n0554j38115L04888O9408M1954k21281n9098R8465
6559I40535o0102q4541L0843k60911n5527J89717J24283P539J53027j2774j64487
6548H07602O0619k57279J26075L0532j8045p8141O1702r3947J16232j6952J71422
6537I09820k09704k9066r240L71218o7182M986j16466p8461Q2496k70666M1023
6526F28758O9505r9939j5867Q2679Q3550r0430K0144K37563j26992J6716k38092
6515E67595K23241j5056k31220O4160Q238O3587J32305j77629P8255N9877l2208
6504G41145j55117J26287P630m26475R3631J12888J49437j32718k4425O2576J242
6493E56101J52238k95307R6138N6663j89609Q6515K6028Q9362r231N7289J95573
$$ plain form
6570 916737 894720 873251 894868 844314 706199 1011087 1080495 1122449 901168 842070 940535
6559 940535 880433 795892 826735 565824 510297 700014 824297 831836 984863 972089 807602
6548 807602 868221 610942 737017 767549 749504 671363 733065 639118 755350 738398 909820
6537 909820 700116 671050 661810 1033028 965846 970832 854366 775905 858401 587735 628758
6526 628758 698263 598324 582457 665136 748686 658256 678400 915963 788971 805687 567595
6515 567595 790836 775780 544560 608720 616958 680545 812850 635221 713476 773353 741145
6504 741145 586028 712315 719945 293470 387101 499989 649426 516708 492283 554859 556101
6493 556101 708339 413032 509170 565833 376224 462739 488767 578129 568898 626187 821760
6482H21760k7325j41382j34491J54148P2175p0230j37854j88949J27266O9137
6472E44255k09363J98222k3933J27985j21316o2647J93292o7051j25381n3506
6462D00557R9066j09114K67604L5397j62110L6413r8746j79158J28105J08970
6452E26984j88648Q4287J06615l7036J69253j71204j4815K10935q1175r7061Q4192
6441E92327o7680R5975M5929k29109J69843L8218l1592r9496j7059J50379j78420
6430D69315q0073R8767j58560L3915k902k20834N9139J28214K65948q6084j65925
6419C40920J23667K42449k42014K33798k37183j81972L8977J17755K47838k57738
6409D26497J35467J77827M6210l39222q3780N7806J03520k86781j95985J03957
$$ plain form
6482 821760 794435 653053 518562 672710 744885 674655 536801 347852 475118 544255
6472 544255 334892 533114 509181 637166 515850 453203 646495 579444 454063 400557
6462 400557 499623 390509 658113 693510 531400 567813 469067 289909 418014 526984
6452 526984 338336 422623 529238 492202 661455 490251 475436 686371 605196 508135 592327
6441 592327 524647 620622 666551 437442 607285 645503 613911 514415 497356 647735 469315
6430 469315 389242 488009 329449 363364 360462 139628 198767 326981 592929 506845 340920
6419 340920 464587 707036 465022 698820 461637 279665 318642 436397 684235 426497
6409 426497 561964 739791 786001 446779 362999 420805 524325 237544 41559 145516
6399A45516J81523j34554R6312J19618l883J9810q7064K65661l52012L4489R9103
6388C84519M3468k4897j67466m926J07599m4621J83009j18299j77485L3702J93046
6377D07649K44814l32233J75993J9511p8611m6435j96655k1887N683r2988L74293
6366D59134L8310p3621k4115p98j97228R4399J2600J87591o2838n2150R9195o7581
6354D12898J36054K2913q3345j84354L2186j83411K04916K38012j68379j62968
6344B64522m9024n6857L5075K450P8194k2598q8401K08895j09657N2468r800J1971
6332C17238P978j43808l416l0523J06206J47677j36449L2752K18810k93131k03672
6321A9662J58772J26737R2383J45470j15380m30676R6234J22539K8567m2396L7129
$$ plain form
6399 145516 327039 192485 288797 408415 404532 424342 337278 602939 250927 285416 384519
6388 384519 427987 403090 235624 230698 338297 293676 476685 358386 180901 214603 407649
6377 407649 652463 320230 496223 515734 437123 390688 194033 172146 177829 84841 459134
6366 459134 497444 423823 399708 398910 201682 296081 308681 496272 433434 381284 480479 412898
6354 412898 548952 571865 488520 304166 336352 152941 357857 595869 427490 264522
6344 264522 215498 158641 193716 196166 274360 251762 163361 372256 262599 315067 305267 317238
6332 317238 325216 181408 177992 147469 253675 401352 264903 297655 516465 223334 19662
6321 19662 178434 305171 397554 543024 427644 -3032 93202 215741 244308 201912 239041
6310B39041Q6459o1024l48n3428J33422Q1070K0236j83351j60187J27445j90847
6299C8488K60128R4718j36954L1132J8545p0383k16001J59234N5992j12228K1850
6288A44521P5826l4984j24922q6842O8755L50787j63713r6926J75802k9034K7025
6277C06295n7180L0962q6610J19232l6316O8175j99394O3172J56878j35590k26143
6266C481K4178K35812p4624j97295P9288L4042K36320M7743j00506o787R098j73028
6254A17722m8111k42527L43550j44523J54524J77915K3202p7323j77138J15825
6244B43116o1500L4600J1391j4547P4781k5443R9951j45399o7973l7937J78015
6233B89055R2647k45640N1898P025L9356J14046J1138k40076m6073r0285N7037
$$ plain form
6310 239041 325500 264476 264128 210700 344122 425192 445428 262077 101890 229335 38488
6299 38488 298616 393334 256380 287512 306057 235674 19673 178907 234899 122671 144521
6288 144521 220347 185363 60441 -26401 42354 393141 229428 132502 308304 279270 306295
6277 306295 249115 280077 193467 312699 276383 344558 145164 208336 365214 229624 3481
6266 3481 27659 263471 188847 -8448 70840 104882 341202 388945 288439 281652 290750 117722
6254 117722 69611 -172916 170634 26111 180635 358550 381752 304429 127291 243116
6244 243116 181616 216216 227607 213060 287841 262398 362349 216950 148977 111040 289055
6233 289055 381702 136062 187960 194985 234341 348387 359525 119449 73376 -16909 40128
6222D0128N3263R2059m7527R8871L8861J94338Q6267j21432k22417J38228L8041
6211C88680k34957k69166J25230P8541k0441l7560L18608k55638k7835j0188j88299
6200a33025L39322Q2899M7394k11120j32202J12185k1649q7698J89587j15326
6190G0367k464J86272J34848J00247m26563K3709J77067j29553r3504J03274l3911
6179A09789j0592j06305R4868J53595k9787m5485l12244J29334J20928J69892
6169B73993M5976j67582O0508J07780p8704m2659p4402k22574R8743j7195J54468
6158A38352P5243j24610J93301K0936m7632k09789J66698K30612k86360j16994
6148C9757Q6935J15421k6120j48524k08064J96224k21025O4517K0573J00633l1111
$$ plain form
6222 40128 93391 185450 137923 236794 275655 469993 556260 434828 212411 350639 388680
6211 388680 153723 -115443 9787 88328 67887 30327 348935 93297 65462 55274 -133025
6200 -133025 206297 289196 336590 125470 -6732 105453 83804 -3894 185693 70367
6190 70367 67903 254175 389023 489270 62707 86416 263483 133930 40426 143700 109789
6179 109789 99197 -7108 87760 241355 211568 166083 -146161 -16827 104101 273993
6169 273993 319969 152387 212895 320675 241971 199312 124910 -97664 1079 -16116 138352
6158 138352 213595 88985 282286 303222 255590 45801 212499 443111 156751 39757
6148 39757 126692 242113 215993 67469 -140595 55629 -165396 -100879 -80306 20327 -10784
6137a0784J05063J45831n3557M2849j54309j25574P8522J69534Q3699j96717j10615
6126b6058K80747O7667k54645j13278K74414j63236l5892Q202J0940j08347R3934
6115C4448J34403k4485j75303K03479K2243K2808J20247j66068Q9443m0145k45060
6104b3990J40574J58339j06987j40465j30077L03659k46026j43569K00989Q8342
6094A00789j84750o5178J46266j09M1832n0648l2066P7064k3171r224J59101k98672
6082a38766l5921J16790m0138J01739K95394r766P0756o5744n9982j31335K3208
6071A26235K584j49454J05734J49082n7189j87325M4843J84806K4020j41791P7348
6060A78893k26523L8619J51915k46513L9588J04593j05583J2720l4745P1958J4492
$$ plain form
6137 -10784 94279 240110 186553 229402 75093 -50481 28041 197575 281274 84557 -26058
6126 -26058 254689 322356 67711 -45567 228847 65611 29719 37921 48861 -59486 34448
6115 34448 168851 144366 -30937 172542 194785 217593 337840 171772 261215 221070 -23990
6104 -23990 116584 274923 167936 27471 -102606 201053 -44973 -188542 12447 100789
6094 100789 -83961 -149139 -2873 -2982 38850 -11798 -43864 33200 10029 805 159906 -138766
6082 -138766 -174687 -57897 -98035 3704 299098 289332 360088 294344 234362 103027 126235
6071 126235 128819 -20635 85099 234181 176992 -10333 34510 219316 243336 101545 178893
6060 178893 -47630 -9011 142904 -103609 -64021 40572 -65011 -52291 -87036 -15078 -586
6049e86j07902J30849J56024j10205k7542Q4812n2478o9889j43485J85589j26302
6038h1115J34891o3481j06088j43341j04967J26687L25807q071k05314N2301j18144
6027a90835K73816n0079k10930K40813r670j88704J91371n4883m2834J66944j0565
6016A14444o453j61616J90937Q0422j72775j76486O8173L1911o9853R9325J67816
6005A65845R9058m13374J96874k03300N2354r0297j7142R6056Q4372J5856P341
5994f357j20059k9221M11017j00458j71223j84933J95013J3053N5333J60186j55465
5983F6886l2083m8043j811l0403n0594J58141l4431k76990J50837M18646k50009
5972G0146j40167J77777q1327k32419K88727p5074k0307o0358M7481m6675r1227
$$ plain form
6049 -586 -108488 22361 178385 68180 40638 125450 72972 3083 -140402 45187 -81115
6038 -81115 53776 -9705 -115793 -259134 -364101 -237414 88393 80322 -124992 -72691 -190835
6027 -190835 82981 32902 -178028 62785 53115 -135589 55782 899 -41935 125009 114444
6016 114444 107991 -53625 137312 217734 44959 -131527 -63354 -31443 -101296 -1971 165845
6005 165845 264903 -148471 48403 -154897 -102543 -192840 -209982 -113926 -29554 -13698 -6357
5994 -6357 -126416 -155637 255380 154922 -16301 -201234 -6221 6832 62165 222351 66886
5983 66886 34803 -13240 -15051 -45454 -96048 62093 27662 -249328 -98491 320155 70146
5972 70146 -70021 107756 26429 -205990 82737 7663 -12644 -73002 -25521 -72196 -163423
5961a63423N9778K54306m5931o5346j06935M0168K29229o9402p6812k8820J56055
5950A82867j18539k19915k5209J95181j12425j7010j6597q2278P9662K05179r4982
5939b4066J45595l79705K76961q4968L8747J3895R3220j99251O6908K5650j88909
5928b15923J51966J44929k9683r0850N7793K832Q5044k9983J36118j08082k03958
5917i9797j7965P6254r0449J02745R688q8460N6328j05003Q3559M9033j26264
5906a50331L8668j20897j47314K1295J46954m6249R3199J81738M0629j35560Q1957
5895D089K0368r0814j85537j26197J97128L1854J99127L8226j59257k0685j42365
5884b34063J31757P6505N6364k12027J04154q6675k1308O9916P5239J53466j9063
$$ plain form
5961 -163423 -103645 150661 104730 39384 -67551 -27383 201846 132444 55632 26812 182867
5950 182867 64328 -155587 -180796 14385 -98040 -115050 -131647 -213925 -134263 70916 -24066
5939 -24066 121529 -258176 18785 -66183 -27436 -13541 79679 -119572 -52664 -27014 -215923
5928 -215923 -63957 80972 51289 -39561 18232 21064 106108 76125 212243 104161 -99797
5917 -99797 -117762 -41508 -131957 -29212 -19524 -107984 -51656 -156659 -73100 -24067 -150331
5906 -150331 -111663 -232560 -379874 -358579 -211625 -257874 -164675 17063 57692 -77868 4089
5895 4089 24457 -66357 -251894 -378091 -180963 -149109 50018 88244 -71013 -91698 -234063
5884 -234063 -102306 -25801 30563 -181464 -77310 -163985 -185293 -115377 -40138 113328 94265
5873I4265j53969n1877l0998k3241K17527m9492q2213M4954K5174J70392J27176
5862B87698m4987k01988M458K6260J2489k1217J32833M290j03450J43133J13400
5851C52919r4395j1019K51374j5933k1247J495j45350p3084p4549n4372p9993
5840C5846q5737J80132r5207k03686K9619K2576k9183J90293P1563j60459j24093
5829a68336K5658J74038j59294Q6645j86563Q4505j0757J65737R9657k3395k38155
5818a50260P300L0520k4358m460j64222K22740r7043j95000J51365J10245L4697
5807g8476M0860l0744j58907J23743L504j12104N9999P3239o1604k6301N6617
5796a10174p4834L0712j9917k7587q6088K93218m7066L62660j86532j7898j2605
$$ plain form
5873 94265 -59704 -111581 -142579 -165820 51707 2215 -79998 -35044 -9870 160522 287698
5862 287698 242711 40723 45181 71441 83930 62713 195546 199836 96386 239519 352919
5851 352919 258524 247505 498879 482946 461699 463194 317844 244760 170211 115839 35846
5840 35846 -49891 130241 35034 -168652 -139033 -116457 -145640 44653 116216 -44243 -168336
5829 -168336 -142678 31360 -127934 -41289 -227852 -143347 -154104 11633 111290 87895 -150260
5818 -150260 -142960 -112440 -136798 -141258 -305480 -82740 -179783 -374783 -223418 -113173 -78476
5807 -78476 -37616 -68360 -227267 -103524 -100020 -212124 -152125 -78886 -140490 -166791 -110174
5796 -110174 -185008 -154296 -174213 -201800 -287888 5330 -41736 320924 134392 116494 103889
5785A03889j71130j48511j4823J77702J2374j49930q4698p9513J08176L1367r7288
5774c12385p6712l6251O3463K35434n3962q519O0086o8911P0057k36592L9066
5763c25226K47941j5266l2355R0936o0877k00322K73199p9793p6378J25121k01977
5752b54997N219K3134M7130n3142j35183K0634J18805K52175q3714r8688p0175
5741b28802K39412k62531J9473M8786N8863j52029j50940L35618p4123J75071
5731H798j2130R5286m587k27588O020M9427p6097J71969m7827j53717J45965M915
5719c9566J04568m5670r9077J52603k26453p5489j2460M2418j17280J30971k7879
5708b13314J88679N0767q1307P1385m2605l9777L5996j29936M7431j82455o416
$$ plain form
5785 103889 -67241 -215752 -230575 -52873 -40499 -190429 -275127 -354640 -246464 -215097 -312385
5774 -312385 -389097 -425348 -361885 -126451 -180413 -188932 -128846 -197757 -127700 -364292 -325226
5763 -325226 -77285 -92551 -124906 -33970 -94847 -295169 -21970 -101763 -178141 -53020 -254997
5752 -254997 -249778 -226644 -179514 -232656 -367839 -347205 -228400 23775 -59939 -158627 -228802
5741 -228802 10610 -251921 -232448 -183662 -124799 -276828 -427768 -92150 -166273 8798
5731 8798 -3332 91954 87367 -140221 -134201 -84774 -160871 11098 -36729 -190446 -44481 -39566
5719 -39566 65002 19332 -79745 72858 -153595 -229084 -241544 -199126 -316406 -185435 -213314
5708 -213314 -24635 26132 -55175 16210 -26395 -66172 -30176 -160112 -112681 -295136 -301552
5697c01552L28435R8116j79162J68378k0757q8632J5553k15234P6465J51236J7097
5686D9943k83870l3075P4901R1793J3541l0554R4434P1593j79805J06911j23450
5675a47638n9102r325k8746J04146k18460L5046K38696j01283l8407J73651J54877
5664A03455j58004P1256k6334j58448J88778k69126J33855K0323p5903Q4588Q5629
5653F9J10649J11813l53499j14830P5590j13073J67924p6510n6198m9579j3002
5642c10646K96570o7367J14116m6139J23934j84432l2054L5917j43650j26431
5632c40182J03873J98324j38722n2664P0948J06525m1800L2943j14613j24026
5622b99394K02886p3000n8028K17844j50919R1658J01218j27444r0807n4052J01373
$$ plain form
5697 -301552 26883 124999 -54163 114215 93458 4826 20379 -194855 -118390 32846 49943
5686 49943 -233927 -267002 -192101 -100308 -86767 -117321 -22887 48706 -131099 -24188 -147638
5675 -147638 -206740 -216065 -244811 -140665 -359125 -324079 -85383 -186666 -225073 -51422 103455
5664 103455 -54549 16707 -9627 -168075 20703 -248423 -114568 -94245 -170148 -85560 69
5653 69 110718 222531 -130968 -245798 -170208 -283281 -115357 -191867 -248065 -297644 -310646
5642 -310646 -14076 -81443 32673 -13466 110468 -73964 -106018 -70101 -213751 -340182
5632 -340182 -236309 -37985 -176707 -229371 -158423 -51898 -93698 -60755 -175368 -299394
5622 -299394 -96508 -169508 -227536 -9692 -160611 -68953 32265 -95179 -185986 -240038 -138665
5611a38665L72724j40015K14344M3061P0752j03045p329m7537j85642k76048j03065
5600c00465J5493O0875M9776P2096K33796j26516o7634Q1225J27733k42777j73382
5589b69780L7953O9798j20895P9861n3820J22825J79749j20780K0658p8480N9758
5578g3153M9713k22949K47599J35531j85887P161N9810j08233o6294m8304k9709
5567b34715J58889p0442M1577N4187M72j57669J22319J24388J6066j3932O6934
5556A08074p3990J26866l1547q4578k37746J78155J97149n1664L4002j23100j70379
5545a28758o2759Q4624k03060j16340K32747L35105K02974k57950j56379j24449
5535a94245k8660J72409K25279k00675n2578K88601Q5607p9424j4206p5301k107
$$ plain form
5611 -138665 234059 94044 308388 351449 422201 319156 311827 264290 78648 -197400 -300465
5600 -300465 -284972 -224097 -174321 -102225 131571 5055 -62579 18646 146379 -96398 -269780
5589 -269780 -231827 -162029 -282924 -203063 -256883 -134058 45691 -75089 -54431 -132911 -73153
5578 -73153 -23440 -246389 1210 136741 -49146 -41985 17825 -90408 -156702 -205006 -234715
5567 -234715 -75826 -146268 -104691 -50504 -50032 -207701 -85382 39006 55072 41140 108074
5556 108074 34084 160950 129403 44825 -192921 -14766 182383 130719 164721 41621 -128758
5545 -128758 -191517 -106893 -309953 -426293 -193546 141559 344533 86583 -69796 -194245
5535 -194245 -222905 -50496 174783 -25892 -78470 210131 295738 216314 202108 126807 124700
5524A24700m3947R9331J47845j11699O4564J28258l3022m5647N855l03525K8372
5513F1085j33188K32818J11736j99391q2979N8372J30919q1737k07999O1738L6348
5502a2278K12640N6510K5826k74621j29541j09472J16231J47359q0691K78444
5492B30407J29885l74905j95224J77217r1895R5449p2296K54457j26393o05j19299
5481i3202m4438J45765j67241M0801L4592Q5188K5608m9952K30801j80552K8751
5470E6121k53j9576J7390m6157R4374j05369K16971j30476K2851N2635J00631
5459B59142k67882m3020J48930l0347j18162R2850J15460q5135J22832j0424q3295
5448A00949J15643k80623J55285k6321J51873j59429R6991J47785n01k42443P4252
$$ plain form
5524 124700 80753 180084 327929 216230 280794 409052 376030 330383 336238 32713 61085
5513 61085 -72103 160715 272451 73060 -9919 48453 179372 97635 -110364 -48626 -12278
5502 -12278 200362 256872 282698 8077 -121464 -230936 -114705 32654 -48037 230407
5492 230407 360292 -14613 -209837 -32620 -124515 -29066 -101362 153095 26702 26097 -93202
5481 -93202 -137640 8125 -159116 -118315 -83723 1465 27073 -22879 207922 27370 56121
5470 56121 55868 36292 53682 7525 101899 -3470 213501 83025 105876 158511 259142
5459 259142 -8740 -51760 97170 66823 -51339 41511 156971 71836 194668 184244 100949
5448 100949 216592 -64031 91254 64933 216806 57377 154368 302153 301652 59209 133461
5437A33461K24718p0350o0625L2726R0109j50971J00382p1254j60617J46457j16169
5426I7867j03714m109J14019K08613K1503K7011J01612n8452r6955j21013j88844
5415b462L36019J31806j46120j59217J68210j63060O7597o2570Q6882j27704k1829
5404A07552R3807K7494m4265J81675J76582q4473l0463n9301O2314j39282j62459
5393A29181L01522m0552j47796J27578K01521r970j5912J51250K7541m0562j815
5382F81986M03444J95305j79097j19431K4825J72935o3700J86887K51899j65093
5372A389960Q7914L15929K268P8804Q3759L05550J41285j47179R4748k5899K27345
5361B554484K77964R0630L5386O1147L625J50244L55272P4858L31470j0753O1396
$$ plain form
5437 133461 358179 287829 227204 259930 350039 199068 299450 228196 67579 214036 97867
5426 97867 -5847 -9956 104063 312676 334179 361190 462802 404350 307395 186382 -2462
5415 -2462 333557 465363 319243 160026 328236 165176 232773 170203 257085 129381 107552
5404 107552 201359 228853 184588 366263 542845 458372 427909 368608 430922 291640 129181
5393 129181 430703 390151 242355 369933 571454 561484 545572 696822 724363 683801 681986
5382 681986 1085430 1280735 1101638 982207 1007032 1179967 1116267 1303154 1555053 1389960
5372 1389960 1477874 1793803 1796071 1874875 1958634 2264184 2405469 2258290 2353038 2327139 2554484
5361 2554484 2832448 2923078 2958464 3019611 3023236 3173480 3528752 3603610 3935080 3924327 3985723
5350C985723L53713J15062K64453K09158K67825J63645N0564K30229N20660M06438
5340F567470M76014L28865K77106M07493O48441L86012N54808M26049J050132
5331A1122390J106777P22663J048113J069164J430846J263674J618438J974126
5323B1356191K034119K163005L030058L346401L718628M009705M208657L653733
5315D7520497K218054J192120r77131k570551l522399l962255m145841l896529
5307C1855965l615763l218513k469033k516498j911130j567680j222600j203002
5299A4131746j170866j072853q30541r62984p71691n10569o55186n75744m27778
5290G153534l63609n01605m07778n58254k49089j2115m64793l03505p4907j50954
$$ plain form
5350 3985723 4339436 4454498 4718951 4928109 5195934 5359579 5410143 5640372 6161032 6567470
5340 6567470 7043484 7372349 7649455 8056948 8705389 9091401 9646209 10072258 11122390
5331 11122390 12229167 12951830 13999943 15069107 16499953 17763627 19382065 21356191
5323 21356191 23390310 25553315 28583373 31929774 35648402 39658107 43866764 47520497
5315 47520497 49738551 50930671 49953540 47382989 43860590 39898335 35752494 31855965
5307 31855965 28240202 25021689 22552656 20036158 18125028 16557348 15334748 14131746
5299 14131746 12960880 11888027 11057486 10094502 9322811 8812242 8157056 7581312 7153534
5290 7153534 6789925 6288320 5880542 5322288 5073199 5061084 4596291 4292786 4217879 4066925
5280D066925k62713j51415k72189m4551j05153l66313P603m9028J614k14152r0530
5269B520098m3572j38298r341j57709l4732j68142K36888k7427j07913l49340
5259A720512j03776o0805j54534J82601Q1905n1892k8258J16639j73291n9725
5249A469376j9031r1551N0186k6434j05367k26363j11072K20497o21J69952p7092
5238A252480O9375l41518n1751J86050j10835k73526l9371j2564L38378k23192
5228G93526k25547j4109o2835J27448J04164R210r8511O1865r6963q377N2627
5217F42498k00742K4932L39381j30722j73854n0869L0448J01573Q1531Q7459j65312
5206E86323n0489j36754q9407j66783L4537j88494R120K40880r54m102p8284Q8971
$$ plain form
5280 4066925 3804212 3652797 3380608 3336057 3230904 2864591 2872194 2823166 2824780 2610628 2520098
5269 2520098 2476526 2338228 2328887 2171178 2136446 1968304 2205192 2177765 2069852 1720512
5259 1720512 1616736 1555931 1401397 1583998 1665903 1614011 1585753 1702392 1529101 1469376
5249 1469376 1450345 1358794 1408980 1382546 1277179 1050816 939744 1160241 1159620 1329572 1252480
5238 1252480 1321855 980337 928586 1114636 1003801 730275 690904 678340 1016718 793526
5228 793526 567979 553870 491035 618483 722647 731857 633346 695211 598248 589871 642498
5217 642498 441756 466688 806069 675347 501493 450624 481072 582645 664176 751635 586323
5206 586323 535834 399080 309673 142890 177427 -11067 -1947 238933 237979 233877 155593 244564
5194B44564j32839J05717j21120M1929J60802J40469N340J9235R1749k55630Q0674
5183C80890k7651J1093n6415L1833k66139N2346Q3554M9473J45416l8810n6108
5172C09482j01446K61756j79789P7111R1435K7124N8417n3570j18268Q1130j19821
5161C33561J9730m7391J12610Q1507j63905J6223m7579J67697j3360L0506p4233
5150D15366J31690M196j28740P1225p171K81665l49447R5329o5129N8223j8536
5139D88671j8616K20860o5282o4306j59163J25924J0759P5186j18852m412k85254
5128B05515m1473N9378l9976M9076N7192p5943j16105J0903O1310R3048K20733
5117D83658j91065k6939O1487n9108K15414k17636j37964J23159O0128j12108
$$ plain form
5194 244564 111725 217442 96322 138251 299053 439522 444862 464097 555846 300216 380890
5183 380890 353239 364332 307917 339750 73611 125957 209511 258984 404400 365590 309482
5172 309482 208036 469792 290003 367114 458549 485673 544090 490520 372252 453382 333561
5161 333561 353291 305900 418510 500017 336112 352335 304756 472453 459093 489599 415366
5150 415366 547056 551252 422512 493737 486566 768231 418784 514113 448984 507207 488671
5139 488671 470055 690915 625633 561327 402164 528088 538847 614033 495181 490769 205515
5128 205515 164042 223420 183444 232520 289712 213769 97664 108567 169877 262925 483658
5117 483658 292593 265654 327141 268033 483447 265811 127847 251006 311134 199026
5107A99026j27558j02823L51487K4319k79783R5564R1059J17851j57184k12660
5097g02J40904O7346k27092q7800J14814j12391J71425O1338j88608J86667m0296
5086H5605l57130N3899J49001L8724k4436L28582k01737M6414L9324J1187l1931
5075A37502n9744k03314K14133j8920L0427L828j21984K82352j25187k24685r2126
5064a77718K91291j3886l3625j05251K24756j96977k47550J24840p9948J22358
5054i1710J10751R3856j79093k59042M9631p162K81875L6242j43321M9028K8577
5043c0368j78974R7157J25938K21133k78353j85916j29592J84432q6470J21527
5033a39486J83965k43191o2867k9447K43194p5883m4027j66276J04929J1988J83011
$$ plain form
5107 199026 71468 -31355 320132 344451 64668 160232 251291 369142 211958 -702
5097 -702 140202 207548 -19544 -107344 7470 -104921 66504 127842 -60766 125901 85605
5086 85605 -271525 -217626 -68625 -29901 -54337 274245 72508 118922 158246 169433 137502
5075 137502 77758 -125556 88577 69657 100084 103912 -18072 264280 139093 -85592 -177718
5064 -177718 113573 99687 66062 -39189 185567 -11410 -258960 -134120 -214068 -91710
5054 -91710 19041 112897 -66196 -325238 -275607 -282769 -894 35348 -107973 -58945 -30368
5043 -30368 -209342 -112185 13753 234886 -43467 -229383 -358975 -174543 -261013 -139486
5033 -139486 44479 -198712 -261579 -291026 -47832 -123715 -167742 -334018 -229089 -217101 -34090
5022c4090J2645R9036j74166O0583Q387l8837k2255K0019J74082k61422J87632
5011C1614l7135k07818O0018M5438R8818k20571j1047L39870p2379l8390m645
5000a6227m9977j99729R1168j04517J772N0498q896N0065R3515J41256Q5034r0526
4988D3436k9837j26842j70378L85078o8962Q771j03013j44477K03789j9318k1271
4977d3024m8092Q4292k08800o1206J1445J39520m7841J7995P4123j07292j14513
4966c03393K18310J12235k69446m573J00108K66829j42398k165l09152j64262
4956d97907J71117K17479M34849j31608j05185M8324k71136J34386L48543k55123
4946I3739J22876q1372k65157J64672j27062j3130J3337n0209P2048r5965Q2397
$$ plain form
5022 -34090 -21445 77591 -96575 -35992 -27605 -66442 -88697 -68678 105404 -156018 31614
5011 31614 -5521 -213339 -153321 -107883 -9065 -229636 -240683 99187 26808 -11582 -16227
5000 -16227 -66204 -265933 -174765 -279282 -277510 -227012 -235908 -185843 -92328 48928 133962 43436
4988 43436 13599 -113243 -283621 101457 32495 41266 -61747 -206224 -2435 -21753 -43024
4977 -43024 -91116 -6824 -215624 -276830 -265385 -125865 -173706 -155711 -81588 -188880 -303393
4966 -303393 -85083 27152 -242294 -246867 -146759 120070 -22328 -24493 -333645 -497907
4956 -497907 -326790 -109311 325538 193930 88745 137069 -134067 319 348862 93739
4946 93739 216615 135243 -129914 34758 -92304 -105434 -92097 -142306 -70258 -166223 -83826
4935h3826m8778l6513k7652M6088L8113L7885K3669j07432Q6151M4813n2083R9640
4923B0075p9127j43455O7147N1322J6741N9769r2525p2955j07337R1642K21931
4912C3228L6704Q1827K5631L2091k29669j37038O5018J64758J51343j13055K8712
4901A39550m3765r7349J73895j57736o1311K4099o1795J86313K3053J21554m5930
4890B00578r1427K91103j52749P148R7408j19287K23827R1116j59933l6100J44221
4879D95905n4622r8041J19702l30595p0508M24737r4004j30585J19998j09318
4869B72669j50514j65463L64055o8797j94327N2158j83222J933K47524l33666
4859a57650R8044K4523j7795K34262k02371j70894k09K60349j30015j3569M0657
$$ plain form
4935 -83826 -132604 -169117 -196769 -150681 -112568 -74683 -51014 -158446 -72295 -27482 -79565 20075
4923 20075 -59052 -202507 -135360 -84038 -67297 -7528 -100053 -173008 -280345 -188703 33228
4912 33228 69932 151759 177390 209481 -20188 -157226 -92208 72550 223893 110838 139550
4901 139550 95785 -1564 172331 14595 -46716 -22617 -84412 101901 124954 246508 200578
4890 200578 109151 400254 247505 254653 352061 232774 456601 547717 387784 351684 495905
4879 495905 441283 343242 462944 132349 61841 486578 392574 261989 381987 272669
4869 272669 122155 -43308 320747 251950 57623 109781 -73441 -71508 176016 -157650
4859 -157650 -59606 -35083 -52878 181384 -20987 -191881 -192090 68259 -61756 -75325 -34668
4848c4668j78788r2491J1056Q4077P3699L1513j90470R5027K8697K2646J72976
4837B3274r9282R8254m7530m4043j3864J38473P6488l4719J42741j81653k37749
4826a79610K2180O8439j14482k0284J12189l7737p5740J56798L8275O8351o3826
4815b5447r4369N9836m8084J66137j00888j87818K22908k25192M5074P975K66209
4804H6341r479k44421Q3667n2576q1482Q3320J32957J24640J80834j63606K0034
4793A60229l16935J1687j02649N3360J59099L2169k94961P3775J29593J04258
4783I625j43798p699M9365k07987Q5266J04782P376K38693k58741j16516J17978
4772a21656M6530J51281j85137K1272r1486R9329k18456j52388J37224K3481J92551
$$ plain form
4848 -34668 -213456 -305947 -294891 -210814 -137115 -105602 -296072 -201045 -172348 -149702 23274
4837 23274 -76008 22246 -25284 -69327 -83191 55282 131770 97051 239792 58139 -179610
4826 -179610 -157430 -88991 -203473 -223757 -111568 -149305 -225045 -68247 -29972 38379 -25447
4815 -25447 -119816 -59980 -108064 58073 -42815 -230633 -7725 -232917 -187843 -179868 86341
4804 86341 76862 -167559 -83892 -136468 -217950 -134630 -1673 122967 303801 140195 160229
4793 160229 -156706 -145019 -247668 -194308 -35209 -3040 -298001 -224226 -94633 9625
4783 9625 -134173 -141872 -92507 -300494 -215228 -110446 -103070 135623 -123118 -239634 -121656
4772 -121656 -75126 76155 -108982 -87710 -179196 -79867 -298323 -450711 -313487 -290006 -97455
4761i7455n6984p2844J24081o6936m4019o5546J16474J12880j10658p5687J79609
4750e7085j25720K28919k92394K1832P4509p5758M7372o60M6508R6671O6898j72920
4738a41828r840J95456R2013k28814J07217M5608j944j62074j30562L399J24239
4727a07130o7555l3284m096J05225J22919p693j8796p7675k57969K59637p0557
4716a56974Q6747J24517J15310j66099m9623j4421j1204J52787k22962J19489
4706b2433J45563r4066k51663P4816K38515m5548p0379r725m9450M7566p652l205
4694d7661j5259J06467j42858j38033O8668L244J44208q9942P4261M2645q7499
4683h1759R0490q3697k1989n4164J68429k31899k61093M36889K38577J63906k94170
$$ plain form
4761 -97455 -154439 -227283 -103202 -170138 -214157 -279703 -163229 -50349 -161007 -236694 -57085
4750 -57085 -182805 46114 -246280 -224448 -149939 -225697 -178325 -178985 -132477 -35806 31092 -141828
4738 -141828 -151668 43788 135801 -93013 14204 59812 57868 -104206 -234768 -231369 -107130
4727 -107130 -174685 -207969 -212065 -106840 16079 8386 -10410 -88085 -346054 -86417 -156974
4716 -156974 -70227 54290 169600 3501 -46122 -60543 -71747 81040 -141922 -22433
4706 -22433 123130 29064 -222599 -147783 90732 45184 -25195 -34920 -84370 -36804 -44456 -47661
4694 -47661 -62920 43547 -99311 -237344 -168676 -165432 -21224 -111166 -36905 5740 -81759
4683 -81759 8731 -74966 -96955 -151119 17310 -214589 -475682 -38793 199784 363690 69520
4672F9520k79883J75625R3492k5805J17022o7927o7775j53533O1140L6329l1300
4661g3095p6420N5933M00075k21372n1329P5149K3565r4751J47931J59727k88516
4650E6897r0102R9487k85972J09392J26920R4231P2644J19741j9192R4977j83451
4639A95572j53881J99974J71113N821j52154q8545J39872o4081j69425K88640
4629C72906j8705K4847J24479m1500Q480l0204q9372K47234L6767k11135J2837
4618D36634J14729N8826k51955P6898p9757J7046Q1995k05354O3961r8796o6582
4607A47645J04209K48057M8837j58460K5943Q6475k6741R6536K94451m5763j86806
4596F34383j40854J93737R5589k86541J1943J45727j0283r073j76868o3075j61733
$$ plain form
4672 69520 -210363 -34738 58754 32949 149971 82044 14269 -139264 -78124 -41795 -73095
4661 -73095 -149515 -93582 306493 85121 33792 108941 132506 37755 185686 345413 56897
4650 56897 -33205 66282 -219690 -110298 16622 110853 183497 303238 284046 379023 195572
4639 195572 41691 241665 412778 418599 266445 177900 317772 253691 84266 372906
4629 372906 354201 379048 503527 462027 470507 440303 350931 598165 634932 423797 436634
4618 436634 551363 610189 358234 435132 355375 372421 454416 249062 313023 214227 147645
4607 147645 251854 499911 548748 390288 416231 502706 475965 572501 866952 821189 634383
4596 634383 493529 687266 782855 496314 508257 653984 643701 634628 457760 394685 232952
4585B32952K81192j17837r5346j00202N2853K42492Q8002r0783J10363P7547j25299
4574E55934K8639N7327l0048J86712O1507j50302J12256o3029l26541r5158L21372
4563F58669q3797q5697j49176L1712M4297J33814j5389J3076P8488j07266n309
4552E13422K36861k41038J43839n2905J42462j16990m4036O8341p1533j26241
4542D52182K10325J2529o4736r1611o1833J07783K22747R389k84j13212k07602
4531D75677J04712j65428q66J16723j54782n5103R7824p6460J93379N2949k40513
4520C48112R6371J01000L4762J48207m2823j49041K56739k32003o2215J02132
4510F01241P0761j44237j42675K4982Q7540r1209l46082M82613l2350j29599o5867
$$ plain form
4585 232952 514144 396307 300961 200759 253612 496104 584106 493323 603686 681233 555934
4574 555934 584573 641900 611852 798564 860071 709769 822025 758996 432455 337297 658669
4563 658669 574872 489175 339999 371711 416008 549822 534433 547509 625997 518731 513422
4552 513422 750283 509245 653084 600179 742641 625651 581615 649956 578423 452182
4542 452182 662507 675036 610300 518689 456856 564639 787386 796775 796491 683279 475677
4531 475677 580389 414961 414095 530818 376036 320933 418757 342297 535676 588625 348112
4520 348112 444483 545483 580245 728452 685629 536588 793327 561324 499109 601241
4510 601241 672002 527765 385090 410072 497612 406403 60321 542934 510584 380985 315118
4499C15118j59914q389O8986O6969n6510k41636K16833j66716P670J64981K1691
4488B29083j33882K12137R6084o282j42214j12338K8603N8981J12753j70987J04884
4477B76822o1810q2614J44909r1425m0484r1647J10039J16702m6770J6101J66259
4466D16082k94336J2411j27179o4900J14920n5332M30927k42356j71780k6587
4456h130P8607K23009j06118j19827k7057L2513J10103k6596k1055k1939N5416
4445A68926Q9199k33435N3239L0131J37657j12789L1426J91114j67815M8478j05555
4434A30576r8160j6358K4813q2191j70346R6585j45856P3086L93689j13040o0550
4423C2248j24957J07086J75710j48875j8181J67513k992L6077j67656J73176o6044
$$ plain form
4499 315118 155204 146815 215801 282770 226260 -15376 201457 34741 42411 207392 229083
4488 229083 95201 307338 403422 397140 254926 142588 171191 230172 342925 171938 276822
4477 276822 215012 132398 277307 185882 145398 53751 163790 280492 233722 249823 416082
4466 416082 121746 134157 6978 -57922 56998 1666 432593 190237 18457 -8130
4456 -8130 70477 293486 187368 67541 40484 72997 183100 156504 135449 113510 168926
4445 168926 258125 24690 77929 108060 245717 132928 164354 355468 187653 236131 130576
4434 130576 32416 16058 40871 -41320 -211666 -115081 -260937 -187851 205838 92798 32248
4423 32248 -92709 14377 190087 41212 23031 190544 187552 223629 55973 229149 163105
4412A63105m9113k21549K09121J8393j89056n7959j4778J545k10179J22268K68717
4401D0515J20910M2271K9798j26563j71417l3933J97090J12139l513l52519K2791
4390a22431J1166P0967K07441k6420k59097N9851o35j90812J25690L0200R0613
4379c467J00827K0979n133j40542j7806O0666L4821L4886Q0720l46455K51887
4368G1383m2444p7429N5450N371p428k27503l5463J83537n3994R8272p1972l5112
4356a37332o2404j585O3580r256M9608l10957K69635J48005J1977l49304R4783
4345b33250K39414k24742J97835K1829k14075N4255P2127R1717J17122m4129j68981
4334i0878l5310j35542P3649L36195k00699r4148L1110k44721K55253J5126q3703
$$ plain form
4412 163105 113992 -107557 101564 119957 -69099 -127058 -141836 -140291 -350470 -228202 40515
4401 40515 161425 203696 233494 106931 -64486 -98419 98671 210810 207297 -145222 -122431
4390 -122431 -111265 -40298 167143 140723 -118374 -58523 -59158 -249970 -124280 -94080 -3467
4379 -3467 97360 118339 113206 -27336 -45142 15524 50345 85231 165951 -180504 71383
4368 71383 28939 -48490 6960 12331 4903 -222600 -258063 -74526 -128520 -30248 -102220 -137332
4356 -137332 -199736 -201321 -137741 -146997 -97389 -408346 -138711 9294 21271 -328033 -233250
4345 -233250 6164 -218578 -20743 1086 -212989 -158734 -86607 5110 122232 78103 -90878
4334 -90878 -126188 -261730 -188081 148114 -52585 -146733 -115623 -360344 -105091 -89965 -173668
4323a73668j5761K27642J58966K0751k66804j17719Q2807J59423k02517j20335
4313b47215J788M6896j8047j15258J80604N5264J5192J27242j49865p9005N7498
4302a24906M756M1644k32566O3578m0990R9961J5336j96634J33618K03390k1487
4291e4300r2860J93600l0169j39967P9334r9514q3338P2408L975J05957j56420
4280b01294j16756Q601m393K55977j44337O8226j0104j11267J20697J00735r4333
4269a28248j86676p2510L51439k83545j18819K17194k3288Q5889l336p5109K9736
4258b07273n0308k8292K24290L0030n3618L1501O4145j67029j73085p557K8331
4247c08865N1315r812L7669l9823J19409J14192j37548l3126P588Q0104k7028
$$ plain form
4323 -173668 -189429 38213 197179 217930 -48874 -166593 -83786 75637 -126880 -247215
4313 -247215 -245427 -198531 -216578 -331836 -151232 -95968 -80776 46466 -103399 -182404 -124906
4302 -124906 -120150 -78506 -311072 -247494 -288484 -188523 -173187 -369821 -236203 -32813 -54300
4291 -54300 -147160 46440 16271 -123696 -44362 -143876 -227214 -154806 -150831 -44874 -201294
4280 -201294 -318050 -309449 -313842 -57865 -202202 -133976 -144080 -255347 -134650 -33915 -128248
4269 -128248 -314924 -387434 -35995 -319540 -438359 -221165 -244453 -158564 -161900 -237009 -207273
4258 -207273 -257581 -285873 -61583 -31553 -85171 -53670 10475 -156554 -329639 -337196 -308865
4247 -308865 -257550 -267362 -229693 -269516 -150107 -35915 -173463 -206589 -199001 -118897 -145925
4236a45925o0156j02132K09782P1446k1068P3889j28625K387j14470M1239Q5979
4225h7654k7160j76568J51529k7957j92219n628j60J86718r2018r732k18750J08250
4213c91349J08485m5675J06991J76713L9820m1332j12758j03070q674O1794j60119
4202c69174Q1572O6554O1714J3491n4303j30363n5026J36810L6857j17240M0130
4191b88978J10398O7704j25397l8328J60752k0514K2662j86300J21635O5961j52687
4180b63092n7670K33275o9712q4412J53218j38815j59895K59968O2302P7722j23078
4169a10189j0448j93774J3467q5395m9062J37745J9807Q5912J65283L55706j58675
4158A70377l39617k23646r3480L81450J95430j40480o4228l4671J91592K6164
$$ plain form
4236 -145925 -206081 -308213 -98431 -26985 -48053 25836 -102789 -100402 -214872 -173633 -87654
4225 -87654 -114814 -291382 -139853 -167810 -360029 -365657 -365817 -179099 -271117 -280849 -499599 -391349
4213 -391349 -282864 -328539 -221548 -44835 -5015 -46347 -159105 -262175 -270849 -209055 -369174
4202 -369174 -287602 -221048 -159334 -145843 -200146 -330509 -385535 -248725 -211868 -329108 -288978
4191 -288978 -178580 -110876 -236273 -274601 -113849 -134363 -111701 -298001 -176366 -110405 -263092
4180 -263092 -320762 -87487 -157199 -241611 -88393 -227208 -387103 -127135 -64833 12889 -110189
4169 -110189 -120637 -314411 -300944 -386339 -435401 -297656 -277849 -191937 -26654 329052 170377
4158 170377 -169240 -392886 -486366 -104916 90514 -49966 -114194 -148865 42727 68891
4148F8891j77787K10845j7644l35630P568M4704M1936k4323J42828k09843m7127
4137b95582J90698m8703L3105p9068K07212j07623J40849N8045K2363p0339r2399
4126d1442l8586k36705P7671J41086N9793k07277J1099P5705p2386J24684J0078
4115i6280J19275j22803q8432P7510N57o8957J82566N774j43487J2842J8704J79161
4103G6430j73597J44348j42125j07682R3855l5221J28829J01346l00449P4428
4093a39838J50343k1365j64650J64419k14318m0909J85841j14820p6149K06129
4083f5317j91011J155J90787j75471K36546P4695j96863J29899R7546j28062K33918
4072B07822l05719j7156O6343P4422j37532j21327J61711q4227j65498j5750J802
$$ plain form
4148 68891 -108896 101949 84305 -251325 -243757 -199053 -157117 -181440 -38612 -248455 -295582
4137 -295582 -104884 -153587 -120482 -199550 7662 -99961 40888 98933 121296 50957 -41442
4126 -41442 -80028 -316733 -239062 -97976 -38183 -245460 -234361 -158656 -231042 -106358 -96280
4115 -96280 22995 -99808 -188240 -110730 -110173 -179130 3436 9210 -134277 -121435 -102731 76430
4103 76430 -97167 47181 -94944 -202626 -108771 -143992 -15163 86183 -214266 -139838
4093 -139838 10505 -10860 -175510 -11091 -225409 -266318 -80477 -195297 -271446 -65317
4083 -65317 -256328 -255173 -64386 -239857 -3311 71384 -125479 4420 101966 -26096 207822
4072 207822 -97897 -115053 -48710 25712 -111820 -233147 -71436 -155663 -321161 -336911 -335109
4061c35109o2444J96911L00490o5195j96412N3727j62803j56029P5066K17493
4051a34305L2747L1005K05502K2376p9970N6316Q347j20077j9524J25567j95010
4040f7026M0266J03017l53049j49349K60585N2272M1773K70221j37461k69877
4030b08628J32597M6759R0845k21934K12681P0847j19872j10218K5800j01791
4020a82914J08724j28145o5354j2667J46481k6017O5430J7692O4805K97618j87110
4009I8543q5890m3884L2060j74970N6761K8115j41831M5483K23694m2491j34962
3998a39372k1109n2008n0600J38484R441m6554k41595P1467P3317J55563m7366
3987a50332R6131N0265P671k83022j3748J07906o2361J20046k024r6439l1683
$$ plain form
4061 -335109 -397553 -200642 99848 34653 -161759 -108032 -270835 -426864 -351798 -134305
4051 -134305 -101558 -70553 134949 157325 77355 133671 142018 21941 2417 127984 -67026
4040 -67026 -26760 76257 -276792 -426141 -165556 -113284 -71511 198710 61249 -208628
4030 -208628 -76031 -29272 61573 -160361 52320 123167 3295 -106923 -81123 -182914
4020 -182914 -74190 -202335 -267689 -280356 -133875 -159892 -94462 -76770 -11965 285653 98543
4009 98543 12653 -31231 829 -174141 -117380 -89265 -231096 -185613 38081 -4410 -139372
3998 -139372 -160481 -212489 -263089 -124605 -115164 -161718 -403313 -331846 -258529 -102966 -150332
3987 -150332 -54201 -3936 3735 -279287 -293035 -185129 -247490 -127444 -129468 -225907 -257590
3976b57590J46276k0665N5565M7506o3637q185j12304j10684n7575J93196J21376
3965f6721l6222l29935J89193J08671N7191n863l4013j07098L8117K53991q6045
3954a8734j18767J99034J7127l34122R944J49196p327J37396L3461j32606j20504
3943a85902J50732O8174j18373j10173J19880M6113M6728j74020O6471N9763n5573
3932h6180j60813N1413J77999N1141J03385j8139k68336k54010J26635q593P1984
3921b13514R7084k09375J15648n2756J03631J2078O3977L8289k38519J13972j4518
3910a84003J35628J46472j12217Q1803l7383q1722j19711J8628J97623n5519m1963
3899e2364n7541J36739j47551J52833P5343j8984j0649J74815j50358J91875j52710
$$ plain form
3976 -257590 -111314 -131979 -76414 -28908 -92545 -100730 -213034 -323718 -381293 -188097 -66721
3965 -66721 -102943 -432878 -243685 -135014 -77823 -83686 -117699 -224797 -186680 67311 -18734
3954 -18734 -137501 61533 78660 -255462 -245518 -96322 -103649 33747 67208 -65398 -185902
3943 -185902 -35170 33004 -85369 -195542 -75662 -29549 17179 -156841 -90370 -30607 -86180
3932 -86180 -246993 -195580 -17581 33560 136945 118806 -149530 -403540 -276905 -285498 -213514
3921 -213514 -116430 -325805 -210157 -262913 -159282 -147204 -83227 -44938 -283457 -169485 -184003
3910 -184003 -48375 98097 -14120 67683 30300 -51422 -171133 -152505 45118 -10401 -52364
3899 -52364 -109905 26834 -120717 32116 107459 88475 77826 252641 102283 294158 141448
3888A41448q6687R244J681k32889K09510L5731j06659R3398J12524q7581j21233
3877c1513j13725K41470k2641j06926k8977O4939Q9184O1173k38718q6384J26874
3866d5244j310P0704K4720o037j0240K00210J19906j54578j20096N2503j36285
3855e747n3643Q3512J5896O9194K66663j24078j26438o831Q5144j04958j24569
3844b5855K42493k47514L3010K26108j16547L5655R8636m5220j94857J50367K1708
3833A77984J48001j10806l4584J13889j41944K8536j59381J55502K49887j13354
3823C13730q2200J6937J64372k095L8761j13406o208j427q5584j1993J21k58432
3811b7424J39567P2302K11162J82733k19393j18044J22194m1738k851O6574J2751
$$ plain form
3888 141448 54761 64005 65686 -167203 42307 78038 -28621 64777 177301 89720 -31513
3877 -31513 -145238 96232 73591 -33335 -62312 2627 91811 152984 -85734 -172118 -45244
3866 -45244 -46554 24150 48870 42833 32593 232803 352709 198131 78035 130538 -5747
3855 -5747 -59390 24122 40018 109212 375875 251797 125359 118528 203672 98714 -25855
3844 -25855 216638 -30876 2134 228242 111695 147350 245986 200766 5909 156276 177984
3833 177984 325985 215179 180595 294484 152540 181076 21695 177197 427084 313730
3823 313730 231530 248467 412839 410744 449505 336099 329891 328464 242880 230887 231008 -27424
3811 -27424 112143 184445 395607 578340 358947 240903 363097 321359 318508 385082 397833
3800C97833m0482k89744M71087j07293J51473j0614Q8707R260n5508j01109M5639
3789E59249K76339K8661K51788j12661j1251J23548J63604J515K8607N9248K27577
3778A596224J12301Q9015J19917K17972m0878Q0237m4963r040j98812n1867k99810
3767A570296L5688j45135j22229R4014j826j78543j04511n739L4907k5166Q7183
3756A238939j42193l16132N4177Q3903r882r3904K01915M6081k7767o2010M4826
3745A017953J58644K7588N3644P315J42067J25435k18118q6067j15287m5715J21865
3734A189324o2008M8572K49309J99913j41066j17146J65896R6098M5212j31477
3724A542627K37035J84835J13403K19728K8298O350L81022K40488j99183K21721
$$ plain form
3800 397833 357351 67607 538694 431401 582874 572260 660967 670227 614719 513610 559249
3789 559249 835588 864249 1116037 1003376 992125 1115673 1279277 1280792 1309399 1368647 1596224
3778 1596224 1708525 1797540 1917457 2135429 2094551 2174788 2129825 2120785 1921973 1870106 1570296
3767 1570296 1605984 1460849 1338620 1432634 1430808 1252265 1147754 1142015 1176922 1151756 1238939
3756 1238939 1096746 780614 834791 918694 908812 814908 1016823 1062904 1035137 973127 1017953
3745 1017953 1176597 1204185 1257829 1265144 1407211 1532646 1314528 1228461 1113174 1067459 1189324
3734 1189324 1127316 1175888 1425197 1625110 1484044 1366898 1532794 1628892 1674104 1542627
3724 1542627 1779662 1964497 2077900 2297628 2325926 2332276 2713298 2953786 2754603 2976324
3714B976324N9866K25575L31104J64015O86122M35816N68808O60509J064724R47196
3704H120059J333838R32299k98642r99386j348885j142875j007058l10669n75167
3695D703514o93606l51881j33201j64857k67064k29668K587k65862k84628J06274
3685B421608l4403Q162J09112j31778j66414j48584n1716P5845O9873m892J99491
3674B346304q4084j92302L087j88944n064j6656J17252m9773Q212J75606J76943
3663B290581k58373l1051J85257J55789j49384k53815J04002j96782r1753M68370
3653B222841r5542m9153P9107j86325O5597j20084j4703n693J72215K9322R0293
3642B187875j59700K92209j9921j77476J99085j90621J19217M9675Q3824p9453
$$ plain form
3714 2976324 3036190 3261765 3592869 3756884 4443006 4878822 5447630 6108139 7172863 8120059
3704 8120059 9453897 10386196 10087554 9088168 7739283 6596408 5589350 5278681 4703514
3695 4703514 4009908 3658027 3524826 3359969 3092905 2863237 2865824 2599962 2315334 2421608
3685 2421608 2387205 2395367 2504479 2372701 2206287 2057703 2005987 2081832 2151705 2146813 2346304
3674 2346304 2262220 2069918 2073005 1884061 1878997 1862341 1979593 1929820 1938032 2113638 2290581
3663 2290581 2032208 2001157 2186414 2342203 2192819 1939004 2043006 1846224 1754471 2222841
3653 2222841 2127299 2078146 2157253 1970928 2036525 1916441 1901738 1896045 2068260 2097582 2187875
3642 2187875 2028175 2320384 2300463 2122987 2322072 2131451 2250668 2300343 2384167 2304714
3632B304714J35093o3078K17647R1491K9553L6524K02853k9412q144j82492R7021
3621B831770J23725K38173N9451O3870O11501K47624M63724j97419j05770j27139
3611D209510l01082j38249j74971Q9804J25156J51418j23761o0322n8930o2986
3601C655587n7873l5325L17089q0103l2635R8733j01997K35619k16382j24417
3591C658296j10037L2130M08916j3350M8741m2240J46976O1159M4443J42376q4518
3580D292892j9394L4956O4290L90084K13783j17940n3470J21833J17411N7421
3570E101866j05050R2202r6822J08087Q6027M1156o2703M27460K02121N6628K46631
3559F097603K06952K58002O15680N18433M34910M04065N48421M70803N70739P04465
$$ plain form
3632 2304714 2439807 2376729 2594376 2685867 2715420 2751944 2954797 2925385 2917241 2734749 2831770
3621 2831770 2955495 3193668 3253119 3316989 3928490 4176114 4639838 4442419 4336649 4209510
3611 4209510 3908428 3770179 3595208 3685012 3810168 3961586 3837825 3777503 3718573 3655587
3601 3655587 3597714 3562389 3879478 3799375 3766740 3865473 3763476 3999095 3782713 3658296
3591 3658296 3548259 3580389 3989305 3975955 4024696 3982456 4129432 4190591 4235034 4377410 4292892
3580 4292892 4273498 4308454 4372744 4762828 4976611 4858671 4805201 4927034 5044445 5101866
3570 5101866 4996816 5089018 4992196 5100283 5186310 5227466 5164763 5592223 5794344 5850972 6097603
3559 6097603 6304555 6562557 7178237 7696670 8131580 8535645 9084066 9554869 10125608 10830073
3549A0830073M15580N67428K93608M15399R47488P51474N42458P12987L50117
3540A5826612N43295J101442N67772N57727Q09031N67523Q19583P68186R37779
3531B2498950R37573P23735Q30178J005916J025799J120630J021963J220185J148606
3522C1533535J312683J377657J327054J319249J741788J619335J572506J908826
3514D3712633K170442J903836K323236K808138L016864K932107L005965L727325
3506F5600546L711086M065693M477228M958601N419857O111752O941103Q006657
3498A09292523R283000J0168866J1707376J3251673J4930160J6629464J8604186
3491B03867248K1347195K4366821K7460919K9216971K8518927K0891829L889325
$$ plain form
3549 10830073 11245653 11813081 12106689 12522088 13469576 14221050 14763508 15476495 15826612
3540 15826612 16369907 17471349 18039121 18596848 19405879 19973402 20792985 21561171 22498950
3531 22498950 23436523 24160258 24990436 25996352 27022151 28142781 29164744 30384929 31533535
3522 31533535 32846218 34223875 35550929 36870178 38611966 40231301 41803807 43712633
3514 43712633 45883075 47786911 50110147 52918285 55935149 58867256 61873221 65600546
3506 65600546 69311632 73377325 77854553 82813154 88233011 94344763 101285866 109292523
3498 109292523 118575523 128744389 140451765 153703438 168633598 185263062 203867248
3491 203867248 225214443 249581264 277042183 306259154 334778081 355669910 359559235
3484C59559235j6079812k9109519l4295071l3426916k8939779k4575233k0626885
3477A72506020j7204593j5026173j2938192j1246256r824927q485139p011237
3470I0769503o477723o097399n260459m624916m225350m325206l695766k774992
3462E3287692k596142k474432k506990k306129j789087j789317j916934j975916
3454C5932745j751431j523659j510963j267754j426085j250032j099657j353117
3446B4750047j011813p46421q49875o55384n24847q01411n69763o60632q48134
3437A8081767n68228n54946m78174l58256m42446l67665o44680k30420o19306
3428A3817646n24764j83847k53498l98192l78531k2255K3255m71231j68164j52256
$$ plain form
3484 359559235 343479423 314369904 280074833 246647917 217708138 193132905 172506020
3477 172506020 155301427 140275254 127337062 116090806 106265879 97780740 90769503
3470 90769503 84291780 78194381 72933922 68309006 64083656 59758450 56062684 53287692
3462 53287692 50691550 48217118 45710128 43403999 41614912 39825595 37908661 35932745
3454 35932745 34181314 32657655 31146692 29878938 28452853 27202821 26103164 24750047
3446 24750047 23738234 22991813 22141938 21486554 20961707 20160296 19590533 18929901 18081767
3437 18081767 17513539 16958593 16480419 16122163 15679717 15312052 14667372 14436952 13817646
3428 13817646 13292882 13109035 12855537 12457345 12078814 12056559 12079814 11608583 11440419 11288163
3418A1288163j03410j22386o0070o5664j70978k05117l47786j03588M6055l48127
3408I807092n55396k37126k09154l04540J42106m86433m75120k08950k60023K2899
3398G235355m49487o3598j53471k39315j39124k19852j68443p3064k35280o0269
3388E433452q7316j97155l0024j11200j98294j30585p0123R2892j08750l6967
3378D555930l24198j33225n3886j28482j10434r3969l49453M8268j92193L0343
3368C248701P3910R402j40471o8376J27512O9705p0354k27145Q5600k6517J86140
3357C268107k8851k16894k68990K65519j34292k36252L6441k8201j59449R0846
3347B587984O4031L991k6804M5298j95823j64645J53872k8744K8082Q0785n5880
$$ plain form
3418 11288163 11184753 11062367 11002297 10936633 10765655 10560538 10212752 10109164 10155219 9807092
3408 9807092 9251696 9014570 8805416 8500876 8642982 8156549 7681429 7472479 7212456 7235355
3398 7235355 6785868 6722270 6568799 6329484 6190360 5970508 5802065 5729001 5493721 5433452
3388 5433452 5346136 5148981 5118957 5007757 4809463 4678878 4608755 4701647 4592897 4555930
3378 4555930 4231732 4098507 4044621 3916139 3805705 3711736 3362283 3410551 3218358 3248701
3368 3248701 3322611 3332013 3191542 3123166 3250678 3320383 3250029 3022884 3108484 3081967 3268107
3357 3268107 3239256 3022362 2753372 3018891 2884599 2648347 2684788 2656587 2497138 2587984
3347 2587984 2652015 2656006 2629202 2674500 2478677 2314032 2467904 2439160 2467242 2548027 2492147
3336B492147r8127L0576J413n7049j07229q8634J96000J19613k40569j58843n4108
3325B035190l9747l0183N3318o3821m4313o7697o7227P1501k33256K78837K15472
3314B108074m8803j70250k58374L3503k10119J51579o4729n7347J8699J0613M3268
3303A556114J23241J39333j90397j48362Q4322J6431Q7697j14231m5756L8613
3293A547005Q7466J63807K18769K0743J7583N3540J84035q9906j96343Q5101L288
3282B095088k11444J74352J078r2216N9640j54996K35079k2648m3939J97308K62645
3271B499947j4123j44661J74527J63240J29982L6927j34751N0937j74728k19114
3261B368183j81414j49197k75368k09895l3025o5683l9006k2634j35539J12072
$$ plain form
3336 2492147 2394020 2424596 2426009 2368960 2261731 2173097 2369097 2488710 2248141 2089298 2035190
3325 2035190 1995443 1965260 2018578 1954757 1910444 1842747 1775520 1847021 1613765 1892602 2108074
3314 2108074 2059271 1889021 1630647 1664150 1454031 1605610 1540881 1483534 1502233 1512846 1556114
3303 1556114 1679355 1818688 1628291 1479929 1564251 1580682 1668379 1554148 1508392 1547005
3293 1547005 1634471 1798278 2017047 2037790 2055373 2108913 2292948 2203042 2006699 2091800 2095088
3282 2095088 1883644 2057996 2059074 1966858 2026498 1871502 2106581 2083933 2039994 2237302 2499947
3271 2499947 2485824 2341163 2515690 2678930 2808912 2845839 2711088 2762025 2587297 2368183
3261 2368183 2186769 2037572 1762204 1552309 1519284 1453601 1414595 1391961 1256422 1368494
3251A368494l55675N8726m8544L59072J35089l18074r1568L5663j75320r533J27614
3240A085944l765Q409m417j97314p484q1362J25230j5495k28300L35619o3758
3229I53307k03018M3467J93202m0678k6045j68835K31401N8865N2471k59111n0643
3218G84383Q1842M7749k9081O2742J78023k35935J8611r7202K2262J6641j8233
3207H31802r7122j75541L2408n2817J88222K18935K09652k66527k56169K05002
3197H37845K14605P7999l13106J56230k4422k96848k2881J1859J75463j05136
3187G11608r6157J89790k00415j97684J25822M6780r9379k564j20493K4597l998
3176C77907l4200J54622j54543K82859k5145m0600J42113k35067j05630q3526
$$ plain form
3251 1368494 1012819 1071545 1023001 1382073 1517162 1199088 1107520 1143183 967863 958330 1085944
3240 1085944 1082179 1090588 1086171 888857 881373 800011 925241 909746 681446 1017065 953307
3229 953307 750289 793756 986958 946280 920235 751400 982801 1041666 1094137 835026 784383
3218 784383 866225 913974 884893 947635 1125658 889723 908334 811132 833394 850035 831802
3207 831802 734680 559139 591547 538730 726952 945887 1155539 889012 632843 837845
3197 837845 1052450 1130449 817343 973573 949151 652303 629422 641281 816744 711608
3187 711608 615451 805241 604826 407142 532964 579744 480365 477801 357308 381905 377907
3176 377907 343707 498329 343786 626645 601500 560900 703013 467946 362316 278790
3166B78790p690K60482j56031o7204J89608o2975n3034K970R1032J54036k46792
3155C83192N941l6245o0085J17113l9511k44192j00628J43297J59746K19701J15963
3144F64292l23962l08831K19114J9985K00124J18144j80998j20224m1473J01128
3134C47299p241Q7546r4127k03505J77852N7674m67j9437M5766L2097k41927L47640
3122E29170r4045j61085J42355J78645J5444k50265O417P8044j93827K01536m2869
3111D09520k83809o786N6200O8489j7356J85693J0912p4424J04126Q7852l53705
3100A86712l2058J14959J41864p3774P6038o3285J5849m8544k58278Q9681J71224
3089C20388J2807p9653M1422J9436p7760p4472J32312K4451J40472k42079K1328
$$ plain form
3166 278790 271100 531582 375551 308347 497955 434980 381946 384916 475948 629984 383192
3155 383192 389133 352888 292803 409916 370405 126213 25585 168882 328628 548329 664292
3144 664292 340330 31499 250613 270598 470722 588866 407868 287644 246171 347299
3134 347299 340058 427604 333477 129972 307824 365498 365031 345594 391360 423457 181530 529170
3122 529170 435125 274040 416395 595040 610484 360219 366636 444680 250853 452389 409520
3111 409520 125711 118925 175125 243614 226258 411951 422863 348439 452565 540417 186712
3100 186712 154654 269613 411477 337703 413741 350456 366305 317761 59483 149164 320388
3089 320388 333195 253542 294964 314400 236640 162168 294480 318931 459403 217324 238652
3078B38652j04187o6600J92351R665r2561J0120J64203J36306k28340R5629L11930
3067F67168n6290j16021q6524m3502j7796R0615Q7244Q2239k21303J11903M317
3056E02050k04670J06897J87379k6580k24898j70303J45436M2391n3945N0052
3046C53809J0238j29457K76024j37197J65555J2516j49049o1615O2274o1292r3254
3035B48552r5133R4507J15437o4159J30430j081o1260M4146M1845P8044k9427
3024E01901J50032l06361L6261r3883n7571J51399J71939K00389l12242k2l0747
3013D11095J74342k7744l1452P6031j20571j18589J82626j296k88176M03277J42737
3002H02280k7576J0651j04358R2183p2532J68681L6799O2507p8963j48558L6907
$$ plain form
3078 238652 134465 67865 260216 269881 177320 187440 351643 487949 259609 355238 667168
3067 667168 610878 494857 408333 364831 347035 437650 524894 607133 385830 497733 502050
3056 502050 297380 404277 591656 565076 340178 169875 315311 357702 303757 353809
3046 353809 364047 234590 510614 373417 538972 551488 402439 340824 403098 341806 248552
3035 248552 153419 247926 363363 299204 429634 428553 367293 411439 453284 531328 501901
3024 501901 651933 345572 381833 287950 230379 381778 553717 754106 441864 441842 411095
3013 411095 585437 557693 526241 602272 481701 363112 545738 544442 256266 659543 802280
3002 802280 774704 785355 680997 773180 700648 869329 906128 968635 889672 741114 778021
2991G78021J96171J58513j87294m3019L7693J26606m5009j36431l0645K85227
2981A139833N2376j11914J01923J57743J93892K9444J94182j88888J90516K90071
2971B049178K04325J45825O8706j00473o1566q6181j02276M060m4185P8060K29862
2960B385335J80881m7454k9433r066M5205J42802k03659J12402M5130j56386M32830
2949B898587K26956L20460M45029L22774l12015m62777p2255o81023m10517m4936
2939B230283k48162l7513j30006k24964r1236J03016q8748q9975J51178j6385
2929A557488r9209Q6172L9926J79742J62802J61005K68919j60183j3009n9827
2919B123826l90780l46580K22476j99928k06611k9323o3224j21057q926q4984
$$ plain form
2991 778021 974192 1132705 945411 902392 940085 1066691 1021682 885251 854606 1139833
2981 1139833 1192209 1080295 1182218 1339961 1533853 1563297 1757479 1568591 1759107 2049178
2971 2049178 2253503 2399328 2468034 2367561 2305995 2219814 2117538 2121598 2077413 2155473 2385335
2960 2385335 2566216 2518762 2489329 2480263 2525468 2668270 2464611 2577013 2622143 2465757 2898587
2949 2898587 3125543 3446003 3891032 4213806 3901791 3439014 3366759 2685736 2275219 2230283
2939 2230283 1982121 1944608 1814602 1589638 1498402 1601418 1512670 1422695 1573873 1557488
2929 1557488 1458279 1544451 1584377 1764119 1926921 2087926 2356845 2196662 2183653 2123826
2919 2123826 1733046 1386466 1608942 1409014 1202403 1173080 1109856 988799 979873 894889
2909H94889K25622k39478j47012j2593M5879o47Q6849r3013Q7025l2074J00372
2898I15819J15923R9010j36922j08990j52632k46682M5551j26523j1824M9319
2888D42049R2365m1121L9535k64052J21401n9793j08776J06715J5100R6275J19365
2877E59063p4608p3594p7796o0373o0607K0850K12181o79k13431K6293o6493m0781
2865A50025J47691L331k53284Q0863Q8334l1613j7597q343N2171j39270Q8470
2854A60778O9632o0099P2970r4876Q8072p2726K64139l64169j50384K48972k27973
2843f5664J11658J96924Q9843L9589k2204m6848q5611J74778j20507k07988K58530
2832C22500k9490j18280k2995Q9799J24549k85201J31116K476r791L3507j0311
$$ plain form
2909 894889 1120511 881033 734021 721428 767307 766660 853509 760496 847521 815447 915819
2898 915819 1031742 1130752 993830 884840 732208 485526 531077 404554 392730 442049
2888 442049 534414 493293 532828 268776 390177 330384 221608 328323 343423 439698 559063
2877 559063 484455 410861 333065 272692 212085 232935 445116 444437 231006 257299 190806 150025
2865 150025 297716 301047 47763 128626 216960 185347 167750 159407 211578 72308 160778
2854 160778 230410 170311 243281 148405 236477 163751 427890 63721 -86663 162309 -65664
2843 -65664 45994 242918 332761 372350 350146 303298 217687 392465 271958 63970 322500
2832 322500 293010 174730 151735 241534 366083 80882 211998 214474 204683 238190 227879
2821B27879N9697j54920r8434J8940J07153n8043K15774l85635O0224L23444k85226
2810C0853J11173j8747n8931N8790J57606j38594l2956r0621J5780n7207J84259
2799A61405j08679J64206o2427J08102K3494k62410K14162N9084k93747j00800
2789i7610n868J83405p8417j9488J18169J2945r990L2000R7797N669N159j56722
2777H7049j43497J5273R6569J04137J23443j24718J27880l9650j66484L7593J44053
2766B61648q5436K1642J01750j52288p7232l7888K791J58119j519j36186q0809
2755b5408K44097J73078k26047j3970j84470P6538J73179j74889K31178j83492
2745H9794J78340q4706m5981r8868p8725Q3699K26915k97534J47825n60L3493
$$ plain form
2821 227879 287576 132656 34222 53162 160315 102272 318046 -67589 -7365 316079 30853
2810 30853 142026 123279 64348 123138 280744 142150 109194 18573 34353 -22854 161405
2799 161405 52726 216932 154505 262607 286101 23691 237853 296937 3190 -97610
2789 -97610 -103478 79927 1510 -17978 100191 113136 103146 135146 232943 238612 243771 87049
2777 87049 -56448 -41175 55394 159531 282974 158256 286136 246486 80002 117595 261648
2766 261648 176212 197854 299604 147316 70084 32196 34987 193106 191587 55401 -25408
2755 -25408 218689 391767 165720 151750 -32720 43818 216997 42108 273286 89794
2745 89794 268134 183428 137447 38579 -40146 43553 270468 -27066 120759 120199 153692
2734A53692K22417j30216j57306J05610M6223l9881L78442k3289l7462J4578l28189
2723B04619r8065K80821j10396J67827j67627p5474J83023M3243k23602J75831
2713C80200o6234j43169k5747K03424P8705j40634L10066j96166l0163m0629k61288
2702F8365K62767L15474k40957k6541J17263q8343M1161j85641j33703m2574R5702
2691A82973P9199Q4963L76788k86918j12947N2682r6398q2671L2174j16327K6502
2680A40020J58994K06278l67192m4361K31674J51598q215k7841j21010j39968
2670A79977k2963J31663J20308L7773j01387p8256O0861q5810j59091J4491M737
2659A02303M3928j33202Q1305J30133j33010J61095o6195O7972j85443k47208
$$ plain form
2734 153692 376109 245893 88587 194197 240420 200539 578981 555692 518230 532808 204619
2723 204619 106554 387375 276979 444806 277179 201705 384728 427971 204369 380200
2713 380200 313966 170797 145050 348474 427179 286545 596611 400445 370282 329653 68365
2702 68365 331132 646606 405649 379108 496371 408028 449189 263548 129845 87271 182973
2691 182973 262172 347135 723923 437005 324058 376740 280342 197671 229845 113518 140020
2680 140020 299014 505292 138100 93739 325413 477011 468796 440955 319945 179977
2670 179977 157014 288677 408985 446758 345371 267115 327976 242166 83075 97566 102303
2659 102303 146231 13029 94334 224467 91457 252552 186357 254329 68886 -178322
2649a78322P6784k7355J54776K33745l2247j19992j10044k063p6461j36193P7193
2638a40179O2150O3037J9335j55258L5999R885o0353O3094N8863J74104k8783
2627A01894k37226J0754J28950K027j12038K03532l49535J46790J60176r2143
2617c6819M4413J9713J05508p7028j43373J18262m0622p8309Q9533O0952K8968
2606I1198j45033j18217p783l049N240R1659N1509j4124r3871P6382l8430J97536
2594I3017O7905l77495K1919K23216q79p5290k86270K05820J51505n4789J15007
2583H3666j01470k0320j22139J03808P858m6369J27800r22r4958M5322J00788
2572H3064r3764M5401J6942j77965L05719n9744N7274j56942j4954N5812J4299
$$ plain form
2649 -178322 -101538 -128893 25883 259628 227381 107389 -2655 -4718 -81179 -217372 -140179
2638 -140179 -78029 -14992 4343 -150915 -114916 -105031 -165384 -102290 -43427 130677 101894
2627 101894 -135332 -124578 4372 6399 -105639 97893 -251642 -104852 55324 -36819
2617 -36819 7594 27307 132815 55787 -87586 30676 -9946 -88255 1278 62230 91198
2606 91198 -53835 -172052 -179835 -182884 -177644 -85985 -34476 -48600 -142471 -66089 -104519 93017
2594 93017 160922 -216573 -194654 28562 27683 -47607 -333877 -128057 23448 -31341 83666
2583 83666 -17804 -38124 -160263 -56455 -48597 -94966 32834 31912 -63046 -17724 83064
2572 83064 -10700 34701 51643 -126322 179397 119653 176927 19985 5031 60843 75142
2561G5142P873n6072M6116N4632q0110j17703J02362o7699o9802m9888m9274o2188
2549b66611p9928J01096j0441J40342j56639J24672P1487J05824l11724J23237
2539a58685M2108k53344M29606N7946O811n2167j26499P4178k38668M1708n9366
2528b36372K4469K54065J6310j16321K5607o4953K69779j83454k31472L32035
2518H9693k14795J10075k0356M7387J2136n4254q7550J49737P8124J992J37548
2507B49737O1286k56118j01747j3934J59450K16616n9507l08034n1983k2524j36919
2496b63677L18788q0650n3574J55197j21552J38782q5545p1363k2029J09259o8273
2485d4637j17456p9315J00602k16119j3626K21976R9979p6421q7059J12072K07169
$$ plain form
2561 75142 83015 26943 73059 127691 47581 -70122 32240 -35459 -105261 -155149 -204423 -266611
2549 -266611 -346539 -245443 -255884 -115542 -272181 -147509 -76022 29802 -281922 -158685
2539 -158685 -116577 -369921 59685 117631 124442 72275 -54224 19954 -218714 -177006 -236372
2528 -236372 -211903 42162 58472 -57849 -32242 -97195 172584 -10870 -242342 89693
2518 89693 -125102 -15027 -35383 12004 24140 -30114 -117664 32073 110197 112189 249737
2507 249737 311023 54905 -46842 -60776 98674 315290 255783 -52251 -104234 -126758 -263677
2496 -263677 55111 -25539 -79113 76084 -45468 93314 7769 -63594 -85623 23636 -44637
2485 -44637 -162093 -241408 -140806 -356925 -370551 -148575 -48596 -125017 -212076 -100004 107165
2474A07165R9747l0669k22247o7736k5086J11311L03692m27757j63908L55276
2464C9788r8388l1116q6903J62135l5797K682m1467J10706o9023L1788o0232o3840
2452a39667J61724K54251k24065q5630J20463N9132J6331o1258M7927l23984M0343
2441a34433L10379J33852k48820k3211j20743j0843j8298K6345O8970n8585j89126
2430b64513J30200J59690o7927M9236r296K22152K0510j71524l17683J16923p7326
2419b09558L6990M9865M2185J5074P1634n1570n0926r5811J55675O2879j37740
2408a11303l8040o6734l0806Q7097K40200k60512J26882k65394K1545J61165n1485
2397a87385r8990P7075J31047P2432o2676P1519p2292q784J94514j01852R8121
$$ plain form
2474 107165 206912 176243 -46004 -113740 -138826 -27515 276177 -151580 -315488 39788
2464 39788 -58600 -89716 -176619 -14484 -50281 -47599 -89066 21640 -47383 -15595 -75827 -139667
2452 -139667 22057 276308 52243 -33387 87076 146208 162539 101281 149208 -174776 -134433
2441 -134433 175946 309798 60978 37767 -82976 -93819 -112117 -85772 -16802 -75387 -264513
2430 -264513 -134313 25377 -42550 6686 -2610 219542 240052 68528 -249155 -132232 -209558
2419 -209558 -172568 -122703 -80518 -65444 6190 -45380 -96306 -192117 -36442 26437 -111303
2408 -111303 -149343 -216077 -246883 -159786 80414 -180098 -53216 -318610 -297065 -135900 -187385
2397 -187385 -286375 -209300 -78253 -5821 -68497 3022 -69270 -78054 116460 14608 112729
2386A12729j69566k0049J41860p9600q8074j35246K49120k55781L1361K4090J64142
2375b5014j62790j1255o6253J97023J53147o4456j08235k12160J03817Q6032l914
2364a14058K07511J7395k37783p452j27887J46004J8597L9357K54263k02796O0942
2353E4093J07505j28505M572k51929k2339J20771R9048j00631J68848j38665j28407
2342b15639L41295j27571o2630J83737j30436j21748J7355j18094L84945L1187
2332A82401j53873N9670J40762j48081j73955K57306j58600j19048K59529o4919
2322H1192j07160n9087J00334k6544Q2660J25912k10896K23064j50119j66859
2312a07503R5153P4298M382O1130L5138q8090J786R3451Q0l329J47943J26271
$$ plain form
2386 112729 -56837 -76886 64974 -14626 -102700 -237946 11174 -244607 -213246 -189156 -25014
2375 -25014 -187804 -199059 -265312 -68289 84858 20402 -87833 -299993 -196176 -110144 -114058
2364 -114058 93453 110848 -126935 -134387 -262274 -116270 -97673 -58316 195947 -6849 54093
2353 54093 161598 33093 37665 -214264 -236603 -115832 -16784 -117415 51433 -87232 -215639
2342 -215639 125656 -1915 -64545 119192 -11244 -132992 -115637 -233731 151214 182401
2332 182401 28528 88198 228960 80879 -93076 164230 5630 -113418 146111 81192
2322 81192 -25968 -85055 15279 -11265 71395 197307 -13589 209475 59356 -107503
2312 -107503 -12350 61948 66330 127460 162598 74508 76294 169745 169825 166496 314439 440710
2300D40710k15197l8028J36093k6812p5606j03448P372K02262k82209J0697j34854
2289g9020K99862K03121l25633P7155m3369r1518l4090q3154n4382O7027L5695
2278b8306J21814P0515j59975M2683j00541L1136J8654k32487q410R3962J55880
2267D925j8689o79L873N6429J47925k1756n8637J74885l23402j03255J82107R793
2255E3519l9829R5635j23249j1049J56569k2163l0568R7804k12622J03583J38238
2244B05868L5105m4974j34076Q073J24242K0937l135r6107l6324k2504r5853K69025
2232B30277L6492j903J84421k68604j7614l9145J70532o09k08370K16065j89970
2221A11572J09741K9407j18026L0116K43158k58466L4010K47453j74755N0521
$$ plain form
2300 440710 225513 187485 323578 296766 221160 117712 125084 327346 45137 55834 -79020
2289 -79020 220842 423963 98330 175485 132116 40598 6508 -76646 -131028 -64001 -28306
2278 -28306 93508 164023 4048 46731 -53810 -22674 -4020 -236507 -244917 -150955 4925
2267 4925 -13764 -14443 -10570 45859 193784 172028 113391 288276 -35126 -138381 43726 53519
2255 53519 13690 109325 -13924 -24973 131596 109433 78865 176669 -35953 67630 205868
2244 205868 240973 195999 61923 69996 194238 215175 212040 115933 79609 57105 -38748 230277
2232 230277 266769 264866 449287 180683 163069 123924 294456 293847 85477 301542 111572
2221 111572 221313 250720 132694 162810 405968 147502 181512 428965 254210 304731
2211C04731L3808k35766N7885m0698p9879j12665L9300l3175J79629J85331K91276
2200E89777M0946l52932j67250R4639L6190k05457L11442l9491j67279Q7262M1870
2189B69717j00273K21273l10520j25612K71947J59441n7314j86201M7630N4073
2179B44161m6158r0564J38015P7456K04629m0007L08787k41615J74828J95102
2169I24634j131L8716l4817Q5015j10454J65550J55091J04387j83386J50630N2357
2158A346592J80695K09467N6929N3945P0610k1769l29153J41140J01378O0588
2148A870422P5329K49954k8032L12991J47273K42954j14887K67164J98974L26800
2138C548942p2654k0261J88480N2659n4995L09700J24611L41494L01853R1493
$$ plain form
2211 304731 338539 102773 160658 119960 40081 -72584 -33284 -66459 113170 298501 589777
2200 589777 630723 277791 110541 205180 241370 35913 347355 307864 140585 227847 269717
2189 269717 169444 390717 80197 -45415 226532 385973 328659 142458 190088 244161
2179 244161 198003 107439 245454 322910 527539 487532 796319 554704 729532 924634
2169 924634 923503 962219 927402 1012417 901963 1067513 1222604 1326991 1143605 1294235 1346592
2158 1346592 1527287 1736754 1793683 1847628 1918238 1896469 1567316 1708456 1809834 1870422
2148 1870422 1945751 2195705 2167673 2480664 2627937 2870891 2756004 3023168 3222142 3548942
2138 3548942 3476288 3456027 3644507 3697166 3642171 3951871 4076482 4417976 4719829 4811322
2128D811322K05617K69894L51304M22996L14435L92908M77280K96110P44290N63583
2118H849739Q11000Q51897J254160J331574J100078J194945J520816J668666K144251
2109B0727126K670937L584958N041471O774450R177406J0519319q23022o738253
2101E0934392q471599q699751o346886m502781l027332k291360j867486j455303
2093A4271894j405522j159198j149978j101044q25245p71954o02598m73454o22627
2084F160274p25507j35813l28055l88019n64547q945j54239R1268l67391o823
2074C572203l29346k26556r0494j68350N6336j81100k56799j14269j17629j7241
2064B126755j69103k60907K6192K08519l02417q0657J6081J704L8559j64989j92726
$$ plain form
2128 4811322 5016939 5286833 5638137 6061133 6375568 6768476 7245756 7541866 8286156 8849739
2118 8849739 9660739 10512636 11766796 13098370 14198448 15393393 16914209 18582875 20727126
2109 20727126 23398063 26983021 32024492 38798942 47976348 58495667 57672645 50934392
2101 50934392 42462793 33763042 27416156 22913375 19886043 17594683 15727197 14271894
2093 14271894 12866372 11707174 10557196 9456152 8630907 7858953 7256355 6782901 6160274
2084 6160274 5434767 5298954 4970899 4582880 4018333 4009388 3855149 3946417 3579026 3572203
2074 3572203 3242857 3016301 2925807 2757457 2813793 2632693 2375894 2261625 2143996 2126755
2064 2126755 1957652 1696745 1722937 1931456 1629039 1548382 1564463 1566167 1604726 1439737 1247011
2053A247011L2677R0677J07284j13063j63747o481p3256q3234m4261P9616K05981
2042A279204j92476M6881k52320P4725Q1416j01612q9467J57437K34570j44795
2032A093563Q5964q5385l00155O7796o4007J06762k97926N9607l0022j58626K52886
2021G30457o694k11100j02204Q7024K082K39750l30311j02257J00656P9921p9183
2010D08141j1552j7530R4618m3873k28799m6041O4494l3758K40942l8950k7824
1999C59868J4677J1976q119j38083J23792j25527n6278J15237j50370j81579J47890
1988A13484M087j14506j2568J26767J63173k50167k935K71237j02673r368n3426
1977A33105n2480K19635m3345j70911K5391j99613M1783K3281l4325L03991L4702
$$ plain form
2053 1247011 1279688 1370365 1477649 1364586 1200839 1194358 1121102 1037868 993607 1073223 1279204
2042 1279204 1086728 1133609 881289 956014 1037430 935818 846351 1003788 1238358 1093563
2032 1093563 1179527 1094142 793987 861783 797776 904538 606612 666219 636197 477571 730457
2021 730457 723763 512663 410459 497483 499565 739315 409004 306747 407403 487324 408141
2010 408141 396589 379059 473677 429804 201005 154964 219458 185700 426642 387692 359868
1999 359868 374545 386521 378402 240319 364111 238584 182306 297543 147173 -34406 113484
1988 113484 117571 3065 -9503 117264 280437 30270 27335 298572 195899 186531 133105
1977 133105 80625 300260 256915 86004 111395 -88218 -46435 -23154 -57479 246512 281214
1966B81214k59356K19345J76154l16283N4506L490j10019J95881q0656j69128
1956d852K54978j61228j41854J25895J653n0657N0946K4053k33553K23605k1606
1945F7380j28874K2856J77064J58488j71460j3023q2239M9850K94972j90253M2083
1934B26844j3236j78086p8247k36108N26950j72261J17988k35891l3492K55601
1924A80062j4829N0968p3156j22267n9542L7022p5585K2108K75982j26021j5961
1913G8781J62287j66363m5660J83909O2870j78368Q1480J8722J13586m5834M4265
1902C09675r2456L22717N84j7493l16589K7081q8880r4600k8389J04048k1919
1891A03779m8540j08921k8089J5905J78686M2833j40578J55379j85690m144L7704
$$ plain form
1966 281214 21858 241203 417357 101074 155580 159070 49051 244932 164276 -4852
1956 -4852 250126 88898 -52956 72939 74592 23935 74881 98934 -134619 88986 67380
1945 67380 -61494 -38638 138426 296914 125454 112431 30192 80042 375014 184761 226844
1934 226844 213608 35522 -42725 -278833 248117 75856 193844 -42047 -75539 180062
1924 180062 165233 216201 143045 20778 -38764 -1742 -77327 -55219 220763 94742 78781
1913 78781 241068 74705 29045 212954 275824 97456 178936 197658 311244 265410 309675
1902 309675 217219 539936 540520 523027 206438 233519 144639 50039 21650 125698 103779
1891 103779 55239 -53682 -81771 -65866 112820 155653 15075 170454 -15236 -19380 18324
1880A8324j50668M8485J72098j24501j15826J80193j56458Q1668j38679q656J21337
1869g2683P8715O6747q7995j14956J95943R7450j26373J78818k52422J8519o3293
1858h1530M7566j10319K68731j50646K681k8324j64103J10436K0830j46615J64131
1847f7162P7422o4291N7657k61745q011J54892J18763q1211q6378K24009j34026
1836g0081j43711M6813Q3396K7773J9277R1737k96116r972J17524L8010P7931
1825a7419j85160k48122K42251J33255O1123Q5154j92027L66637r9773o372J61293
1814C00840k83187j50991K34619J88363k37140j87181J2770J41578P7561J6233
1804A13465j8193l7284Q4403q7926R9388J39575j86882q7000m8373J26385k58997
$$ plain form
1880 18324 -132344 -83859 88239 -36262 -152088 28105 -128353 -46685 -185364 -194020 -72683
1869 -72683 6032 72779 -15216 -130172 65771 163221 36848 215666 -36756 -18237 -81530
1858 -81530 -33964 -144283 124448 -26198 -23517 -51841 -215944 -105508 -84678 -231293 -67162
1847 -67162 10260 -54031 3626 -258119 -266130 -111238 7525 -73686 -160064 63945 -70081
1836 -70081 -213792 -166979 -83583 -55810 -36533 55204 -240912 -250884 -133360 -95350 -17419
1825 -17419 -202579 -450701 -208450 -75195 -14072 71082 -120945 245692 145919 139547 300840
1814 300840 17653 -133338 101281 289644 52504 -134677 -121907 19671 97232 113465
1804 113465 95272 57988 142391 54465 153853 293428 106546 19546 -28827 97558 -161439
1793a61439p9936K96451k19477K91791n225q828l2824j84356R5979m214J86795
1782A74717l6501j12750j67187K00239j03588j78761N2818J08916j68740n8241
1772b89078N2651J52411L00954j48311n0154j11004L9467l78595J71390J85787
1762g4482J83187r5617j71379L5564R1545O2353j56980K30639k29579j05829k8139
1751b58717J46952p6446L1702J87603L8420j10369j20330k0624R6742J35585J12505
1740A63023k2495k60855J10660j78096j9658R339K2673J18633q8889L0203M3652
1729g1810Q3247q9718j62892l7397K9978P3081L4762o7625J36612L8209j7932
1718e1485L5303M1759N7448j79657M6515j98021M4465K05246j01378J54305l837
$$ plain form
1793 -161439 -241375 55076 -164401 127390 122165 113337 80513 -103843 -7864 -12078 174717
1782 174717 138216 25466 -141721 58518 -45070 -223831 -171013 -62097 -230837 -289078
1772 -289078 -236427 -84016 216938 68627 18473 -92531 -53064 -431659 -260269 -74482
1762 -74482 108705 13088 -158291 -122727 -31182 31171 -125809 104830 -124749 -230578 -258717
1751 -258717 -111765 -188211 -156509 31094 69514 -40855 -161185 -181809 -85067 50518 163023
1740 163023 140528 -120327 -9667 -187763 -207421 -198082 -175409 -56776 -145665 -115462 -71810
1729 -71810 11437 -78281 -241173 -278570 -248592 -175511 -140749 -208374 -71762 -33553 -51485
1718 -51485 -16182 25577 83025 -96632 -50117 -248138 -203673 1573 -99805 54500 50663
1707E0663j45816q0816J84178k6491j90714J13144K7496j57778L54983J27816
1697B56665k38721j20002p3707j2752K83935J29022j35195j38388J39873M756
1687I5486O9453j18926R8168l27512K30258j47265k99453P5817Q4649M06007k67674
1676a00992o1462N2117R1383N3417j0639J86584n8122j65524M7032R0646n1023
1665G3417L1441k06098K5434j20258k00624L13524N8970o5228n4043R6902J98314
1654A51751L3258k01407r1980p0060J08684O4918P3301j33869L9699l1952K6181
1643c1476l1676M7527J37604j64414k10278J31403r3468P7676j39654M1113L58486
1632A22843o3991K47051j30127l99884J24572k5886J48885m5952M4435J72293
$$ plain form
1707 50663 -95153 -175969 8209 -18282 -208996 -95852 -68356 -226134 128849 256665
1697 256665 17944 -102058 -175765 -188517 95418 224440 89245 -49143 90730 95486
1687 95486 164939 46013 144181 -183331 46927 -100338 -399791 -323974 -239325 166682 -100992
1676 -100992 -162454 -110337 -18954 34463 23824 210408 152286 -13238 33794 124440 73417
1665 73417 104858 -101240 -75806 -196064 -396688 -83164 -24194 -89422 -143465 -46563 151751
1654 151751 185009 -16398 -108378 -178438 -69754 -4836 68465 -65404 -25705 -57657 -31476
1643 -31476 -63152 -15625 121979 -42435 -252713 -121310 -214778 -137102 -276756 -235643 122843
1632 122843 58852 305903 175776 -224108 -99536 -125422 23463 -22489 21946 194239
1622A94239j68305j25689J17424J25915Q9546J15546l25249R9433r1744N9306
1612I0422j29780j27560J17466j3943J82113m74065Q0515J28931K31709j6599
1602F9209k20466P4257p3832L65774n8005q5493j29017k17179J28800J21544k17370
1591b41778J85312m20n8843j07970j4344Q9378L7452K269j48060J99223K59015
1580B01234l1573j10716J74661M2244j15486r8200k2945R4941j7563j03850p9637
1569f6890l9638O3131l335j02475L8246R0732p5698m5553J27746n32j31294O5018
1557h0542J05347o3500K9758k4410R0035j1682O7332j10314p5480J67499j50561
1546e6518k17669j2278J60565n7120J22146J36777q7675j76385Q2689l8053L3009
$$ plain form
1622 194239 25934 -99755 17669 143584 233130 348676 23427 122860 31116 90422
1612 90422 -39358 -166918 -49452 -63395 118718 -355347 -274832 -145901 85808 69209
1602 69209 -151257 -77000 -150832 214942 156937 71444 -57573 -274752 -145952 -24408 -241778
1591 -241778 -56466 -56886 -115729 -223699 -238043 -148665 -111213 -108944 -257004 -57781 201234
1580 201234 169661 58945 233606 275850 160364 62164 39219 134160 116597 12747 -66890
1569 -66890 -106528 -43397 -46732 -149207 -110961 -20229 -95927 -141480 -13734 -14266 -145560 -80542
1557 -80542 24805 -38695 -8937 -33347 56688 45006 112338 2024 -73456 94043 -56518
1546 -56518 -274187 -286465 -125900 -183020 -60874 75903 -11772 -188157 -105468 -143521 -110512
1535a10512J409m0299o9308J94905j37072l9729p2221L30970J54193p9375l5474
1524I7487p7352j69158Q2942j4621J30230p0802J7325r9490j52693J8868J95268
1513d1996K20089j96462K8829q7798o9559k190j52414J69233L2661r0526J56037
1502c4096k34127K94105k0553N3398n8860l12882O7765K5744K67501o7468q3643
1491a03116K76022j40643p3092q2296N0215o8935o2271Q7874m2080l3171L5480
1480a56013Q5361J0112j98161M48622j3348j02736J5992p2732L8165P1599j78521
1469e1660Q905q5406Q0911p5243J13822j35741j05590J54970J13471n6161p599
1458d5321L8717J43873K3426k56446n5167k49395Q4723K10668q2963R1039j32286
$$ plain form
1535 -110512 -109103 -149402 -218710 -23805 -160877 -200606 -272827 58143 212336 132961 97487
1524 97487 20135 -149023 -66081 -80702 49528 -21274 -3949 -103439 -256132 -237264 -41996
1513 -41996 178093 -18369 10460 -77338 -146897 -149087 -301501 -132268 -99607 -190133 -34096
1502 -34096 -268223 25882 5329 58727 -133 -313015 -245250 -219506 47995 -19473 -103116
1491 -103116 172906 32263 -40829 -123125 -72910 -141845 -204116 -116242 -158322 -191493 -156013
1480 -156013 -70652 -60540 -258701 189921 176573 73837 89829 17097 55262 126861 -51660
1469 -51660 -42755 -128161 -47250 -122493 -8671 -144412 -250002 -95032 18439 -37722 -45321
1458 -45321 -6604 137269 160695 -95751 -150918 -400313 -315590 -104922 -187885 -96846 -229132
1447b29132L2525J18794P3346n4468J10059l1804m0812j20201k32585K45523P8651
1436e0104J43305j02227N5865j21789J68127l8048j64201J60320m374j36779J08222
1425A8317K7193j33107M0258J01023k09186R2674N3206P6978M0235j05648J35326
1414A37269r1063k13811P7137J45361j11784k56847J64780J71501n5060Q8510
1404E5993L4309j66969j73601m8709J61607K04710j5923q7866J87604k18763k0749
1393h8357n1944K01956j898l8619K18688j24762k56533J60426J12960j94212j4984
1382g7279p8172J83473P5920j51372k39972J97601K44117j55926l3224k1812L2878
1371b3768k04092P8111P7021j14554n6338L28923R2694j20596m9654K0068j38450
$$ plain form
1447 -229132 -196607 -77813 -4467 -58935 51124 19320 -21492 -141693 -374278 -128755 -50104
1436 -50104 93201 -9026 46839 -74950 93177 55129 -109072 51248 46874 -89905 18317
1425 18317 45510 -87597 -47339 53684 -155502 -62828 -9622 67356 107591 1943 137269
1414 137269 46206 -167605 -90468 54893 -56891 -313738 -148958 22543 -32517 55993
1404 55993 90302 -76667 -250268 -298977 -137370 67340 51417 -36449 151155 -67608 -88357
1393 -88357 -140301 61655 59757 21138 239826 115064 -141469 18957 131917 -62295 -77279
1382 -77279 -155451 28022 103942 -47430 -287402 -89801 154316 -1610 -34834 -56646 -23768
1371 -23768 -227860 -149749 -72728 -187282 -243620 85303 177997 57401 7747 27815 -110635
1360a10635k77629K61130m9386K26453L8545r7412l5808j50722j37662J18695
1350b14431J14377M8263P5002J71335p4382j86288O6055J80843j42830Q872l27495
1339b80679N3704L27938m2384j95306k3828R3046J1885o407j33465P1099M3434
1328h0963R7621M3296j38561L6550M1527j58009O3196o4022o8760K12681R1952
1317G6508k55415J12934J20508j31785J13224K4334j25423l2596Q0941J96819
1307A80049k45040O544j89930P5918L0792M4688n8970l4538J01937K61287n8303
1296A14434M3328J34837k96350p7458j86182J26266j64068L65490j50173j20126
1286b10002J85328L2738K72978k32888j3948N965j78565R3259r6370n9389O1474
$$ plain form
1360 -110635 -388264 -127134 -176520 49933 88478 -8934 -44742 -195464 -333126 -214431
1350 -214431 -100054 -51791 23211 194546 120164 -66124 -69 180774 37944 46816 -280679
1339 -280679 -226975 100963 58579 -136727 -160555 -67509 -55624 -62031 -195496 -124397 -80963
1328 -80963 16658 59954 -78607 -42057 -530 -158539 -95343 -159365 -228125 -15444 76508
1317 76508 -178907 -65973 54535 -77250 35974 60308 -65115 -97711 -16770 180049
1307 180049 -64991 -58447 -248377 -172459 -141667 -96979 -155949 -190487 -88550 172737 114434
1296 114434 157762 292599 -3751 -81209 -267391 -141125 -305193 60297 -89876 -210002
1286 -210002 -24674 8064 281042 48154 34206 40171 -138394 -45135 -141505 -200894 -139420
1275a39420Q6947O6844r4177j84191L33322O486j23509M8537m8339l12970R8562
1264b61908J31471j6744R0624M4450N2619K01806q6531p9664J17652l18085n7064
1253a81374J94832M1572J07749j31067n9603K01701L4747j92331k34272O0683
1243a57363R3612o4043O6218N0731j9891l955K221j85681N7421J81005o0157l3405
1231g3287K370J23599j5015K6706j83361j3691n0604L0359L4637r0564K47708
1220C8857M2456J2316j25887j137J50287n0016n8780M2670J09324j45295P624
1209B2419R9615j13656O0952P878q7999J8315J03271l09888M5813K3533j21681
1198b51428L74093l19247J52176M0074J73852m5895l3687K2623m9990k18126m8496
$$ plain form
1275 -139420 -52473 14371 -79806 -263997 69325 75811 -47698 839 -47500 -360470 -261908
1264 -261908 -130437 -147181 -56557 -12107 40512 242318 155787 76123 193775 -124310 -181374
1253 -181374 13458 55030 162779 31712 -27891 173810 208557 16226 -218046 -157363
1243 -157363 -63751 -127794 -61576 -10845 -30736 -34691 -32470 -218151 -160730 20275 -39882 -73287
1231 -73287 -70917 52682 37667 64373 -118988 -132679 -183283 -152924 -118287 -208851 38857
1220 38857 81313 93629 -32258 -33395 116892 66876 8096 50766 160090 14795 22419
1209 22419 122034 8378 69330 77208 -10791 7524 110795 -199093 -153280 -129747 -251428
1198 -251428 122665 -196582 -44406 -4332 169520 123625 89938 112561 62571 -155555 -204051
1187b04051K23088j4402P0249j24328k64294J29080m3042K1062k2334K85120q3105
1176b6957J2985j83193J07535o4701j53173J73526J69239j59657l21082m7141
1166d92619J40967K97325o2254j13583L6975J11597l6806j18297J13136J53579
1156C0020j21849J68835q3942j92292o2232M39881j37363P0623j07034k00707
1146a96060o5033K92046J03934j62558j76278P8553K37397p2804j28128N6361
1136c2570j4317J294J22717j61767l3779L73910j19495N2146j1973q5774j42163
1125e1771J7883P6212p4176j47542J31787M4449j71554K49657O6791K8623m7605
1114A22754j3492k13240j5123J94915Q9954N7962j253l57856J09192K61619Q4644
$$ plain form
1187 -204051 19037 4635 74884 -49444 -313738 -184658 -227700 -206638 -228972 56148 -26957
1176 -26957 -13972 -197165 -89630 -154331 -307504 -133978 35261 -124396 -445478 -492619
1166 -492619 -351652 -54327 -116581 -230164 -193189 -81592 -118398 -236695 -123559 30020
1156 30020 -91829 77006 -6936 -199228 -261460 178421 41058 111681 4647 -196060
1146 -196060 -261093 30953 134887 -27671 -203949 -125396 112001 39197 -88931 -32570
1136 -32570 -46887 -45593 77124 -84643 -118422 255488 135993 188139 176166 90392 -51771
1125 -51771 -33888 42324 -31852 -179394 -47607 -3158 -174712 74945 141736 170359 122754
1114 122754 109262 -103978 -119101 75814 165768 223730 222477 -135379 -26187 235432 320076
1103C20076j89120m0060r1095q1592K19700j79969j06753P0516q6959K35342J4513
1092H4599p1934j12413O79J30172l9628j5003j40610M3281j1200J18789N5079
1081D1811o2505o0256L23336k15131j4043J41676k3152j71844m536l11599L35349
1070b0894J57588k45060M7230j01501K4109J15205l052j15441P6421n1491J65518
1059D8632j03655J38254j16888r5919L65891j38375Q3415J44900l04104j75312
1049a53161K9323L6637k575J13328M3362J23944o6489k44849K49335r8789j67698
1038a37632J35292K17458q3566p0859o196l17222J11539q1001J96772j84342J71847
1027d7910N2131l1657J13828q6254N4421l17025K79973j63862n860k3825J59681
$$ plain form
1103 320076 130956 90896 -199 -81791 137909 -42060 -148813 -78297 -165256 70086 84599
1092 84599 12665 -99748 -99069 31103 -8525 -23528 -164138 -120857 -132057 -13268 41811
1081 41811 -20694 -80950 242386 27255 13212 154888 131736 -40108 -44644 -356243 -20894
1070 -20894 136694 -108366 -61136 -162637 -138528 -23323 -26375 -141816 -65395 -116886 48632
1059 48632 -55023 83231 -33657 -129576 236315 97940 181355 326255 22151 -153161
1049 -153161 -123838 -87201 -89776 23552 66914 190858 124369 -120480 128855 30066 -137632
1038 -137632 -2340 215118 131552 60693 54497 -262725 -151186 -232187 -35415 -219757 -47910
1027 -47910 4221 -27436 86392 138 54559 -262466 17507 -146355 -152215 -176040 -16359
1016a6359L46748l57436l4525n3697J02148K14852p2594k11738k3612J31624O9187
1005I4598k91722J532M5782j8931o714l2108j215J92503k09792r1003j37219K54954
993a99335j2725p8992K59335j49865j2966J34975k4527j6243P9076J49673o6611
982F1795J72283p341j96849J74901l32534p9107J77517J5084J09524j97030J03805
971B048N5162k30405L05478R0455j92540k91512J89500K63100P3178j96127M9581
960A17918n8585j0890l69192n809L98986p4739j7719K183J41463q9566Q2553j31638
948a5035j26173J46843O6230l3043J16029J17345n2579l56292J1297L3687Q3217
937h474J0545N8533L1974p8615k14388m5635N3012N8211J77776P7993q9502j1748
$$ plain form
1016 -16359 330389 -27047 -61572 -115269 -13121 201731 129137 -82601 -106213 25411 94598
1005 94598 -197124 -195592 -149810 -168741 -175455 -207563 -208778 -16275 -226067 -317070 -454289 -199335
993 -199335 -212060 -291052 -31717 -181582 -194548 -59573 -84100 -100343 -21267 128406 61795
982 61795 234078 226737 29888 204789 -127745 -206852 -29335 -14251 95273 -101757 2048
971 2048 57210 -173195 132283 222738 30198 -261314 -71814 191286 264464 68337 117918
960 117918 59333 48443 -320749 -326558 72428 -2311 -20030 -17847 123616 34050 116603 -15035
948 -15035 -141208 5635 71865 38822 154851 272196 219617 -136675 -125378 -91691 -8474
937 -8474 2071 60604 92578 13963 -200425 -246060 -193048 -134837 42939 120932 31430 19682
925A9682L8150O1446j65707j46183K95787P9081J48452l60862J63237j22298J18061
914A28846O8026j78989k5208K7254l883j83179K64627J5287j07561q6156K24596
903A43660m4440l23056J46263p5490M7665L9554J82055q9472q6580j00917n2048
892b12806Q2574O8675K42947j84270n7403J37759J68415j91063R693p3644j7212
881b6335J09456p7756j6119O2693p0268N9774P8990q046m119l6535N1324m0542
869H2517n9976j07967J62624j05605k66399P3982K28621N221N9844J03359N5937
858B32158m8146R098O5036m36413J32592K01570j76461J96887j26734p4619L02175
847B77143j94808p6889M63j04563J21186Q1278J24998j07514k4581k9411J32766
$$ plain form
925 19682 57832 119278 -46429 -192612 103175 182256 330708 -30154 133083 10785 128846
914 128846 196872 17883 -7325 19929 16046 -167133 97494 112781 5220 -80936 143660
903 143660 99220 -223836 -77573 -153063 -105398 -65844 116211 26739 -59841 -160758 -212806
892 -212806 -130232 -61557 181390 -2880 -60283 77476 245891 54828 64521 -9123 -26335
881 -26335 83121 5365 -10754 51939 -18329 41445 120435 112389 108270 71735 123059 82517
869 82517 22541 -85426 77198 -28407 -294806 -220824 7797 13018 72862 176221 232158
858 232158 184012 193110 258146 -178267 -45675 155895 -20566 176321 49587 -25032 277143
847 277143 82335 5446 5909 -98654 22532 103810 228808 121294 96713 67302 200068
836B00068j42638J35088j38617l5016M4926J53265j12668l77470l6270J84039
826a25293J2961J63883K36269j32586k217p4455J3714N2105o3224j01350J21126
815A00933n3877j71159j1065m2492J95714M6150J72500k23806o5954N1566k2708
804b4198P0144j86499J98252P365p3485k69689N3256J04092J64249L6705p185
793G3007m3813j62122p7205L56756j92981q7576K84172j24304q5281K15820R5061
782B51534j08290j67754J71127j11223j06263J40631m0734j61016K13935o5032
772A6915K8808K4989j23788j2375k1557N5148L6983K7966J18890j41689k15399
761b05109N0925R5424K95860j95117K15504k7157l58716N8488R6652n7861j49056
$$ plain form
836 200068 57430 192518 53901 18885 63811 217076 104408 -273062 -309332 -125293
826 -125293 -112332 51551 287820 155234 153017 78562 92276 144381 81157 -20193 100933
815 100933 47056 -124103 -135168 -177660 18054 64204 236704 12898 -53056 -1490 -24198
804 -24198 45946 -140553 57699 65064 -8421 -278110 -224854 -120762 43487 80192 73007
793 73007 29194 -132928 -210133 146623 -46358 -133934 150238 25934 -59347 156473 251534
782 251534 143244 -24510 146617 35394 -70869 69762 29028 -131988 81947 16915
772 16915 45723 70712 -53076 -65451 -87008 -31860 5123 33089 151979 10290 -205109
761 -205109 -154184 -58760 237100 41983 257487 230330 -128386 -69898 26754 -31107 -180163
750a80163n3141K83826j30260L306M0925l8442o5040m3418K80281K3938J10606
739B32418k05585r8618j669j29298J41218Q0122o6770j07895o3469J58415N1322
728i809j6928n0056L4385R0263k684J9875J20186j98191j53975J60103j66172
717a73003j50140M30854L0359o3718J55384j15526q6003j69315K04054J57736
707B20682j82888j30195j9073J2920O4816N5549J46660l2078k79525P7910K01453
696A36231r9876J49530N2549n3109p0439p9799k7685j85449J01421K57222l1008
685A49588j19851k599K4719p0067j8278j9853Q6551K2987r8249J60279j49734
674c4507k06676p5679J09400J07142R5769K05709M1509l02743j64908J64053l6193
$$ plain form
750 -180163 -233304 50522 -79738 -76432 -35507 -73949 -138989 -182407 97874 121812 232418
739 232418 26833 -71785 -73454 -202752 -61534 18588 -48182 -156077 -219546 -61131 -9809
728 -9809 -26737 -76793 -42408 47855 45171 65046 185232 -12959 -166934 -6831 -173003
717 -173003 -323143 107711 138070 74352 229736 114210 28207 -141108 62946 220682
707 220682 37794 -92401 -111474 -98554 -33738 21811 168471 136393 -143132 -65222 136231
696 136231 36355 185885 238434 185325 114886 35087 7402 -178047 -76626 180596 149588
685 149588 29737 27138 51857 -18210 -36488 -56341 30210 53197 -45052 115227 -34507
674 -34507 -241183 -316862 -207462 -100320 -4551 201158 242667 -60076 -224984 -60931 -97124
663i7124J56167J30861k26115J05103q4738J24201Q9307k00712J15560J15532
653B28042k96657L0955m2779J7885Q2299j20636J03854j23766J56836n9867P2561
642D8727m9225j6539J50301J0729n5794j14902j32311J33783M8463k32870O3985
631a45653j69485L82249J06940k26071J14659j1543J7673N4851j0078j79991N4795
620a1654J91529p7186k56266K2495O7670M439k27750J40353J12998k3467l1683
609h8522M0611j19999J80738j7026O8191j04983P2086K2648K591m0424Q4730o0103
597D0538j54007N7940K46865r4929P6083J62932l33801l3617l8532k26442R3955
586b03015Q8142k4013R1419l674J4719l6952J17058k2357Q6748j20864J03009
$$ plain form
663 -97124 59043 189904 -36211 68892 -15846 108355 197662 -3050 112510 228042
653 228042 -68615 -37660 -80439 -62554 19745 -100891 2963 -120803 36033 -23834 48727
642 48727 -498 -17037 133264 143993 88199 -26703 -159014 -25231 23232 -209638 -145653
631 -145653 -315138 67111 174051 -52020 62639 51096 68769 123620 113542 -66449 -11654
620 -11654 179875 102689 -153577 -131082 -63412 -58973 -286723 -146370 -33372 -56839 -88522
609 -88522 -47911 -167910 12828 -4198 63993 -40990 31096 53744 56335 15911 100641 40538
597 40538 -113469 -55529 191336 96407 172490 335422 1621 -31996 -70528 -296970 -203015
586 -203015 -114873 -138886 -47467 -51141 -36422 -73374 43684 21327 108075 -12789 90220
575I0220p716J02301k91751K3616K47625k6596k62344M5975j2243Q0165M7169
564C6421n8815r5460M8612J19020J32191R4703l28146n3780J22425Q0281P5962
553A73414n2438r0085k7193K15821P7428j88625r4749j06989q1179J03322O8733
542b540l5578J49721l5972r8949k0706J0116M7402n0829k6026K5751j04069K57925
530A16246j02975k08357J63648K6318p8890O832L25061k73200q3427Q6946N2560
519C0762k91258Q4080J23068j23563O5277l3866Q0035J34499K1483m0023K0404
508G0898m1586P6387R8889n5645j85731J49190j35521J26001k10292m3447J65252
497A4395J99924l3948R0384J1694n3647l32876J31956K9239L5652J21297j22958
$$ plain form
575 90220 82504 184805 -106946 -83330 164295 137699 -124645 -78670 -90913 -10748 36421
564 36421 -22394 -117854 -69242 49778 181969 276672 -51474 -105254 17171 97452 173414
553 173414 120976 30891 3698 219519 296947 108322 13573 -93416 -174595 -71273 -2540
542 -2540 -38118 111603 75631 -23318 -44024 -33908 13494 -37335 -63361 -37610 -141679 116246
530 116246 13271 -195086 -31438 -5120 -84010 -77178 247883 -25317 -108744 -21798 30762
519 30762 -260496 -176416 -53348 -176911 -111634 -145500 -65465 69034 90517 50494 70898
508 70898 29312 105699 204588 148943 -36788 112402 -23119 102882 -107410 -150857 14395
497 14395 214319 180371 270755 282449 228802 -104074 27882 57121 92773 214070 91112
486I1112l0199p8162J66668k88788k03358J80985J68172k16210L75659j62239
476C640p2121R9680j2088j44772K46993J08529j60193K34190J7256r5821q2230
465A43063p8664r8266l2663J92550J48309l36004o9542k2583J60256J90125j11896
454H4685N5947o3652R83j07284K55168r0308k21638J49160J4173K5662l3706m2420
442B6770R4570l6064J5769r8605p1234J45688K2450J69431o3885l16519j09863
431b21492K37946k0890k17017Q8161N1933o6914K69350o2380n2736J1963J2564
420C0488M5694k83501M227J28346o5610K66795l3166j96654J87630j03077M6467
409B7639K26599m407j43815j0223M9696r6116l4878n9874P266j06564J5911Q2471
$$ plain form
486 91112 60913 -17249 149419 -139369 -342727 -161742 6430 -209780 165879 3640
476 3640 -68481 31199 19111 -125661 121332 229861 69668 303858 321114 225293 143063
465 143063 64399 -33867 -66530 126020 274329 -61675 -131217 -153800 6456 196581 84685
454 84685 140632 76980 77963 -29321 225847 135539 -86099 63061 77234 102896 69190 26770
442 26770 121340 85276 101045 2440 -68794 76894 99344 268775 204890 -111629 -221492
431 -221492 16454 -4436 -221453 -133292 -81359 -148273 121077 58697 5961 17924 30488
420 30488 76182 -207319 -203092 -74746 -140356 126439 93273 -103381 84249 -18828 27639
409 27639 254238 249831 106016 95793 145489 49373 14495 -45379 -38113 -144677 -128766 -46295
397d6295l880J40596j10799J00016O8198p1423L7245M2859k6268j69301j73782
386b12834O3292J42357q5223J00305j2884j22202K34967O2580k24706l9646N7762
375c6232l1106L9773o273K5465J28786J97572k68259j15424J1283M8775R2091
364H6451j42020j58041P6969K29562R2870j3502j04725l4387J33992j62139K23937
353B28967k24175Q5811M0076k88217J72665j54119p0718o6708K45136l8895P6333
342F156L61687o7031j53570K2216j54106O8197j41542J31270J0536J7190q8917
331A2086K1300O1381k11733J3522L14532q2519m1155J32162j33153p7102J83107
320A92428J0435L7872m2044j76014l7766L4203J83962Q858l87366j5035Q160R0227
$$ plain form
397 -46295 -50175 90421 -20378 79638 147836 76413 113658 156517 130249 -39052 -212834
386 -212834 -149542 -7185 -92408 7897 -4987 -127189 107778 170358 -54348 -93994 -36232
375 -36232 -67338 -27565 -33838 -8373 120413 317985 49726 -65698 -54415 -5640 86451
364 86451 -55569 -213610 -136641 92921 185791 172289 67564 33177 167169 5030 228967
353 228967 4792 90603 130679 -157538 15127 -138992 -209710 -276418 -31282 -70177 6156
342 6156 367843 300812 147242 169458 15352 83549 -57993 73277 83813 101003 12086
331 12086 33386 94767 -116966 -103444 211088 128569 87414 219576 86423 9321 192428
320 192428 202863 240735 198691 22677 -15089 19114 203076 211934 -175432 -190467 -182307 -92080
308i2080m7210J81980O1071n0413J4355k1959J08903j18715R038m5694k9055J89684
$$ plain form
308 -92080 -139290 42690 103761 53348 67703 45744 154647 35932 44970 -724 -29779 159905
$$ [...]
##END NTUPLES=NMR SPECTRUM
##END=
