##TITLE=1H_CA-9280-1
 CDCl3
 8 sc, 
 2.9.2024
##JCAMPDX= 6.0         $$ Bruker NMR JCAMP-DX V2.0
##DATA TYPE= NMR SPECTRUM
##DATA CLASS= NTUPLES
##ORIGIN= UXNMR, Bruker Analytische Messtechnik GmbH
##OWNER= root
$$ XWIN-NMR		Version 3.5
$$ Mon Sep  2 13:55:44 2024 Russian Standard Time (UT+4h)  she@DPX200
##.OBSERVE FREQUENCY= 200.1318
##.OBSERVE NUCLEUS= ^1H
##.ACQUISITION MODE= SIMULTANEOUS
##.ACQUISITION SCHEME= undefined
##.AVERAGES= 8
##.DIGITISER RES= 18
##SPECTROMETER/DATA SYSTEM= spect
##.PULSE SEQUENCE= zg30
##.SOLVENT NAME= D2O
##.SHIFT REFERENCE= (INTERNAL, D2O, 0, 20.9782)
##AUDIT TRAIL= $$ (NUMBER, WHEN, WHO, WHERE, WHAT)
$$ ##TITLE= Audit trail, XWIN-NMR		Version 3.5
$$ ##JCAMPDX= 5.01
$$ ##ORIGIN= Bruker BioSpin GmbH
$$ ##OWNER= she
$$ F:/spectra/data/she/nmr/H-F/1/pdata/1/auditp.txt
$$ ##AUDIT TRAIL=  $$ (NUMBER, WHEN, WHO, WHERE, WHAT)
(   1,<2024-09-02 13:54:24.64 +0400>,<she>,<DPX200>,
      <created by zg, POWCHK disabled, PULCHK disabled
       configuration hash MD5:
       00 E9 B6 7A A2 85 ED C7 34 08 36 98 17 FE 4E 26
       data hash MD5: 16K
       77 1C E9 F4 F3 00 21 0D 8E 18 80 43 A3 E2 C1 8A>)
(   2,<2024-09-02 13:54:27.50 +0400>,<she>,<DPX200>,
      <Start of raw data processing
       efp BC_mod = 2 LB = 0.24 FT_mod = 6 PKNL = 1 PHC0 = -25999.89 PHC1 = 12.18748 SI = 16K 
       data hash MD5: 16K
       81 0A F5 F6 B5 B4 25 DA CC C4 15 63 6E 09 A4 F1>)
(   3,<2024-09-02 13:54:50.21 +0400>,<she>,<DPX200>,
      <pk PHC0 = 3.959947 PHC1 = 0.4 
       data hash MD5: 16K
       D3 C1 EE 66 B1 92 DE E4 C2 65 04 1E AF 88 D9 36>)
(   4,<2024-09-02 13:54:56.60 +0400>,<she>,<DPX200>,
      <abs ABSG = 5 
       data hash MD5: 16K
       77 12 B0 00 66 B5 E5 52 A6 64 08 5D FC DB 7B 6A>)
$$ ##END=
$$ 
$$ hash MD5
$$ 2A 01 12 9F 60 79 98 E8 8D C7 20 89 BF AC 4D FB
##$RELAX= 
##$RELAX= 
##$RELAX= 
##$RELAX= 
##$RELAX= 
##$RELAX= 
$$ Bruker specific parameters
$$ --------------------------
##$DU= <F:/spectra>
##$EXPNO= 1
##$NAME= <H-F>
##$PROCNO= 1
##$TYPE= <nmr>
##$USER= <she>
##$AMP= (0..31)
100 100 100 100 100 100 100 100 100 100 100 100 100 100 100 100 100 100 
100 100 100 100 100 100 100 100 100 100 100 100 100 100 
##$AQSEQ= 0
##$AQ_mod= 1
##$AUNM= <au_zg>
##$AUTOPOS= <>
##$BF1= 200.13
##$BF2= 200.13
##$BF3= 200.13
##$BF4= 200.13
##$BF5= 200.13
##$BF6= 200.13
##$BF7= 200.13
##$BF8= 200.13
##$BYTORDA= 1
##$CFDGTYP= 0
##$CFRGTYP= 5
##$CHEMSTR= <none>
##$CNST= (0..31)
1 1 145 1 1 1 1 1 1 1 1 1 1 1 1 1 1 1 1 1 1 1 1 1 1 1 1 1 1 1 1 1 
##$CPDPRG= <>
##$CPDPRG1= <>
##$CPDPRG2= <>
##$CPDPRG3= <>
##$CPDPRG4= <mlev>
##$CPDPRG5= <mlev>
##$CPDPRG6= <mlev>
##$CPDPRG7= <mlev>
##$CPDPRG8= <mlev>
##$CPDPRGB= <>
##$CPDPRGT= <>
##$D= (0..31)
0 1.2 0 0 0 0 0 0 0 0.06 0 0.03 0 0 0 0 0.0002 0 0 0 0 0 0 0 0 0 0 0 0 
0 0 0 
##$DATE= 1725270864
##$DBL= (0..7)
120 120 120 120 120 120 120 120 
##$DBP= (0..7)
150 150 150 150 150 150 150 150 
##$DBP07= 0
##$DBPNAM0= <>
##$DBPNAM1= <>
##$DBPNAM2= <>
##$DBPNAM3= <>
##$DBPNAM4= <>
##$DBPNAM5= <>
$$ [...]
##$SUBNAM3= <"">
##$SUBNAM4= <"">
##$SUBNAM5= <"">
##$SUBNAM6= <"">
##$SUBNAM7= <"">
##$SUBNAM8= <"">
##$SUBNAM9= <"">
##$SW= 24.0689170037331
##$SWIBOX= (0..15)
0 0 2 0 0 0 0 0 0 0 0 0 0 0 0 0 
##$SW_h= 4816.95568400771
##$TD= 16384
##$TD0= 1
##$TE= 0
##$TE2= 300
##$TE3= 300
##$TEG= 300
##$TL= (0..7)
0 120 120 120 120 120 120 120 
##$TP= (0..7)
150 150 150 150 150 150 150 150 
##$TP07= 0
##$TPNAME0= <>
##$TPNAME1= <>
##$TPNAME2= <>
##$TPNAME3= <>
##$TPNAME4= <>
##$TPNAME5= <>
##$TPNAME6= <>
##$TPNAME7= <>
##$TPOAL= (0..7)
0.5 0.5 0.5 0.5 0.5 0.5 0.5 0.5 
##$TPOFFS= (0..7)
0 0 0 0 0 0 0 0 
##$TUNHIN= 0
##$TUNHOUT= 0
##$TUNXOUT= 0
##$USERA1= <user>
##$USERA2= <user>
##$USERA3= <user>
##$USERA4= <user>
##$USERA5= <user>
##$V9= 5
##$VALIST= <valist>
##$VCLIST= <CCCCCCCCCCCCCCC>
##$VD= 0
##$VDLIST= <DDDDDDDDDDDDDDD>
##$VPLIST= <PPPPPPPPPPPPPPP>
##$VTLIST= <TTTTTTTTTTTTTTT>
##$WBST= 1024
##$WBSW= 4
##$XGAIN= (0..3)
0 0 0 0 
##$XL= 0
##$YL= 0
##$YMAX_a= 417726
##$YMIN_a= -302694
##$ZGOPTNS= <>
##$ZL1= 120
##$ZL2= 120
##$ZL3= 120
##$ZL4= 120
##$ABSF1= 21.28233
##$ABSF2= -2.78681
##$ABSG= 5
##$ABSL= 3
##$ALPHA= 0
##$AQORDER= 0
##$ASSFAC= 0
##$ASSFACI= 0
##$ASSFACX= 0
##$ASSWID= 0
##$AUNMP= <proc_1d>
##$AZFE= 0.1
##$AZFW= 0.1
##$BCFW= 0
##$BC_mod= 2
##$BYTORDP= 0
##$COROFFS= 0
##$CY= -3
##$DATMOD= 1
##$DC= 0
##$DFILT= <>
##$DTYPP= 0
##$F1P= 0
##$F2P= 0
##$FCOR= 1
##$FTSIZE= 16384
##$FT_mod= 6
##$GAMMA= 0
##$GB= 0
##$INTBC= 1
##$INTSCL= 3.70164e-10
##$ISEN= 128
##$LB= 0.24
##$LEV0= 0
##$LPBIN= 0
##$MAXI= 10000
##$MC2= 0
##$MEAN= 0
##$ME_mod= 0
##$MI= 1.114404
##$NCOEF= 0
##$NC_proc= -7
##$NLEV= 6
##$NOISF1= 3.799351
##$NOISF2= 2.8
##$NSP= 0
##$NTH_PI= 0
##$NZP= 0
##$OFFSET= 20.97822
##$PC= 1
##$PHC0= -25995.93
##$PHC1= 12.58748
##$PH_mod= 1
##$PKNL= yes
##$PPARMOD= 0
##$PSCAL= 0
##$PSIGN= 0
##$REVERSE= no
##$SF= 200.130010106248
##$SI= 16384
##$SIGF1= 3
##$SIGF2= 2
##$SINO= 5.538805
##$SIOLD= 16384
##$SREGLST= <1H.CDCl3>
##$SSB= 0
##$STSI= 16384
##$STSR= 0
##$SW_p= 4816.95568400771
##$SYMM= 0
##$S_DEV= 0
##$TDeff= 16384
##$TDoff= 0
##$TI= <>
##$TILT= no
##$TM1= 0
##$TM2= 0
##$TOPLEV= 0
##$USERP1= <user>
##$USERP2= <user>
##$USERP3= <user>
##$USERP4= <user>
##$USERP5= <user>
##$WDW= 1
##$XDIM= 16384
##$YMAX_p= 402903278
##$YMIN_p= -961586
$$ End of Bruker specific parameters
$$ ---------------------------------
##NTUPLES= NMR SPECTRUM
##VAR_NAME=  FREQUENCY,     SPECTRUM/REAL,   SPECTRUM/IMAG
##SYMBOL=    X,             R,               I
##VAR_TYPE=  INDEPENDENT,   DEPENDENT,       DEPENDENT
##VAR_FORM=  AFFN,          ASDF,            ASDF
##VAR_DIM=   16384,         16384,           16384
##UNITS=     HZ,            ARBITRARY UNITS, ARBITRARY UNITS
##FACTOR=    0.29402158847633, 1,            1
##FIRST=     4198.37137780165, 0,            0
##LAST=      -618.584306206058, 0,           0
##MIN=       -618.584306206058, -961586,     0
##MAX=       4198.37137780165, 402903278,    0
$$ Real data points
##PAGE= N=1
##DATA TABLE= (X++(R..R)), XYDATA
$$ [...]
12542 -321936 -40003 -239674 -66073 80055 -171448 -78614 -323846 -326199 -200153 -268515
12532 -268515 -369170 -66110 98403 -297190 -407942 -83417 27315 -28729 97166 -185051
12522 -185051 -299455 -187221 121769 -351239 -125766 -69766 -209872 -182246 -245154 -219179
12512 -219179 -213653 -81962 69191 21330 -250629 -149470 111017 45371 107948 -121431
12502 -121431 -446757 -528341 -472920 -340070 -359633 -62835 -84311 -229723 -71317 -257948
12492 -257948 48037 -211723 -176024 -20951 -295649 -174790 -312697 -411220 322310 222275
12482 222275 47326 -41567 -77576 123756 42027 -117182 -132795 -248382 -208474 -55898
12472 -55898 -165587 -404734 -215854 -80514 -289065 -506546 -374245 -243239 -183858 -59715
12462 -59715 -399740 -270793 -328146 -125389 -20431 -143627 -184130 34560 114042 -474
12452 -474 -222513 -9132 -304972 -687232 -426583 -324943 -125485 -288123 -49875 124028
12442 124028 -115750 -66459 -279248 -354086 -134728 73343 -206112 -163170 16347 -131098
12432 -131098 -98601 195285 -299153 -527431 -148348 -15109 -233929 -387964 -402451 -293418
12422 -293418 -159895 -193151 238713 -182933 -129395 -224773 -416445 -177802 45436 -214732
12412 -214732 -238704 37689 -113531 65327 191217 -75008 -361549 -129467 -38197 -74384
12402 -74384 53475 -17227 -312209 -205735 -275217 97901 254756 167311 217420 181392 -233236
12391 -233236 -81536 -177897 -295257 -399529 -339567 -184882 -357388 -88650 -191598 -405189
12381 -405189 -76072 -10381 178454 -19196 41932 95416 -160793 -303866 -314095 -406975
12371 -406975 -349703 -253964 -72734 70410 -353103 -411259 -122152 -156428 -394499 -382041
12361 -382041 -425782 -447212 -317614 -199947 -86842 -309743 -473843 -403036 -176084 -119859
12351 -119859 -243064 69537 -283913 -284089 -130847 -24863 178949 83513 -84182 -418897
12341 -418897 -444314 -500095 -578920 -328456 -377212 -425581 -264218 -288507 -153288 -97321 -262502
12330 -262502 -101467 -120928 58381 166544 32406 -8521 -290006 -64289 -242153 -547935
12320 -547935 -122656 -310748 -230660 -244393 -35705 -19299 -266789 -341986 -493202 -324688
12310 -324688 -23383 156900 -43442 -181843 70808 -225298 7883 -40753 -144076 -92023
12300 -92023 -107307 -197794 -226032 72503 149356 174717 -125119 -149417 -268733 -234713 20212
12289 20212 -192561 -433391 -716044 -486684 -107112 69308 -182140 -48911 -191396 -343498
12279 -343498 -233835 -328248 -141650 -188400 190054 -176973 -378026 -343658 -87422 -98340
12269 -98340 -275536 83496 94616 -99103 -20284 375 -110100 -192742 -91833 -166757 -72893
12258 -72893 103726 -108331 -48747 -143144 -510016 -381065 -395747 -208728 -362414 -267189
12248 -267189 -61017 -377214 -469334 27443 -196921 -283894 -354965 -358113 -255282 -618009
12238 -618009 -464141 -496110 -82314 -170733 -180998 -99558 -295707 -197250 -237504 -220816 -140681
12227 -140681 -284869 -289288 -395687 56099 53058 -72692 -175301 -209578 -187498 23044 17231
12216 17231 -470287 -18834 160265 -139160 -356803 -190261 -501481 -559892 -306431 -284709
12206 -284709 -121959 -132484 -37978 -171252 -236591 -143257 -181911 -225897 -130592 -109872 -197591
12195 -197591 -56629 -315456 -509141 -390698 -594712 -494710 -69815 178026 -27544 67356
12185 67356 -158047 -243746 -206072 43044 -191859 -189734 -194388 -217654 -18037 -129702 -124475
12174 -124475 -377088 -318765 -466557 -386985 -387160 -375563 -233508 -30290 -259529 -22084 -67934
12163 -67934 -229050 -247625 -177087 -107614 -94734 -29805 -45228 -32359 -253802 -225070 -236435
12152 -236435 -54452 -97158 -413928 -329920 -158105 -206080 -172804 -83923 68680 48695 -42183
12141 -42183 -194406 -117345 -148321 -8593 -106056 -135540 -9405 -247667 -177744 -174595 -58774
12130 -58774 -323339 -282082 -119850 -25264 -8698 39104 -428 78735 206709 351462 268405
12119 268405 108612 -73935 51401 -342952 -390453 -174445 -232784 75652 -156250 -146600
12109 -146600 -349216 -221663 -132926 -290369 -193360 -182032 -213026 -135059 -294576 -477673
12099 -477673 -165811 -207570 -246821 -213881 -191251 41313 -131049 -129903 -161596 -121639 -71084
12088 -71084 -26861 -20917 8658 -94314 -211604 -376251 -85892 -118329 -189876 -270864 -51666
12077 -51666 -82307 -84737 -101489 -59481 242405 342343 62266 -80772 -49204 -77252 62827
12066 62827 -137593 -308233 -198214 37909 -3716 168595 31718 19491 -82380 -301732
12056 -301732 -569729 -269058 -367977 -98896 -138296 -270638 -238507 -327298 -41571 60277
12046 60277 -158494 -102570 14947 -179244 -117734 7880 167910 13762 -6291 -139770
12036 -139770 -426731 -336904 -512208 -348423 -183323 -173618 -393274 -243079 -29996 279070
12026 279070 249377 164570 191194 34705 -51096 -107593 -7021 -59240 -78448 -453670 -173087
12015 -173087 -106845 -315097 -453230 -65500 -145784 -38294 -40854 -240075 -252187 -381412
12005 -381412 -309563 -84704 -160910 -245008 -25034 -131283 -1097 -151903 -53724 -146543
11995 -146543 -228135 87156 -134719 -64571 32826 -211819 -241074 38321 36362 -152579 84152
11984 84152 46376 21469 -80398 -35733 179822 -138219 6145 -25230 47027 130845 -293667
11973 -293667 -254511 96258 -155360 -101720 -242018 -427693 -148882 -113930 -163212 13212
11963 13212 64695 -43176 -131777 -105744 128111 -55281 -265155 -67920 -45723 -173246
11953 -173246 -13833 -211580 -412546 -453169 -365787 -230498 -132099 -101145 -152350 -19420
11943 -19420 -131672 -396964 -296681 61736 157352 -331084 -163877 41346 92373 -118407
11933 -118407 -309920 -139933 -14437 -141708 -302731 -492413 -422399 -93141 152662 168698
11923 168698 -282781 41542 12985 -85142 91216 107163 61306 -65623 5697 26756 33686
11912 33686 -456209 -466608 -283933 -137781 -65384 129847 326736 86529 66163 -63124
11902 -63124 48972 -111191 54544 98480 93653 -132882 -358803 -181453 -13797 -154957
11892 -154957 -212755 8100 110088 9400 -112951 -136778 -356738 -182892 77926 217239
11882 217239 262817 106988 -157613 -443599 -305734 -33159 66577 71322 -106121 -184598
11872 -184598 -427433 -245976 -195873 -90915 -66260 -300070 32932 72324 -165739 -301624
11862 -301624 -191909 -186537 -90668 -230185 -157022 -370537 -244672 284969 138190 186338
11852 186338 -71269 36551 -10127 -118862 130370 -145212 -507279 -273995 -286370 -167752
11842 -167752 -148432 -7859 157080 330798 305799 -153979 -320765 -124629 -444252 -48111
11832 -48111 -130137 -183919 -126791 -416331 -209736 -166759 -341835 -206495 254029 149548
11822 149548 7810 -354583 -172773 -86632 -57139 -147952 105714 218793 -202110 5803
11812 5803 -269506 -429966 34553 -129974 -36349 -138687 94298 -181998 -246548 -130909
11802 -130909 -131077 137101 316735 15574 -356959 -221554 -69494 -131010 -457894 -77496
11792 -77496 -63434 -249977 -107929 -248163 -111257 34528 -154940 -51377 -289272 -167583
11782 -167583 -132908 17867 -43965 -148116 68956 -91966 -399544 -376272 -1977 -20201
11772 -20201 -383106 -522866 -374245 -165671 -176752 -189876 -203162 -421334 -346802 -391497 -225402
11761 -225402 -145656 142715 -115423 -92664 119982 -7167 111185 -144247 -380932 -279088
11751 -279088 -186263 -202270 -255707 86073 204561 330916 -167474 -362981 -16658 -8961
11741 -8961 17284 165603 104991 -126480 -11100 31773 183429 87587 249914 -21192 104198
11730 104198 80906 -14890 22972 -53694 -301923 -176714 -173666 -241288 -194284 -386928 -140616
11719 -140616 164538 257406 266173 -21648 -38225 77138 83507 140823 73532 232564 90358
11708 90358 -121662 -183249 -94300 86961 -6963 345659 174080 8797 119078 -23796
11698 -23796 -25323 -42436 188022 -89966 -490356 -203837 -306668 -149032 -70731 -140566 -112007
11687 -112007 53867 -29087 40204 37982 36871 -89391 -382663 -325494 -176396 -1625 -73334
11676 -73334 115609 59134 37960 63537 -49703 -87475 -10242 -166543 -42570 -325713 -84618
11665 -84618 -368452 -314625 38144 144618 146947 44989 -191014 -262824 -68997 56514
11655 56514 -229194 -258439 -103337 -67000 -79259 -25140 265128 217158 249096 337498 176978
11644 176978 -46963 102073 414024 390674 146004 29406 -7666 36985 -15576 87240
11634 87240 -70639 75353 94489 -230422 -73570 440 26210 100876 -59150 -43815 134232
11623 134232 -191327 -88633 92335 231033 161896 91059 -54363 -15294 -32488 -225022
11613 -225022 -38106 -49237 -267929 -17416 110392 -345184 -311156 -161823 -164213 99880
11603 99880 120743 -235284 156228 238671 275495 278123 55437 8530 186868 162382 182654
11592 182654 169099 33570 42459 117871 127472 -162728 29063 -136823 -375798 -140082 -181503
11581 -181503 114553 218323 355826 -23506 16753 128577 27986 303269 186094 -13881
11571 -13881 2983 -177149 225817 937 -166400 79497 -6997 -111878 -250778 -268619
11561 -268619 -81215 198033 111195 -187568 -143690 211555 75955 290807 168321 55565
11551 55565 -41050 -114866 17699 65523 -157380 -125173 97774 199636 109593 -200089 231717
11540 231717 27897 5068 166999 -111254 -2151 152294 307650 18498 -245053 -25859
11530 -25859 247293 143989 158107 -53489 -145548 -164872 30796 188797 -75306 -84313 170626
11519 170626 326486 306936 -31084 -44158 -78027 -87884 106747 162560 284292 445716 292018
11508 292018 202662 152019 -50670 -124871 85724 269523 312930 209797 -114672 -101298
11498 -101298 166906 283688 179170 502946 495032 366714 115798 -102897 -16418 309101
11488 309101 215161 -180155 50048 -180251 -180495 362366 -222092 -167411 235325 299211 226657
11477 226657 161588 119080 329036 310265 218325 249124 260887 133046 61618 173773 147052
11466 147052 334296 605877 289706 67473 202750 292874 61047 87933 140173 407891
11456 407891 311878 229978 194418 -49764 -42550 -107880 202567 74185 54022 52858 141163
11445 141163 130207 -65234 44823 141250 1270 -8094 -92949 113407 -51042 23529 63881
11434 63881 -20464 -189270 -72614 -317539 59474 168359 -189618 -137844 83027 -165077
11424 -165077 18694 123802 -91013 -205463 -197247 -320442 -29752 129018 154766 -68075
11414 -68075 68041 158215 -50999 -6956 -29127 209668 115672 265066 105435 -18898
11404 -18898 262607 425694 485514 394012 331392 -57809 -34168 -27037 -77404 209672 -126250
11393 -126250 130581 252404 297333 192530 169145 -27990 331713 515445 509975 648350
11383 648350 274529 -326408 -181196 77082 -72026 35335 285640 447544 374882 256632
11373 256632 51489 -226531 183121 71762 -54197 137672 237887 169190 -102650 -8623
11363 -8623 41639 185888 -12228 99352 141699 130177 199575 240705 240773 78264 19181 301993
11351 301993 378159 235834 95099 81336 -73299 -56274 137380 241117 303485 127198
11341 127198 408478 331532 190278 219950 219428 148076 234966 160868 381884 238786 127122
11330 127122 204215 141950 50067 169746 69424 206507 290252 236475 295137 44132 -69030
11319 -69030 36040 -123447 -77869 88303 -91563 28080 118274 124124 252437 283535 272112
11308 272112 357129 191935 44095 179500 450744 433647 162154 71527 -31103 100844
11298 100844 -75220 252051 -135070 -84880 229700 61077 292687 69424 153366 192440
11288 192440 162344 200236 250802 75161 360491 196374 379469 285733 195556 142367 -41776
11277 -41776 -125928 -148810 149103 221332 371576 156055 61440 12188 318963 404985 343495
11266 343495 147642 -119180 41988 -61429 299361 384767 76724 173336 118624 333850
11256 333850 320922 387782 512650 -23232 332065 313836 124780 134027 160810 27981 -21013
11245 -21013 -165857 133637 259334 311985 519988 407207 562116 259208 76863 268852
11235 268852 89731 50689 -146329 -41956 253056 85806 166854 198022 76888 -11765
11225 -11765 174271 205664 -32311 319390 376081 38188 -53332 338308 371193 172378
11215 172378 172557 95440 11396 48285 140923 -183169 207913 318390 176938 159441 317896
11204 317896 392279 164637 91162 173578 410092 395477 326531 161526 -116840 -174613 -41666
11193 -41666 169298 179604 -81303 217654 84912 4999 197138 288984 516048 184268
11183 184268 89810 13708 83684 178460 227448 305846 267049 475091 252847 300162 143850
11172 143850 259747 208593 71019 198210 341127 410968 435771 579085 142699 40794
11162 40794 426333 346664 194982 178255 5613 398050 443543 427854 501710 312369 359548
11151 359548 746728 768210 631016 542817 453688 338294 354985 495365 505593 676429
11141 676429 730983 633759 539005 229523 137447 34851 238199 371044 295183 249897 315284
11130 315284 123806 307725 63771 115219 -7355 93639 282798 361243 513522 342798
11120 342798 449441 521149 372275 139258 314093 171444 291812 478795 771509 595405
11110 595405 316255 264028 239894 243641 -9378 -32880 -15048 -46746 87591 214414 253283
11099 253283 277997 173311 -43968 34943 30539 -3822 -2675 -193043 96883 16628 58891
11088 58891 121197 160429 44893 40004 96194 61521 134047 152817 178320 217956 619977
11077 619977 328979 304200 323198 189193 136336 157022 208652 361972 396881 472533 447841
11066 447841 316031 163325 569350 253089 76448 357343 139382 228333 178216 -41218
11056 -41218 122917 419736 210833 514662 509359 480341 76392 -82228 82763 137090
11046 137090 326009 322110 530345 302905 116465 146979 257299 160700 189006 333686
11036 333686 264077 38578 48109 -210062 -31992 163373 -191128 -102754 372824 148281
11026 148281 85912 397991 395914 88328 -233003 -161240 273389 552798 116195 60209
11016 60209 449728 423043 170442 238471 624924 198834 189293 422256 359412 239725 241638
11005 241638 379056 298851 482126 411227 395025 461012 228143 46866 410051 90771
10995 90771 237575 447409 488323 322886 606048 292806 371234 331466 65815 132314
10985 132314 343475 518609 362330 65424 203839 473791 467139 319932 586457 461434
10975 461434 -100787 70989 30309 193987 223921 432480 367951 387556 362303 140058
10965 140058 178324 433341 241843 304512 539624 609984 295179 102776 210755 347160
10955 347160 168205 135150 393680 143071 38695 127301 130000 414844 182854 289592
10945 289592 661193 509551 -33563 -108570 840 201127 102536 269889 115740 53466
10935 53466 115140 -151449 55507 25712 101794 247081 211607 308235 220539 246609 141748
10924 141748 57914 106302 548269 181075 52550 414343 566431 491047 263751 261719
10914 261719 -31520 222188 297406 -144064 34826 214063 -126920 338046 255606 374046
10904 374046 474825 221996 -36338 189431 240998 376435 423971 286262 519195 311161
10894 311161 -156323 396919 579254 342325 462371 363482 433977 696613 623899 628906
10884 628906 341852 154583 163342 -18356 51809 302540 218122 236391 58793 141430 314123
10873 314123 348262 165892 58887 235755 34194 112600 -116980 -112146 -73330 213328
10863 213328 277899 172457 455940 209480 245056 409981 257712 301311 443986 304367
10853 304367 234764 444323 519287 287588 122282 182154 138390 31985 173135 -97760
10843 -97760 179304 288828 90464 172115 83957 85368 114067 314491 379116 360957 194463
10832 194463 334009 30562 75078 279719 432134 587362 498992 283526 213948 412796
10822 412796 642242 372646 505223 330309 219247 160932 67690 180512 -142671 131425
10812 131425 195161 374304 133651 60621 357024 338871 119139 107685 324028 187981
10802 187981 147766 222595 112738 143831 348666 457158 56187 139838 157165 185120 326195
10791 326195 266976 168313 13243 -165297 -60776 186451 72970 242912 -28336 208588
10781 208588 374727 325343 70935 153740 271808 188410 64281 -25928 162483 432824
10771 432824 595535 398801 176230 236467 262369 350438 124401 85437 198905 -75611
10761 -75611 -117851 -6622 77331 291064 -3897 -135983 143231 47512 52919 -97890 213
10750 213 334158 431487 89908 340814 370331 14912 119224 -49183 176654 59802
10740 59802 -3998 347269 414783 -17545 72506 241516 4821 263553 377099 332818
10730 332818 63601 496697 516930 309509 474295 436469 239488 128977 104044 -4705
10720 -4705 -48069 110631 217153 229420 159123 427029 522547 492836 353408 201267 216737
10709 216737 -21400 204840 435399 560542 480377 153532 159666 150614 144045 135866 349314
10698 349314 204925 258090 857050 384639 236226 539851 459519 189808 134864 255316
10688 255316 218735 485146 577074 354668 63942 369107 361964 326303 27482 156818
10678 156818 229416 321638 105818 -2633 -10351 -65760 393192 331734 462073 243780 33226
10667 33226 166507 288568 110491 330569 385572 249302 204578 5810 -9777 37947
10657 37947 -255742 242678 269590 41017 -122770 206535 214594 469832 471950 310322 217966
10646 217966 86499 358659 184324 39535 -136787 68954 125638 334543 453345 183383
10636 183383 231601 344756 468584 513971 443942 -41470 99735 162484 205887 544113
10626 544113 333193 272434 -4983 63545 324770 223447 95364 139824 195677 532986
10616 532986 406412 243964 381033 461017 158320 258295 226323 305729 249406 167174 -41385
10605 -41385 307852 274425 88420 151822 59194 -150773 23109 235017 156636 627630
10595 627630 140878 -153433 -107574 -135091 -64425 116947 245078 186838 241106 84804
10585 84804 241230 585049 398674 313368 194939 112575 147344 399036 201815 74790
10575 74790 257299 176694 77767 211235 263333 168180 67159 75668 252587 -29185 -75105
10564 -75105 325876 427761 50708 103539 46616 100943 460657 531275 453110 401971 304872
10553 304872 298369 376778 72503 92742 -134379 -264246 -226843 40266 250501 -41001
10543 -41001 -26733 -159011 -211141 -47314 -63841 -329 133789 246240 15834 -287248
10533 -287248 -123911 280224 264277 121311 -65202 50223 349609 433179 175756 -67041
10523 -67041 -191543 144815 128503 25057 -282061 67656 13869 -83878 195317 131209
10513 131209 38623 126897 314224 275879 312704 -29011 310532 138212 -173526 -340987
10503 -340987 222807 136528 -45742 -182737 -38566 -5987 132076 53074 -9483 -54160
10493 -54160 -19493 172952 610269 459675 120855 -91451 -179949 111504 -116087 246567
10483 246567 291209 84427 -62537 150543 200917 -80947 25552 50908 150532 18
10473 18 232543 157544 25187 259291 334158 170132 169377 139169 131241 121359 -11600 117220
10461 117220 264475 265492 246924 334749 210454 69424 35298 174187 -141890 -39740
10451 -39740 -159345 -18967 -19327 88553 -69706 126881 181639 144739 -131245 175961 170310
10440 170310 36193 121225 309533 -3388 89058 35816 66415 127617 116006 11682 -176222
10429 -176222 107584 33948 191314 320686 367476 434719 566244 513006 287677 118182
10419 118182 -9208 -45625 255850 121757 15659 221674 -38968 -16759 92654 37071
10409 37071 -258627 -265368 -127086 -4527 285481 458756 381145 -100661 -174335 -64594
10399 -64594 147191 63265 15523 -34873 119732 111065 -174014 -132953 -9802 -63587 233174
10388 233174 193554 154401 93821 56659 249410 160217 63402 -16681 50515 -30804 41870
10377 41870 -11450 -60158 209790 -56285 200331 -67816 39143 115717 367935 -41021
10367 -41021 -22761 -215704 -230044 -198044 48604 64107 -303120 -150439 -118518 -64263 63384
10356 63384 15625 79296 -35784 -213289 -41792 -84106 251702 255432 126956 162243 79363
10345 79363 -3918 281546 277623 33971 73307 -852 -241458 -205114 -58578 -45470 197978
10334 197978 76662 -94510 38982 -208002 -414181 -338831 53441 2075 114153 255331
10324 255331 273954 409499 51834 -112787 -91249 -204308 14665 72782 62043 -69918
10314 -69918 202266 217526 166263 190876 93768 11075 145695 28656 9103 -261594 -145896
10303 -145896 84222 101955 323543 32895 -22396 -26009 76512 99773 -71416 -143141 -12836
10292 -12836 44727 146619 299157 144161 19517 256307 113533 -168056 278626 255262
10282 255262 106774 15002 58177 237927 -46182 11311 -115077 -19745 71675 -1855 65836
10271 65836 -307698 -287832 -243390 -65991 -127844 -33758 -135425 37618 58137 -251557 -92199
10260 -92199 -337546 -299310 -127470 -100158 -108219 14634 -30588 -26859 -211758 11631 -55377
10249 -55377 -133459 -31439 16148 164047 -46160 -168466 78843 102601 109153 -250290 -240555
10238 -240555 93315 276412 120450 22274 268847 -18211 -180007 -181187 -269370 -510104
10228 -510104 -305993 -394095 -112013 -312075 -235020 -267496 -224308 -338539 -129855 -146429
10218 -146429 -20465 -31654 -154340 51271 -266760 -364164 -290795 -66108 123049 -122838
10208 -122838 11613 361546 8637 113596 324649 151180 9077 155819 5334 -59813
10198 -59813 -150328 106499 -128039 -98854 -141282 -84842 139924 -147697 -9896 -142587
10188 -142587 -130481 -32515 185708 -53131 -266067 -13958 305397 152344 -249673 -117707
10178 -117707 75183 63697 -82039 -94843 -10294 32968 -73684 -11977 -181265 -266240 -51243
10167 -51243 -60861 -210700 -223937 -466380 -252436 -131084 -237251 -316139 -338119 -322288 -344133
10156 -344133 -365211 -62793 76887 -122668 -457784 -224608 -289520 -128064 233588 -103323
10146 -103323 -142752 -50881 2855 -221945 -399351 -489754 -552081 -232815 60007 -50104
10136 -50104 -2416 -12754 -183148 -271242 34056 53051 -105649 54854 -174772 -205326 -11522
10125 -11522 -454126 -339656 -133946 -137637 -2347 -35046 -72927 231688 131185 -199799
10115 -199799 -402312 -365271 -299722 -227211 -470517 -410857 -222205 -222200 -58500 -102778 -355779
10104 -355779 -556393 -206175 -259711 -135599 6133 132552 -152455 -84938 -90142 135827
10094 135827 -58135 -265901 -225035 -253381 -180095 -486150 -59788 -283663 -283061 -74979 -49605
10083 -49605 -211487 98483 412463 -6343 150461 196361 71388 34397 -258819 -506405
10073 -506405 -272410 -353062 -314895 -302452 -257812 -117226 -13886 110635 -195852 -368906
10063 -368906 -191238 -263310 -70749 -234144 -42040 223044 222401 106966 -78984 -30307
10053 -30307 170759 -195700 -160327 -279572 -357506 -274776 -289687 -391027 -181495 76916
10043 76916 -143271 -430220 -354528 -33349 66553 88821 -203084 33053 -361004 -329924
10033 -329924 -34683 -344438 -178032 -152233 -179829 64523 -208168 -250228 -372754 -194312
10023 -194312 -186569 -81351 112145 -32584 -163066 -222679 -378061 -249864 -57763 30129
10013 30129 -142511 -353183 -345757 -191184 101805 -155968 -252158 -24452 -130376 -341219
10003 -341219 -347634 -435458 -456524 -292027 -180973 30158 -200688 -144635 -272716 -90267
9993 -90267 -126058 88587 49083 -104237 -159686 -499920 -462713 -293900 -60763 -105231 -104813
9982 -104813 -310460 -458653 -326732 -206259 -145721 -1953 54429 -2359 -127401 -41699
9972 -41699 200277 269578 251068 102978 169787 -145219 -64817 -257210 -341262 -50375 109668
9961 109668 -28989 -29154 -214342 33413 417999 -59324 -161385 -235522 -479687 -339665
9951 -339665 -375930 24348 -28125 -252636 -329734 -385321 -441548 -493002 3287 -453728 -524520
9940 -524520 -650609 -320417 128406 -132836 -265942 10668 -164449 -280109 -190616 -420398
9930 -420398 -540931 -561262 -428602 -228099 -316995 -202708 -419127 -586434 -368368 -357436
9920 -357436 -12266 -257639 85245 -87650 -375847 -340736 -188579 31792 -275399 -98227
9910 -98227 24278 -93994 -277165 -441283 -263066 147710 -135799 -147628 -415922 -132095
9900 -132095 -101497 -42954 -182958 -392102 -260107 -394567 -19650 98855 -351133 -346322
9890 -346322 -504178 34590 424285 -35566 -168368 -112158 94975 259421 63681 71627
9880 71627 122253 -902 58587 63217 -77273 -206598 150977 -125308 -95913 15398 -471788
9869 -471788 -278853 37287 -31888 -231559 -151523 -323543 -10867 231841 15471 -181453
9859 -181453 -126110 -267851 -408902 -257590 -106927 55459 -229375 -297927 -258294 -103564
9849 -103564 104007 -81353 -13608 -186499 -327259 -287529 76275 -96130 -320493 -71088
9839 -71088 -111051 -149810 -212335 -455285 -153587 -307838 -140483 -317189 -314306 -56062 109145
9828 109145 314336 50332 56861 -65275 25689 -250631 -192612 -389234 -212932 134942
9818 134942 823 -261993 -284305 -63820 -99954 -173714 60357 -3289 -71156 -88353 -248749
9807 -248749 -105274 166327 -4777 -198956 -171356 -158997 -6721 -50719 -269318 -106679
9797 -106679 -375641 -425727 -310261 -222582 90830 -56210 -154228 -29796 -94152 -155116 -6346
9786 -6346 -85666 -209923 -46453 162901 -115749 -115758 -244108 -459350 -356806 -202551 -85501
9775 -85501 -256222 -373520 -57739 96356 -147046 -127171 -195782 -77413 -196205 -38523
9765 -38523 -9281 -145421 -256421 -473933 -627142 -217426 -26993 -119696 -112216 -213727 -398606
9754 -398606 -162596 -433222 -588597 -308942 -416616 -232912 123830 -35671 -145480 -117729
9744 -117729 -342020 -314910 -248374 -392896 -369771 -234900 -30485 -186033 -128394 118030
9734 118030 210451 212151 314114 55963 12098 110936 223109 127654 106682 95250 -147992
9723 -147992 -392573 -164190 79883 8136 -125014 -165121 -253567 -254310 7622 232630 -392904
9712 -392904 -393181 -137180 68833 -71782 -449439 -546578 -612917 -326810 -485096 39448 -58586
9701 -58586 -226949 -77035 -238022 -242054 -101745 -424010 -369143 -369871 -82850 -397345 -288397
9690 -288397 -458440 -390285 -170888 -256441 -208349 -651146 -276487 -527188 -480786 -342546
9680 -342546 28423 -38323 28479 -13041 -69731 -91179 -70178 -45040 -10435 253417 -1912
9669 -1912 -204560 -87277 -45392 -130494 -202962 -119854 -26902 181510 98394 -478399 -201624
9658 -201624 -592231 -515801 -110449 -71532 -133172 -227774 -289476 -122937 -283189 -277347 -337705
9647 -337705 -208363 -166902 -81314 -51686 -292927 129828 135090 -117904 42513 -104819 109671
9636 109671 -55884 6073 -13433 -121913 -441419 -177432 -453702 -363224 -33621 -129411
9626 -129411 -59157 -116310 -56684 -323845 -454583 -404236 -402349 -135796 -259582 -173960 -127603
9615 -127603 -264166 -269935 -175055 -333857 -184596 -75899 -21813 -60425 -403170 -170258 -58873
9604 -58873 -141236 -277620 -348461 -240052 -244630 -134137 -270315 -118877 -123437 -174154 -43895
9593 -43895 -155735 7013 3783 273086 -242628 -490193 -441091 -412865 -395312 -264579 -27781
9582 -27781 -213323 -184790 -32624 -225523 -506585 -376608 -162219 -219109 -373662 -339565
9572 -339565 -182606 -399015 -335777 -208721 -62729 -50905 68316 -92562 -401901 -405296
9562 -405296 -313153 -197350 -143275 -81131 94822 -44659 267910 163218 -172381 -218549
9552 -218549 -87278 -119049 -332003 -176514 6914 -288109 -162763 -336475 -303588 -513235
9542 -513235 -195786 -183241 -354190 -210600 -358769 -338488 -396243 -418118 -294381 23759
9532 23759 46832 -75103 -99272 39097 -33651 -118612 -62158 -294578 -462617 -309911 -193098
9521 -193098 -277603 -144479 -152821 -246010 -238339 -304680 -274920 -83464 -263005 -202319 -368457
9510 -368457 -590362 -584102 -106734 -71848 -198327 -293556 -138832 -153333 -443078 -286491 -178317
9499 -178317 103043 83216 -457708 -436999 -532273 -380532 -58062 -294993 15810 -16707
9489 -16707 -12233 -98829 -176681 -233200 -311487 -395061 -1780 38172 51790 20563 -210347 -211063
9477 -211063 117078 -105681 -647152 -437325 -602288 -306759 -367307 -238408 126785 -168886
9467 -168886 -85034 -194136 -296762 -198667 -52469 15614 -354908 -360991 -265893 -284070 9755
9456 9755 -4610 -8851 12540 257686 168942 -174325 -402521 -174055 -271815 -410543 -392815
9445 -392815 -161004 -501486 -399321 -320931 -54937 226015 -33506 -51951 -73437 -106214
9435 -106214 -96627 -62822 164145 -93710 -63821 163452 -130706 -222025 -189809 -222768 -140340
9424 -140340 -182826 -16130 -115436 -349807 -342031 -114909 46393 -127877 -180173 -436794 -392649
9413 -392649 -246089 -9443 187481 148631 117626 118463 119622 -99654 25655 68632 17331
9402 17331 276797 112942 47801 -151925 -275916 -246033 -304217 -397728 -223823 -556907 -484366
9391 -484366 -459049 -100776 -38701 -159319 -232601 -330398 -177230 -107949 180078 128618 -121949
9380 -121949 -158725 175481 -27733 -110876 30611 -13508 -136895 137816 71982 115452 64652
9369 64652 109077 -351678 -371257 -112402 -311656 -237273 -102425 62330 394327 -14135
9359 -14135 -236910 -407259 -372600 -214437 -571832 -454424 -206670 -249224 -203087 -249561 -188137
9348 -188137 -64269 -195848 -53282 -376810 -454662 -348263 -310572 -520342 -304939 -51473
9338 -51473 69603 294569 298945 263027 123297 -88218 51655 283661 -149728 245725
9328 245725 357970 49361 -109059 -51761 -240886 -132394 -45117 12394 215369 -32310
9318 -32310 -187914 -7134 13323 -267049 -267727 -302903 -428696 -375833 -240792 -481145 -472628
9307 -472628 -524832 -496942 -621532 -386476 -375671 -465487 -413459 -163329 -113317 -150614 61651
9296 61651 242471 67126 -97108 -37145 -285295 -259169 -185756 -90595 -162417 -195624 249011
9285 249011 43423 55790 -20008 6062 -386814 15706 301742 -76650 -42116 33262 74896
9274 74896 267311 129095 -275138 78571 174146 -224588 -322423 -175599 131906 60086
9264 60086 156281 83031 289464 277209 186562 161103 28424 117049 99361 -242491 -168112
9253 -168112 136661 153959 -19785 -72728 4782 -27203 10817 125511 251185 2399 -27834
9242 -27834 214174 317313 568096 324645 249942 27162 185809 452615 631457 559208
9232 559208 171416 317393 541963 147960 151455 246146 234240 -1251 136573 256519
9222 256519 291382 355245 369124 487484 415545 509393 424983 594087 404050 787592 402050
9211 402050 704536 500463 699238 828995 1177620 1341802 1508718 1582595 1596512 1269008
9201 1269008 994097 881409 712426 615308 653655 518911 483990 347190 286919 250659
9191 250659 527982 484369 254360 213606 452678 380417 172938 -13756 339335 292963
9181 292963 313044 290497 393442 430391 192243 132907 331110 366294 330633 304442 178995
9170 178995 481675 174083 469796 414867 267789 286385 224067 222714 402920 195353 123178
9159 123178 -1362 164943 -151232 103054 79284 200012 207756 311679 -31030 304809
9149 304809 365879 419960 592756 665176 379942 173940 537432 521952 399646 320856 249791
9138 249791 17090 161798 308569 322854 208043 199121 514664 555276 301291 141727
9128 141727 265088 542004 328377 348147 272136 390329 604891 534519 389317 286624
9118 286624 200916 317476 286661 617896 533346 443729 623409 362935 306732 822370 777041
9107 777041 711433 436229 450981 310360 274731 499452 283512 444485 453000 487058 752798
9096 752798 747696 64787 230279 448226 196418 434767 212206 321819 489365 488818 604175
9085 604175 814081 883854 529320 349516 581451 534449 739086 814793 710015 850068
9075 850068 1066364 1056099 570343 581445 780290 869347 1036431 841071 913042 972023 922239
9064 922239 1019811 1166814 1117717 948851 1027125 1000169 880127 667782 1015665 942089 1046791
9053 1046791 697441 980114 1083603 863186 1122444 1392185 1334113 1247665 1394188 1193326
9043 1193326 681122 1009688 1254036 1049126 1072775 1178809 1439865 1391313 1200439 1192734
9033 1192734 1302991 1234286 1682439 1250054 1118136 1363804 1501286 1709731 1831793 1692793
9023 1692793 1339576 1644223 1615283 1560851 1616605 1788960 2031127 1778753 1595299 1830190
9013 1830190 1864084 1917610 1664037 1760210 2166176 2291961 2078302 1900611 2278601 2228290
9003 2228290 2321915 2411229 2232711 1969478 2206621 2599834 2245792 2074726 2244304 2374247
8993 2374247 2591836 2449707 2658367 2726731 2890449 3133996 3203461 3415853 3603801 3771307
8983 3771307 3404605 3268857 3500784 3401250 3690954 3958393 4003021 4353448 4523125 4794361
8973 4794361 4985668 5299822 5407154 5537401 5776088 6147541 6213151 6397985 6865680 7087371
8963 7087371 7279388 7762040 8015840 8470541 8994473 9226589 9890759 10547373 11045823 11826616
8953 11826616 12523365 12802240 13403947 14130179 13779172 14143735 14672220 15036235 15686812
8944 15686812 16171258 17210422 17927493 18464056 19607585 20610709 21854607 23176409 24297943
8935 24297943 25974749 27525477 29595418 31244937 33092389 34974153 36900504 39459455
8927 39459455 41779625 44091873 46954549 50297420 53910121 58394143 63669115 70314117
8919 70314117 78595224 88023835 99448184 113328375 130260551 151345841 176182089
8912 176182089 201634773 221078989 228190590 220854394 199735416 171077560 142860161
8905 142860161 120683238 103682435 88910347 75972716 65389711 57334005 50567765
8898 50567765 44998980 40773966 36901704 33716386 31037389 28748050 26720133 24759088
8890 24759088 23225675 22055993 20675375 19459314 18131558 17233700 16105833 15602855
8882 15602855 14977244 14073919 13616426 13145627 12707318 12033465 11821072 11458855 11030372
8873 11030372 10502781 10150869 10174456 9986896 9289315 9037374 8328490 7823375 7300946 7267057
8863 7267057 7338770 6999668 6607385 6209327 5616416 5577567 5364863 4895567 4895401 4838184 4692301
8852 4692301 4613737 4619049 4446768 4161874 3764429 3657499 3677338 3585491 3188688 3160963 3090150
8841 3090150 3124663 2913057 2906951 2981224 2401137 2463306 2191485 2140867 2425883 1785483 1434565
8830 1434565 1802880 2092455 1944937 1779207 1694759 1448701 1263203 1245827 1452676 1420076
8820 1420076 1245013 1230367 1396556 1069014 937244 837727 1214423 1331006 923762 998575
8810 998575 1121831 1173577 999603 789015 783408 624163 691013 968390 869975 704728 1040809
8799 1040809 1223308 852633 577010 491612 608902 791523 970457 724090 629561 539257
8789 539257 671240 646841 589902 643475 642766 723093 621143 541836 522208 457521 526642 441354
8777 441354 433780 410880 499557 222120 -118868 38996 310232 102929 83592 -153867 -117815
8766 -117815 124624 5054 270660 244737 278203 92974 16554 245524 141106 -102281
8756 -102281 129093 92831 29896 500989 303734 146015 62282 252768 186966 171589 308712
8745 308712 300369 354523 260369 186410 137534 333709 166671 159182 77507 155477 72735 128276
8733 128276 209414 134743 277109 73798 39941 136251 47950 36203 82294 -20220 139888
8722 139888 185006 234756 193002 309722 314730 -70162 35785 139072 -310801 -168862 -387290
8711 -387290 -435613 -106704 3491 142417 260180 324867 57679 -30780 248569 244379 -303763
8700 -303763 -257727 -59797 34950 106364 -71954 -351248 -13497 9470 -40132 93916 150563
8689 150563 61049 -51657 -176579 511017 -61578 -12632 69865 62426 150534 238062 145275
8678 145275 127638 26759 30945 -21277 -176874 112413 72003 -32860 -34918 88988 -26900
8667 -26900 120567 63346 -127266 -161439 -18653 -94904 -161219 -83616 63940 158402 443378
8656 443378 40493 291745 188492 -46381 -32124 52538 -44390 90737 289284 126588
8646 126588 289828 154158 -119553 -140329 70269 -38509 -237685 -75392 223748 -143881
8636 -143881 148903 192395 -141615 24917 -40409 -202999 -150427 155417 218435 344328
8626 344328 482382 270965 241525 262382 448486 772998 492726 578653 653167 531795
8616 531795 804069 1011415 1289124 1304469 1269739 1298692 1110893 870963 533497 406290
8606 406290 551480 491028 367408 427239 560046 352332 537732 799061 578143 335911
8596 335911 119502 207884 67457 203428 -84188 -70486 -302696 28122 -162385 -141947
8586 -141947 12189 16964 270243 318735 39524 -15128 -86017 -241223 -348612 -148285 -194785
8575 -194785 -5990 16441 -58082 224141 246546 59179 -152314 -105276 -94504 10810 -106700
8564 -106700 95184 108352 190700 92950 -23437 152635 209585 11533 -148839 -21166
8554 -21166 -203237 -36938 232746 111906 -131335 23983 141674 38502 198013 51469
8544 51469 44957 -153472 -99236 -35738 102638 52892 -1479 337728 282381 139956 177297
8533 177297 279066 204574 277835 55910 -102530 121878 137562 215213 333235 111287
8523 111287 -19522 14143 114343 59102 258495 215745 128520 100047 183704 323407 259365
8512 259365 169835 79354 102119 33109 121972 111645 -17818 116281 -59529 85799 -74737
8501 -74737 -248957 92851 111860 255322 -184999 -59238 -304760 5951 -94512 -180808
8491 -180808 98609 -27469 6248 29581 276557 328028 2815 514719 436 450239
8481 450239 95603 583279 491725 124445 5349 110363 150881 -715 236090 218570
8471 218570 206712 -29381 168602 255059 288950 193186 124434 193261 31252 -11070 191176
8460 191176 6587 66822 41187 282267 200067 524651 394677 21353 111073 106214 242594
8449 242594 132513 -250973 -46531 154486 63892 255968 376174 218089 403995 547246
8439 547246 260925 229412 235371 -34304 -232348 -342927 49953 42455 -150395 14598 71952
8428 71952 184687 209029 256126 196244 49685 309797 277420 371168 -151045 -102130 139581
8417 139581 160690 76165 212922 198875 250867 -195055 86133 95266 -79398 92214 -91632
8406 -91632 136264 234549 -28280 8321 -5300 113949 101928 81009 270641 -15793 -25442
8395 -25442 104067 234913 505755 456707 303867 295099 179365 86067 292667 577111 377399
8384 377399 379792 227367 200257 291063 302182 247738 582909 289346 125015 342936 288044
8373 288044 269372 6109 333088 264380 110337 180839 229928 198384 283417 299976 239634
8362 239634 305615 561579 513067 266740 273486 434231 334442 347350 323115 659008 402262
8351 402262 204113 325295 302050 327357 395371 418532 833355 846988 587530 290654 269764
8340 269764 318389 83919 342104 204602 197907 248613 482409 651398 660571 340856 359090
8329 359090 298758 357056 371225 598569 557509 276727 91706 224723 283408 51867 349009
8318 349009 429489 291045 361383 324167 229640 646040 581971 459362 406897 485238 492620
8307 492620 422287 730580 433962 472819 322837 -16427 433784 359334 412900 659609
8297 659609 244128 395172 256580 426738 266706 391595 458065 265669 264381 286940
8287 286940 439021 517541 424348 291717 352368 550506 692373 617437 412168 692734
8277 692734 476497 370709 756331 676145 158021 260528 335052 521923 633439 461206
8267 461206 312760 273772 292573 406927 578075 462472 621312 467858 394178 297411
8257 297411 556756 396979 338768 429826 79199 77126 260010 387114 637825 835836
8247 835836 519512 483040 531499 584455 756667 679044 587441 397864 816527 667348 420214
8236 420214 638243 715890 912458 704230 668427 709482 461539 467833 379648 582478 615390
8225 615390 718307 573075 428475 530456 473392 736170 725751 755702 575278 501628
8215 501628 613248 694195 624150 539577 550045 653603 556507 155364 95529 192706 281950
8204 281950 753332 735021 554585 625703 684545 813867 630147 830238 760620 861331
8194 861331 674091 1316450 589975 234689 835792 806619 607640 579633 419384 287582
8184 287582 471300 755873 644231 523824 766987 825188 985850 981679 843894 568546
8174 568546 846152 782954 790777 701565 861776 1043338 1105351 891617 890460 1086430 1312557
8163 1312557 1081878 898329 541697 699920 724587 712053 570725 612781 866785 977802
8153 977802 890131 827219 1051318 1146315 1206879 1041720 836080 857754 796620 784063 932884
8142 932884 879024 639008 502261 953050 1021127 854134 541877 847920 960717 1123190
8132 1123190 1067072 828864 1165813 1122708 1222283 1151904 1065130 1036407 893707 718694 849220
8121 849220 623225 434911 783591 656432 663676 671978 796123 544960 955852 829360
8111 829360 757886 908774 824836 821912 704612 849235 1175766 1185557 946657 1001333 1017182
8100 1017182 1250695 1182391 1296968 1394415 1209784 1305393 1199782 1132199 964266 1013317
8090 1013317 922072 948555 1061891 966345 1159156 1114087 1205561 1089215 814706 884402 1117833
8079 1117833 1175343 1065206 1102412 1096418 906198 930203 937556 981008 1031183 940631 915179
8068 915179 946048 843323 1008768 903403 1058709 1209018 1048114 671983 715981 1009593
8058 1009593 1068222 1072598 1043083 1022950 930773 666157 751230 787232 1063994 1200738 1035225
8047 1035225 935020 1248155 1252998 1132103 1141841 1054894 1431722 1271907 1189834 1351657 1525324
8036 1525324 1239312 1371830 1252337 1395727 1427578 1232788 1511755 1416463 1360556 1359825 1488118
8025 1488118 1471616 1405423 1573374 1236618 925494 1222767 1132387 1468446 1219489 1254973
8015 1254973 1571339 1393867 1387863 1300763 1401794 1179953 1446661 1563188 1526972 1549095
8005 1549095 1378012 1320297 1585490 1471739 1466935 1188009 1166324 1524442 1409092 1606295
7995 1606295 1568361 1520618 1816309 1854531 1787981 1727921 1636534 1559060 1715515 1831398 1874013
7984 1874013 1728760 1642947 1748947 1719989 1565961 1539297 1868445 1881301 1804511 2022785
7974 2022785 2095979 2274289 2037468 1788412 1625320 2118301 2421497 2474495 2216145 2038115
7964 2038115 1880938 2198043 2055909 2033150 2301531 2317552 2057688 2099821 2183765 2236265
7954 2236265 2706963 2611825 2694764 2456986 2468376 2344760 2359156 2806420 2874441 2731234
7944 2731234 2752538 2748876 3128230 3116367 3241036 2846613 3033946 3211255 3279865 3347351 3218089
7933 3218089 3266178 3723832 4056499 4170216 4165414 4200699 4230814 4257687 4424614 4533616 4663556
7922 4663556 5083669 5408106 5540825 5850837 5710584 5532019 5707328 6133284 6612997 6624343
7912 6624343 7368807 7551708 7561912 8261262 8571747 8733685 8974160 9391373 10952896 11067918
7902 11067918 10911694 11368832 11844762 12627878 13438289 14154524 14893062 15593151 16276276
7893 16276276 17412067 18651932 20070682 21052452 22164024 23948279 25821452 28139124
7885 28139124 30905202 34003344 37069813 39640191 41640806 42844290 43954991 44725031
7877 44725031 45732093 46423904 46754805 46109735 44578605 43215586 41761351 41123302 40529758
7868 40529758 40416589 40439529 40078476 40078011 40268473 40714331 41214295 42193010 42854029 44041072
7858 44041072 44614452 44931038 45000092 44586073 43551252 42936442 42824478 42824536 42855196 42448871
7848 42448871 40950117 38088720 35034716 31541043 28186553 25537459 23172225 21073282
7840 21073282 19027850 17654388 16332049 14985073 13705260 12790543 12408144 11799659 10931732
7831 10931732 10454426 9699094 9553443 9245687 8722116 8111969 8152387 7941813 7352327 7269921
7821 7269921 6929893 6546683 6517046 6332734 6366939 5939702 5903352 5955277 5649096 5346720
7811 5346720 5111917 5306932 4895433 4878163 4714302 4781386 4655808 4813484 4737508 4698915
7801 4698915 4628681 4482645 4302085 3906995 4098517 4123153 3869838 3937785 3829749 3796784
7791 3796784 3892160 3660581 3963725 3967100 3350507 3637988 3499618 3452579 3509562 3697964
7781 3697964 3196754 3205182 3274151 3359051 3375584 3259426 3033533 3466590 2943897 3088970
7771 3088970 3293458 3125119 3451633 3425005 3630855 3274398 3209612 3251841 3286697 3190254
7761 3190254 3144527 2896311 3588840 3407710 3308791 3291956 3663700 3661130 3677860 3412185 3587379
7750 3587379 3399299 3227721 3548315 3595200 3755427 3600577 3451512 3502424 3542832 3535757
7740 3535757 3599974 3776890 3503358 3435988 3405003 3433860 3574423 3828953 3561391 3575052
7730 3575052 3639843 3681850 3603584 3621933 3586108 3682712 3760915 4100609 4370566 4023548 4216895
7719 4216895 3794478 3786673 3651629 3875620 3545301 3233774 3285587 3216101 3127492 3441744
7709 3441744 3516603 3168413 3233894 3096243 3387797 3400634 3101285 3279938 3158375 2955778
7699 2955778 3110161 3291765 3143788 3145229 3200356 3420059 3477425 3450560 3213651 3154419 3147678
7688 3147678 3356475 3558493 3615577 3505387 3319540 3407470 3388884 3161480 3267382 3188694
7678 3188694 3404235 3214784 3574173 3836398 3864205 3698428 3528474 3582883 3796785 3547183
7668 3547183 3835556 3787210 3686921 3853325 3864661 3675517 3957227 3828409 3740576 4012164
7658 4012164 3991907 4090122 3949358 3867674 3748455 4217248 4286143 4185408 4292669 4123059
7648 4123059 4016283 4308312 4406435 4398259 4437536 4425333 4541051 4709927 4607308 4654034 4555473
7637 4555473 4873653 4751758 4748440 4775759 4806930 4954753 4889542 4789825 4967602 5045489 5165201
7626 5165201 5348932 5330640 5362269 5426947 5085487 5286492 5704888 5638222 5767893 6032338
7616 6032338 5942098 5798856 6192256 6055479 6137689 6260372 6308232 6516200 6817652 7154768
7606 7154768 7298017 7220087 7018354 7207481 7462900 7535722 7636648 7842150 8112838 8040108
7596 8040108 8360042 8531696 8651066 8643940 8929846 9211818 9126138 9339426 9078131 9280809
7586 9280809 9476064 9185853 9473354 9720235 9662353 9998760 10012091 9896789 9984482 10435958
7576 10435958 10833680 11131338 11273255 11551925 11602062 11890876 12139556 12276881 12608452 13261156
7566 13261156 13569410 13964584 14550067 14931367 15180500 15545994 15583551 15623489 15955007 16524835
7556 16524835 16532303 16947263 17502607 18403608 19374538 19714254 20001689 20853298 21663549 22728184
7546 22728184 23708831 24490141 25746052 27094466 28267842 29994963 31860553 33767411
7538 33767411 35948628 38303536 40841498 43274578 45934047 48032107 50536761 53145986
7530 53145986 55371398 57824115 61144021 64872679 68286036 71362845 73424384 74955293
7522 74955293 76141754 76671756 76055564 73572208 69531471 66091049 64133380 62308888
7514 62308888 60899210 59959556 58880625 58507797 58384447 58759144 59859616 61507998 63961824
7505 63961824 66945909 70527606 74682251 79169451 84113243 88749386 93393181 97995463
7497 97995463 102670259 106547726 110314583 112577410 113484625 113050897 111425550 109491772
7489 109491772 107723986 107140385 107955696 110343527 113396730 117749273 122958438 129536329
7481 129536329 138783682 150819429 163351339 174373669 184212917 192068542 197438498 200858625
7473 200858625 201384126 198763258 191326832 182008094 172861350 164793283 157566151 149894954
7465 149894954 141583196 135191685 131514901 130637363 131541970 134280812 138629641 143714742
7457 143714742 149477703 155993365 163330056 174191793 187510549 201886346 210806617 214310075
7449 214310075 211843373 205311373 199217262 194083644 188118496 177535815 161712080 142203136
7441 142203136 123523720 108365982 96684679 87325490 78906799 71642321 65482969 60250505
7433 60250505 56162545 52381195 49251371 46280736 43457652 41324238 39478132 37488063
7425 37488063 35724893 34163817 32860092 31263485 30327342 29520357 28567660 27805985 27045576
7416 27045576 26199788 25167252 24740698 24210250 23539864 23026383 22616390 22255368 21613466
7407 21613466 21108433 20603192 20518658 20045342 19768146 19622647 19021838 18646685 18534771 18219326
7397 18219326 17810576 18004405 17952903 17632564 17758237 17630372 17187010 16896002 17205722 16893006
7387 16893006 16802024 16845087 16978035 17044680 16883753 16671309 16865601 16810447 16366844 16339831
7377 16339831 16435032 16309958 16087695 15956781 16047175 16298613 16135458 16410495 16601600 16660361
7367 16660361 16674158 16430155 16657893 17217209 17331432 17578127 17623496 17485774 18173793 18825132
7357 18825132 18833009 19021539 19320009 19602996 20286908 20341341 20782489 21124151 21550966 21795577
7347 21795577 21769567 22022675 22526586 23057230 24104301 24569740 25147867 25654567 26311065
7338 26311065 26849814 27349847 28282689 29376268 30474581 31702013 33365962 34875752 36610214
7329 36610214 39033782 41520375 43843226 45917303 48024539 50281572 52062735 53314195
7321 53314195 54627620 54539309 54556657 54597661 54805922 55129422 54746275 54791614 55147058 56334712
7311 56334712 58014514 60110386 62545714 64522485 66652374 68779855 71566349 74806476
7303 74806476 79418194 85113439 92200361 100486881 109107514 115577167 118743214 118163319
7295 118163319 113866445 108042411 102150575 99097888 97591690 97374698 96870096 96291799
7287 96291799 96484333 95943968 95591747 97089655 99798508 103828108 109367394 115789761 122138176
7278 122138176 127574923 132606595 137198643 142053918 146808257 149760362 151015240 148482445
7270 148482445 144617865 142070833 140640120 139491903 138181415 135725258 133980807 133289721
7262 133289721 134519585 137170087 140415319 144788699 150808769 158311846 167750072 178647098
7254 178647098 191260086 205524452 222156982 240508022 259968435 279946043 298975289
7247 298975289 313182612 321248094 323618811 321585786 316217811 309322462 301704257 292858019
7239 292858019 282119008 269989171 260071193 253203270 249204425 247402246 247631909 250261667
7231 250261667 255809212 264056112 275611377 290001956 304890363 319092942 333191538
7224 333191538 348020463 363931482 378819158 392013473 400270811 402903278 401506039
7217 401506039 398422372 393348215 385680903 375706741 362574499 347246798 330672555 314758849
7209 314758849 299817319 285231311 273142040 263380329 255832169 249345926 243882237 239489937
7201 239489937 236000825 233265232 231158104 228447317 223495158 216700304 208862516 201261848
7193 201261848 194632754 188472958 182054865 174141745 165410299 156867686 149339422 142055779
7185 142055779 135703537 130274782 126230362 123074535 120833742 119718097 118739973 117724075
7177 117724075 116923803 116453683 116122054 116076963 116119923 115669408 114043353 111629306 108573105
7168 108573105 104968405 100951515 97606264 94387766 91785142 89289903 87657268 85802863
7160 85802863 84034825 82781562 82142364 81311719 81162663 81795509 82849613 84276865 85980531
7151 85980531 88219876 91145615 94532495 98358561 102380646 106030194 108789857 110291565
7143 110291565 110371297 109103632 107027609 104443532 101836370 98722237 96386262 94113479
7135 94113479 92462599 91965019 92496654 93512838 95900143 99266414 103915033 109363945
7127 109363945 114414107 118870384 121044819 120619398 117847344 114036038 109876567 106563603
7119 106563603 103803734 102478467 101658302 100922363 98911407 96142325 92092625 87422180
7111 87422180 82925964 78697839 75479794 72263117 68879659 66233683 63734024 61997171
7103 61997171 60217982 59036824 58625936 58649152 59033611 59269511 59797607 60230123 60630769
7094 60630769 61304750 62282369 63065217 64136013 64320161 64667935 64332718 63059240 61805965
7085 61805965 60412768 59057410 57516186 56529504 55170628 54144705 53670425 53210146 53197451
7076 53197451 53710908 54391370 55269928 56322226 57265086 58320198 59059973 60283602 61345301
7067 61345301 62956095 64529374 66001673 67792245 69948615 71996110 74761403 77688458
7059 77688458 81171943 84875342 89075358 94211983 99621741 105326596 111261805 117588441
7051 117588441 123997549 130454756 136586551 141798890 145808992 149125142 151901934 154371280
7043 154371280 157779239 162622968 167735026 169877366 170096739 166897197 161890319 158660461
7035 158660461 158583574 160851465 164057373 168904716 174856053 182207214 191428584 201211954
7027 201211954 212150212 224143989 236535880 248161483 257318190 263773979 266727037
7020 266727037 266643539 265123329 262170448 259682409 257880335 256822992 256351050 257130290 259355075
7011 259355075 263295458 268872802 277369727 288545871 301377512 313972380 323779995 329320422
7003 329320422 329091679 323131702 313503927 301877788 290000578 278845502 268765303 260342976
6995 260342976 252022136 244062381 235339442 226677293 218553227 210400019 202551891 194331293
6987 194331293 185203323 176128712 166817526 158285892 150111649 142249155 134653007 127309619
6979 127309619 120574590 114784501 109358640 105230795 101889116 99219303 96848290 94456335
6971 94456335 92563020 90980515 89396236 88373306 88098260 87433934 86828439 86496398 86175172
6962 86175172 85319483 84026955 82585890 81272779 79901630 77934800 76116633 75096765
6954 75096765 74643138 74696138 75958469 77247193 79593313 82455912 85088537 87687735 90171598
6945 90171598 92291543 93824012 94495797 93783954 92407424 89594361 85963252 82530709
6937 82530709 78530341 74934287 71308852 68195691 65610498 64025866 62762777 61892614
6929 61892614 61961889 62272123 63559505 65217164 66797979 68703442 70850387 73522869 76097551
6920 76097551 78846658 81033241 82086335 80671450 76861449 71906761 67064246 62074548
6912 62074548 58188476 54528088 51300513 48246479 45291150 42674958 40503479 38588700
6904 38588700 37117520 36019585 35431218 35094771 35027659 35231447 35376204 35739340 36219604
6895 36219604 36659052 36599581 35863060 34725042 33809441 32189660 29910052 27892872 26078993
6886 26078993 24169173 22115129 20503933 19140841 17685313 16503053 15470307 15142393
6878 15142393 14522958 14059056 13325360 12611726 12344356 11890994 11232613 11004897 10867020
6869 10867020 10486315 10107758 9923368 9469438 9258033 8841169 8304997 8108166 8085583 7786957
6859 7786957 7450946 7103319 7215950 7167731 7007360 6693850 6560897 6200222 6249936 6291900
6849 6291900 6135849 5802207 5853247 5797098 5571305 5581672 5067376 4889607 5202861 5337568
6839 5337568 5290181 5239431 4880187 4661797 4648669 4941005 4723283 4076930 4337065 4447833
6829 4447833 4596624 4409932 4236494 4219939 4254310 4277371 4119966 3844415 3739356 3602049
6819 3602049 3884611 3797973 3887807 3811519 3731421 3624785 4024536 3580261 3743494 3867514
6809 3867514 3828622 3555562 3485060 3423902 3294050 3440910 3782979 3797430 3522193 3437542
6799 3437542 3510600 3717115 3547783 3489103 3547782 3363346 3191283 3209141 3093055 3264127
6789 3264127 3186811 3401396 3417042 3620270 3616668 3350247 3290164 3136814 3336108 3089220
6779 3089220 3063331 3511488 3371169 3438380 3311209 3318547 3418574 3390952 3404134 3276328 3170566
6768 3170566 3280976 3469398 3546361 3041950 3302003 3312872 2971316 2983912 3246872 3077886
6758 3077886 3003406 2829940 2854675 2768022 3319907 3293310 2745532 2925350 3192822 3234888
6748 3234888 3282902 3563404 3581503 3269913 3258353 3270545 3438497 3274681 3188261 3220350 3260683
6737 3260683 3134872 3014921 2784399 2915841 2979007 3024933 2884190 2462107 2765228 3029791
6727 3029791 2951379 2826726 2788661 2937077 2901763 2629144 2727543 2818068 2517332 2719576
6717 2719576 2676462 2776324 2818258 2538323 2262421 2598773 2234680 2201131 2306929 2351720
6707 2351720 2226230 2093822 2363262 2166398 2158538 2134958 2086595 1837072 1784205 2050602
6697 2050602 2125729 2091531 2145348 1918682 1946586 1878191 1966122 2201900 2413061 2057704 1927339
6686 1927339 2198373 2009467 2051330 2132571 2301521 1951756 2050321 1853451 1714539 2306985
6676 2306985 2228416 1812871 1491838 1800613 1765767 1695294 1705016 1778619 1768293 1912796 1912638
6665 1912638 1841921 1709471 1883659 1919992 1836286 1532859 1553303 1580872 1930177 2154791
6655 2154791 1872881 1671205 1673196 1960834 1829736 1662001 1600165 1890907 2043217 1841413
6645 1841413 1566859 1677147 1808556 1783886 1682365 1450921 1552410 1662007 1673128 1556141
6635 1556141 1669529 1379644 1152484 1427709 1386017 1434625 1432037 1859228 1674813 1551870
6625 1551870 1406932 1139337 1364533 1442794 1479935 1402127 1510870 1722879 1717047 1480027
6615 1480027 1496352 1338207 1021298 1124952 1159986 1380805 1294716 1435888 1782131 1472112
6605 1472112 1159845 1183512 1325289 1106274 1165180 1319704 1446223 1460275 1677082 1247966
6595 1247966 1268652 1154322 1368049 1385109 1308034 1177860 1090723 1172014 1170699 1171282 1422358
6584 1422358 1425767 1176084 1275684 1563239 1300734 1299652 1423217 1440567 1377587 1347249 1054108
6573 1054108 825432 1264708 1390589 1259411 1001313 1257857 1416797 1665970 1447157 1293189
6563 1293189 1301459 1298217 1197198 1506187 1407666 1215898 1232145 1199240 1026439 1128522 1076074
6552 1076074 1009965 1200957 1090931 966637 1062486 1102752 1000911 1096208 1229327 1408188
6542 1408188 1668499 1288462 847455 1096123 1026655 968736 1135805 1099728 1206118 1321717
6532 1321717 1352451 1233951 1261979 1047680 952441 937365 1154997 1321508 1185188 947553
6522 947553 1077341 1015413 923840 1023538 1073645 858985 920649 1266869 1086973 996473 887590
6511 887590 835919 772333 1399497 1000107 737879 763420 863042 1068863 1113815 995150 1136590
6500 1136590 845691 1117656 1003964 1030651 890872 911239 934368 1138062 1121840 1122137 901913
6489 901913 627753 683823 731641 1089033 986136 843236 899213 938922 805067 1033834
6479 1033834 1035793 1235230 1042553 1160648 872505 732392 931878 855602 676369 986661
6469 986661 913407 437155 518932 890362 759078 711303 704695 702740 995239 925200 753006
6458 753006 868199 889658 874506 851267 1001480 615934 556347 727874 813821 568898 667836
6447 667836 478117 369219 510154 699731 678905 689622 651641 564766 484990 643152 798895
6436 798895 535637 534383 616993 830886 747865 552443 786278 524289 603143 683463 507290
6425 507290 766293 796868 726059 790254 455444 452676 363453 705621 477115 581287 589184
6414 589184 775812 501385 294606 643882 719717 775452 647615 513216 285738 446259
6404 446259 520549 626058 845406 710713 651709 588511 357426 563721 639732 850186
6394 850186 806329 681279 498968 533791 505399 866410 533990 801685 515595 390871
6384 390871 439149 528277 728006 537640 671548 401451 411923 475788 719713 450974
6374 450974 500326 424135 148916 286553 113780 596135 425970 473204 490952 642148
6364 642148 613793 548076 639216 787621 966412 611597 357835 204550 348091 373696
6354 373696 361031 448050 352754 717440 557723 370345 199028 12601 118530 333642
6344 333642 279407 161696 799307 1107113 587499 707673 562869 212407 -48551 132581
6334 132581 269266 366611 273405 191782 212781 480513 489249 457316 486760 310414 460160
6323 460160 620635 644836 330942 536143 562408 359879 -64664 56359 150488 180529
6313 180529 -50699 10171 167782 255277 518631 593236 549928 395589 730713 476749
6303 476749 631197 677177 248357 111673 358732 403192 290273 370777 156555 557544
6293 557544 337534 360107 371119 356961 374892 351740 397250 155494 127189 -7264 198745
6282 198745 481784 605607 311558 200105 224598 180115 125220 287358 250233 427973
6272 427973 196003 53767 520347 540895 361217 34545 10270 252209 19900 181653
6262 181653 426108 33413 46732 3385 19632 -98962 -184844 -163478 -75785 50043 -175747
6251 -175747 -304472 -9060 15839 185518 139899 197653 50794 -82021 77239 -158773
6241 -158773 -398931 -201759 -206903 -31236 106201 67347 -184094 -103938 100960 94904 -197547
6230 -197547 152939 313528 221688 -88012 195252 406914 320462 52038 67892 23674
6220 23674 -50239 97636 8552 153940 -112653 204589 32473 241488 435826 91903
6210 91903 -34174 131160 89030 193897 -74286 -43430 -255074 -204342 -181071 -162614 78336
6199 78336 -208369 -307513 -71063 22136 -45369 197413 395001 526877 446526 44595 -100691
6188 -100691 -36791 182622 9858 -296407 73694 174328 -141270 -104441 -260081 -319602
6178 -319602 -148449 -60277 -115732 -20571 244097 112773 8279 110619 94402 39033 34419
6167 34419 -27557 51889 84560 163448 227469 161049 270960 264199 168139 353809 377663 554055
6155 554055 728296 539478 427338 557673 223002 385845 380263 445779 491697 445537 372905
6144 372905 443323 304839 197508 200462 390936 123013 128350 255910 -31750 -96705 70667
6133 70667 65654 -180626 -93030 -144418 -139054 -17076 129849 240297 136717 -52998 69311
6122 69311 193914 -146862 -249321 -113422 37705 283411 150925 -41601 -327389 -165375
6112 -165375 6297 -188112 -346039 -114675 16452 -29594 -158247 72182 95422 61702
6102 61702 -134859 -279838 -8481 -24282 -222502 44759 14097 55376 155489 38680
6092 38680 -50874 -301993 -312563 -435267 -404911 -68014 -175304 -128685 -285185 -298072 -294595
6081 -294595 -173986 -280947 -463724 -636723 -303813 -295093 -104084 -72646 -242727 -297724
6071 -297724 -134446 -117348 -150463 -48973 -37851 102283 -107246 -24129 -143011 -216660 -344866
6060 -344866 -219653 -291046 -374585 -254655 55513 21411 -126779 -129922 3801 -44193 263976
6049 263976 148219 144046 301749 374622 410720 620000 676421 444574 296595 226282 135203
6038 135203 -140303 51392 -74406 -132240 -101639 -180119 -125775 35083 252882 -37685
6028 -37685 -90640 -229216 -568271 -368383 -678435 -393534 -226151 -154060 -383120 -437806
6018 -437806 -197158 -237528 5057 10117 -96983 -215066 -149265 -63829 -88225 -75611 -139706
6007 -139706 -243297 -201803 -343431 -231906 -442066 -157331 173102 -147996 -350364 -38788
5997 -38788 -353207 -539624 -318606 -349752 -553920 -548159 -369787 -493709 -199907 89322
5987 89322 -100377 -174648 -255691 -254855 -240898 -462970 -236211 -384438 -473326 -272165 -87662
5976 -87662 -316314 -710483 -657459 -322995 -485922 -444295 -576374 -356121 -337138 -576847
5966 -576847 -399276 -381598 -478383 -374010 -431406 -371570 -286826 -530714 -527345 -40991 21631
5955 21631 -97657 -147491 -318953 -121889 73149 191815 260920 -117523 -405104 -262959
5945 -262959 -210687 -376082 -432203 -240769 -225165 -281934 -166857 166662 171149 17440 -238424
5934 -238424 -226137 -377028 -321706 81574 -272141 -458041 -134590 -66770 -77288 -190385
5924 -190385 -110795 -315132 -9032 -171636 -166972 -231311 -120557 -56559 -270227 -114990 -169107
5913 -169107 44692 301631 -71418 308057 391589 421718 181917 291959 150567 -110832
5903 -110832 168412 190573 271390 97809 267577 660752 774343 559280 429466 826801
5893 826801 694862 453394 714823 905621 661145 763843 1132463 1027190 1035778 1458755
5883 1458755 1229207 1124035 1218730 1197862 1656308 1766565 1688572 1844532 2017965 2172215
5873 2172215 2555805 2368132 2577236 2676074 3013499 3099085 3337261 3347845 3642319 3990477
5863 3990477 4595645 4628471 4621926 5193481 5829365 6618268 7512825 8392118 9123573 9910740
5853 9910740 11482776 13211503 15128272 17439122 19986546 22301592 23614556 23749938
5845 23749938 22687125 20690129 18035854 15528207 13362754 11384240 9931895 8259981
5837 8259981 7056344 6412941 5368382 4492675 3939671 3455014 3231595 3248620 3122947
5828 3122947 2839407 2616770 2546391 2210930 2003921 2084532 1684580 1497205 1567599 1341409
5818 1341409 1344460 1498955 1097843 984320 1285640 1187654 1163069 1146191 911845 983103 814866
5807 814866 616877 569479 453922 476035 219707 473915 598375 262268 258118 204792 -20579
5796 -20579 -26366 190327 -146222 -74827 93931 6499 30364 154695 87594 -66741 290547
5785 290547 -85153 -176485 -343870 -38674 -254724 -197319 -45422 -273852 -312172 -329203
5775 -329203 -300316 -205923 -114953 -68535 44269 -114842 -188040 -360585 -545057 -508163 -381202
5764 -381202 -564730 -580561 -359957 -686003 -961586 -598719 -263372 -301039 -594774 -473107
5754 -473107 -377015 -318747 -170460 40877 -112358 -352018 -349303 -423158 -298800 -471476 -384950
5743 -384950 -559188 -720120 -631228 -686749 -289611 -235860 -575767 -73237 -256066 -401313
5733 -401313 -404183 -414025 -211111 -339167 -271655 -180637 -421546 -515461 -332992 -197549 -199798
5722 -199798 -333160 -623119 -690980 -155132 -342826 -173789 -551763 -509141 -382431 -713944
5712 -713944 -791695 -356533 -519184 -544413 -454846 -646621 -388677 -548850 -553132 -373795 -692666
5701 -692666 -610750 -153556 -48447 -155551 -408579 -441150 -560283 -240497 -362760 -470153
5691 -470153 -587411 -713622 -487942 -528014 -542425 -443186 -708019 -526584 -501749 -656054
5681 -656054 -597216 -417978 -352308 -276055 -362843 -515557 -717287 -732801 -401274 -233225 -397656
5670 -397656 -450848 -557171 -419764 -140227 -435309 -263806 -326611 -388698 -531646 -463458
5660 -463458 -534163 -528017 -292182 -528030 -329853 -497424 -470442 -298593 -219762 -562025 -211325
5649 -211325 -269237 -520981 -573664 -550547 -472006 -334545 -525037 -468395 -134317 -418937 -395555
5638 -395555 -421085 -77011 -205175 -190688 -459344 -518067 -739549 -637398 -716669 -645349 -258862
5627 -258862 -336064 -281888 -394472 -440075 -412479 -310377 -490542 -513315 -278544 -366458 -518921
5616 -518921 -429768 -394402 -409262 -310042 -450802 -360427 -582016 -637681 -313797 -255896 -336072
5605 -336072 -431987 -634139 -363557 27782 31184 -15001 32959 -79419 -57919 -18384 -182804
5594 -182804 -132368 -21004 -603030 -364571 -410903 -484922 -597596 -386882 -246632 -431167
5584 -431167 -215154 -205425 -291687 -75229 -88346 -220279 -280678 -164013 -25701 13141 16684
5573 16684 -126740 -24830 -29858 -86393 -464740 -366684 -198367 -157347 -398555 -23422 -105284
5562 -105284 -131385 -46103 -375378 -347660 4498 38114 -104396 -86605 105065 -54439 -132811
5551 -132811 -19750 -20279 -368767 -391423 -89681 -182720 -366671 -559968 -84500 26216 -199760
5540 -199760 -34158 -336739 -219623 -89952 -219490 -202607 -173926 -388049 -179594 -101818
5530 -101818 -257895 -175413 -128583 -302128 -184890 -324228 -486507 -548329 -339202 -147006
5520 -147006 -477069 -586399 -667504 -780291 -277827 -18692 56381 162650 9772 24422
5510 24422 88097 -106278 -294813 121942 178829 -154073 28943 163270 459189 436164
5500 436164 376903 262114 506775 296827 338297 468801 184674 224742 220572 319102 94118
5489 94118 -75101 -333059 -236064 -165850 -116893 -85611 32555 100285 82773 -107946 -11629
5478 -11629 -256624 -140022 278685 83277 -41356 137117 81094 -233065 -85939 35883
5468 35883 12847 -13209 -84469 -219162 -292896 -370831 -330032 -78589 -180471 -337210 -179537
5457 -179537 -36332 -42354 -13489 107627 189795 126575 397429 271640 63580 70838 408534
5446 408534 436968 161549 67176 498794 616280 473947 17274 2078 28944 284049
5436 284049 549717 471854 476226 664837 475838 456660 577910 474584 602787 792424
5426 792424 882161 838997 856041 864333 986641 1187410 1270596 1229876 1099389 1080743 1402860
5415 1402860 1263879 1413534 1817187 1538472 1492723 1528339 1695948 1823933 1642043 1744870
5405 1744870 1934054 1889407 1953671 2048562 2048286 2177680 2235224 2062018 2461625 2534730 2632117
5394 2632117 2563525 2648288 2938100 3136357 3567113 3577100 3711702 3974315 3805301 3874381
5384 3874381 4131893 4381748 4740785 4802424 4994215 5146933 5450370 6094963 6114262 6413762
5374 6413762 6996140 7472143 7508660 7872317 8847875 9343144 9737697 10317720 11196459 11756524
5364 11756524 12526647 13325907 13990173 15064766 16065735 16918417 18550729 19923533 21056154
5355 21056154 22616292 24630282 26624751 28955477 31772550 34629114 37875233 42132409
5347 42132409 46505856 51551766 56665059 61428179 64820033 66453408 65406290 62783368
5339 62783368 58639856 53744265 48461194 43404774 38627933 34080941 30422711 27129440
5331 27129440 24311857 22191329 20160913 18429655 16769152 15175131 14105334 13006727
5323 13006727 11822278 11040262 10068201 9492460 8712114 8236485 7824126 7409057 6946884
5314 6946884 6492510 6132973 5736002 5217476 4859756 4854393 4369784 4158390 4236958 3852683
5304 3852683 3704351 3316340 3281201 3211379 2915790 2931493 2545314 2673681 2682071 2495007
5294 2495007 2385361 2253751 2130549 2000805 1882984 1818055 1669054 1541523 1588952 1914788
5284 1914788 1710870 1635487 1397168 1390142 1398524 1120136 1063310 960279 894192 730852 849434
5273 849434 953690 889722 853980 702447 522617 421036 418422 589512 626958 448743 603885
5262 603885 462772 465736 349537 350058 346546 397130 511212 369044 25544 208624 159622
5251 159622 52373 216464 92653 -88524 -116727 -165589 -80922 -6130 -173360 -205023 -64069
5240 -64069 45357 -28894 5349 61458 -354236 -68279 -360789 -434533 -515960 -288783 25426
5229 25426 80347 -259849 -226372 -240686 144247 46496 -202938 -229797 9106 -75131 -276255
5218 -276255 -316849 -282536 -220676 -210896 -181390 -183056 -71405 -341259 -529552 -489844 -501164
5207 -501164 -573945 -266630 -123925 -4985 210973 -198038 -480900 -244763 -366627 -443813
5197 -443813 -516690 -498704 -291293 -473585 -497721 -400058 -416695 -219418 -368445 -628478 -402599
5186 -402599 -353213 -324387 -250334 -339031 -324638 -442477 -339719 -352895 -163764 -216175 -88541
5175 -88541 -262892 -207464 -242815 -282006 49801 -187120 -151361 121546 53281 -212086 -163783
5164 -163783 156888 -59087 -116836 -403376 49873 -110699 155314 293548 182744 159250
5154 159250 151974 351155 459175 351011 512383 724505 522800 486209 430162 566402
5144 566402 205395 358566 389840 452058 313463 495134 644833 319423 463037 424441
5134 424441 185097 189471 329876 306149 220119 -111338 161031 316348 306946 445624 140904
5123 140904 136318 152880 -29149 -26903 -218640 -35477 -115209 -71250 89919 83984 -188741
5112 -188741 -428593 -531194 -460352 -319852 -71562 -362083 -339019 -167074 -58212 -330875
5102 -330875 -378973 -197775 -364804 -648043 -530546 -206093 -72210 -78131 -340546 -420091
5092 -420091 -44785 17555 -118193 241327 -62205 -353344 -376701 -385120 -346759 -108445 -436729
5081 -436729 -474030 -493155 -709268 -413527 -299979 -321369 -653525 -715056 -703742 -545604 -561033
5070 -561033 -430215 -278811 -357 -96036 -275049 -128711 -68842 -303194 -156928 -247933
5060 -247933 -288570 -378433 -295072 -428594 -617111 -182740 -351138 -360368 -541601 -489687 -518877
5049 -518877 -644080 -724100 -657381 -392744 -590660 -617256 -510523 -316485 -169878 -445105
5039 -445105 -276076 -197886 9313 -156336 -63047 -381898 -241495 -113510 -336571 -513096
5029 -513096 -340792 -311274 -394878 -292436 -200281 -388076 -328181 -335698 -129476 -547882 -686257
5018 -686257 -358109 -313990 -473104 -424883 -268221 71878 -240589 -484615 -524242 -506494
5008 -506494 -143753 -66189 -132099 -74804 -140094 -210988 -225881 -600919 -356366 -207198 -463862
4997 -463862 -269831 -434974 -338692 -35 -86392 -151949 -66807 55318 44857 125633 300060
4986 300060 192002 165917 169234 -5413 -191067 -100223 224200 41087 32495 -225504 15961
4975 15961 -91411 -56795 70250 -125403 -400716 -366783 -133284 -71478 100310 14801 358571
4964 358571 260366 100838 281763 281930 207813 102817 121279 -54762 2026 -52403 189741
4953 189741 286124 -47042 -245340 19222 -207737 -45104 211468 -39274 -24417 128605
4943 128605 144736 23234 178944 172004 287741 -57707 -110497 117255 -164473 191850
4933 191850 363002 205459 217580 191934 242247 88540 -17797 -8400 -77127 -109055 184095
4922 184095 53829 -72510 -265908 -60652 5992 259604 453004 404091 528797 669215
4912 669215 633409 402391 294591 319984 415717 197737 122634 -155793 -75758 195937 192090
4901 192090 368547 436650 485222 348923 60162 107759 290401 488806 853154 918809
4891 918809 876448 722826 966974 742878 1059057 960102 609083 813341 749011 777296
4881 777296 497681 804378 789969 898885 884866 734487 612342 974000 421254 673469
4871 673469 640324 646648 809715 856722 766730 717598 489647 740837 368627 214540 185557
4860 185557 415405 169366 173234 463833 357819 347862 537304 406726 199455 77985
4850 77985 203054 171257 67868 69580 199493 -13672 27375 107061 -40869 -130332 -130760
4839 -130760 -107271 -36316 243503 -157788 -29363 -70848 49976 -140391 147736 192373
4829 192373 119150 -12241 83628 -116850 -16607 221920 418428 305422 -997 9066
4819 9066 -88403 -308479 135659 118887 -92415 55211 171540 332932 363928 129288 272069
4808 272069 -57068 170870 298039 114693 53742 513690 333449 182967 74486 245882
4798 245882 331409 144105 162746 422136 74222 -205469 -190611 -211811 37960 -50331 -94775
4787 -94775 169474 209816 208845 475840 345791 271301 112138 33652 25634 345479 351309 370080
4775 370080 184061 264524 385160 -78790 46831 87999 188468 15440 48049 -45525
4765 -45525 -1686 92959 339443 601578 561111 500126 151149 292418 101847 98304 251967
4754 251967 -26311 -113070 294031 508294 230660 376714 286713 91550 211776 281478
4744 281478 254831 334057 308785 206734 166852 252137 286057 335053 -389 259275 351365
4733 351365 256495 257262 296157 228565 352629 322576 202584 336329 351266 371867 412124
4722 412124 478125 334185 806918 421414 470803 346281 403491 161408 283831 577792
4712 577792 742338 524243 456981 495737 425720 412071 339796 423261 650607 554161 503993
4701 503993 435608 649952 596036 581853 719743 906338 672642 549395 525064 412619
4691 412619 632374 420674 770593 716198 533210 834914 688348 486152 477591 910575
4681 910575 629058 1032545 1029196 1093600 990457 917135 1107025 946038 721513 927926
4671 927926 881438 637597 909486 902013 1034507 751623 1118593 1381425 916781 972115
4661 972115 1189898 1529815 1652013 1309096 1506121 1362051 1319990 1197690 1667419 1742991
4651 1742991 1510667 1624534 1661291 1767237 1898173 1781149 1560592 1849238 2409628 2340775
4641 2340775 2613313 2690819 2533876 3053074 2819729 2744598 3096071 2849876 3032669 3174917
4631 3174917 3437934 3293039 3644589 3805294 4244896 4707846 4866300 5159765 5445858 5376446
4621 5376446 5426234 5638065 5756475 6033532 6261755 6395720 6703193 6817022 6850480 6957848
4611 6957848 6670495 6765036 7118538 7111441 7493858 7645667 8139917 8777837 9293624 10125698
4601 10125698 11015691 11525805 11655078 11912501 11774908 12011104 12625821 13402029 13690363
4592 13690363 14021882 13968335 13744371 13027768 12241264 11627373 11653283 12018460 11209761 11685162
4582 11685162 12138623 12216203 12911099 13976601 14927524 16125711 16834233 17087653 17633292
4573 17633292 18092273 18592806 19723032 21685098 22920398 23524039 23475756 22800782 21206216
4564 21206216 19376432 18207148 17839230 17873909 18103350 18198058 18192429 17698889 17701171 17045777
4554 17045777 17040065 17520361 17817009 18024765 18518263 19308688 20071577 21065435 22762577 24366087
4544 24366087 25494880 25892049 25330958 24024764 22808659 22603319 22481494 23000522 23827520
4535 23827520 24786469 25097779 24576097 23502765 21866344 20040041 18698752 17949567 17315924
4526 17315924 17123224 16724880 16597033 16163383 16418894 16890849 17180323 17376834 17002444
4517 17002444 17112180 17069579 17271044 17970849 19187723 20535483 22031322 22943160 22597847
4508 22597847 21223511 19196958 17501468 16440264 15923028 15543069 14869292 14184985 13101637
4499 13101637 12303934 11360179 10387340 9903491 9399979 9212419 8931807 9149962 9402979
4490 9402979 9322255 9460568 9852495 10664694 10793083 10942580 10316272 9755200 9323528 9382790
4480 9382790 9097335 9308500 9443860 9118259 8560333 7559395 6943194 6416382 5642582
4471 5642582 5231479 4735127 4444805 4127940 3761717 3663167 3518207 3387092 3194819 3418089
4461 3418089 2913508 2769153 2943728 3318137 3240512 3476227 3500778 3728919 3737614 3175817
4451 3175817 2519584 2298694 2242594 2109874 2143595 1791614 1710289 1633464 1500125 1566852
4441 1566852 1369595 1392830 1327825 1350492 1090358 1055205 1374532 1119279 959546 879006
4431 879006 799741 909007 820695 852037 814670 627585 729718 943959 983604 593808 654820
4420 654820 733773 767813 690237 760724 591035 365171 459227 618706 484267 454069 694009
4409 694009 768351 455993 572664 728064 523486 535030 552860 537815 654857 604646 563872
4398 563872 274956 392101 475887 322038 81777 192409 272161 402573 772500 412226
4388 412226 33596 140341 510174 379870 385446 288725 205993 303227 318778 252227 340861
4377 340861 506779 239148 417671 552640 462657 658419 108531 103214 440038 388305
4367 388305 337548 192444 219575 297653 358049 567085 290931 106898 -41268 42323 516939
4356 516939 447355 244379 251135 105310 -40964 322301 249370 570672 529965 238582 401812
4345 401812 434016 508412 174375 100543 227110 224710 -90385 4502 86637 426488 276416
4334 276416 343094 253769 119181 49497 52447 -149971 -70065 -85835 -25713 126296 48519
4323 48519 104026 -5708 261035 168007 40306 -41183 258436 298501 322209 395305 359683
4312 359683 245596 -29244 44112 129383 -124838 156432 211683 466968 550497 198498
4302 198498 327939 259581 308669 181239 193226 272252 289862 274476 179424 229909 369447
4291 369447 334966 -22590 276466 188528 222055 -201660 -243333 -12303 77102 -1019 -183862
4280 -183862 111361 -40745 -34877 67713 -45607 -232390 -99439 29640 167171 153094
4270 153094 566105 629080 -147391 -116663 265614 99111 20510 214258 342735 400317
4260 400317 -86937 -166028 -127948 -36854 -99159 -41495 97237 -27569 421746 232306 -132258
4249 -132258 -204278 88784 96439 -193916 -133900 38023 21842 19708 488421 333786 215792
4238 215792 -12516 66984 189655 99958 -75765 13736 275514 292892 172332 -87469
4228 -87469 -253874 -132498 -28660 -137102 62441 -69544 123095 -58956 -154333 209487
4218 209487 186400 -95073 214658 248437 411530 542346 388495 384304 95930 -118700
4208 -118700 -5861 225486 294957 -80868 -304203 -101637 240288 50535 -155534 -56893
4198 -56893 -126268 24187 -89129 -152419 231544 201584 188688 169686 110674 65885 -81578
4187 -81578 168713 166936 305552 133806 112794 350324 154010 131068 222700 417154 173962
4176 173962 340760 249313 81707 139432 141536 -68391 -134804 66959 12572 178537 154383
4165 154383 21665 85885 97108 26282 -97488 -230205 -103595 -346506 -129022 204550
4155 204550 65225 140006 58981 214494 287913 197889 221099 129859 126626 256923 412603
4144 412603 223005 214424 174245 14196 -248937 171137 67548 -230046 106257 -36005
4134 -36005 -104292 167142 410666 494946 167106 163114 341508 288126 289716 220594 58528
4123 58528 40275 299173 215885 86710 -12142 -982 94027 79350 283296 239754 638485
4112 638485 366838 81960 -28104 190960 36857 -5440 147030 77755 237411 385936
4102 385936 484873 266781 13868 -284602 -100822 308435 453826 564248 230958 269283
4092 269283 428251 389051 163944 184032 336610 209229 405785 473412 394226 224310
4082 224310 469982 411542 172740 367267 543920 325134 128323 220608 265558 -37652
4072 -37652 -20280 391080 364552 306729 337014 231336 247551 419390 618485 161576 -37444
4061 -37444 -21432 37144 -142522 -28989 265107 195365 328425 407840 347990 125392 161211
4050 161211 233454 70711 146047 126263 -4014 82197 296445 368880 244043 333531 514284
4039 514284 245171 285218 291063 289904 400509 376139 277723 472236 705502 521459 384918
4028 384918 467237 580747 398201 171570 453267 428182 429743 630054 593784 402945 527568
4017 527568 268153 282242 462210 505642 445838 413639 672286 811547 679378 600635 771766
4006 771766 817614 567743 532069 283280 432521 363869 529334 532506 522873 474373 332161
3995 332161 629499 658401 637722 862491 559615 785439 889430 760677 743153 532269
3985 532269 737271 763533 620121 544268 898925 946270 583109 621813 446840 305987
3975 305987 404920 360162 615135 721015 576207 502279 517936 456763 591894 664222 824358
3964 824358 852578 804476 897586 933395 727802 977459 823448 696318 509908 531588 645129
3953 645129 449368 528156 864338 585435 724511 490557 654388 662050 656571 715894 706139
3942 706139 489161 688003 857196 719667 1150797 864540 698393 871638 933321 990314
3932 990314 720249 693063 672726 728958 771308 695127 978888 1041010 1147519 1036804 1249435
3921 1249435 1161447 1041006 1128365 1222698 1019495 987462 1432582 1557462 1925892 1788602
3911 1788602 2183199 2131194 1689332 1614411 1521326 1559076 1545876 1767961 1433168 1308615
3901 1308615 1280043 1310437 1368151 1427193 1256717 1012665 1128219 1142529 1240689 1089403 905816
3890 905816 1113924 1524091 1189933 1361564 1554064 1651267 1695422 1773494 1747197 1935642
3880 1935642 1652141 1874939 1914265 1723069 1836023 1719746 1892728 1851004 1775633 1578233
3870 1578233 1441917 1414227 1206605 1280619 1786393 1704457 1445930 1569240 1573746 1475229 1717793
3859 1717793 1439122 1545449 1584649 1515830 1228636 1641227 1880980 1996213 1940175 1650471
3849 1650471 1922225 1743708 1965278 1956345 2006315 1701892 1989144 2147426 1811100 2011855
3839 2011855 2250345 2371536 2376873 2411251 2417312 2504816 2514207 2498970 2487852 2787420 2854723
3828 2854723 2636001 2657936 2546153 2599082 2685026 2884327 3033686 2768903 2834066 2867682
3818 2867682 2794678 2524594 2443749 2430160 2169968 2224005 2095806 2224378 2737220 2597183
3808 2597183 2561347 2887923 2452616 2266447 2641707 3037128 2918103 2580850 2833423 2710703
3798 2710703 3150774 2790672 2730232 2918439 3192154 3141914 3538151 3749145 3513306 3287110
3788 3287110 3375153 3442901 3799843 3926873 4050394 4041085 4481507 4356495 4298245 4322888 4674104
3777 4674104 4866617 5136327 5146660 5178551 5655826 5770850 5759978 6383827 6452679 6326389
3767 6326389 6595549 6720451 6720270 6604454 6756704 6808035 6887527 7139244 6980396 6951348 7492957
3756 7492957 7228891 7388283 7216579 7189801 7673908 7959005 8245120 8003396 8473315 8755259
3746 8755259 9058496 9343079 9721149 10025537 10572007 10906598 10874064 11179374 11358833 11660477
3736 11660477 11945022 12316670 12669656 12799230 13333640 13484594 13411750 13990934 14050151 15087877
3726 15087877 15685517 16024085 16348266 17000380 17818723 18756085 19694305 20837282 21793057
3717 21793057 23329455 24541696 25931630 27392965 28981068 30379583 32356931 34190364
3709 34190364 36292769 38266046 40605863 42716388 45460160 49089089 53314263 57248526
3701 57248526 63279413 70164070 78006626 87356765 99133412 113060189 129996374 150550325
3693 150550325 171399511 181494763 182393301 172463183 150308159 126500347 107175734
3686 107175734 93693384 81871012 71590272 62186175 54767162 48964949 44720203 40852063
3678 40852063 37636946 34811339 32256377 30312591 28666000 27251943 26122039 24961828
3670 24961828 23668905 22519037 22078824 21716693 21270238 20751059 19992128 19097862 18493894
3661 18493894 17990416 17421687 16888301 16366599 15555020 15337067 14950420 14303008 14232229 14255166
3651 14255166 13904921 13710333 13759482 13340049 13312594 13540006 13323267 13301872 13194892 13222963
3641 13222963 13678536 13594658 13626763 13763305 13911797 14522364 14468085 14495548 14962081 15048135
3631 15048135 15398895 15656414 15931038 16479656 17035052 17860622 18337981 18921351 19643459
3622 19643459 20604945 21481938 22396042 23172700 24346776 24976496 26009082 27344705 29098336
3613 29098336 31328762 33858871 37223105 40923119 44606049 47472129 47661847 45993046
3605 45993046 42176197 38006474 34348534 31908484 29477030 27510126 25749562 24048392
3597 24048392 23190980 22615468 21818280 21211449 20943717 21220531 20932351 21039025 20942472 21066073
3587 21066073 21466671 21762756 22116758 22471175 22916839 23071623 23874053 24794789 25355120
3578 25355120 26051905 26915101 27775845 29007485 29762975 31076128 32541469 33235712 34411987
3569 34411987 35493821 36055802 37122720 38533195 39729404 40936249 42379094 43678320
3561 43678320 45251164 47120664 49489748 51541287 53760804 56635182 59292167 62390910
3553 62390910 65804418 69426195 73178498 76550007 80813518 84986313 89288818 94178767
3545 94178767 99227662 104949237 111353018 117600018 125233742 134085988 143388250 153966145
3537 153966145 165870386 179684739 195491474 213293318 233297372 255382655 279569901
3530 279569901 305505108 332817723 358329181 378085047 386308607 380432073 360756453
3523 360756453 332387214 301203088 271439114 244556569 219965118 197828213 178171708
3516 178171708 160716221 145598038 132306169 121243649 111606114 103157509 95702892
3509 95702892 88917377 82893706 77806032 73353583 69328212 65641423 62363207 59201700
3501 59201700 56393656 53754458 51819677 50120943 47917668 46627694 45429959 44155483
3493 44155483 43234064 42168185 41449314 40739142 39874121 39835193 39465496 39415884 39365364 39742867
3483 39742867 40522124 41239215 42737698 44404133 46239582 48537741 51060324 53386700
3475 53386700 54812387 54634783 53221365 50091631 46096943 42338149 38692331 35588751
3467 35588751 32673044 30307712 28253982 26403397 24766807 23495403 22274919 20988182
3459 20988182 19836107 18931544 17869331 16854668 15933677 15218335 14190851 13520672 12935906
3450 12935906 12295064 11982047 11456671 11057925 10775208 10498215 10066212 9720877 9318173
3441 9318173 9161080 8689040 8390707 7912143 7828694 7665013 7312111 7221773 6934292 7111884
3431 7111884 6787561 6515121 6245459 6174033 6083625 5743658 5775564 5793523 5378264 5040867
3421 5040867 5212594 5367519 5038382 5007245 4786368 4971614 4977260 4404257 4628239 4481715
3411 4481715 4209871 3753149 3716197 3755381 3667114 3973158 3882448 3624655 3724262 3689155 3415364
3400 3415364 3437076 3225633 3115759 3241160 2960187 2782122 2716017 2930880 2872255 2523041
3390 2523041 2529426 2377429 2544934 2487922 2204570 2110789 2094412 2097741 2079768 2360922 2289898
3379 2289898 1919747 2109626 1986093 2074002 2003034 1836004 2014024 1783659 1795843 1963023
3369 1963023 2001935 1895031 2139372 2205996 1742769 1677139 1809752 1975559 2107234 2233156
3359 2233156 2163188 1943583 1786640 1566412 1861884 2209165 2361835 1971899 1833985 2020518
3349 2020518 2178647 2317301 2032206 1973981 2073863 1843050 1687177 1986873 1925051 2024123
3339 2024123 2230431 2207904 2342525 2323832 2141479 1876993 2271294 2245269 1958487 2360106
3329 2360106 2659440 2127016 2141504 2403227 2186012 2481443 2631020 2478649 2639975 2822007
3319 2822007 2973060 3008544 2991371 3129677 3461495 3829939 3854473 4170083 4288291 4496070
3309 4496070 4040055 4053834 4227377 3962388 3503986 3295303 3140215 2952092 2786065 2816914
3299 2816914 2679794 2427196 2085278 1887665 1900254 1809901 1687920 1865826 1739196 1750002
3289 1750002 1822095 1502674 1391683 1642213 1357959 1206101 1188641 1443284 1264010 1170375
3279 1170375 1230395 1268130 1131519 801751 1438971 963406 937573 1031083 1102768 1139596 1121512
3268 1121512 1149147 1047545 1234438 1267315 1551506 1303216 1119432 1029994 1263864 1067080
3258 1067080 1167601 1174562 1367494 1450873 1174146 1482041 1381071 1304870 1206985 1770627
3248 1770627 1388795 1205126 1264403 1130026 1001293 690840 892463 1064713 936481 1006378
3238 1006378 993739 1079850 1065927 1214125 1257673 1439731 1130289 1180064 1211168 1321312 1300164
3227 1300164 1095796 1018928 1106845 656152 891228 1146864 1078308 1000424 1436847 1283165
3217 1283165 1322951 1463073 1228355 1136181 1217408 1311436 1519032 1539714 1506275 1296970 1104967
3206 1104967 1036968 1221565 1389316 1239255 1145585 1137071 1477453 1180323 1206728 1131017 1138579
3195 1138579 1176121 1055069 843975 888600 726794 1009077 998110 1218402 868211 1178912
3185 1178912 1055107 1259802 1627209 1151511 1065463 969881 1299962 1243867 1122842 1259110
3175 1259110 961857 1043808 1051780 1161174 1032683 1037070 1364992 1186892 1187395 1279700 1505897
3164 1505897 1403336 1320008 1395120 1311462 1176851 1393158 1594815 2009620 1889341 1640355
3154 1640355 1518634 1700328 1856303 1384174 1350651 1510637 1638804 1923274 2218437 2306890
3144 2306890 1997647 2166457 1942016 1605046 1652703 1674911 1604556 1366602 1705212 1582065
3134 1582065 1469290 1468355 1378085 1347628 1506381 1374787 1290010 1369262 1270080 1374090 1492811
3123 1492811 1688793 1209371 1049487 1434072 1264433 1520771 1371443 1170637 1275104 1366798
3113 1366798 1535357 1112129 1299234 1496953 1455484 1343386 1433682 1464624 1296348 1409562
3103 1409562 1515509 1514824 1743875 1840503 1903199 1932228 1622816 1587952 1808181 1888300 1981866
3092 1981866 1988562 2068165 2329185 2366545 2358153 2404541 2221391 1987394 2363169 2512182 2113139
3081 2113139 2161752 2218234 2109533 2212171 2183806 2350534 2103689 2587217 2293833 2230637
3071 2230637 2682360 2783653 2389525 2734270 3026109 3200027 3160203 2953666 3126823 3293513
3061 3293513 3155897 2563665 2387333 2600128 2546376 2533774 2601721 2713644 2852438 3169850
3051 3169850 2822207 2611378 2800361 2723710 3116652 3323537 3287127 3135453 3190554 3168649
3041 3168649 3172370 3511327 3586023 3643321 3769863 3762621 3910185 3686346 3566929 3568895 3785536
3030 3785536 3895026 4054795 4220288 4227621 4051444 4470031 4456519 4560652 4795227 5200277
3020 5200277 5343594 5571004 5537865 5614587 5872172 5764505 5805488 6260882 6344256 6435284
3010 6435284 6711683 6751325 6897363 7516782 8209182 7949510 8092442 8810709 8816772 8961760
3000 8961760 9521163 10040195 10316497 10757179 11275869 12002788 12508615 12897107 13569978 14052626
2990 14052626 14729089 15220457 15903189 16296787 16461444 17029883 17691049 18635566 19559783
2981 19559783 20501406 21571187 22930388 24678451 26715603 29073237 31915921 35040931
2973 35040931 38705004 43505586 49255708 54794117 57953408 59387170 57609913 53115492
2965 53115492 48772108 45483834 43477521 41957676 40887071 40156054 40049282 39918695 40011799
2956 40011799 40470346 41626655 43459727 46021073 48954833 52593451 57429096 63489495
2948 63489495 70613553 80305631 90390669 95782201 96273976 90737336 79983448 68589335
2940 68589335 59869609 53862696 48601284 44093216 40143593 37096916 34709722 33118959
2932 33118959 31895539 31540858 31482288 31656878 32218474 33358662 35555673 37901525 41149329
2923 41149329 45250341 49619118 51538498 51468867 48684170 43351508 37339524 32390989
2915 32390989 28649543 25357618 22725122 20164944 17987598 16608394 15297683 14075024
2907 14075024 13006769 12340227 11475920 11032569 10843163 10137845 9748797 9733893 9503455
2898 9503455 9066878 8959795 8478195 8283840 8163959 7923437 7321913 6745479 6270209 5789513
2888 5789513 5910685 5463344 5253895 5197710 4764997 4524916 4486907 4419149 4085879 3839096
2878 3839096 3594605 3116420 2996500 3072006 3231723 3407536 3034083 2669802 2464242 2255292
2868 2255292 2537381 2385999 2600786 2586958 2588168 2389751 2308679 2086327 2191732 2304893
2858 2304893 2126156 2088357 1799009 1942109 1805040 1718515 1730088 1697562 1785887 1741262 1231914
2847 1231914 1348483 1180001 1163385 1095456 1040168 1190257 1120234 1166377 1074659 1213860 1077586
2836 1077586 1001373 1081911 1152047 1124456 1181987 1045541 1049310 1112124 806024 720832 850167
2825 850167 704270 663451 654031 539967 1106051 976565 537092 476258 610812 662781 866487
2814 866487 539780 515404 852611 683237 569869 639562 1026988 748122 597886 104203
2804 104203 102991 285067 294952 425210 579051 652390 568313 567434 581503 360404 602289
2793 602289 445797 480020 700437 497607 231344 164898 522429 506905 527223 756959
2783 756959 447047 290285 466327 611936 527827 564588 430365 752482 1047645 779507
2773 779507 393478 480018 797628 936632 841777 645782 992072 644593 833676 743816
2763 743816 753950 786847 976716 1019711 1199540 1218603 1210636 1163755 1282116 1396654 1456244
2752 1456244 1531245 1446099 1312184 1362989 976033 1113731 1244772 1056891 712179 1021264
2742 1021264 1329752 1357928 1200560 1160792 1255733 1489602 1504836 1374879 1480082 1777232
2732 1777232 1869815 1787962 2068806 2003164 1812768 2105417 2257439 2130685 1929613 1823377
2722 1823377 2058191 2075598 1878282 1589439 1751069 1991241 2034912 1912150 2081388 1953178
2712 1953178 1968445 2055220 2050765 1908727 1852592 2092292 1986731 2178751 1866719 2028597
2702 2028597 2401607 1959995 1694295 1850091 1540913 1500599 1565066 1367866 1171376 1622958
2692 1622958 1562135 1621248 1371823 1367274 1277647 1204250 1444004 1203735 1275561 1109891 1242532
2681 1242532 1130403 1223287 1136368 1433447 1105791 1012641 1043822 1041475 1016583 850704 930066
2670 930066 1010142 814323 1007309 998917 1058423 823065 844641 614035 516088 273840 650461
2659 650461 507292 196494 217146 528672 685256 520413 278337 348569 456226 706067
2649 706067 507994 270440 50773 115563 69300 99616 57532 26104 -102564 -291339 41849
2638 41849 46091 -291859 -380958 227747 241023 120524 122220 -50010 -91916 -287401 -205492
2627 -205492 -255204 -296412 -74780 201002 227929 -94626 -17116 -133576 -185031 -168984 -140780
2616 -140780 78664 15430 -412418 74102 -69994 -198861 148770 39534 -389577 -90879
2606 -90879 -175974 -121011 -283677 -167541 -295003 -270526 -128933 -127834 -476253 -103019 -143333
2595 -143333 -164553 -266850 -236444 -216860 -249788 -98367 -197438 -268044 -332112 -421742 -25619
2584 -25619 115720 -232242 -442500 -499223 -228388 -136755 -411455 -788973 -559231 -399753
2574 -399753 -294560 -502163 -232194 -487456 -304221 -169489 -328790 -283717 -70347 -171502
2564 -171502 -304026 -283863 -251556 -19678 47702 -150291 -164889 -81765 -240155 -386568 -128581
2553 -128581 66648 134806 -231025 -202163 -267395 -49598 -130827 -163459 23996 -290968 -512920
2542 -512920 -401117 -482331 -254128 -257482 -307821 -114433 -289224 -224321 -414325 -317043 -494243
2531 -494243 -379265 -427096 -205506 -63767 -272877 -21096 -285843 -286683 -285471 -219344 -197950
2520 -197950 -13455 -189300 -429689 157827 68517 -154563 76643 80681 15356 -43348 -412202
2509 -412202 -129520 -194833 -72534 -102036 -16935 -45516 -301065 -420227 -121725 -36538 -10466
2498 -10466 -305801 -205335 -152139 -200770 -218862 -47893 -301945 -266489 -156205 -352280 -405342
2487 -405342 -412661 -151795 -201464 -244313 -58453 -68307 24065 300337 231025 -118050 -453675
2476 -453675 -424743 -204054 -442575 -298770 -211604 -95333 145088 -216129 -240173 -233383 -68671
2465 -68671 -416768 -287466 -114471 -331972 -304726 -55620 34849 62969 -21133 -100295 -270703
2454 -270703 -99208 -216563 -244955 -371413 -110819 -258278 -262946 -225969 -340663 -305336 -209714
2443 -209714 -337584 -467177 -507660 -186180 -53091 -162753 -367752 -318040 27387 -402321
2433 -402321 -514460 -286649 190588 -48723 -62031 -111418 -58417 -267914 -391792 -452347
2423 -452347 -394330 -237567 -327179 -348697 -425819 -266729 -14911 55680 -12774 -236332 -370454
2412 -370454 -335974 -415605 -332346 -574518 -410354 -653039 -526303 -245918 -231131 97830
2402 97830 -278335 -452800 -203068 -74784 -43328 -106495 -173522 -163129 -454044 -678101 -538897
2391 -538897 -530438 -432726 -248578 -58296 -267555 -157263 -581355 -308910 -221115 -390604
2381 -390604 -449978 -472493 -245614 -288929 -135859 -236210 -104070 -183307 -211109 -33377 -82092
2370 -82092 -209563 -232704 -217118 -20250 -371839 -723613 -597701 -424997 -491791 -453831 -249362
2359 -249362 -180491 -138911 -123875 -153704 -280437 -97781 -340864 -322164 -123786 -91134 -222965
2348 -222965 -322629 -145170 -585888 -333296 -402 -222975 -341126 -193602 189139 -58436
2338 -58436 -237457 -460517 -386573 132092 -82453 -269175 -312092 -268878 64439 107449 -71300
2327 -71300 85998 63036 142581 -146924 -291436 -8846 -334885 -153096 -58464 -108361 -320161
2316 -320161 -303567 -156757 27869 129587 78788 78357 194393 80580 133013 251030 40687
2305 40687 52251 122154 465739 470973 483847 239505 153075 4958 152149 -177471 -50
2294 -50 117519 -88559 -191082 54589 54026 86364 46879 -113216 -23226 -89021 -334312 -84018
2282 -84018 210575 21266 185766 -315129 -367519 -398862 -88581 -237119 -424938 -292048
2272 -292048 -170847 305250 45644 401560 135482 -181911 2635 -193756 -143710 64172
2262 64172 -30468 211102 42055 -241352 -41277 196613 21138 -14637 79131 369225
2252 369225 220376 160449 -154850 66372 93547 43781 17740 -92303 -78569 17894 -7369
2241 -7369 51989 326950 228336 146876 291757 301869 -10205 42071 -32894 50472 114158
2230 114158 74534 -6759 187080 187718 25002 -3471 -85178 32344 60447 -335118 -40034
2219 -40034 92220 296953 324029 135697 339 182429 -82073 -45723 187809 502752
2209 502752 532233 515007 416415 421981 316696 457044 431617 -68796 -26244 246616 169835
2198 169835 482156 336412 422896 413025 371164 429957 570368 289572 345637 291132 315468
2187 315468 431608 298878 441869 612173 625790 354806 -37878 159574 426615 856926
2177 856926 774246 737230 723981 616256 763769 577948 835630 783546 941244 882422 1129143
2166 1129143 1262410 1285315 1033282 1043170 1253426 1348884 1353793 1481741 1482636 1529007 1398021
2155 1398021 1539961 1657327 1744308 1732690 1867384 2213317 2387372 2465310 2597690 2569522
2145 2569522 2763455 3014150 2726999 2799852 3271309 3405163 3436069 3729300 3769608 3947241
2135 3947241 4133971 4501123 4875855 5188158 5439707 5688262 5973753 6286099 7050923 7557420
2125 7557420 7965675 8401621 9038355 9485095 10068576 11025886 11855084 12542814 13322198 14709169
2115 14709169 15805407 17404894 18981089 20844047 23182113 26656141 30194955 34955912
2107 34955912 40970210 48253585 53924168 55441379 53479939 46294326 38282297 31255566
2099 31255566 27340183 23890903 20974630 18149246 15812448 13972815 12511758 11762961
2091 11762961 10486788 9401309 8580231 8123091 7179541 6513593 6248453 5680244 5254427
2082 5254427 4782250 4337574 4216423 4158538 3983639 3765783 3659652 3364456 2985314 2967057
2072 2967057 3017029 2585349 2572961 2580644 2178812 2161886 2113253 2323518 2244429 1744700 1619154
2061 1619154 1611349 1575372 1398152 1472214 1552938 1487324 1229375 1072762 1006262 896535 1036120
2050 1036120 1039143 1111955 1176969 1139429 705632 799320 765383 870125 996165 788188 570843
2039 570843 387133 287219 520006 678977 537780 541537 379519 656980 558976 761929
2029 761929 501757 187230 397225 466719 111882 -88424 -67275 71673 320691 264336
2019 264336 95232 289783 315928 112309 281984 57223 -86498 -117381 56 72852
2009 72852 300945 174839 27622 281687 -97646 -393872 24301 221901 -4276 235482
1999 235482 125355 119135 -170891 125595 29330 150487 62848 114556 271411 -23963 -23648
1988 -23648 232911 -100703 -179920 262124 69660 129227 194665 154730 -40056 -6987 -81797
$$ [...]
##END NTUPLES=NMR SPECTRUM
##END=
