##TITLE=1H_CA-9279-3
 CDCl3
 8 sc, 
 10.10.2024
##JCAMPDX= 6.0         $$ Bruker NMR JCAMP-DX V2.0
##DATA TYPE= NMR SPECTRUM
##DATA CLASS= NTUPLES
##ORIGIN= UXNMR, Bruker Analytische Messtechnik GmbH
##OWNER= root
$$ XWIN-NMR		Version 3.5
$$ Thu Oct 10 14:03:17 2024 Russian Standard Time (UT+4h)  she@DPX200
##.OBSERVE FREQUENCY= 200.1318
##.OBSERVE NUCLEUS= ^1H
##.ACQUISITION MODE= SIMULTANEOUS
##.ACQUISITION SCHEME= undefined
##.AVERAGES= 8
##.DIGITISER RES= 18
##SPECTROMETER/DATA SYSTEM= spect
##.PULSE SEQUENCE= zg30
##.SOLVENT NAME= D2O
##.SHIFT REFERENCE= (INTERNAL, D2O, 0, 21.0194)
##AUDIT TRAIL= $$ (NUMBER, WHEN, WHO, WHERE, WHAT)
$$ ##TITLE= Audit trail, XWIN-NMR		Version 3.5
$$ ##JCAMPDX= 5.01
$$ ##ORIGIN= Bruker BioSpin GmbH
$$ ##OWNER= she
$$ F:/spectra/data/she/nmr/H-F/1/pdata/1/auditp.txt
$$ ##AUDIT TRAIL=  $$ (NUMBER, WHEN, WHO, WHERE, WHAT)
(   1,<2024-10-10 14:02:10.45 +0400>,<she>,<DPX200>,
      <created by zg, POWCHK disabled, PULCHK disabled
       configuration hash MD5:
       00 E9 B6 7A A2 85 ED C7 34 08 36 98 17 FE 4E 26
       data hash MD5: 16K
       CB 7C 54 6B 7B 03 F9 74 C6 BE 3F 1D 41 92 CB 19>)
(   2,<2024-10-10 14:02:14.26 +0400>,<she>,<DPX200>,
      <Start of raw data processing
       efp BC_mod = 2 LB = 0.24 FT_mod = 6 PKNL = 1 PHC0 = -26500.76 PHC1 = 12.58743 SI = 16K 
       data hash MD5: 16K
       CB 3C E5 E1 0C B5 E0 8B 6F C7 75 CF 70 51 B2 C6>)
(   3,<2024-10-10 14:02:34.82 +0400>,<she>,<DPX200>,
      <pk PHC0 = -0.8270797 PHC1 = 1.4 
       data hash MD5: 16K
       9C 9D 59 52 69 F9 A1 2F 3D 6E 51 55 70 57 61 F7>)
(   4,<2024-10-10 14:02:38.07 +0400>,<she>,<DPX200>,
      <abs ABSG = 5 
       data hash MD5: 16K
       DC DF 20 92 D5 53 8A 71 84 5D 50 A4 37 E7 18 EE>)
$$ ##END=
$$ 
$$ hash MD5
$$ C4 B4 7A 82 23 58 D5 CC 4B 03 6E BA E2 6F A6 7A
##$RELAX= 
##$RELAX= 
##$RELAX= 
##$RELAX= 
##$RELAX= 
##$RELAX= 
$$ Bruker specific parameters
$$ --------------------------
##$DU= <F:/spectra>
##$EXPNO= 1
##$NAME= <H-F>
##$PROCNO= 1
##$TYPE= <nmr>
##$USER= <she>
##$AMP= (0..31)
100 100 100 100 100 100 100 100 100 100 100 100 100 100 100 100 100 100 
100 100 100 100 100 100 100 100 100 100 100 100 100 100 
##$AQSEQ= 0
##$AQ_mod= 1
##$AUNM= <au_zg>
##$AUTOPOS= <>
##$BF1= 200.13
##$BF2= 200.13
##$BF3= 200.13
##$BF4= 200.13
##$BF5= 200.13
##$BF6= 200.13
##$BF7= 200.13
##$BF8= 200.13
##$BYTORDA= 1
##$CFDGTYP= 0
##$CFRGTYP= 5
##$CHEMSTR= <none>
##$CNST= (0..31)
1 1 145 1 1 1 1 1 1 1 1 1 1 1 1 1 1 1 1 1 1 1 1 1 1 1 1 1 1 1 1 1 
##$CPDPRG= <>
##$CPDPRG1= <>
##$CPDPRG2= <>
##$CPDPRG3= <>
##$CPDPRG4= <mlev>
##$CPDPRG5= <mlev>
##$CPDPRG6= <mlev>
##$CPDPRG7= <mlev>
##$CPDPRG8= <mlev>
##$CPDPRGB= <>
##$CPDPRGT= <>
##$D= (0..31)
0 1.2 0 0 0 0 0 0 0 0.06 0 0.03 0 0 0 0 0.0002 0 0 0 0 0 0 0 0 0 0 0 0 
0 0 0 
##$DATE= 1728554529
##$DBL= (0..7)
120 120 120 120 120 120 120 120 
##$DBP= (0..7)
150 150 150 150 150 150 150 150 
##$DBP07= 0
##$DBPNAM0= <>
##$DBPNAM1= <>
##$DBPNAM2= <>
##$DBPNAM3= <>
##$DBPNAM4= <>
##$DBPNAM5= <>
$$ [...]
##$SUBNAM3= <"">
##$SUBNAM4= <"">
##$SUBNAM5= <"">
##$SUBNAM6= <"">
##$SUBNAM7= <"">
##$SUBNAM8= <"">
##$SUBNAM9= <"">
##$SW= 24.0689170037331
##$SWIBOX= (0..15)
0 0 2 0 0 0 0 0 0 0 0 0 0 0 0 0 
##$SW_h= 4816.95568400771
##$TD= 16384
##$TD0= 1
##$TE= 0
##$TE2= 300
##$TE3= 300
##$TEG= 300
##$TL= (0..7)
0 120 120 120 120 120 120 120 
##$TP= (0..7)
150 150 150 150 150 150 150 150 
##$TP07= 0
##$TPNAME0= <>
##$TPNAME1= <>
##$TPNAME2= <>
##$TPNAME3= <>
##$TPNAME4= <>
##$TPNAME5= <>
##$TPNAME6= <>
##$TPNAME7= <>
##$TPOAL= (0..7)
0.5 0.5 0.5 0.5 0.5 0.5 0.5 0.5 
##$TPOFFS= (0..7)
0 0 0 0 0 0 0 0 
##$TUNHIN= 0
##$TUNHOUT= 0
##$TUNXOUT= 0
##$USERA1= <user>
##$USERA2= <user>
##$USERA3= <user>
##$USERA4= <user>
##$USERA5= <user>
##$V9= 5
##$VALIST= <valist>
##$VCLIST= <CCCCCCCCCCCCCCC>
##$VD= 0
##$VDLIST= <DDDDDDDDDDDDDDD>
##$VPLIST= <PPPPPPPPPPPPPPP>
##$VTLIST= <TTTTTTTTTTTTTTT>
##$WBST= 1024
##$WBSW= 4
##$XGAIN= (0..3)
0 0 0 0 
##$XL= 0
##$YL= 0
##$YMAX_a= 191210
##$YMIN_a= -173317
##$ZGOPTNS= <>
##$ZL1= 120
##$ZL2= 120
##$ZL3= 120
##$ZL4= 120
##$ABSF1= 20.99879
##$ABSF2= -3.070341
##$ABSG= 5
##$ABSL= 3
##$ALPHA= 0
##$AQORDER= 0
##$ASSFAC= 0
##$ASSFACI= 0
##$ASSFACX= 0
##$ASSWID= 0
##$AUNMP= <proc_1d>
##$AZFE= 0.1
##$AZFW= 0.1
##$BCFW= 0
##$BC_mod= 2
##$BYTORDP= 0
##$COROFFS= 0
##$CY= -3
##$DATMOD= 1
##$DC= 0
##$DFILT= <>
##$DTYPP= 0
##$F1P= 0
##$F2P= 0
##$FCOR= 1
##$FTSIZE= 16384
##$FT_mod= 6
##$GAMMA= 0
##$GB= 0
##$INTBC= 1
##$INTSCL= 3.70164e-10
##$ISEN= 128
##$LB= 0.24
##$LEV0= 0
##$LPBIN= 0
##$MAXI= 10000
##$MC2= 0
##$MEAN= 0
##$ME_mod= 0
##$MI= 1.114404
##$NCOEF= 0
##$NC_proc= -7
##$NLEV= 6
##$NOISF1= 3.799351
##$NOISF2= 2.8
##$NSP= 0
##$NTH_PI= 0
##$NZP= 0
##$OFFSET= 21.01936
##$PC= 1
##$PHC0= -26501.59
##$PHC1= 13.98743
##$PH_mod= 1
##$PKNL= yes
##$PPARMOD= 0
##$PSCAL= 0
##$PSIGN= 0
##$REVERSE= no
##$SF= 200.130001874432
##$SI= 16384
##$SIGF1= 3
##$SIGF2= 2
##$SINO= 5.538805
##$SIOLD= 16384
##$SREGLST= <1H.CDCl3>
##$SSB= 0
##$STSI= 16384
##$STSR= 0
##$SW_p= 4816.95568400771
##$SYMM= 0
##$S_DEV= 0
##$TDeff= 16384
##$TDoff= 0
##$TI= <>
##$TILT= no
##$TM1= 0
##$TM2= 0
##$TOPLEV= 0
##$USERP1= <user>
##$USERP2= <user>
##$USERP3= <user>
##$USERP4= <user>
##$USERP5= <user>
##$WDW= 1
##$XDIM= 16384
##$YMAX_p= 370568641
##$YMIN_p= -269411
$$ End of Bruker specific parameters
$$ ---------------------------------
##NTUPLES= NMR SPECTRUM
##VAR_NAME=  FREQUENCY,     SPECTRUM/REAL,   SPECTRUM/IMAG
##SYMBOL=    X,             R,               I
##VAR_TYPE=  INDEPENDENT,   DEPENDENT,       DEPENDENT
##VAR_FORM=  AFFN,          ASDF,            ASDF
##VAR_DIM=   16384,         16384,           16384
##UNITS=     HZ,            ARBITRARY UNITS, ARBITRARY UNITS
##FACTOR=    0.29402158847633, 1,            1
##FIRST=     4206.60447387049, 0,            0
##LAST=      -610.35121013722, 0,            0
##MIN=       -610.35121013722, -269411,      0
##MAX=       4206.60447387049, 370568641,    0
$$ Real data points
##PAGE= N=1
##DATA TABLE= (X++(R..R)), XYDATA
$$ [...]
8818 -4689 -85166 -28256 -57027 -913 -54516 -42167 -150636 -214296 -60937 -116877 -49662 -60730
8806 -60730 -104984 -39269 20833 -83290 -115341 -700 49200 -103674 -58844 33280 12578
8795 12578 80862 146794 79371 104876 -23507 17089 74642 35951 -4932 105973 -23551
8784 -23551 -124272 -78641 13011 41473 -28344 -97342 -18451 12559 -69599 -108256 6481
8773 6481 -27673 -74876 8758 -51007 -97339 -113591 -82391 -105075 22963 -36924 -51901 -9301
8761 -9301 -136355 -115775 -47232 16254 -18417 71693 -10567 -57199 -45589 -343 -23047 -11120
8749 -11120 -50322 10010 40170 -32579 -14759 -105374 -24798 -114098 -54271 41845 16408 -33604
8737 -33604 -38543 3990 17189 28076 -10596 77883 29029 -17920 -35321 31475 9975 71330
8725 71330 83632 2881 -49342 -63502 -26240 10780 -90144 -69251 -4432 3429 -44483 -44600
8713 -44600 20405 -17334 -30696 -23554 6006 -92069 -33886 -31835 -78071 -80341 -165213 -236220
8701 -236220 -101249 -97148 -56741 1048 40244 30919 10028 -91623 -57359 -38961 -4912 -5803
8689 -5803 -52820 8863 79590 36601 10965 18291 -100202 -57344 22105 -21004 -39853 -97981
8677 -97981 31623 5791 -36722 31529 -36928 -67369 -38237 1899 8759 -18618 -52136 -74535
8665 -74535 -39454 -15440 -27538 20093 63837 33876 -27342 15078 21329 -13110 3945 32405
8653 32405 -60841 -72377 8724 -81276 -23651 59925 -8417 -11325 29542 44576 80546 23972
8641 23972 36528 -2405 -82210 -117260 -66494 -57499 11531 54142 14616 -45795 -84903 -20350
8629 -20350 1991 -59938 -61621 8448 61440 36457 20121 11548 -74028 -102232 -97009 -111406
8617 -111406 -165532 -32416 -8371 -132130 -65838 -108172 -106059 -49975 -34732 -101202 -21481
8606 -21481 -1869 35522 -24511 -43281 10268 -58463 -3305 -54280 -20001 -50689 -21872 27649
8594 27649 -46660 -59805 -35683 -19633 -161281 -135086 -121514 -148072 -70682 -39839 -42640 908
8582 908 -40534 -72941 -92523 7590 18682 -65916 -40801 34176 125434 36165 84715 59996
8570 59996 33307 126938 94960 18975 57244 -30011 -2866 38976 88773 74359 37591 -9036
8558 -9036 -58821 -66289 -51968 -90573 29744 83876 76015 21851 7120 -79094 -43244 -78123
8546 -78123 -70838 -77289 -66346 -109984 -17376 -46774 -2329 3183 -96072 -115358 -84524 -14715
8534 -14715 27124 -42612 -30982 20581 29851 -49947 -191764 -72187 -16891 15548 71666 36091
8522 36091 -101843 -188622 -77254 513 37862 16358 -53012 -38732 9872 -158038 -62255
8511 -62255 33658 -31269 -68534 -83915 -59812 12935 4094 -93250 -124957 -87076 -41985 -66325
8499 -66325 -8839 -28534 -29075 -46390 -110948 -46248 -53341 -89837 -178508 -251064 -227291 -175173
8487 -175173 -162013 -206092 -206592 -194349 365850 259780 93557 -22075 116338 11942 14047
8476 14047 -9238 9909 -6337 -66809 -67542 -65275 -101187 -25874 96769 110678 67696 35393
8464 35393 -52005 -106331 -94462 -66842 65173 18769 -2933 27391 -25577 -61001 24873 9956
8452 9956 -87054 -58776 -4899 -24662 -68811 -56516 67680 50564 -203 -39437 -47971 -8827
8440 -8827 -29406 -37819 -110149 -148820 -48979 -35747 -16086 49358 23865 -35320 37229 92377
8428 92377 67466 -90303 -104340 -57256 -53024 -100489 -68798 41665 69695 27456 -88731
8417 -88731 -122999 -38139 -44218 -102835 -25732 -6357 -83245 42576 -93147 -172427 -44057
8406 -44057 -39886 -94026 -36018 -136761 -147088 21509 864 3780 33303 -10554 -333 -67835
8394 -67835 30219 40863 30238 -9729 -82048 -16914 -113468 -131143 -40505 -12001 -53626 -30416
8382 -30416 -52606 -887 -26129 -41129 54888 442 36946 75603 48653 -17138 14808 -13853
8370 -13853 -60877 -102400 -12186 -125793 -91377 -22769 42735 -46593 -157603 -45442 25846
8359 25846 -20448 -141119 -22026 15719 6372 -17018 -43634 -143113 -43877 36017 -9438 -18091
8347 -18091 -52796 -50873 -72813 -21815 -35416 -26698 -848 26545 84221 6656 232 -42936
8335 -42936 -38147 40968 3126 -35244 -123089 -121302 296 74954 60778 -3510 -22490 9220
8323 9220 14602 46196 91481 -28775 23616 -38432 -55051 -87247 -115131 -45443 13804 -15617
8311 -15617 -14729 -26662 -38905 -36234 -52804 -13362 -11166 -18822 -68212 43043 74033 37686 12254
8298 12254 -38636 -26219 -66958 -97788 -121435 -94745 61856 76664 -9096 -51490 -16942 -61541
8286 -61541 -68604 -83616 -70114 52915 34808 -84276 -87191 8409 -47266 6337 28698 39884
8274 39884 69674 29467 -65681 -134174 -87893 26962 25153 -28607 -84642 -3114 -14389 -23373
8262 -23373 37241 -10670 -7617 -18956 -23141 23260 -26492 -51500 -41469 37518 99391 67648
8250 67648 26086 -6564 -21570 -54072 -49664 -30981 39679 -19896 15137 -32906 -53222 -76018
8238 -76018 -94249 -43870 56073 90550 66412 -48965 -21402 28552 23471 124271 -42177
8227 -42177 19699 -15897 11673 27532 -61047 -246 -67949 107213 140657 13594 -63313
8216 -63313 -154074 -185948 -132588 -114586 -113579 -49733 -148091 -156825 -132397 -53921 -37115 27300
8204 27300 34521 -28407 -22879 -122023 -74922 -34722 -58284 -85905 -153295 -86066 -85947 -248618
8192 -248618 511221 535211 230201 85187 -108690 34400 -76195 59227 -70214 -28071
8182 -28071 -74593 35475 -21358 69897 120858 -76897 -49429 -58209 21479 -14573 42610 -4218
8170 -4218 -21845 77521 3651 42867 76552 -1794 2236 -75036 -46479 -49294 -9688 35815
8158 35815 69916 67605 62441 -30063 -16973 -22858 -31980 -53979 -58953 22525 56997 82338 52974
8145 52974 3414 -23132 -112597 -11193 7519 -29933 -1262 -37209 -30071 -11314 -52559 -53728
8133 -53728 -77110 -83531 14768 -21744 75091 26584 26984 -36789 -18791 -17483 -114227 -4111
8121 -4111 75598 -23492 -113845 -24579 -9977 -46643 -52353 -46528 -41868 3741 102194 207721
8109 207721 30655 -74231 8406 -64097 -73295 -9321 -36297 -67203 -78221 -104330 -40601
8098 -40601 -75941 -64177 -25774 -76341 -160123 -82462 -100359 -95158 -59116 -71759 -76426 -49857
8086 -49857 -41040 -93095 -28153 35837 -77156 -36993 -27675 -266 1347 -35875 26917 -86149
8074 -86149 -92662 -45590 -4268 12549 13259 44603 -5082 5386 -119 -58447 -137692 -152821 -79875
8061 -79875 -104498 58371 76969 -28231 891 8317 -27538 -94246 -87250 -52159 35113 52880
8049 52880 101050 17777 13406 -14592 -101960 -48396 -54775 -51585 74068 40992 -52195 -18010
8037 -18010 -90623 -79530 -8328 -41956 -46705 15254 -78499 -36961 -17779 9502 -9221 3315
8025 3315 -15735 57157 -22759 7427 -104681 -100396 -39536 -62583 -97972 -150154 -54167 -54513
8013 -54513 -128524 -188763 -111527 -4501 -20070 40911 24954 -33554 12421 -12072 38276 25419
8001 25419 -11936 30307 30790 -114491 -135437 -160772 -66076 -126459 -81992 -51812 -38302 -59684
7989 -59684 -47802 -41471 -40138 47970 12944 -44630 -60742 -83063 -107881 -80324 -64811 -71718
7977 -71718 5477 -45931 -23716 33234 -28876 -19157 -132811 -134346 -21860 -15630 44290 103256
7965 103256 64581 923 26220 -15393 -38295 -20915 16389 51184 -20060 -41815 -52457 -44678
7953 -44678 -68607 10011 50116 57180 -66300 -53899 -94552 -83801 -125575 -21468 21861 24507
7941 24507 -19354 -35860 212 -48529 -29682 -26583 -76987 -188148 -118181 -28249 -63096 -62050
7929 -62050 -102202 -64452 -63028 -123687 -138859 -111571 -64645 -65266 21236 -48521 -30517 38168
7917 38168 -51797 -135732 -72223 -68050 -18655 -77311 -42174 -47811 -82062 -112546 -98403 -177828
7905 -177828 -70880 -16654 99540 62341 642463 460277 -67016 58595 -67117 -67552 -142459
7894 -142459 -53668 -21593 -2605 -9044 69260 12260 -71654 -87857 -4021 35146 -5715 -203054
7882 -203054 -95717 -10701 -46116 68351 108773 -73230 -104107 -55856 -68827 20233 -51589
7871 -51589 17495 15538 17680 -57631 -171696 -84501 -16319 -69573 -32245 3093 -20715 -43429
7859 -43429 -3802 61685 69957 4913 52255 -40991 -80398 -55872 -8344 -7357 -62628 -13899
7847 -13899 -45646 -32940 -87647 -17425 -76805 -50219 -60868 -89201 -119875 -66190 -47247 11647
7835 11647 30213 -80923 -58971 -8406 7401 -73500 -20843 14721 -29008 -5208 10256 25551
7823 25551 88668 -32093 -6989 78424 -38747 -64771 -58019 39119 -26250 -120009 -60563 33659
7811 33659 12635 -76464 -149928 -88743 -85894 43137 -93269 -108738 -91258 -116178 -149338 -104409
7799 -104409 -9088 -66015 -99724 -22653 -61128 -93582 36625 8999 -14724 -25210 319
7788 319 -23515 9648 -83527 16364 32769 -49562 -19891 7645 30774 -50040 59360 44635
7776 44635 -28849 86338 31025 21252 36550 -11501 -15030 -72496 -99447 -21160 -37852 -136672
7764 -136672 -69002 -58440 6176 -5714 -19119 -70709 -111392 -90555 -64450 9237 -24616 -49280
7752 -49280 -53666 82703 -784 -126127 -71127 13679 7047 -89609 -58253 -31072 29769 -61946
7740 -61946 -79314 -11290 2507 72428 15392 95352 55436 88939 -57175 -47126 -87508 -19375
7728 -19375 -37585 -61147 -13065 -24171 -30769 37785 43914 -91334 -44447 -49165 -77305 -132317
7716 -132317 -162713 46458 51784 12484 66180 37709 44092 -12130 -41267 71717 8150 3201
7704 3201 30705 -17649 -7382 70058 127792 96933 89686 96396 143852 77952 42548 46449 115021
7691 115021 65354 -6594 -73351 -36846 61945 102031 -34385 -9575 111117 212071 -5583
7680 -5583 -70372 -107193 -123977 -95632 -16782 62 41043 29045 -96932 -83961 -88917 -41673
7668 -41673 82071 43737 -27525 -66718 -53253 27617 -56175 -1316 -51125 -57390 -90554 -154156
7656 -154156 -117492 -135069 -117483 -90728 -180225 -131670 -178957 -133170 -100426 -72681 -106699 -135269
7644 -135269 -156301 -110284 -56191 47882 58963 -13503 -135704 -65291 -25012 -57010 -18891
7633 -18891 2134 -66394 -78075 -38471 37795 32343 -7137 5060 -12530 27424 17340 30932
7621 30932 30928 45728 2914 -16403 -42894 -82121 19525 4666 -36527 36841 -7179 7978
7609 7978 -5293 -44663 26516 -66396 -105504 -127970 -27460 74849 27014 17778 -94022 -106252
7597 -106252 -129064 34617 -5270 -5378 -128635 -98834 -66632 -86383 -136544 -108003 -112650 -26767
7585 -26767 -62528 -163959 -173772 -100491 -123988 -90380 -114855 1183 -71016 -94183 -23527 40398
7573 40398 6192 -30674 2812 6224 -136260 -111754 -47931 -113028 -101536 -73182 -47558 -162743
7561 -162743 -94714 -49237 -40144 -58207 3624 15732 -21144 -65808 -43310 23733 29543 24389
7549 24389 25024 -3011 68050 62894 87461 43828 3791 -3505 -44825 -45582 -71111 -83713 -58010
7536 -58010 -80060 -41726 -49970 12286 63222 59237 -4784 -14477 -30444 -54021 -114279 -120559 -52532
7523 -52532 -13247 -66569 -20431 26636 12288 -96247 -40678 -7008 -1283 -25486 -115958 -51747
7511 -51747 -12973 -60231 -40647 25583 -6044 -62634 -91004 -61137 -108679 -100288 -46653 -87944
7499 -87944 -70859 -87325 -44634 -101108 -72710 -54749 93128 -3775 -64282 -21732 25544 -63517
7487 -63517 -46199 -26497 -28342 -76100 -63521 -74763 -79595 -48982 -357 -33868 -25503 16138
7475 16138 -103638 60524 4763 121633 24865 -13677 -43918 -38792 -88677 -31673 -52006
7464 -52006 48226 84959 -40266 -38463 -9100 -37460 -21795 42732 -2269 25149 -3394 -73399
7452 -73399 -25347 -19650 -32738 -15045 -28495 58515 -11313 -14733 -12406 -111962 -143246 -1593
7440 -1593 -72886 19687 -65486 -162517 28075 -44439 -161315 -118945 -72817 53013 23877
7429 23877 -41158 -34245 79986 44860 -14497 -11653 -41692 -25122 3525 -107471 -159022 -123753
7417 -123753 -70389 -7563 85338 20391 -16505 21152 77960 25055 -73602 62927 135383
7406 135383 113731 57924 -28245 -89559 -14919 27553 86045 -36521 1191 -22061 97597
7395 97597 81290 108851 -3536 57967 91017 61978 97270 29211 -94345 -79562 -89110 -122821
7383 -122821 -7864 -136567 -141505 -61442 -43917 17459 -103027 -84500 576 -62131 -103188
7372 -103188 -107933 -62631 -5580 -11393 35525 74654 30326 7942 -8316 76933 89426 -13944
7360 -13944 42506 100877 132499 92349 10055 -8284 68005 122468 99758 64862 70516 86585
7348 86585 48839 58127 43103 44966 4972 48142 -35783 -95532 -1492 21237 28868 70059
7336 70059 186074 38977 -19933 -537 -25349 32368 -19160 7541 67600 -39122 11413
7325 11413 54527 52966 -11192 -17078 31215 -56082 -98819 -26436 -21142 -3455 43927 88934
7313 88934 -21316 -121729 -102281 -37019 -3362 -113816 -44728 -8348 -25713 -21913 32363
7302 32363 35894 70721 139590 113810 61919 87176 20372 45350 153757 51668 65334 50559
7290 50559 -20694 -14097 -58329 -54267 -44794 -90092 -52080 4271 -41549 -13505 77840 174914
7278 174914 91931 -106035 -54808 77856 -69483 -83994 -119273 -177245 -134397 -23198 -50205
7267 -50205 2688 6187 68425 -72451 -35540 -29620 14119 25659 41617 -16824 -71546 43820
7255 43820 71508 37180 54689 -19682 -3749 91058 45721 29760 32092 73168 -56979 -94254
7243 -94254 -26171 72777 13841 -22320 50611 41282 27389 49304 -2579 -82339 -52597 -95764
7231 -95764 -3303 -39083 -55333 32254 133 -76563 -24230 94114 19325 61523 10620 7352
7219 7352 9255 -34460 -37487 36597 79149 152807 49304 111471 59607 42567 19657 27084
7207 27084 -53888 10162 77222 149507 107531 -102508 -4738 66381 83998 74758 93339 133353
7195 133353 66368 -31231 52847 64992 40714 24767 106303 96525 100669 88736 68214 -19422
7183 -19422 -34527 -87617 17759 -7408 -40980 -123738 22137 43416 -83480 -12415 76489
7172 76489 113045 24032 -3788 117888 50898 39474 107343 122973 58883 -45332 20873
7161 20873 -3596 83600 77049 135692 26813 -33486 -97785 42273 -13401 29662 124385 87852
7149 87852 70997 79045 95979 193225 85228 47184 55472 67103 -32143 103294 103440 32256
7137 32256 127422 36431 122597 162504 168716 117404 123321 142849 179193 250886 247022 266998
7125 266998 187796 101948 230774 253882 318978 328668 184455 165138 239848 224816 244656
7114 244656 254716 314936 278698 262227 273549 206568 184650 166311 209100 176322 219253 239513
7102 239513 239901 284338 310507 234698 273431 243630 275632 326753 273554 325487 322576 326771
7090 326771 387019 325094 365196 459169 383559 342698 380660 343110 383424 418989 383781 489390
7078 489390 454783 472484 549660 539893 568276 589117 576560 698629 864177 911657 836067
7067 836067 906443 979236 1054310 1126505 1205712 1330998 1375548 1387437 1578839 1536108 1664804
7056 1664804 1869706 1841552 1962835 2223856 2557338 2771161 2967224 3284097 3632960 4086937
7046 4086937 4736065 5336972 6025612 7205773 8881196 10289979 9631183 8069550 6743597
7037 6743597 5607387 4747048 4068726 3456764 3160803 2915567 2638031 2458914 2275976
7028 2275976 2081611 1954232 1751829 1577977 1510073 1283253 1237062 1211699 1142760 1057391
7018 1057391 1111552 1070214 975232 904555 856505 860253 831531 766419 720744 634011 602254 563021
7006 563021 565036 567275 566718 559099 487979 329656 362062 401498 454433 506443 556857 392205
6994 392205 354090 318782 289528 323318 277328 244050 261282 265244 299641 291154 323426 300396
6982 300396 275942 229225 161547 219101 176644 273587 235066 312330 283756 242854 255818 176224
6970 176224 177389 269806 251269 255533 293992 189558 127096 140411 88727 87178 156636 145163
6958 145163 96755 166210 153120 194715 263203 186979 176992 215299 148220 104937 111757 150259
6946 150259 164308 100289 189105 189845 104336 127778 114454 67595 80738 89926 63118 111385
6934 111385 172937 34631 117148 182879 80690 155287 79125 181335 213025 181096 203675
6923 203675 175966 189494 119945 99797 132234 123864 125965 223355 264770 275438 125367 136722
6911 136722 220377 199247 232613 98919 18977 10675 80870 118949 130892 54198 73411 35500
6899 35500 -3851 52619 112337 56639 20449 54597 41374 93791 123047 119863 113388 142244
6887 142244 155743 76299 71536 80299 18222 -15839 33005 -34050 -17552 7539 91644 92766
6875 92766 85283 173521 34829 -17223 -16914 -200 -20119 14601 -41025 -27107 -6796 -4017
6863 -4017 -22557 -14778 -22536 -139740 -75947 -22592 -22950 13721 -47137 -36277 606 32498 66065
6850 66065 82712 -18596 50952 -2127 18238 7440 75888 -18539 -12081 -160252 -111964 -95748
6838 -95748 -56203 87757 19968 -21086 20035 31060 121823 58719 -79249 -46084 -82797
6827 -82797 15140 33198 -55671 -109327 -88122 35087 -699 -62640 82663 27718 12941
6816 12941 -1419 61804 -20416 1198 -19194 27399 3504 22462 117753 116100 57850 43861
6804 43861 -114747 -99149 45543 -32917 -39539 -50054 -9269 -32691 -50539 31221 -44442 -88494
6792 -88494 10880 10918 98468 52087 14568 54666 8573 -45570 29869 -43149 -31309 8385
6780 8385 44944 84849 12959 -16673 -56936 -55056 -67563 -23097 12970 -52026 -4143 -44307
6768 -44307 18041 109879 21186 1240 -91820 -8874 28631 76694 13987 -48395 2091 115578
6756 115578 124938 91452 36891 17362 -3776 -20749 -33686 -978 14412 38829 -11535 -1352
6744 -1352 -13402 -16795 17742 45868 18008 -72901 15747 92862 -44592 -87434 -53654 -28255
6732 -28255 -61495 -643 13526 114746 44625 146129 112425 -1671 -18552 -64396 -60882
6721 -60882 -13963 82851 2125 59031 103796 7042 52657 35353 58826 13575 50719 46663
6709 46663 9627 -21681 20337 67132 20267 44305 -10744 44977 21448 7081 -9770 26034
6697 26034 35399 104166 22125 -67953 -9229 41600 -86730 -13591 5227 34326 -17728 -69454
6685 -69454 -38827 0 -8318 61353 -78095 515 53719 97194 6484 28159 36078 35940
6673 35940 102101 -42586 -4552 -46536 28833 38686 -55549 -14274 13208 -460 -66839 -121475
6661 -121475 -100084 -18169 -48108 12403 64334 40815 -62466 6536 109054 79944 25321
6650 25321 -133625 -143250 -71973 -14576 -50436 14871 -40361 -35321 -31415 -11341 160122 108828
6638 108828 -9426 -7851 29519 96887 126828 37427 -46246 -63333 12262 45643 36620 79423
6626 79423 127139 79133 87422 29975 -2991 6072 2318 -29352 34739 75549 54038 -63336
6614 -63336 -127142 -48465 -23893 -7517 12595 71495 -5750 87195 36738 70418 69498 71562
6602 71562 30164 20011 -15416 89138 106146 -55737 21472 9653 -14953 131918 102759
6591 102759 4933 2084 -5941 9141 -41380 -126367 -62225 -97394 -55379 -8318 162532 89947
6579 89947 44941 103293 82916 62378 -61684 -98986 -29394 43931 -11762 9214 25916 -43764
6567 -43764 -16555 -7458 -85930 -20863 2847 -56096 -51037 -33488 54403 155034 137944 122389
6555 122389 155020 147328 40135 -47297 -72597 -25664 -47290 -16468 -48462 -4443 -91860 -13940
6543 -13940 -3211 -59365 -11881 -68542 15005 111763 136925 6346 -56322 98540 64513
6532 64513 19543 -61974 21841 8633 4150 -91366 -107874 -14616 31763 88907 60582 -29964
6520 -29964 9359 45875 59572 66682 35365 44995 69250 102683 58834 38168 23609 113068
6508 113068 143257 160715 205744 95988 102381 48678 -111665 32492 129962 38058 132269
6497 132269 109947 97256 87445 123667 56343 86437 61640 -54255 -13340 -390 128128
6486 128128 127828 79418 49594 -21405 19245 74988 -15308 72975 59002 20454 2051 89389
6474 89389 63909 -8240 -107167 -113074 -32850 63732 -56791 -44322 448 -55675 33488 70832
6462 70832 38801 50645 32977 5972 -100336 -41429 -18473 -4984 6316 51254 32378 -5285
6450 -5285 9023 53689 62834 -13724 12242 48240 -66475 -10004 46498 82268 -11806 27097
6438 27097 88831 123051 87866 77607 123555 24616 9108 36446 -1994 -70707 -62986 -36011
6426 -36011 -17681 -67649 -167941 -147789 -140979 -132931 -111192 -51618 -40203 33640 39407 11354
6414 11354 -29590 -54833 -108904 -75430 35805 37080 58420 -32587 -69311 -112019 -5302 17524
6402 17524 78279 -13296 -11510 35100 -12263 -41297 -55188 -178738 -127388 -69834 33439 -41466
6390 -41466 -27814 -3703 -90907 -103038 75396 -8799 -25392 -3160 -24796 -36089 -136 7617
6378 7617 -37291 39163 -1173 -56334 3716 40096 -32899 -96052 31370 86833 78856 44606
6366 44606 62672 51506 -107486 -119200 -26557 75393 85391 84751 42313 74910 19030 -44836
6354 -44836 26632 -38869 -20796 -4964 -39567 -77103 -51115 -39426 11158 -27175 50944 144928
6342 144928 127807 140573 38812 65815 102714 137943 98122 61908 95918 100006 155400 150731
6330 150731 109171 37319 64078 145240 77824 138539 58191 11844 89424 206390 108170
6319 108170 69540 160033 151819 55538 84765 92671 140123 152424 243457 266125 220216 247962
6307 247962 302275 310708 251054 177656 255347 318173 185951 153718 159927 126574 222277 183149
6295 183149 139122 203578 60652 53501 -10375 22866 94980 74518 60501 55407 82735 78198
6283 78198 54480 133133 135671 104174 167691 127362 80474 89705 44401 -20230 38413 130820
6271 130820 124131 23465 -5238 -7446 61637 -1732 -42286 -39697 -60017 -93243 -24051 57874
6259 57874 102690 101584 112673 -31 4803 148558 76796 39203 54729 58118 65339 45668
6247 45668 32852 16323 112945 163755 11159 36126 65634 45189 -32607 -18027 -60566 -73484
6235 -73484 -2501 -10809 42247 18054 -52170 78621 52490 10685 -68079 -23329 -399 -40411
6223 -40411 -101490 9599 40957 -1343 -17839 -83909 -4305 149613 78705 57244 76192
6212 76192 43296 67874 29567 15347 31643 695 -48951 122848 15620 40889 95379
6201 95379 36999 79339 65236 61704 133498 113072 41626 -40851 -10473 -16182 62267 106070
6189 106070 27825 44884 -7799 -65240 42059 31253 -39624 58379 27436 128984 137893
6178 137893 168723 123089 173678 100630 157633 274333 128947 181243 93903 196181 174894
6167 174894 187776 166859 238413 287391 352985 371124 432521 445706 487800 471009 543672 598987
6155 598987 634984 606635 781210 814457 763182 824307 777553 806818 839845 850978 734638
6144 734638 653612 570704 512174 410799 448298 441574 321040 230728 293518 380550 225038
6133 225038 203930 263307 195140 215586 187857 213144 168559 199615 208242 196358 136522 186795
6121 186795 112665 97418 147057 168866 129587 124065 92117 131230 201693 200274 157464 134771
6109 134771 169015 216555 183705 243858 333378 294524 217883 274066 258779 230009 397859
6098 397859 290968 286275 424116 440218 499386 649728 633338 617547 776848 868485 988734
6087 988734 1083565 1130123 1320116 1577770 1607838 1579064 1563330 1482408 1508282 1557805 1515964
6076 1515964 1526097 1364891 1246123 1180957 1067651 1085127 900695 695236 582030 507387
6066 507387 570094 519664 423439 440356 327011 331548 437250 415792 314349 228951 187393
6055 187393 103745 156239 260179 204558 142706 112802 113822 152069 221969 183560 145069 190539
6043 190539 135967 56704 87091 164954 117874 39081 -70346 46725 136776 98003 159569
6032 159569 205148 71374 55257 -5327 63948 93689 102233 16279 55656 32064 -60816 68651
6020 68651 -47083 5157 -26552 -5155 93841 65370 50775 102780 190316 172796 74709 75983
6008 75983 95488 21566 -17844 102918 90373 104524 76977 6731 -5857 -6826 57866 95903
5996 95903 60259 114522 15368 41239 86367 97828 107603 107624 135285 66788 58256 -8110 -2425
5983 -2425 115466 79731 69735 93749 11280 56495 37134 -11189 79993 14663 57327 74790
5971 74790 114095 53774 -10304 71546 63921 73835 8697 -6706 107743 27254 -3185 77373
5959 77373 20762 22729 -35044 -20872 105893 90387 136368 100644 129458 176963 150178 184777
5947 184777 228997 212630 121377 133111 71515 116116 233215 264591 193831 156226 189663
5936 189663 204331 231955 205070 166529 116020 144863 217451 160035 257591 215633 231600 249577
5924 249577 187086 251225 124620 107143 139632 163127 131651 167796 144641 97247 148201
5913 148201 247109 157097 143024 131014 171269 157489 84367 139104 174836 111434 37247 122402
5901 122402 136876 140247 176538 86817 52753 116606 58098 149189 207637 180415 82747 106375
5889 106375 64183 128336 47894 -35551 -11177 64650 114483 123889 133553 71372 49289 155326
5877 155326 267941 145651 86826 161645 130207 150336 125970 142205 238898 131134 120277
5866 120277 111739 178172 246363 283479 248818 239112 345963 435702 456423 415135 486685 426454
5854 426454 464429 544941 665585 753932 896159 1020006 1071974 1094957 1044720 1077952 1030565
5843 1030565 1017039 930588 933608 835056 884710 856277 785897 815149 727799 705102 830302
5832 830302 851979 937912 990337 943358 1008632 1079141 1232545 1289819 1471548 1544601 1672414
5821 1672414 1723806 1846085 1812919 1827237 1853125 1790520 1610147 1478585 1389158 1196084 1083225
5810 1083225 980702 976585 825048 722078 701631 698108 551058 647453 637605 520907 540945
5799 540945 502143 492729 523057 507388 360161 340295 416012 483838 411794 344996 326750 310796
5787 310796 348991 349614 281752 247865 162505 245765 293906 203756 88493 38071 188794 204991
5775 204991 189862 214824 104192 160826 167422 129174 145691 196494 219393 151985 172731 105635
5763 105635 127558 132854 129277 76180 111463 136147 71260 72605 883 34639 85447 1868
5751 1868 86061 51567 48081 -29986 -70519 44326 2049 14101 -3603 60003 86395 32627
5739 32627 77586 21975 36021 -21357 31594 60382 -10774 70301 39922 27631 -18594 -17391
5727 -17391 -62712 -101497 -75837 -27429 43399 -2530 -22289 -6719 77621 65479 30591 -9747
5715 -9747 -13667 -20294 7078 -26563 -5306 -3067 -88974 -90449 -93255 -67249 -4458 66673 60915
5702 60915 99947 -35779 -26706 48119 34466 30071 27258 -9310 -77090 -83238 43879 57831
5690 57831 47046 43726 -283 38385 84936 49934 -5781 -56320 -108601 -18899 -22327 -74477
5678 -74477 -2350 52721 -12963 1982 33812 95335 95328 56802 3497 -56326 -101836 -77207 -53559
5665 -53559 -74167 -96709 -14243 7939 -1034 -25047 -11969 -13443 -34734 -4767 -85049 -18983
5653 -18983 -25144 -78075 13554 -47457 -66333 -51190 4197 30991 -14584 48 48724 -22657
5641 -22657 14327 19540 -108175 -76987 -24969 62352 20870 7534 -63368 -45142 -32210 -13507
5629 -13507 -27587 -11578 82350 -2623 -68822 -107519 -70104 16980 564 -17702 -99145 -37296
5617 -37296 25779 -51214 -40001 -56628 -103586 -93834 -15128 -7110 29753 52274 87222 -1286
5605 -1286 -21193 -15300 22709 -29593 -71879 -33915 -53419 2138 54659 -90427 32516 -25566
5593 -25566 -99545 14370 79229 29298 -99951 -18031 -15053 11053 -119448 -156800 -121684
5582 -121684 -81793 -46426 -21314 -22130 -35498 11427 33625 7608 28205 5034 -66530 -121616
5570 -121616 -32247 -51389 -21620 -5626 -82554 -67586 7710 46788 109389 101233 2024 -16454
5558 -16454 24450 5214 -64343 -127912 -70073 -21994 52971 132619 89171 49658 48480 -71565
5546 -71565 -81017 -128572 -104972 31922 97852 82835 68209 -15836 30888 45365 93913 68724
5534 68724 78053 100399 67055 -27991 -36845 -30404 -10177 30282 20011 -15107 -67199 -35628
5522 -35628 -70365 44426 -27656 17034 -9262 -43613 -63033 -12055 10231 -22009 -69624 -44139
5510 -44139 -14176 -28893 -60484 -3741 20173 -38234 67201 2322 31663 -34486 -84921 -109720
5498 -109720 -66758 -54167 -29189 39950 54180 -17913 7667 -20156 -112744 -40983 27587 131211
5486 131211 -33357 -48074 -62670 -14902 -16539 47295 33242 -67027 -107094 -18051 39792
5475 39792 94629 59648 4297 17520 14977 13159 18720 47764 -1156 -35742 -100150 -55968
5463 -55968 49913 -7338 -59927 8802 -46414 6650 -29036 18697 77852 72610 75487 15759
5451 15759 -102880 -4178 42258 20824 -74465 -84247 20828 83981 -7125 -34869 3016 37929
5439 37929 180560 -36409 -112364 -90531 -81581 -24909 -36204 -64531 -4338 -54934 81812
5428 81812 8331 -134 74123 57258 106477 182445 26654 -26834 -66322 -233 -143601 -154465
5416 -154465 -105170 -63716 -46676 -109913 -90011 -39302 -25295 40809 -27214 -44627 8821 -8372
5404 -8372 16147 -17879 -56664 -56174 -67070 -89630 31096 -84190 -118012 -60101 7948 39685
5392 39685 23911 -31708 6665 -6578 -77755 -111341 -10670 76880 -26686 -99239 -12789
5381 -12789 17844 -30 -54982 -72784 -9415 61232 -12220 24800 -118485 12265 -15123
5370 -15123 -41664 20104 -50354 -8167 -32167 -45406 -73047 -150529 -62926 -41408 -64923 -45637
5358 -45637 1867 32912 24213 22078 28093 25167 -19467 39137 27250 33437 65857 -8535 -59093
5345 -59093 -15130 10685 -2536 -9734 5660 82971 91371 70341 -19912 -22811 97455 57365
5333 57365 53713 105007 42031 2167 10365 -34308 39925 89371 109393 171991 40147 24247
5321 24247 -35757 -61768 -26833 -39623 -88323 -58286 34906 36526 -6098 22572 73844 122092
5309 122092 67248 8007 5628 -17283 -76635 -42169 16267 -19196 30700 -18366 -61162 114463
5297 114463 64535 5367 77758 136398 136949 56729 37119 -87302 11450 19725 82477 22852
5285 22852 25874 95182 -50478 -10784 4070 18247 -17030 -111450 -95617 2904 -17658 -25656
5273 -25656 -19681 -11045 60711 93754 71557 -55883 51644 16499 94224 111471 6890 34376
5261 34376 147656 98956 70406 49278 15723 35128 41209 27663 78189 62754 19424 -57350
5249 -57350 -103370 -9045 42894 44984 28540 59429 16756 69699 47838 60567 63630 43316
5237 43316 -65394 -46165 -45718 -39305 -20753 -50609 4296 31875 22746 -10009 31739 -2103
5225 -2103 26543 -61832 37313 84809 -22799 -60413 -22304 -39214 -53074 -19567 -57619 -3655
5213 -3655 77343 49913 44419 -33002 23927 119623 38620 35654 -31736 -28669 -74584 -84300 -190177
5200 -190177 -58021 -39545 -1867 -23 -31764 -36372 39900 37580 -8135 -324 -28970 -13842
5188 -13842 -26050 29253 -8642 -38244 47236 -10818 -187 29148 -80641 -57982 -5414 39857
5176 39857 64816 44843 -84927 10945 79598 145662 158028 8818 -57420 100221 58532
5165 58532 124223 213891 156596 69382 36937 76684 40493 4214 78886 40001 49829 85128
5153 85128 30930 10856 7810 335 41585 88387 7154 -44832 -106406 -56079 -121684 -56978
5141 -56978 14384 -659 66331 100862 71876 89368 134969 106015 -37267 2068 94346 95335
5129 95335 59206 86892 41973 47692 12163 -10531 148529 71356 83239 27139 63527 55533
5117 55533 -1211 -34200 -21976 7703 23154 16070 77016 57359 105231 159291 26050 21754
5105 21754 -80922 -30153 40300 44251 73807 989 -39919 -46602 -36177 -29045 116346 103047
5093 103047 97644 145501 180835 162130 281030 173624 94149 119047 124559 181075 116466 119274
5081 119274 54958 96427 108213 173277 124614 154448 208554 179857 82967 96589 71152 124268
5069 124268 136009 137314 162278 177011 192071 164320 196580 258965 214693 53448 99015 160417
5057 160417 120821 61914 3077 24720 52510 107325 141229 215552 114041 83450 60029
5046 60029 84599 65520 22740 143680 158465 178000 143749 99103 170696 79389 43905 -44865
5034 -44865 56828 14041 -37441 115416 162680 137884 158151 223546 336374 246339 137337
5023 137337 173886 206150 107696 64257 146189 8489 120162 107719 142863 153103 115409
5012 115409 95548 124243 19207 33772 148419 180097 114219 99373 84876 79375 96989
5001 96989 69837 69312 107550 189159 117215 206466 233689 141312 242363 245428 269279 237423
4989 237423 186063 218715 231883 307417 296788 159484 172251 232875 215591 218326 226102 196062
4977 196062 111278 135923 134970 132406 253980 261638 242444 191437 285087 312285 259745 224238
4965 224238 244789 252931 194842 252754 186280 164057 154827 140193 214122 171873 179294 156497
4953 156497 188401 129377 115439 79479 87582 190662 108448 96717 74517 54785 73229 66362
4941 66362 13486 117282 100760 67829 151892 121175 31106 19697 60229 145875 135385 132463
4929 132463 232036 168570 100828 159525 128380 197683 338282 260443 210246 251659 200521
4918 200521 234846 186654 239608 287275 289911 293433 187386 226787 261197 311407 298375 284273
4906 284273 205316 249396 183416 254565 305570 315442 383048 253844 230191 320610 283195 166219
4894 166219 129098 128303 181237 142914 265395 251100 236043 212067 133420 50135 179136 293711
4882 293711 247527 105794 80527 144204 258890 251850 214027 205742 158552 151516 61258 61584
4870 61584 79489 99896 94675 198403 78366 99996 154066 154668 160473 178302 133134 177797
4858 177797 138412 71741 82380 106411 167165 183543 197009 193769 245416 235294 309250 300132
4846 300132 218944 150923 143976 217728 210594 282555 260166 178578 297488 325403 330488 274057
4834 274057 329617 390850 419885 341774 408124 429043 423746 554443 526860 501233 572731 684427
4822 684427 750059 761608 768503 879040 833544 784712 799995 847521 794477 831550 791166 752077
4810 752077 760681 701789 656338 592808 634308 587938 534888 528078 636950 607128 582648 617019
4798 617019 568972 458100 438575 437525 456552 453677 391522 379571 354172 395297 434558 446370
4786 446370 489497 489326 390512 418574 354321 349675 491690 469020 481635 378020 393631 425648
4774 425648 394589 463462 515763 532518 455484 583138 551673 509026 549787 652560 565935
4763 565935 567953 655715 670911 632044 689198 750278 752648 690566 604161 503331 561780 596569
4751 596569 613778 664940 624553 616542 627445 643813 718063 751463 630847 617881 706837 640296
4739 640296 542542 686363 683475 725583 688286 708018 776889 794575 813715 868434 768434
4728 768434 808924 684046 731938 808512 813054 766696 846392 914680 843693 857827 766675 824490
4716 824490 875442 824205 949939 872865 846374 898904 851226 871430 826844 715659 750341
4705 750341 785173 812993 803249 822976 937068 884779 922632 928285 902126 813085 834345 936957
4693 936957 959939 977614 1016199 999044 1096436 1069137 1031661 1122715 1087976 1048902 1215457
4682 1215457 1245232 1290885 1290929 1241263 1202027 1323899 1422066 1395954 1480988 1576117 1603730 1610862
4670 1610862 1619564 1577890 1672815 1751501 1849993 1838625 1713290 1819153 1922408 2004279 2027015
4659 2027015 2041290 2018902 2019392 2180503 2248420 2342756 2288766 2335283 2451538 2550106 2496138
4648 2496138 2542922 2701267 2790301 2937025 3091949 3215467 3308985 3434962 3540042 3638770
4638 3638770 3904516 4058664 4225533 4368950 4547233 4732318 4809039 5064652 5331256 5466132
4628 5466132 5645393 5993158 6110439 6548066 6765289 7013358 7297707 7638284 8048918 8360363
4618 8360363 8754534 9200067 9780707 10431578 10964772 11466601 12162359 12879359 13639547 14576008
4608 14576008 15565049 16458422 17559090 18882762 20239972 21626444 23111611 24786803
4600 24786803 26534061 28538581 30771245 33156765 36008737 39188427 42674285 46607246
4592 46607246 51135854 56214871 62143990 69145209 77486573 87288022 98583201 110790460
4584 110790460 121639755 126475368 125449022 122149731 118756122 117862260 119874241 123165372
4576 123165372 124831097 121154839 111261011 99678996 88078754 77298776 68148003 60533608
4568 60533608 54365650 49304755 45231214 41765216 38800014 36129576 33543378 31010861
4560 31010861 28817167 26715762 24977730 23472947 22169879 20805501 19633966 18658695
4552 18658695 17612644 16848157 16069674 15423799 14678141 14024025 13364018 12715983 12216974
4543 12216974 11720367 11215364 10798490 10428459 10075994 9722820 9462902 9032024 8599076
4534 8599076 8386623 8067527 7769834 7533020 7311410 7083068 6877971 6677363 6464388 6177706
4524 6177706 6109864 5901481 5707046 5512240 5473494 5324917 5104291 5043673 4918755 4760829
4514 4760829 4682583 4625258 4464595 4392468 4318074 4180642 4101927 3991100 3874894 3846956 3809159
4503 3809159 3811374 3773881 3581964 3771463 3807831 3765673 3785051 3744059 3726618 3829771 3850823
4492 3850823 3832064 3805939 3860935 3941133 4022649 4120541 4229900 4373477 4418813 4496491 4502329
4481 4502329 4483201 4545734 4564715 4499028 4474292 4350043 4124857 4031971 3874413 3821131 3876550
4470 3876550 3870602 3732607 3747318 3669575 3702436 3754761 3844549 3945037 4080099 4112163 4276739
4459 4276739 4433872 4483490 4589285 4657603 4578988 4649199 4700093 4742064 4909197 5019754 5010775
4448 5010775 4903954 4935796 4842231 4787285 4816518 4959481 4917440 5135581 5381130 5532748
4438 5532748 5827704 6061948 6369703 6815527 7147774 7597050 7931707 8138424 8322763 8441673
4428 8441673 8482525 8568303 8573527 8506409 8456678 8583803 8734872 8947445 9226639 9493683 9841897
4417 9841897 10378643 11001428 11700493 12419617 13294774 14335859 15591475 17016742 18668792
4408 18668792 20636518 23007349 25941405 29794770 34059832 36331630 35227891 33259402
4400 33259402 31819685 30684440 30584175 31852464 33940754 35826205 34646015 31044754
4392 31044754 27301758 23588480 20645206 18301898 16361030 14729861 13516062 12480336
4384 12480336 11542400 10886580 10157753 9488528 8776352 8262080 7768545 7385122 7016840
4375 7016840 6580298 6158822 5808963 5608408 5382885 5122151 4878228 4770615 4601915 4398173
4365 4398173 4177870 3918193 3940246 3767768 3612840 3523112 3436996 3305765 3152948 3115631
4355 3115631 2941812 2872716 2847031 2849919 2723017 2692297 2679670 2629080 2609925 2572755 2544432
4344 2544432 2574765 2612705 2570092 2402873 2334642 2361278 2309772 2084544 2065414 2084445 1926669
4333 1926669 1853102 1803502 1647457 1641658 1649726 1572445 1447312 1444479 1366399 1364558 1308073 1296541
4321 1296541 1202309 1234100 1229010 1189579 1119842 1139427 1049767 1006859 1097812 990678 882923
4310 882923 836619 925715 854902 835716 947764 914910 777877 832605 755169 749749 799032
4299 799032 798529 725234 733685 762600 685159 683705 641350 636460 659090 718852 665339 689567 659209
4286 659209 664034 716953 735836 702892 674157 714963 742512 609938 594119 562254 451991
4275 451991 495955 558480 566936 569394 483718 505599 566496 480554 481488 414974 448403 404551
4263 404551 452385 558453 507402 509133 449876 371020 374902 464764 412000 435116 482062 463635
4251 463635 434797 324316 372803 302787 337128 306408 295764 311277 201016 270271 338315
4240 338315 343689 271928 204501 311572 238140 299957 302407 299969 272186 253877 308531 364632
4228 364632 360628 304816 298947 230798 256591 250515 226386 175549 128021 146955 182899 134624
4216 134624 174251 218557 218825 273465 322485 314109 399191 330038 270618 252697 253252 304363 258182
4203 258182 243062 226285 307046 293845 284070 319311 271791 206326 227750 363427 216334
4192 216334 276641 349382 273130 228462 264398 277640 299344 300150 321170 338330 320832 367867
4180 367867 401131 436973 315083 289552 333748 274389 246553 276491 352126 354363 302155 338692
4168 338692 316496 296888 347282 449687 422432 336928 395283 468100 434598 510385 478352
4157 478352 447158 387049 295779 351508 345594 321708 348506 250482 316483 270794 266286 357891
4145 357891 259614 289633 321740 307617 340058 226440 105550 222706 219821 261054 326132
4134 326132 376373 287329 273681 201596 170987 206204 138156 275468 206251 215298 257215 177520
4122 177520 213292 166030 218686 266176 248089 395529 311966 216146 235929 225016 285649
4111 285649 318712 183927 203065 212477 280795 338937 402745 354989 314355 287845 310237 361955
4099 361955 308091 206101 301473 250572 269548 341003 278193 235526 197669 227336 250385
4088 250385 248687 227335 227378 181238 211630 176338 206721 212647 217523 243274 351883 298756 428411
4075 428411 418373 484868 494890 404168 368680 332033 454471 462250 414229 442638 391173 468157
4063 468157 441541 424012 567945 504234 555872 549853 462817 467555 470786 415313 442479 302011
4051 302011 385709 412730 432662 411314 468583 535021 604174 518436 521875 586453 530305 452977
4039 452977 455649 494548 489441 450499 478914 486914 504145 481979 520385 590173 572981 504771
4027 504771 497406 514198 456316 526670 495086 539610 570907 648238 502435 610188 681114
4016 681114 740525 731035 803030 748816 721212 656187 716013 732717 697099 740712 698580 760448
4004 760448 779432 772139 839987 929110 804554 820113 908291 909792 978065 900886 935088 923451
3992 923451 929956 882159 865061 712544 772836 738138 749623 713064 694228 680235 612916 647118
3980 647118 758017 666687 625396 580797 607590 662602 503885 502117 449461 514637 433089
3969 433089 400620 411665 467160 530168 584403 635645 582030 622661 561950 468936 536324 567119
3957 567119 583618 470413 493160 498301 551816 541588 575928 451537 515490 573279 543228
3946 543228 644862 600281 575510 637230 688768 617790 620938 668202 661349 752159 733970 639535
3934 639535 529183 568880 623615 679149 616089 660876 630448 683051 627271 613568 564262
3923 564262 539150 599036 721785 625189 572736 642059 678661 748821 709762 704562 584200
3912 584200 667522 651893 674491 628489 566888 502209 565017 602246 551601 571672 576736 573968
3900 573968 545684 555641 540980 462946 444509 498862 610242 684327 640277 517061 506121
3889 506121 591570 406744 465013 537186 552611 568927 498920 469640 454990 433388 537177
3878 537177 489870 447480 420904 407576 476932 542275 429992 504405 522158 497120 511293
3867 511293 517005 504163 464427 520924 547634 559914 492442 559648 481233 518758 504081 510685
3855 510685 479644 556149 559558 619356 588581 424044 417378 305873 275729 482709 489890 526527
3843 526527 474746 558966 560392 426162 500976 586047 549533 580642 682078 587281 628195
3832 628195 660004 586701 665453 654306 729299 658093 673229 730764 767887 842939 917525 898310
3820 898310 847839 957170 1012955 1039683 943749 893963 899024 794131 754884 948229 877797
3809 877797 746522 785418 804754 780051 809750 818036 822529 850992 794099 630744 723917 726681
3797 726681 818399 826294 773680 829067 774672 828670 796763 845904 846686 840245 892114 825629
3785 825629 813573 869039 863233 814330 893108 893793 919250 876867 961178 934790 907595 906869 912002
3772 912002 877317 871573 922468 965954 1004663 978996 1073324 1059644 1113121 941780 1008865 984105
3760 984105 955435 1005639 963230 990451 1007248 1011477 1056487 1117807 1116653 1146018 1257283 1147555
3748 1147555 1145000 1212311 1183107 1254297 1290450 1311769 1284292 1349193 1395514 1361295 1401603 1508459
3736 1508459 1529637 1468914 1468837 1528941 1633476 1673301 1586613 1624959 1649206 1701263 1699455 1795199
3724 1795199 1785858 1799476 1817236 1885688 1835494 1844970 2007889 2012254 2020974 2007454 2203144 2225011
3712 2225011 2243029 2188482 2171923 2121985 2227635 2313083 2356712 2419214 2387992 2465348 2491117
3701 2491117 2558001 2565190 2597741 2676459 2798465 2853499 2932658 3053579 3177100 3252546 3312910
3690 3312910 3388311 3394998 3303719 3235182 3240356 3273225 3186413 3228802 3302492 3243475 3146901 3201568
3678 3201568 3113300 2998248 2900481 2886745 2891350 2775654 2719933 2749065 2775373 2735796 2722999
3667 2722999 2803872 2992021 2950468 2888729 2986569 2925047 2921802 2908216 2902344 3046089 3048492 3141598
3655 3141598 3087384 3116944 3090897 3137987 3174484 3238265 3281153 3304472 3336139 3326712 3323945 3429417
3643 3429417 3498355 3478636 3441280 3557189 3532267 3715308 3758309 3731974 3909463 3931551 4165147
3632 4165147 4167164 4231822 4341373 4477065 4601511 4745284 4893801 5037603 5214124 5289378
3622 5289378 5556830 5740749 6013668 6244859 6435105 6671868 6847421 7047151 7191351 7419942
3612 7419942 7721315 8070868 8334207 8643919 9075594 9346672 9789251 10275160 10794170 11407181
3602 11407181 12002913 12583070 13503611 14294283 15050602 15916326 16890688 18041872 19332601
3593 19332601 20774085 22364661 24185866 26194879 28614756 31393878 34499215 38097915
3585 38097915 41950020 45828680 49474321 52318493 54472589 56480558 59273167 62971878
3577 62971878 67425904 71561050 73483626 71807576 69125884 66089887 63470065 62034042
3569 62034042 61826182 62134549 61168613 57447617 52739239 48382366 44502180 40998033 38502658
3560 38502658 36693201 35546792 34057805 31821122 29978948 28284880 26836469 25661280
3552 25661280 24754270 23988653 23408865 22915939 22744386 22522441 22386990 22324625 22392716 22535559
3542 22535559 22638811 22831239 23250233 23692505 24135304 24601903 25181960 25874191 26691034
3533 26691034 27441445 28411360 29346697 30458464 31708202 33067986 34462034 36012122 37568718
3524 37568718 39369623 41315373 43369222 45476557 47753978 50154992 52700426 55383950
3516 55383950 58069713 61022047 64141919 67151427 70282156 73546704 76817019 80217031
3508 80217031 83317836 86482499 89618917 92669068 95885609 98876018 101966841 104960253
3500 104960253 107759605 110490567 113031977 115142485 117058510 118932874 120462958 121754086
3492 121754086 123003460 124055187 124893481 125537191 125955844 126188282 126148508 125924987 125337156
3483 125337156 124535867 123681790 122577411 121315974 119836065 118304715 116706625 114936065
3475 114936065 113098798 111060213 108775209 106323894 103791974 101171186 98394198 95466300
3467 95466300 92611679 89903985 87042028 84269940 81372263 78519838 75518264 72383027
3459 72383027 69318334 66274155 63344428 60509873 57708605 55022498 52413548 49980914
3451 49980914 47480371 45184152 43070854 40801714 38616872 36660488 34797174 32981854
3443 32981854 31371762 29903344 28551995 27155929 25903246 24772575 23787435 22746610
3435 22746610 21692325 20885849 20167783 19471361 18807106 18162301 17552950 17041152 16629551
3426 16629551 16174596 15770092 15430702 15129316 14873209 14627879 14316633 14149821 13904329
3417 13904329 13754919 13620453 13470621 13345734 13277623 13109785 13033770 12896517 12673764 12600381
3407 12600381 12553817 12561324 12537924 12446803 12378620 12275794 12227288 12153184 12097565 11999064 11933809
3396 11933809 11845583 11851054 11767188 11713210 11776047 11888194 11843342 11790337 11784538 11697780 11788391
3385 11788391 11830321 11907757 12047557 12124173 12182767 12255735 12448048 12663701 12912678 13145262
3375 13145262 13249465 13520217 13722615 14054234 14303720 14612759 14946519 15365578 15696820
3366 15696820 16091330 16489973 16893764 17391435 17821579 18240071 18872304 19463705 20040370
3357 20040370 20825307 21508031 22233729 23116304 23979953 25104750 26167264 27428503 28655815
3348 28655815 30035822 31647250 33438806 35220694 37178799 39418604 41730614 44331058
3340 44331058 47154784 50419911 54084666 58298509 62884084 68097792 74013558 80635015
3332 80635015 88152851 96530747 105859229 116542045 128145529 140058352 151209009 160296664
3324 160296664 166490654 169531060 170210401 169529765 168077656 166913903 165996584 165461246 165042544
3315 165042544 164201700 161919799 157575530 150661496 141464895 130819940 119665560 109057848
3307 109057848 99392104 90991306 83813734 77589325 72372263 67711501 63586587 59839571
3299 59839571 56460939 53440423 50693279 48116029 45848112 43634202 41659967 39793381
3291 39793381 38442237 37107871 35981845 34964865 34010261 33255033 32443693 31664191 31125119
3282 31125119 30535228 30098902 29657251 29306200 29066140 28821178 28656667 28466252 28485106 28479803
3272 28479803 28593082 28622004 28679469 28683246 28805399 28912700 29191405 29360450 29644648 29993210
3262 29993210 30386523 30739290 31229159 31649855 32248054 32943898 33633404 34424948 35330471
3253 35330471 36132253 37042528 37982207 39023433 39991182 41127614 42287323 43586151 45034653
3244 45034653 46485818 48118037 49746194 51341980 52863481 54285853 55827413 57251020
3236 57251020 58697889 60149428 61596668 63227460 64951158 66446813 68078293 69795347
3228 69795347 71384974 72974545 74754402 76672135 78700084 80842120 83210733 85849576
3220 85849576 88892183 92225461 95979280 100242226 104896888 110069545 116054319 122740669
3212 122740669 130092161 138326775 147662856 157914177 169206172 181736909 195615539
3205 195615539 210872570 226727075 242323773 256890275 270119640 281950453 292545392
3198 292545392 302256152 311459968 320643746 329827097 339130498 348147597 356273417 363143854
3190 363143854 368180738 370568641 369880763 367386755 364254358 360822137 357539095 354356706
3182 354356706 350918214 347161252 342823420 337885243 332167174 325635179 318612626 311241459
3174 311241459 303835258 296550582 289556481 282917783 276552378 270490982 264574157 259067148
3166 259067148 253897050 249387306 245757058 242954845 241615026 242050241 244306922 248284215
3158 248284215 253224531 258093762 262165338 264569295 264477233 261865690 257537495 252582390
3150 252582390 247607382 243188937 239357402 235892790 232269640 227425200 220498198 211344526
3142 211344526 200283623 188273516 175462831 163089650 151515949 141320870 132344988
3135 132344988 124542336 117577119 111333858 105817503 100758110 96262195 91992349 88027138
3127 88027138 84213093 80720140 77334850 73984139 70707288 67526022 64685616 61989993
3119 61989993 59504814 57201666 55012394 52955813 50882330 48912367 47019010 45268119
3111 45268119 43594008 41890831 40379323 38788867 37491972 36302817 35011811 33862464
3103 33862464 32728588 31773781 30915899 30079620 29271035 28449976 27604151 26937336 26366194
3094 26366194 25736394 25121837 24499924 23810460 23200337 22759946 22280409 21925166 21508620
3085 21508620 21061091 20700691 20352725 20050822 19761978 19506134 19199504 18942808 18624646
3076 18624646 18415630 18202469 18045006 17823382 17620808 17516327 17363358 17191245 17018886
3067 17018886 16890580 16814105 16774430 16626575 16632168 16591480 16524273 16615187 16594758 16553570 16694808
3056 16694808 16741578 16617735 16766209 16883218 16955722 17018385 17126692 17223664 17428283 17637316
3046 17637316 17811643 17990241 18174683 18291949 18482795 18857719 19183524 19534142 19754315
3037 19754315 19971198 20355144 20728346 21104505 21525740 21840581 22270491 22749830 23168836
3028 23168836 23821496 24448188 24936654 25471498 26035330 26569581 27233149 27962275 28599346
3019 28599346 29255736 29950367 30752309 31464427 32146351 32945958 33769317 34477009 35257267
3010 35257267 35990475 36565036 37234008 37924598 38566926 39062840 39561265 40053983 40306588
3001 40306588 40544471 40706621 40881324 40850048 40766116 40680054 40547408 40269409 39853293 39449122
2991 39449122 38986117 38515581 37853452 37220721 36543112 35889302 35226909 34601997 33937067
2982 33937067 33335765 32658072 31902697 31275038 30662252 30053161 29413795 28844270 28254397
2973 28254397 27671929 27186226 26601185 26117919 25604935 25132584 24558500 24044429 23657595
2964 23657595 23254227 22920686 22557577 22196606 21962796 21632510 21475103 21142060 20929025
2955 20929025 20798130 20604145 20432198 20293196 20188407 20132382 20205004 20193772 20164105 20468587
2945 20468587 20832752 21001567 21344588 21550969 21759202 21820288 21838663 21628896 21207482 20713453
2935 20713453 20185682 19628224 19051726 18412726 17831349 17341265 16742488 16246489 15664289
2926 15664289 15081621 14451863 13865706 13259287 12727528 12249026 11818950 11382718 11031423
2917 11031423 10636043 10274031 9881525 9601012 9290293 8972265 8774992 8595007 8449141
2908 8449141 8254802 8062511 7766209 7521315 7269476 7123785 6992638 6844633 6787020 6403441
2898 6403441 6245145 6129595 6042645 5956850 5801485 5712739 5507898 5575054 5394670 5188646
2888 5188646 5098278 5045166 4977181 4865869 4743668 4693455 4669197 4508706 4379195 4329826 4182642
2877 4182642 4129140 4028981 3981776 4000138 3945717 3818708 3784641 3691008 3708520 3651201 3549971
2866 3549971 3589866 3479541 3385195 3478523 3493645 3464380 3370350 3378320 3266002 3249636 3221192
2855 3221192 3182261 3190525 3271219 3239233 3174349 3149222 3271215 3349119 3372642 3411684 3487140
2844 3487140 3752559 3951571 4021165 4077157 3810038 3701257 3379343 3208009 3112668 2995335
2834 2995335 2948369 2895473 2843909 2802140 2777199 2800365 2867315 2915096 2937869 2975399 3041809
2823 3041809 3139444 3253611 3417239 3510941 3236500 2930257 2744366 2618578 2434294 2312823
2813 2312823 2266394 2175163 2109652 2033933 1935817 1987071 1994833 1987135 1934547 1837391 1700213 1795600
2801 1795600 1738146 1709404 1647409 1615770 1635767 1549316 1514803 1622706 1513796 1510259 1439258
2790 1439258 1371892 1472806 1498943 1427440 1409848 1380112 1294638 1265615 1224511 1208102 1298458
2779 1298458 1377428 1382171 1252811 1279465 1312220 1328279 1160240 1332220 1260272 1192044 1246028
2768 1246028 1277155 1194497 1193039 1202637 1232207 1186944 1270259 1312457 1247101 1246298 1189525 1176390
2756 1176390 1189395 1157465 1059971 1108064 1058399 1115842 1136176 1204018 1131130 1190317 1278588
2745 1278588 1278189 1214188 1214922 1255639 1251648 1208032 1241742 1293898 1195010 1229732 1313426 1319449 1444093
2732 1444093 1386155 1376520 1338170 1367076 1490257 1593132 1643015 1665914 1664823 1719468 1744256
2721 1744256 1778712 1874137 1883556 1940322 2141815 2149872 2183260 2287389 2357520 2446469 2635146
2710 2635146 2779681 2847264 2992308 3134367 3266889 3592458 3732103 3904459 4165570 4386507
2700 4386507 4678209 4707400 4866499 4941726 4993922 5013089 5039601 5157012 5243269 5280858 5311640
2689 5311640 5341604 5574123 5680780 5788579 5928622 6158975 6348676 6646278 7105365 7428285
2679 7428285 8002167 8377126 8236462 7713927 7116357 6651727 6278194 5941953 5577252 5213839
2669 5213839 4989956 4858010 4753501 4641884 4448144 4379164 4322351 4275661 4195141 4185532 4162287
2658 4162287 4203754 4308837 4212203 4249396 4220885 3989787 3758829 3530192 3323839 3060324
2648 3060324 3017926 2752928 2583732 2487137 2312366 2123917 2016823 1945838 1890191 1864381
2638 1864381 1745103 1703299 1525934 1431325 1327093 1254229 1286592 1281707 1235730 1189076 1073035
2627 1073035 1054966 1011229 902261 891500 929493 819291 874767 795131 710355 727197 732492
2616 732492 649636 703044 708943 678438 633474 610281 598744 595605 543900 630506 630471 516105
2604 516105 578404 546076 473624 520659 504205 559758 563092 519286 509847 443006 476464 528953
2592 528953 552376 452678 434322 373925 385784 421833 424438 348867 326973 374998 398774 321038
2580 321038 311311 339582 274343 330621 365540 376473 218847 239650 331466 315539 303419 237069
2568 237069 234529 311533 315818 253658 248277 294326 342430 331854 300571 220095 159677 249132
2556 249132 258922 207150 192802 266225 191912 74386 124704 228401 184327 150226 110305
2545 110305 156586 123807 107609 68671 119760 208576 127739 154141 80576 54089 153214 161053
2533 161053 278376 253164 153226 158956 147357 157526 139513 61684 -10461 79276 162397 222284
2521 222284 201131 168293 159335 175877 227026 251588 204441 187954 102018 91416 30523 103688
2509 103688 100805 178073 100137 131533 120637 165563 116285 149883 50771 103869 86264 168713
2497 168713 152457 35162 111486 70608 122702 125239 129806 13804 -12789 63017 71844 109732
2485 109732 120099 147938 54463 16551 68863 113730 100799 134137 186832 128035 121980 133809
2473 133809 132887 151036 207526 11041 132659 127484 145403 162607 190590 142882 132168 89306
2461 89306 141161 172114 90900 180114 175896 134571 146995 96841 164184 74727 17702 -80890
2449 -80890 -58764 -8337 8204 108526 -2242 -48208 -6903 32480 43366 35060 130761 174859
2437 174859 122751 19507 77240 121043 103650 142952 81624 39337 10317 122317 107688
2426 107688 133504 58483 132787 79269 27401 45509 21716 130961 216886 130534 9895
2415 9895 55152 23286 106069 121806 123900 62532 5158 -91372 -91887 65208 116586 53600
2403 53600 19781 43817 -48227 -38775 -25891 -10997 -18454 131829 48463 86605 86871 25373
2391 25373 66217 19940 52992 122352 96819 98822 -10793 29984 -18934 63300 144718 45360
2379 45360 70760 19743 22055 -10211 -6755 33236 -6627 -16295 21920 12349 5137 82352 126794
2366 126794 136893 41541 -12753 -872 -116594 -66423 -63998 -17469 -72815 -80913 4151 42853
2354 42853 14972 -32064 35458 94687 88795 69775 -72353 18505 -17866 -80317 -134847 -90773
2342 -90773 -83626 -18670 38322 -7161 -47864 -50147 -35127 -7984 -93175 -85629 -3981 23149
2330 23149 17188 -38731 -81063 39409 63256 -48923 -29320 -45819 -33152 -106667 -432
2319 -432 56079 40099 30766 -10264 36197 52191 66249 44702 -46798 -92171 43087 -36510
2307 -36510 -101784 -100794 -96548 -104629 -47624 -64808 1186 -114231 -118305 -99938 -14925 -36551 -126940
2294 -126940 36235 141434 102282 160619 125542 21317 69528 28891 30161 -22633 71906
2283 71906 15653 79613 137471 71755 -36801 117900 108962 19877 33343 120261 76300 14671
2271 14671 31779 -62955 -103766 -35257 -93574 -133663 -63355 -31726 -38510 -30439 31988 -52732
2259 -52732 -79704 -69326 -35520 12866 -44216 -95751 -4893 42315 -45588 -6627 -71147 -39051
2247 -39051 -59442 -101817 26406 -73142 -80827 32117 364 -7707 37609 -30707 -36242 -113564
2235 -113564 -25532 11527 -52107 23506 46836 69958 -25756 -21791 -55007 -30851 -28815 -27575
2223 -27575 25681 39499 89834 77904 -60163 -26075 31352 8070 -50829 60497 10157
2212 10157 26756 -51268 -63913 -2122 -78571 -76832 -63135 -33281 -24 -15304 -80429 -56924
2200 -56924 -38551 -32553 11716 13449 7860 87279 65580 40230 39646 -84552 -57351 44027
2188 44027 29085 -30485 -88405 -105185 -115904 -57898 -11744 -64126 39552 27982 51209 76998
2176 76998 60950 55501 30265 103978 64889 3394 -10413 77382 20440 -25916 67341 59766
2164 59766 -59752 -36605 -70888 28724 129451 122219 134728 118320 153630 153771 194159 156502
2152 156502 251336 107363 70714 127357 77026 -2955 -53164 8257 122329 58763 52844
2141 52844 218825 173560 145409 180601 246746 153572 241808 244566 307828 337901 276180 295101
2129 295101 305221 290919 368962 431120 502486 538964 509901 499686 553986 526769 513512 588520
2117 588520 647493 516778 643498 653718 616187 784546 872155 904646 849366 972881 1093059
2106 1093059 1121420 1158581 1192837 1360501 1438000 1606417 1697901 1831660 2045881 2138854 2385624
2095 2385624 2518629 2685569 2876196 3134732 3393832 3683266 4071685 4396278 4796312 5139817
2085 5139817 5693843 6416531 7232458 8139427 9244322 10610970 12496358 15153939 18076621
2076 18076621 17626975 14764598 12623609 10469658 8791169 7605829 6607724 5818541 5300906
2067 5300906 5044390 4838442 4600482 4123013 3686859 3374697 2965521 2723844 2519881 2335779
2057 2335779 2195310 2035856 2011033 1896562 1765730 1670070 1561257 1523418 1434019 1364471
2047 1364471 1227067 1144608 1186674 1093112 965423 995566 966313 886010 795653 862894 780527
2036 780527 656409 647138 682861 712897 681073 693774 575843 491422 518691 386835 352354
2025 352354 280891 376840 435597 439760 497483 397941 377427 409715 347868 426557 387647 349071
2013 349071 330196 301291 345684 240848 212957 184993 153759 253025 265002 139576 144990
2002 144990 162474 202008 135705 161865 197182 136284 119677 214634 205741 183808 291904 234420
1990 234420 152959 179721 133865 81041 79754 74008 143992 115381 33148 6866 104627 138112
1978 138112 105376 102302 103260 -107508 49033 88182 -37783 -127156 -64223 -994 48327 15855
1966 15855 22059 74518 40819 63812 19010 -99730 -87929 -25655 -27503 41740 58595 -31344
1954 -31344 -9723 -47971 15181 -81218 -101942 -22856 -6519 9625 -60370 639 -11865 28944
1942 28944 89828 60461 12736 -33363 28793 81699 119977 117662 105796 136058 82599 130323
1930 130323 89921 58751 55371 4497 -56899 -21686 -115930 -41695 -27159 -63884 11320 -60326
1918 -60326 -12237 69075 30796 -44871 30701 -48363 -127555 -104403 -86088 24135 -45587 56101
1906 56101 48779 -91901 -82163 -67321 -19954 17682 -86972 -92166 -104580 -72275 -110844 -62913
1894 -62913 -93843 -89412 -156701 -108177 -74915 -49511 5877 -22184 -6620 47480 16595 -75238
1882 -75238 -115979 -66179 -40281 -6999 -43765 11988 25042 58116 -2253 -6876 24427 -51725
1870 -51725 -29793 45212 47158 3615 -115181 -81970 -30340 -147413 -86063 -124840 -34616 -38974
1858 -38974 -29807 629 -62673 -30335 -96325 -155955 -80713 -71948 -94859 29976 60365 -32449
1846 -32449 -45103 -6221 -29882 -48517 -2580 86777 -9398 8727 83050 -22484 39084 -8411
1834 -8411 -59553 -61079 -98091 -56225 -126964 -72609 25114 21692 22689 -113000 -79925 -27299 9980
1821 9980 54952 -60512 -84987 -112284 -140202 -72947 -104584 -83782 28529 -23152 -157202
1810 -157202 -48849 -40709 -47381 -46230 -56803 -105791 -63359 -87968 -89690 -94969 -66068 -54871
1798 -54871 -74925 -104358 -37029 -75036 -48357 -38405 74841 -15659 -90293 76171 -25716
1787 -25716 -83561 -12942 13579 -31104 -13559 -23352 -80798 -69916 -76909 -22272 -49661 -54542
1775 -54542 -65303 19421 -39889 -10268 -107741 -62625 59109 13892 32168 -54003 -37609 -39630
1763 -39630 -68941 3065 10447 -37604 12668 -18104 -52895 -83897 -147481 -166590 -217939 -131809
1751 -131809 -21849 -37842 55628 36291 -57513 -97276 -152163 -159585 -217616 -204987 -94233
1740 -94233 30200 -13036 -112589 -31297 -71592 -98537 -94079 7914 -106831 -69396 -130822
1729 -130822 -98944 -95004 -107190 -128587 -107287 -186933 -61497 -160988 -162591 -120221 -112171 -94616
1717 -94616 -74737 -163364 -183688 -106387 -85045 -118512 -131369 -84255 -62596 -101256 -218029 -165916
1705 -165916 -74727 -58854 -100300 -108032 -59978 -69193 -19734 -73113 -168794 -6868 -14386 -63743
1693 -63743 -137273 -148140 -70051 6443 -44057 -70146 -43414 -73655 -12816 3514 -111960 -74089
1681 -74089 -40750 -42186 -134508 -132621 -43494 -47904 -50664 5597 -22906 -689 -64748 -107242 -133424
1668 -133424 -142733 -136560 -150754 -147968 -34037 -18918 -14627 -19813 -87159 -60229 -3843 73905
1656 73905 -94860 -173854 -20670 -86905 -120723 -48419 -22555 -11416 58605 -18504 -135656
1645 -135656 -92445 -79208 -74740 -65838 -60246 -101416 -219040 -149433 -53224 -145941 -211935 -186305
1633 -186305 -167751 -113777 -121914 -43171 -6694 -59490 -126167 -161594 -95024 15977 -3031 -109501
1621 -109501 -134177 -58785 -91353 -184082 -174216 -79088 -62658 24658 21420 -34744 -40663 1595
1609 1595 -97423 -136910 -108639 -122062 -122413 -45998 -116741 1937 -495 -70750 -108435 -92705
1597 -92705 -73036 -123275 -15688 -88276 -83506 -87657 -121834 -103981 -109002 -107185 -110210 -59508 28994
1584 28994 -127423 29639 72907 -17778 -87849 -79654 -26595 12869 -39419 -51915 -75524 -59172
1572 -59172 -21192 -45476 -7084 -32692 33108 3871 -16361 766 38389 -63848 -145111 -117516
1560 -117516 -107168 -71718 -74713 -10099 -16846 -93401 -84112 21960 -84644 -48641 -99735 -46188
1548 -46188 -144282 -105812 -85863 -13153 23075 -62391 -85674 -56395 -101448 -148671 -76346 -25319
1536 -25319 -82620 -144005 -31636 -10712 -112299 -44776 -9787 4072 -76122 -228255 -131827
1525 -131827 -92166 -54770 11168 24024 87635 47619 -35140 -33804 -33082 -6138 -80454 -107075
1513 -107075 -35610 -9622 37444 -66757 -170546 -75166 6401 -54780 -109734 -165922 -132122
1502 -132122 -198511 -205578 -30131 -596 74901 -40106 -122437 -125848 -35166 -46544 -296 -30821
1490 -30821 -93552 -49615 -49075 -95209 -135877 -96955 -35580 -113588 -91712 -86220 43622 18396
1478 18396 -43957 -61600 -83686 -113228 -108498 -9560 -68349 -54515 -132127 -187504 -196101 -55817
1466 -55817 67984 10047 -97051 -58591 -178691 -132488 -51921 58659 21542 38718 -17974
1455 -17974 -72992 -23117 17285 75780 -81876 -168902 -84961 -49815 -84422 -6165 23870 29540
1443 29540 -35340 37834 64289 30774 -50434 -82317 1609 87592 -67281 -27669 -411 -22503
1431 -22503 -5995 -12549 -54839 39706 -40004 -28103 -7723 -41397 -73039 -41587 -18070 -56683
1419 -56683 -59132 -163424 -140323 -23161 -111415 -126772 -153092 -102084 -121087 -384 -56171
1408 -56171 -84543 14908 7953 -43889 14821 -37537 -13902 71376 18225 17520 -62947 -24273
1396 -24273 48014 -8755 -52313 -50154 -101896 -27817 -112889 -112598 -47719 15847 -95254 -116118
1384 -116118 -83971 -66035 -14219 -83387 -73766 -54306 -85299 -79903 -103485 -107451 -104767 -53155
1372 -53155 -53746 320 14690 -43632 -41944 -17755 -130946 -166504 -144685 -76357 -89530 -83540
1360 -83540 18497 -1364 -19629 -39621 -89020 -92151 -17249 -172820 -181847 -109161 -44398 -69963
1348 -69963 -73865 -94474 -143437 42018 -91820 -189129 -107146 -75207 -74978 -9574 -23408 -34103
1336 -34103 -54532 -98461 -82173 1662 69732 111392 43535 32814 -114554 -13384 -4495 33601
1324 33601 82488 134334 125580 153411 126583 -43368 -30004 78298 -48179 -155591 -136587
1313 -136587 -67774 -80104 -1535 -71753 -17420 -26070 -9871 -24473 -80178 23385 9124 32676
1301 32676 593 -27041 -80970 -15238 -17938 29324 -49843 3347 -10682 -32031 -22743 -159731
1289 -159731 -48753 -7417 -14038 16026 107524 115287 58974 -5888 -43471 -270 -8777 -53003
1277 -53003 -92420 -51548 -155846 -56177 -56792 -47605 -99989 -164955 -61931 -10846 -18757 -52459
1265 -52459 -48876 -69308 -25016 -72206 -44198 -40124 -75456 -62410 10634 -98290 -117608 -106601
1253 -106601 -151184 -6190 -80886 -94797 -184695 -128199 -43116 2320 34148 -28423 5699
1242 5699 -51976 -62899 37225 -48506 -54312 -109156 -1292 110614 27408 -24733 22253 -12947
1230 -12947 -15931 -13285 -66046 -132209 -68922 -39876 -25099 10842 24577 -56297 -31696 -96074
1218 -96074 -59075 -92912 -73578 -89455 -117225 -163286 -153338 -71615 -69137 -101743 12214 38287
1206 38287 -55929 59491 5672 -40443 -86925 -34408 16553 -7128 -27754 -87494 -96589 -145032
1194 -145032 -141504 -116972 -148840 -269411 -116608 -75762 -67535 90115 -6903 -60375 -15842
1183 -15842 31018 77692 -5031 -97005 -134094 -113333 -45512 27468 -100358 -161654 -26624
1172 -26624 -3008 -25374 -102163 -81614 -132361 -33097 3539 24263 63249 41202 53258 -31453
1160 -31453 -112107 -118886 -48215 18275 -46544 -152904 -129771 -47197 -53270 -66863 -114420 -22211
1148 -22211 19825 -15967 -68298 32525 -13281 58543 -27163 -65592 -3926 5149 -56554 -30384
1136 -30384 -42644 -14825 29795 53247 472 -8188 -45624 -102394 17332 11753 -50803 -25075
1124 -25075 -99195 -58992 44736 112400 84576 1955 28207 -33654 22690 -3736 -6851 -5493
1112 -5493 -34142 -95740 -182232 -102653 -83844 -41424 -20011 -37839 48889 1756 -14779 34105
1100 34105 28470 1263 -47863 -49804 -55896 -89342 -70604 27249 75996 -43860 -49514 -33193
1088 -33193 -95531 -109654 -63517 -11614 -772 -20812 -72843 -93365 -96696 -87399 -24152 31388
1076 31388 44455 47463 -91424 -36304 -58071 -100247 -138221 -72363 -11128 -92469 -85385 -140608
1064 -140608 -40829 -96696 -60397 -26235 -6647 -35120 2532 -1365 -2851 -4424 -77469 -32165
1052 -32165 -42968 -74606 -108724 -99279 -249 21323 -1246 -110480 -40100 -46861 -79452 61851
1040 61851 30691 30493 81186 75385 10246 -12505 -34724 55677 79019 -48927 -16823 5477
1028 5477 674 -12238 -125251 -124123 3458 52979 -36697 -51835 -77606 -53191 -43694 -32128
1016 -32128 -15161 -92730 -65883 -40508 -49564 -86240 -138169 -110706 -60633 -66160 -49984 46581
1004 46581 51930 68589 -140 -74941 13498 -105652 -3466 -3680 -67096 36462 107967 30208
992 30208 -54541 -21628 21382 -26684 5734 108253 -3635 45420 71769 -36996 -78850
981 -78850 60922 87030 28303 -15130 -117927 39450 8641 -18906 -44209 22264 90126
970 90126 71116 96962 8360 -35310 51902 37036 -21613 -64690 2434 55734 87211 19122
958 19122 -14500 30823 2591 -22293 -32976 -59530 -17348 29101 59756 73714 3367 -28837
946 -28837 -4050 41268 -90070 -115286 -79391 -113661 -38799 29109 -66947 -59981 -80007 -92908
934 -92908 -45828 121220 -7345 -125705 36186 180755 103901 89063 127236 4864 -23163
923 -23163 -36149 -77786 -20655 17176 44087 40054 -16983 -9775 -78307 -107676 -129512 -139792
911 -139792 -24437 -16729 25119 61710 19385 63083 -41315 -30318 10814 -3118 10777 -63225
899 -63225 33683 -32854 -35449 -63426 -125 5119 -3035 75415 128174 21991 43088 61217
887 61217 49142 -14457 -87497 -92927 -58702 -60153 -103262 -49506 22997 55003 -17599 -11261 -52103
874 -52103 -41235 -81935 27036 81898 94546 50310 -41552 -39057 54552 52015 92048 42986
862 42986 21472 66142 33231 -34130 -55362 -3196 36248 38569 83209 -46238 25483 120543
850 120543 108342 92712 143757 27771 170 49399 109178 47442 10256 7543 -7988 -10945
838 -10945 44170 104769 41059 98444 -43299 44077 40375 41246 28667 -23636 -74967 -117529
826 -117529 -72342 -43380 7707 40343 125017 55048 -89912 -48322 -65369 -21434 40703 -41702
814 -41702 -179194 39559 40495 35032 8378 -11999 -67309 54460 166503 166823 13979 -31374
802 -31374 -35277 -29506 33612 -18072 84525 14272 -34762 43105 59961 -23947 -43606 -46624
790 -46624 66468 2569 -36063 33573 81548 33110 -7107 -32692 56289 11787 -33478 -82240
778 -82240 -157833 -97032 -7172 -14189 67377 13905 20163 -15564 -9343 -18308 -36558 28938 34381
765 34381 -16739 36338 74189 -25457 -40301 -3774 -86875 -81361 -89181 -105906 -106118 -102523 -18327
752 -18327 -69074 78145 39207 -31096 -63798 -27721 -30896 31809 11039 15064 -48322 3249
740 3249 8558 -73565 -6053 40502 -7834 -33384 52228 18729 27466 -58128 10051 19158 -148
727 -148 -67064 -89698 36993 50408 -33696 -43011 -29870 -111119 -70254 -26507 36664 -37007
715 -37007 -22612 -10920 8893 -24265 -4887 96778 -3965 -53296 -16959 74784 68505 50684
703 50684 -44656 -13653 32699 -45106 4141 -43611 -55368 29422 -29104 -59059 -16325 75443
691 75443 -4529 68323 7988 -65705 3377 4130 82366 3261 -65168 -56104 27478 21597 51919
678 51919 92651 11813 44501 45760 4981 2943 -17221 3866 99500 94828 10346 -95966
666 -95966 58429 57600 355 33870 -17456 91786 40857 50251 354 -26611 25618 37137
654 37137 30253 -5320 104059 71615 10963 -17602 37292 177610 66881 116711 152878 119950
642 119950 114984 90510 82561 59595 -30539 -11961 113292 -44537 -120155 -28188 -9571 -4897
630 -4897 -6525 -86540 -82873 -42706 -38889 9268 -47805 -85694 -8685 93065 15335 -3626 -20120
617 -20120 -74430 -45184 66919 31178 1748 37531 -14991 -35498 -6483 34488 -6547 111295
605 111295 7134 46437 85179 95121 14350 -35482 -7332 -67684 69486 122851 83194 63405
593 63405 67194 86295 72376 -51151 -909 15560 76998 69901 121839 101283 -48177 -27023
581 -27023 75148 47668 47435 117606 81200 54318 125778 123039 22442 50569 155956 206326
569 206326 100395 31594 -78896 52096 53630 -117263 19148 153383 -2547 10508 34654
558 34654 -27361 38915 -26183 11776 -24558 38890 85344 64387 58805 119796 55475 92793
546 92793 95219 73580 24431 -15795 -12607 46329 -16647 77828 133019 40874 50357 29283 32299
533 32299 65725 83776 21832 15683 -20683 88883 46418 33718 18709 19592 21837 130169
521 130169 96176 37737 -18872 -82122 -41360 18234 -41795 -87682 -86688 3132 11031 22585
509 22585 95418 131169 70898 132396 97057 58805 91698 135383 68629 17548 52716 54502
497 54502 120947 184374 49591 -45248 45258 63694 59727 37922 58717 104516 97114 -18877
485 -18877 -11636 -71994 -24635 92300 27408 -78772 22829 60433 -48100 -43425 68862
474 68862 10542 49126 102804 125882 142580 27503 70554 10443 82410 57464 78998 81274
462 81274 58535 -59045 -22044 94145 -4109 19637 -64972 -11212 19096 51661 91960 75155
450 75155 5498 -9414 34829 41902 36562 74448 -6360 57897 5905 -18204 106073 22205
438 22205 -26863 103712 80493 57742 64885 87950 80077 129316 55850 35905 14874 31029
426 31029 96529 61618 140863 92510 29591 78430 51586 -26262 -16772 41398 26606 22826
414 22826 58917 85203 63099 39668 113121 98533 142338 56294 124986 188428 30442 42528
402 42528 10348 50720 55194 139274 58433 116835 211663 109414 31371 70954 63270 65788
390 65788 114568 135814 170133 190564 67668 21784 99417 48340 91862 60169 62376 14094
378 14094 -103136 -42983 96006 52170 -2007 16737 -14589 -33490 47960 3012 138624
367 138624 24481 24939 127505 94495 22137 -23840 86384 176279 138400 -3768 -2103 4385
355 4385 -72703 17636 12697 88090 65644 -43505 84206 95139 -18413 17454 53530 35387
343 35387 23916 86182 58240 26540 36057 62641 63308 3934 143526 133752 91692 54132 16886
330 16886 3341 -54071 28327 30717 8449 -7049 -8370 -70754 74990 151206 124913 157647
318 157647 87794 42275 119490 39922 35602 99385 131246 126094 -2853 36885 168387 82255
306 82255 123004 173202 70506 123084 105237 46206 105387 52968 81942 136947 93036 37465
294 37465 30474 71024 180434 103974 16688 40056 11085 -19777 69772 211582 132202 89267
282 89267 36336 71890 107374 82647 48202 129273 136166 113817 73432 98636 90087 86926 28462
269 28462 77863 84482 40221 38099 83986 69289 92312 120052 161672 97981 -16416 -10791
257 -10791 -2837 18757 93088 -36588 24517 96966 123644 138972 116557 84573 67205 7798
245 7798 55947 85182 6384 -6158 17733 31211 40146 24466 -29159 -10548 74450 120940
233 120940 108627 101942 152989 44531 79710 5696 76809 107123 91245 160650 81907 97186
221 97186 98262 45974 49523 17637 35780 55015 -9768 30311 37217 41436 61493 35092 34205
208 34205 4324 25708 91874 68134 134821 159791 102692 54098 103481 124299 68638 19723
196 19723 55542 38096 66073 15887 75153 145747 69438 82287 160024 76002 56928 52929
184 52929 46370 52284 -1559 14525 27078 -13245 -21669 41034 102071 51199 74786 94126 74150
171 74150 26879 -16624 -49265 41161 82021 152251 86109 79620 70038 99993 104763 81090 66924
158 66924 -9595 -22551 831 52624 83502 44837 110515 89414 69060 32272 21580 18161
146 18161 26296 -10781 5180 26159 118122 135531 58473 40573 16942 -31693 -7559 -42665
134 -42665 15143 3556 -50677 1902 -3207 50182 37416 111657 73342 -7671 54303 -44590
122 -44590 -32444 38835 -66621 -15865 6709 -15177 14002 3767 -48176 -48197 18405 -59534
110 -59534 -40548 -15477 29119 -44729 -70455 -91767 -26095 13531 -69213 -77822 -100215 -8245
98 -8245 -46664 -50274 -38355 -109564 -48958 212 -68660 -75903 -79294 -96010 -75771 771 -30918
85 -30918 24228 30289 56733 25421 -28489 -63980 -34245 14056 43427 7061 84844 -25937
73 -25937 -18022 -3202 -3301 -79147 -71855 -80911 -32491 -13697 -86836 -17488 -54332 -59092 -79649 -138614
59 -138614 -106010 -64524 -112734 -124886 -77900 -52045 25974 -37636 -65010 -77019 -70514 -114826
47 -114826 -110806 -132569 -112526 -7505 -40324 -91790 -34586 -39827 -58377 -44006 -36247 -86457
35 -86457 -86356 -72347 -143434 -79491 -68983 -86822 -64231 -89228 -126182 -101046 -118154 -166232 -166817
22 -166817 -104430 -108212 -57864 -91735 -101031 -90007 -139173 -139783 -169950 -198659 -171170 -160959 -140614
9 -140614 -166784 -92698 -106053 -157079 -106539 -112616 -175421 -183184 -111918
0 -111918
$$ Imaginary data points
##PAGE= N=2
##DATA TABLE= (X++(I..I)), XYDATA
16383 -1856936 -1838632 -1774364 -1753796 -1759065 -1665694 -1648201 -1643756 -1657410 -1617801 -1593559 -1582738 -1584471
16371 -1584471 -1594187 -1559233 -1524513 -1557570 -1504487 -1525001 -1488711 -1491599 -1425027 -1457210 -1430016 -1326847
16359 -1326847 -1319024 -1321573 -1370379 -1332201 -1245996 -1219064 -1193282 -1231792 -1211727 -1138855 -1113148 -1138131
16347 -1138131 -1115451 -1092723 -1131588 -1048806 -1039243 -978360 -1009424 -933325 -980041 -964615 -938010
16336 -938010 -960552 -916899 -840252 -789938 -819642 -788059 -824911 -783208 -796731 -669601 -683192
16325 -683192 -661385 -711093 -736414 -712414 -634978 -569274 -544955 -544766 -519209 -550635 -503127 -569739
16313 -569739 -490855 -484115 -435048 -436112 -432914 -438607 -420580 -341348 -402779 -417357 -397992 -339334
16301 -339334 -327359 -307514 -332912 -223375 -167670 -163686 -117920 -147065 -194944 -244476 -234302
16290 -234302 -165546 -105962 -111384 -63658 -83620 -128200 -101356 -78685 21048 -16099 56167 45306
16278 45306 37045 -79908 -9453 8320 82588 151533 208907 193281 177351 122668 192110 258148
16266 258148 215110 240699 260767 179508 300123 334342 312690 351686 310762 225646 342097
16255 342097 401994 418614 404279 350752 373629 435284 435185 456483 496216 464799 443664 483827
16243 483827 517844 555331 595859 507200 480231 577681 614444 664837 623645 632758 665261 640272
16231 640272 650143 635845 705770 602649 634718 663009 798361 719126 706190 732350 720183
16220 720183 706791 751296 843852 871987 808013 749317 783940 794267 770403 778658 757687 763373
16208 763373 810213 794883 863183 882712 893350 913667 848527 850620 910479 910734 935723 941170
16196 941170 998084 934864 969380 1044000 941106 913009 948272 943209 847394 841749 1016763
16185 1016763 1046822 1002886 982422 912733 1003949 1113335 1076039 1027449 980752 1002718 1094641
16174 1094641 1172494 1085781 1051668 1074986 1130988 1064723 1141735 1194515 1171482 1170443 1073409
16163 1073409 1061968 1137772 1190630 1185083 1187637 1256275 1204829 1176001 1147154 1181909 1245501 1196632
16151 1196632 1244426 1175064 1239912 1201149 1156854 1203972 1209321 1179745 1218141 1259223 1217158
16140 1217158 1251389 1231839 1255236 1259622 1281379 1414733 1318092 1233591 1262426 1269205 1338028
16129 1338028 1320572 1293792 1335267 1285024 1205647 1307314 1257572 1294139 1359074 1300152 1271860
16118 1271860 1168756 1223526 1257108 1275208 1288680 1286797 1285025 1224342 1251080 1351831 1294107
16107 1294107 1340121 1270411 1321504 1351700 1293114 1343425 1358446 1352087 1395568 1437288 1422729
16096 1422729 1398846 1351500 1321390 1243843 1277805 1404445 1408079 1422317 1420372 1450088 1337677
16085 1337677 1365181 1473170 1451721 1357474 1386536 1402027 1445453 1371832 1400793 1451601 1448667
16074 1448667 1365563 1284388 1319270 1426048 1381600 1362737 1421113 1467871 1457543 1454129 1440322
16063 1440322 1451010 1404726 1367746 1330630 1356616 1307338 1400113 1405434 1411862 1423888 1385294 1429149
16051 1429149 1331533 1348922 1357554 1426204 1394229 1346860 1302198 1451830 1499702 1414482 1405592
16040 1405592 1442895 1445251 1440775 1434227 1507844 1468155 1340584 1358479 1412428 1460987 1420163 1340481
16028 1340481 1435105 1415575 1463350 1456292 1366958 1343256 1410481 1420806 1475756 1424759 1412498
16017 1412498 1456275 1482939 1417391 1430803 1366714 1358285 1358080 1372486 1452002 1487202 1348161 1479303
16005 1479303 1453858 1460566 1455436 1479839 1449442 1447220 1544275 1536747 1535870 1457650 1448950 1407441 1455244
15992 1455244 1492454 1427164 1398504 1380888 1411015 1418005 1476843 1484893 1491867 1408290 1416112 1460600
15980 1460600 1507660 1530737 1532865 1510998 1442960 1407138 1357029 1507294 1485479 1369585 1425700
15969 1425700 1465878 1426172 1408934 1520438 1483734 1486012 1516621 1384630 1396959 1451880 1396357
15958 1396357 1378507 1486063 1434395 1479707 1483725 1484772 1472920 1476096 1478321 1466288 1489517 1481357
15946 1481357 1543172 1458804 1370850 1369814 1433217 1480863 1413159 1461612 1519257 1505440 1520790
15935 1520790 1503618 1486376 1356700 1348507 1412661 1368564 1399257 1406323 1570685 1424595 1367996
15924 1367996 1396159 1417202 1430930 1541161 1515938 1468608 1566504 1536059 1426937 1391889 1383919
15913 1383919 1382941 1481384 1526939 1474031 1461966 1401782 1549171 1547604 1449145 1508942 1509353 1446291
15901 1446291 1436966 1441595 1477465 1410247 1497756 1554175 1433172 1422151 1378200 1399856 1391711 1340466
15889 1340466 1493288 1428490 1385614 1363350 1421287 1523116 1521023 1402824 1397881 1401889 1449132
15878 1449132 1385708 1353939 1397925 1440177 1475781 1510959 1527705 1373634 1522241 1443122 1378761
15867 1378761 1298731 1385192 1495665 1391818 1399380 1404323 1289936 1336224 1468294 1413610 1434472
15856 1434472 1444879 1398882 1452222 1409476 1393700 1459299 1467584 1356889 1411401 1377843 1449438
15845 1449438 1458053 1446852 1532519 1476379 1493945 1528035 1431792 1403822 1428100 1466752 1537379
15834 1537379 1505684 1530665 1516897 1424702 1430472 1517029 1495788 1404713 1414967 1409626 1382192 1420079
15822 1420079 1505123 1447755 1444035 1467591 1472013 1463482 1521639 1538671 1529355 1409976 1377311 1500817
15810 1500817 1536102 1524309 1436536 1461235 1432185 1473861 1512304 1445900 1401815 1367288 1354073
15799 1354073 1387888 1372642 1356876 1446449 1568345 1644956 1597486 1415006 1424777 1415497 1420957
15788 1420957 1410526 1372678 1406591 1411110 1458712 1469751 1539536 1543400 1556581 1558675 1552252 1502189
15776 1502189 1483726 1477261 1469841 1524149 1550079 1527855 1556211 1430519 1369952 1477059 1503569
15765 1503569 1574347 1513545 1453717 1467734 1453613 1445144 1401058 1495623 1509607 1508113 1474601 1468627
15753 1468627 1535313 1511820 1419556 1452548 1492801 1443562 1334983 1374769 1475384 1411468 1485742
15742 1485742 1493872 1359628 1496589 1576643 1412467 1502196 1501246 1392924 1321731 1373264 1424744
15731 1424744 1425764 1486948 1535167 1463141 1344296 1439461 1323539 1379203 1496270 1407435 1467419
15720 1467419 1517693 1561909 1542393 1472433 1383639 1415647 1484207 1544042 1440933 1429078 1557374
15709 1557374 1503074 1487586 1546878 1424443 1479651 1447603 1473878 1505433 1469386 1493620 1436796
15698 1436796 1378851 1450420 1520508 1557346 1509556 1389313 1468038 1413426 1384046 1468829 1465593
15687 1465593 1407470 1523360 1527864 1463675 1401150 1403634 1364158 1334079 1343105 1415588 1417446 1380856
15675 1380856 1363752 1412636 1431269 1363161 1395840 1397621 1380859 1455740 1414907 1387475 1463483
15664 1463483 1440597 1380464 1450304 1531701 1507888 1465609 1494797 1484919 1406057 1479343 1503709
15653 1503709 1478519 1346645 1411160 1491326 1477188 1446155 1435288 1409468 1432303 1390477 1417615
15642 1417615 1380069 1407270 1409513 1429928 1525800 1493756 1423143 1417735 1510686 1482535 1425373 1407546
15630 1407546 1525205 1537901 1544590 1565398 1432882 1478539 1487013 1376752 1411707 1540667 1630224
15619 1630224 1529506 1484984 1445306 1354347 1326642 1453400 1423340 1425664 1455277 1453740 1448468
15608 1448468 1395675 1476828 1510607 1489158 1467472 1509231 1415624 1468823 1467394 1498078 1470956
15597 1470956 1326113 1427945 1378667 1406017 1476216 1466564 1493022 1470659 1428105 1415345 1469139
15586 1469139 1531365 1527979 1565800 1607262 1533748 1534846 1522408 1507554 1463724 1450045 1479401 1446698
15574 1446698 1548090 1571034 1546857 1545115 1525064 1521790 1377897 1467923 1557086 1492360 1466593
15563 1466593 1450436 1517636 1543045 1491698 1520586 1454819 1466414 1535904 1530439 1601149 1496815
15552 1496815 1541255 1560041 1555560 1549679 1540985 1526792 1464700 1454479 1555328 1541702 1407142
15541 1407142 1405640 1388219 1355270 1489475 1450904 1524224 1425818 1382793 1449289 1440977 1530402
15530 1530402 1471529 1498307 1496293 1363369 1410192 1494039 1505633 1554969 1540993 1512716 1478480
15519 1478480 1475041 1568848 1549328 1525908 1633274 1612638 1484428 1501320 1576883 1593635 1578322
15508 1578322 1450815 1502621 1607437 1537520 1496574 1510432 1395541 1484773 1443909 1370652 1431918
15497 1431918 1387558 1321134 1445496 1493028 1504977 1522644 1548273 1475766 1456402 1485221 1441722
15486 1441722 1500220 1508077 1503256 1550649 1469572 1372401 1439977 1570866 1530062 1528333 1475646 1536830
15474 1536830 1534566 1356910 1372146 1467904 1471339 1400614 1434449 1458080 1531286 1529794 1510357 1544296
15462 1544296 1501042 1510593 1474692 1539339 1476232 1459109 1560791 1494334 1501735 1532674 1462254
15451 1462254 1446508 1479457 1444703 1447286 1403354 1445638 1502392 1536073 1526464 1556420 1603777 1554264
15439 1554264 1422944 1608174 1466177 1510766 1514848 1387508 1445360 1467491 1361397 1403852
15429 1403852 1494788 1504026 1489659 1462245 1481973 1374589 1490352 1593349 1562777 1595390 1588220
15418 1588220 1568918 1474465 1487172 1566423 1475404 1471614 1496576 1528450 1470528 1531603 1558553
15407 1558553 1519747 1477318 1507755 1537216 1496929 1468593 1494370 1454526 1461341 1544052 1484542
15396 1484542 1606275 1567342 1528728 1588484 1591178 1555743 1608786 1560571 1512206 1495928 1452353
15385 1452353 1532646 1474624 1471967 1430164 1528141 1548652 1496109 1553987 1589710 1570592 1464492
15374 1464492 1475818 1523980 1580363 1542737 1520319 1528258 1449988 1457292 1488543 1603833 1499689
15363 1499689 1392084 1436792 1501619 1427393 1525865 1531923 1446039 1460202 1509346 1483813 1503933
15352 1503933 1526234 1535582 1529836 1432759 1511002 1517943 1499396 1501512 1538491 1519394 1518735 1482529
15340 1482529 1480048 1416050 1386635 1461705 1620022 1575017 1539506 1513831 1513546 1499275 1502438 1532371
15328 1532371 1544038 1523864 1502705 1477204 1449654 1466607 1481059 1523730 1575884 1641735 1545156
15317 1545156 1533127 1550382 1537363 1550295 1486572 1487041 1552685 1497216 1510813 1427922 1428511 1439129
15305 1439129 1444978 1504916 1552675 1572889 1606245 1601138 1599004 1567326 1574395 1561277 1577444 1617749
15293 1617749 1539157 1537527 1471582 1591607 1599189 1470173 1464395 1497931 1567500 1461157 1445094
15282 1445094 1460424 1504535 1548558 1684435 1641250 1506193 1513933 1563415 1580044 1535964 1502902
15271 1502902 1593269 1457610 1479235 1540198 1545498 1593791 1581188 1517297 1466193 1467045 1415601 1466678
15259 1466678 1512911 1489141 1483124 1490852 1527449 1555774 1560136 1483914 1507115 1560616 1437887 1515947
15247 1515947 1638307 1531885 1455692 1546171 1535839 1474296 1492793 1579947 1499113 1572521 1537130
15236 1537130 1494834 1426030 1430015 1541324 1480062 1476151 1487311 1567052 1476525 1419036 1531543
15225 1531543 1453898 1485149 1540710 1522185 1433786 1400718 1463335 1443879 1496636 1499323 1469651
15214 1469651 1499259 1388205 1458131 1519582 1482606 1437393 1482640 1463225 1484869 1456727 1509030
15203 1509030 1508532 1551854 1649016 1548190 1474678 1529470 1559739 1540900 1629308 1620357 1548484 1510402
15191 1510402 1562309 1516962 1499162 1548183 1551624 1574245 1546853 1512537 1532947 1634471 1540980
15180 1540980 1573875 1690432 1531556 1521100 1573281 1553624 1507814 1484336 1478838 1470534 1526583
15169 1526583 1465909 1492090 1553516 1531757 1472137 1467891 1551209 1499098 1546851 1544023 1567890 1514811
15157 1514811 1488609 1436193 1386991 1475668 1498574 1511464 1536014 1526328 1482385 1544897 1651354
15146 1651354 1525622 1470935 1507813 1476666 1522754 1517111 1502868 1582098 1622850 1530321 1553472
15135 1553472 1495503 1572604 1634893 1608529 1565317 1533443 1416135 1401145 1527755 1527250 1568458
15124 1568458 1557122 1459069 1438403 1485152 1542453 1465591 1531425 1543776 1528465 1494163 1526853
15113 1526853 1505250 1637951 1691391 1533382 1582816 1534051 1574074 1559525 1511231 1484240 1576398
15102 1576398 1572287 1565041 1605122 1650408 1529616 1504627 1583770 1554248 1523798 1492076 1502921
15091 1502921 1508983 1537307 1601419 1610943 1529988 1581921 1637653 1507632 1483248 1545639 1531493
15080 1531493 1536505 1604381 1560742 1640477 1609798 1516597 1503627 1513928 1558338 1617544 1575017
15069 1575017 1556146 1584450 1507866 1553728 1580400 1431400 1519058 1450209 1499993 1598907 1620369
15058 1620369 1596352 1602977 1640881 1619100 1663639 1720330 1614165 1464442 1581739 1539874 1468232
15047 1468232 1557670 1589608 1622623 1621199 1595680 1640270 1599826 1577617 1643524 1513884 1461192
15036 1461192 1555129 1609843 1598571 1661717 1613801 1684316 1669796 1645498 1637746 1574537 1523394
15025 1523394 1519698 1495786 1563549 1582654 1582741 1445986 1453657 1493330 1562352 1688831 1578401 1602092
15013 1602092 1672710 1699980 1578286 1551781 1548440 1569708 1526901 1619773 1543689 1532183 1499752
15002 1499752 1593727 1583653 1513089 1430665 1464323 1531167 1525313 1534806 1450383 1468272 1495896 1539457
14990 1539457 1562615 1537826 1595170 1558295 1474250 1492732 1681281 1716830 1530503 1452032 1467697
14979 1467697 1518393 1625130 1724248 1690339 1633766 1553930 1549578 1508718 1545542 1638641 1594815
14968 1594815 1578424 1595467 1634531 1678467 1677228 1702968 1778419 1721098 1639305 1684743 1683184 1589455
14956 1589455 1591606 1477023 1429957 1517081 1585838 1511068 1648663 1788222 1716939 1563250 1598776
14945 1598776 1613675 1547563 1635399 1700528 1611766 1515908 1566104 1539683 1573817 1606151 1641936
14934 1641936 1546863 1524979 1536352 1532977 1504748 1513559 1597727 1550115 1593655 1601568 1657857 1576880
14922 1576880 1610896 1535537 1553494 1597241 1596453 1581485 1474947 1479268 1525207 1523538 1557212 1524570
14910 1524570 1513646 1595450 1505235 1484156 1526458 1624899 1594090 1625206 1611829 1570164 1487602
14899 1487602 1489817 1612328 1616031 1565383 1574038 1629277 1572989 1516375 1516809 1566902 1550282 1616727
14887 1616727 1517438 1588639 1583471 1523931 1535642 1631359 1521079 1586073 1610884 1622223 1627648
14876 1627648 1528864 1619838 1587692 1576642 1526688 1539624 1530020 1582916 1617768 1656739 1622311
14865 1622311 1661120 1557972 1517830 1577458 1529369 1466578 1596861 1581503 1562265 1528322 1548016
14854 1548016 1580748 1596188 1620023 1666016 1674372 1601340 1562014 1564344 1535136 1544817 1549399 1507519
14842 1507519 1530915 1620713 1559469 1508181 1534170 1510107 1553646 1477270 1527309 1556684 1519750
14831 1519750 1605852 1621116 1561630 1585542 1606431 1521481 1594133 1596047 1606669 1595254 1574910
14820 1574910 1633265 1631514 1592154 1648693 1627423 1618110 1608154 1654474 1559089 1523776 1570558 1630419
14808 1630419 1550467 1589549 1537702 1569907 1627223 1541281 1551005 1600901 1540314 1593634 1670717
14797 1670717 1678569 1554918 1505960 1508946 1558506 1604274 1678453 1589202 1554350 1535666 1544706 1504835
14785 1504835 1554975 1625073 1641499 1568061 1601188 1617701 1546788 1468032 1451817 1600553 1703978
14774 1703978 1674281 1565598 1630354 1504714 1567268 1520698 1605086 1647872 1524128 1527628 1587147
14763 1587147 1584026 1614321 1564767 1600587 1604228 1669349 1763614 1678119 1630033 1651287 1594779 1567345
14751 1567345 1534153 1570074 1520778 1501829 1526927 1601250 1657303 1609400 1572311 1618892 1586705
14740 1586705 1528728 1581932 1669934 1599193 1659524 1676883 1596462 1651861 1630208 1539208 1565761
14729 1565761 1549833 1518586 1497064 1573993 1688498 1602899 1497415 1550849 1538550 1568991 1596826
14718 1596826 1582441 1602427 1689278 1566381 1597417 1640578 1694514 1662340 1716263 1650600 1622440
14707 1622440 1577739 1554131 1543502 1605301 1634499 1604638 1557554 1602518 1556253 1589358 1598704
14696 1598704 1713755 1599949 1669475 1554538 1466744 1560554 1548737 1617962 1648014 1576998 1626709
14685 1626709 1757847 1681405 1699555 1685483 1592242 1615429 1594347 1612675 1668937 1619003 1629958
14674 1629958 1557115 1559510 1502270 1524734 1522190 1549671 1496834 1594360 1586414 1626887 1632444 1669533
14662 1669533 1553029 1540389 1502608 1487609 1512302 1540209 1506621 1538625 1614156 1628982 1634480
14651 1634480 1521841 1565623 1678183 1593106 1616505 1588455 1589032 1513934 1559990 1490375 1526921
14640 1526921 1561394 1613910 1678677 1662350 1627063 1687159 1624531 1547292 1625780 1621273 1697805
14629 1697805 1716854 1650310 1635050 1627194 1664148 1633671 1622788 1538107 1608944 1527949 1620016
14618 1620016 1579353 1628787 1578147 1478622 1458497 1469693 1673207 1560464 1552550 1569726 1602953
14607 1602953 1628107 1651348 1690507 1664850 1666940 1675456 1598181 1572606 1582589 1637228 1595342 1644601
14595 1644601 1690770 1629546 1558914 1692793 1654500 1583137 1566631 1576497 1618682 1667880 1581736
14584 1581736 1540522 1624777 1623351 1715384 1648269 1645812 1617589 1575556 1617656 1572460 1571164 1648158
14572 1648158 1644718 1608803 1564836 1554518 1457823 1462285 1595695 1554192 1572446 1628904 1536856
14561 1536856 1456664 1615751 1733388 1707332 1650801 1561400 1743600 1810928 1720660 1707317 1678752
14550 1678752 1634142 1631709 1636959 1561638 1449214 1519820 1638955 1579884 1592159 1579840 1634939
14539 1634939 1671942 1586985 1534818 1593017 1612633 1555708 1544901 1634296 1615082 1667324 1617222
14528 1617222 1717305 1667242 1624275 1656128 1654196 1595116 1587271 1632467 1572644 1595683 1577656
14517 1577656 1655436 1626495 1605138 1646325 1634777 1567125 1553817 1552269 1572658 1712121 1663511
14506 1663511 1630210 1572296 1630757 1669248 1657473 1671222 1723379 1552902 1524409 1616349 1630412
14495 1630412 1590895 1681784 1727250 1659653 1728452 1617836 1574290 1628100 1709097 1692348 1693510
14484 1693510 1618290 1622332 1587010 1554814 1637302 1597266 1623542 1636928 1640676 1592888 1578738 1640717
14472 1640717 1574560 1618576 1671460 1602488 1551808 1594230 1649968 1671389 1627755 1630239 1652118
14461 1652118 1601296 1591899 1548841 1691298 1734009 1672353 1621154 1602747 1643305 1711732 1688529
14450 1688529 1561438 1658125 1573144 1569936 1663583 1641004 1719314 1705894 1662924 1748950 1767597
14439 1767597 1570646 1604244 1697054 1650735 1709404 1670943 1617864 1589729 1663023 1634214 1619852
14428 1619852 1642529 1710435 1660974 1627796 1703427 1633016 1635632 1573271 1681551 1669052 1719942
14417 1719942 1676221 1637599 1644478 1666978 1699181 1616172 1606647 1623626 1682328 1648611 1578374 1571862
14405 1571862 1609914 1627357 1657348 1611370 1725845 1686584 1582783 1649981 1653607 1658296 1616715
14394 1616715 1610125 1555564 1599050 1663678 1603387 1670711 1630903 1636970 1597381 1616558 1608165 1590980
14382 1590980 1605844 1676454 1622284 1657344 1764225 1693637 1666510 1648730 1676758 1587915 1648024
14371 1648024 1687558 1653062 1646364 1626761 1660862 1631589 1649164 1656819 1662651 1697822 1724278 1586254
14359 1586254 1643779 1631556 1669871 1663217 1642241 1760580 1670156 1624183 1513805 1609818 1585341
14348 1585341 1591576 1592953 1651262 1670699 1646105 1678983 1601194 1626245 1702078 1755626 1626700
14337 1626700 1706837 1603695 1678545 1690488 1619797 1668963 1576225 1651746 1654654 1653734 1699770 1675249
14325 1675249 1670028 1735781 1660881 1752696 1665535 1789496 1738151 1670783 1794937 1675683 1677808
14314 1677808 1717197 1763201 1678515 1608394 1656019 1715795 1655065 1651215 1595789 1573605 1620546
14303 1620546 1589336 1678235 1788747 1649348 1687272 1670896 1751055 1686496 1714040 1658799 1614836
14292 1614836 1621318 1621578 1588318 1504653 1549788 1773176 1786725 1654237 1642249 1644687 1545211 1614325
14280 1614325 1573884 1612304 1619386 1585306 1655261 1760028 1637064 1702755 1799284 1653242 1640422
14269 1640422 1603071 1724520 1628922 1752018 1640750 1695107 1653547 1621838 1713984 1728198 1733889
14258 1733889 1724114 1648533 1660859 1679854 1640825 1656011 1654839 1630479 1631216 1726013 1782352 1691661
14246 1691661 1631628 1629216 1643598 1604537 1657371 1719195 1693400 1576082 1716316 1678604 1664104
14235 1664104 1707589 1773523 1744525 1694031 1655522 1666946 1664434 1654021 1611822 1635714 1667820
14224 1667820 1670580 1671578 1684497 1721655 1788227 1829199 1785810 1700900 1649933 1607827 1623517 1622673
14212 1622673 1727414 1695338 1686741 1728103 1659065 1809622 1666487 1665892 1722231 1764940 1708563
14201 1708563 1718218 1787960 1634832 1633341 1675443 1640257 1639460 1734490 1752482 1581850 1619526 1696313
14189 1696313 1692826 1603698 1526120 1665964 1685089 1612252 1662934 1675694 1676447 1729376 1747492 1657825
14177 1657825 1650999 1661056 1713850 1755273 1636558 1599796 1623006 1658277 1643200 1694181 1690232
14166 1690232 1715174 1688051 1670480 1712454 1691672 1768457 1694686 1642420 1655631 1621905 1647268
14155 1647268 1701653 1727344 1773527 1672011 1740493 1764528 1755889 1701090 1710171 1670279 1625102
14144 1625102 1712064 1778339 1731755 1690070 1677361 1706071 1663463 1675485 1733808 1705814 1683953
14133 1683953 1693270 1704226 1719593 1710836 1716954 1658879 1577379 1649564 1611036 1739004 1785851 1758151
14121 1758151 1775886 1749744 1800932 1724712 1643964 1774207 1732142 1647788 1720581 1677338 1746977
14110 1746977 1674155 1632464 1575527 1800071 1754056 1690650 1681514 1642891 1634603 1580538 1708201
14099 1708201 1685303 1652270 1688657 1728682 1720100 1756139 1635465 1630886 1671449 1645766 1683268
14088 1683268 1662959 1684514 1768507 1701338 1678670 1715782 1681190 1665351 1611573 1651985 1706567
14077 1706567 1685892 1666879 1681623 1614847 1718744 1736445 1645954 1650937 1642053 1722063 1680138
14066 1680138 1575022 1586129 1683889 1604950 1650268 1646582 1723994 1696948 1722926 1791168 1758815
14055 1758815 1789054 1696121 1611791 1706228 1594654 1528727 1583141 1620689 1572422 1690866 1724977
14044 1724977 1664814 1656215 1720647 1697887 1699852 1675515 1702621 1762394 1693299 1681159 1639282 1722456
14032 1722456 1754892 1815486 1740826 1652657 1719076 1676272 1692730 1743347 1703106 1765476 1738131
14021 1738131 1800643 1790524 1742024 1716053 1637999 1573737 1722123 1793327 1761432 1758458 1770564
14010 1770564 1727419 1691201 1690964 1673028 1678263 1649950 1778167 1757727 1734601 1772029 1640837
13999 1640837 1684584 1728610 1738203 1695932 1604513 1621444 1731151 1735832 1708991 1713250 1707651 1652611
13987 1652611 1655563 1704310 1734364 1692029 1701839 1764340 1705554 1686826 1821624 1776862 1786131 1735484
13975 1735484 1695092 1710132 1657946 1741773 1779364 1798919 1671399 1718706 1756866 1734269 1663483
13964 1663483 1723656 1809236 1722111 1682954 1704446 1677185 1700360 1624323 1719540 1692068 1714585
13953 1714585 1703448 1766216 1799739 1724828 1717920 1688202 1671910 1726837 1725276 1711215 1708473 1651794
13941 1651794 1675757 1669017 1674673 1660012 1637410 1597954 1673682 1744420 1731729 1778210 1734968 1667832
$$ [...]
##END NTUPLES=NMR SPECTRUM
##END=
