##TITLE=1H_CA-9279-2
 DMSO-d6
 8 sc, 
 9.10.2024
##JCAMPDX= 6.0         $$ Bruker NMR JCAMP-DX V2.0
##DATA TYPE= NMR SPECTRUM
##DATA CLASS= NTUPLES
##ORIGIN= UXNMR, Bruker Analytische Messtechnik GmbH
##OWNER= root
$$ XWIN-NMR		Version 3.5
$$ Wed Oct  9 14:10:48 2024 Russian Standard Time (UT+4h)  she@DPX200
##.OBSERVE FREQUENCY= 200.1318
##.OBSERVE NUCLEUS= ^1H
##.ACQUISITION MODE= SIMULTANEOUS
##.ACQUISITION SCHEME= undefined
##.AVERAGES= 8
##.DIGITISER RES= 18
##SPECTROMETER/DATA SYSTEM= spect
##.PULSE SEQUENCE= zg30
##.SOLVENT NAME= DMSO
##.SHIFT REFERENCE= (INTERNAL, DMSO, 0, 21.0164)
##AUDIT TRAIL= $$ (NUMBER, WHEN, WHO, WHERE, WHAT)
$$ ##TITLE= Audit trail, XWIN-NMR		Version 3.5
$$ ##JCAMPDX= 5.01
$$ ##ORIGIN= Bruker BioSpin GmbH
$$ ##OWNER= she
$$ F:/spectra/data/she/nmr/H-F/1/pdata/1/auditp.txt
$$ ##AUDIT TRAIL=  $$ (NUMBER, WHEN, WHO, WHERE, WHAT)
(   1,<2024-10-09 14:09:10.01 +0400>,<she>,<DPX200>,
      <created by zg, POWCHK disabled, PULCHK disabled
       configuration hash MD5:
       00 E9 B6 7A A2 85 ED C7 34 08 36 98 17 FE 4E 26
       data hash MD5: 16K
       56 58 C7 FB A5 9A 2E CF 10 C6 7B 66 8E 2C 6E ED>)
(   2,<2024-10-09 14:09:24.03 +0400>,<she>,<DPX200>,
      <Start of raw data processing
       efp BC_mod = 2 LB = 0.24 FT_mod = 6 PKNL = 1 PHC0 = -26511.31 PHC1 = 24.58743 SI = 16K 
       data hash MD5: 16K
       00 30 3A 2F 0C A2 10 CC 54 31 CE 93 E5 D7 D3 8A>)
(   3,<2024-10-09 14:09:44.18 +0400>,<she>,<DPX200>,
      <pk PHC0 = -5.914666 PHC1 = 0.9999999 
       data hash MD5: 16K
       94 21 1B A3 64 14 AD FF 82 06 22 E0 39 81 7A 12>)
(   4,<2024-10-09 14:09:48.07 +0400>,<she>,<DPX200>,
      <abs ABSG = 5 
       data hash MD5: 16K
       C2 9F 1D A1 9D E3 B4 77 60 B1 82 9B 8E ED 1D 3C>)
$$ ##END=
$$ 
$$ hash MD5
$$ 3F B4 A3 8E CB 4C E3 5F BA F4 A5 EC F6 BE 15 01
##$RELAX= 
##$RELAX= 
##$RELAX= 
##$RELAX= 
##$RELAX= 
##$RELAX= 
$$ Bruker specific parameters
$$ --------------------------
##$DU= <F:/spectra>
##$EXPNO= 1
##$NAME= <H-F>
##$PROCNO= 1
##$TYPE= <nmr>
##$USER= <she>
##$AMP= (0..31)
100 100 100 100 100 100 100 100 100 100 100 100 100 100 100 100 100 100 
100 100 100 100 100 100 100 100 100 100 100 100 100 100 
##$AQSEQ= 0
##$AQ_mod= 1
##$AUNM= <au_zg>
##$AUTOPOS= <>
##$BF1= 200.13
##$BF2= 200.13
##$BF3= 200.13
##$BF4= 200.13
##$BF5= 200.13
##$BF6= 200.13
##$BF7= 200.13
##$BF8= 200.13
##$BYTORDA= 1
##$CFDGTYP= 0
##$CFRGTYP= 5
##$CHEMSTR= <none>
##$CNST= (0..31)
1 1 145 1 1 1 1 1 1 1 1 1 1 1 1 1 1 1 1 1 1 1 1 1 1 1 1 1 1 1 1 1 
##$CPDPRG= <>
##$CPDPRG1= <>
##$CPDPRG2= <>
##$CPDPRG3= <>
##$CPDPRG4= <mlev>
##$CPDPRG5= <mlev>
##$CPDPRG6= <mlev>
##$CPDPRG7= <mlev>
##$CPDPRG8= <mlev>
##$CPDPRGB= <>
##$CPDPRGT= <>
##$D= (0..31)
0 1.2 0 0 0 0 0 0 0 0.06 0 0.03 0 0 0 0 0.0002 0 0 0 0 0 0 0 0 0 0 0 0 
0 0 0 
##$DATE= 1728468549
##$DBL= (0..7)
120 120 120 120 120 120 120 120 
##$DBP= (0..7)
150 150 150 150 150 150 150 150 
##$DBP07= 0
##$DBPNAM0= <>
##$DBPNAM1= <>
##$DBPNAM2= <>
##$DBPNAM3= <>
##$DBPNAM4= <>
$$ [...]
##$SUBNAM3= <"">
##$SUBNAM4= <"">
##$SUBNAM5= <"">
##$SUBNAM6= <"">
##$SUBNAM7= <"">
##$SUBNAM8= <"">
##$SUBNAM9= <"">
##$SW= 24.0689170037331
##$SWIBOX= (0..15)
0 0 2 0 0 0 0 0 0 0 0 0 0 0 0 0 
##$SW_h= 4816.95568400771
##$TD= 16384
##$TD0= 1
##$TE= 0
##$TE2= 300
##$TE3= 300
##$TEG= 300
##$TL= (0..7)
0 120 120 120 120 120 120 120 
##$TP= (0..7)
150 150 150 150 150 150 150 150 
##$TP07= 0
##$TPNAME0= <>
##$TPNAME1= <>
##$TPNAME2= <>
##$TPNAME3= <>
##$TPNAME4= <>
##$TPNAME5= <>
##$TPNAME6= <>
##$TPNAME7= <>
##$TPOAL= (0..7)
0.5 0.5 0.5 0.5 0.5 0.5 0.5 0.5 
##$TPOFFS= (0..7)
0 0 0 0 0 0 0 0 
##$TUNHIN= 0
##$TUNHOUT= 0
##$TUNXOUT= 0
##$USERA1= <user>
##$USERA2= <user>
##$USERA3= <user>
##$USERA4= <user>
##$USERA5= <user>
##$V9= 5
##$VALIST= <valist>
##$VCLIST= <CCCCCCCCCCCCCCC>
##$VD= 0
##$VDLIST= <DDDDDDDDDDDDDDD>
##$VPLIST= <PPPPPPPPPPPPPPP>
##$VTLIST= <TTTTTTTTTTTTTTT>
##$WBST= 1024
##$WBSW= 4
##$XGAIN= (0..3)
0 0 0 0 
##$XL= 0
##$YL= 0
##$YMAX_a= 332605
##$YMIN_a= -303205
##$ZGOPTNS= <>
##$ZL1= 120
##$ZL2= 120
##$ZL3= 120
##$ZL4= 120
##$ABSF1= 21.09282
##$ABSF2= -2.976316
##$ABSG= 5
##$ABSL= 3
##$ALPHA= 0
##$AQORDER= 0
##$ASSFAC= 0
##$ASSFACI= 0
##$ASSFACX= 0
##$ASSWID= 0
##$AUNMP= <proc_1d>
##$AZFE= 0.1
##$AZFW= 0.1
##$BCFW= 0
##$BC_mod= 2
##$BYTORDP= 0
##$COROFFS= 0
##$CY= -3
##$DATMOD= 1
##$DC= 0
##$DFILT= <>
##$DTYPP= 0
##$F1P= 0
##$F2P= 0
##$FCOR= 1
##$FTSIZE= 16384
##$FT_mod= 6
##$GAMMA= 0
##$GB= 0
##$INTBC= 1
##$INTSCL= 3.70164e-10
##$ISEN= 128
##$LB= 0.24
##$LEV0= 0
##$LPBIN= 0
##$MAXI= 10000
##$MC2= 0
##$MEAN= 0
##$ME_mod= 0
##$MI= 1.114404
##$NCOEF= 0
##$NC_proc= -6
##$NLEV= 6
##$NOISF1= 3.799351
##$NOISF2= 2.8
##$NSP= 0
##$NTH_PI= 0
##$NZP= 0
##$OFFSET= 21.01642
##$PC= 1
##$PHC0= -26517.22
##$PHC1= 25.58743
##$PH_mod= 1
##$PKNL= yes
##$PPARMOD= 0
##$PSCAL= 0
##$PSIGN= 0
##$REVERSE= no
##$SF= 200.130002462499
##$SI= 16384
##$SIGF1= 3
##$SIGF2= 2
##$SINO= 5.538805
##$SIOLD= 16384
##$SREGLST= <1H.CDCl3>
##$SSB= 0
##$STSI= 16384
##$STSR= 0
##$SW_p= 4816.95568400771
##$SYMM= 0
##$S_DEV= 0
##$TDeff= 16384
##$TDoff= 0
##$TI= <>
##$TILT= no
##$TM1= 0
##$TM2= 0
##$TOPLEV= 0
##$USERP1= <user>
##$USERP2= <user>
##$USERP3= <user>
##$USERP4= <user>
##$USERP5= <user>
##$WDW= 1
##$XDIM= 16384
##$YMAX_p= 421247814
##$YMIN_p= -407512
$$ End of Bruker specific parameters
$$ ---------------------------------
##NTUPLES= NMR SPECTRUM
##VAR_NAME=  FREQUENCY,     SPECTRUM/REAL,   SPECTRUM/IMAG
##SYMBOL=    X,             R,               I
##VAR_TYPE=  INDEPENDENT,   DEPENDENT,       DEPENDENT
##VAR_FORM=  AFFN,          ASDF,            ASDF
##VAR_DIM=   16384,         16384,           16384
##UNITS=     HZ,            ARBITRARY UNITS, ARBITRARY UNITS
##FACTOR=    0.29402158847633, 1,            1
##FIRST=     4206.01625927626, 0,            0
##LAST=      -610.93942473145, 0,            0
##MIN=       -610.93942473145, -407512,      0
##MAX=       4206.01625927626, 421247814,    0
$$ Real data points
##PAGE= N=1
##DATA TABLE= (X++(R..R)), XYDATA
$$ [...]
6280A0372L0664K7713r3998M046J13679l5453j39680M6720K0315p8565J05438
$$ 10372 41036 68749 -25249 -21203 92476 57023 -82657 -35937 -15622 -94187 11251
6269A1251L1237J2365j02275J10293J3187q9614p4637M0814j0886N7040K1891
$$ 11251 42488 54853 -47422 62871 76058 -13556 -88193 -47379 -58265 -1225 20666
6258B0666l6750P3518l3796J5121p4904R5659p0787P2260R3779m2124n1894o8667
$$ 20666 -16084 57434 23638 38759 -36145 59514 -11273 60987 154766 112642 60748 -7919
6246g919O0739o1938P5078o3104J13977L7737j54583Q9403n2269n2485L7657J9546
$$ -7919 52820 -9118 65960 2856 116833 154570 -13 89390 37121 -15364 22293 41839
6234D1839R358k9251Q3665j0541p0857K5008J11551r4748J8286M0658r9830n9562
$$ 41839 51197 21946 105611 95070 24213 49221 160772 66024 84310 124968 25138 -34424
6222c4424J04707O6121J8666o8466L3604J0200k8080P3970O572j8058L6248j4710
$$ -34424 70283 136404 155070 86604 120208 130408 102328 176298 182870 164812 201060 186350
6210A86350N0545k9997J3715l6958J6361k4973J0353J6559l7856K3321p3986N6706
$$ 186350 236895 206898 220613 183655 200016 175043 185396 201955 164099 187420 113434 170140
6198A70140J25393J7678l9080R3293o6912l851o810J6319N2690N2522q3469R7972
$$ 170140 295533 313211 274131 367424 300512 296661 289851 306170 358860 411382 327913 425885
6186D25885M9499q168P4764J33468l1252K616K6717k5232P4163Q7164J43969M036
$$ 425885 475384 467216 541980 675448 644196 646812 673529 648297 722460 809624 953593 957629
6174I57629q381J07751L6149K0915j49248o0091J67780m9141p1407k5896L3992
$$ 957629 949248 1056999 1093148 1114063 964815 904724 1072504 1023363 951956 926060 960052
6163I60052k0242o8986q6640q5911J6752J12536L4053o3742P04r4667L116k2079
$$ 960052 939810 870824 784184 698273 715025 827561 861614 797872 798576 703909 707025 684946
6151F84946l9323k0591o7116M6029j43109K1394L0489q3628L3750K0301o7805
$$ 684946 645623 625032 557916 603945 460836 482230 512719 429091 462841 483142 415337
6140D15337n524p5952M004L0262k4983k0764j057j9062n8111p8539K7548l1513
$$ 415337 409813 333861 337865 368127 343144 322380 321323 302261 244150 165611 193159 161646
6128A61646l4391M5587K8909r820j02445J27300p0527k7186M2799J07514o5942
$$ 161646 127255 172842 201751 191931 89486 216786 146259 119073 161872 269386 203444
6117B03444o7313l0459O4232j6013j08880l0915Q1572O7046q8901J2606M6508
$$ 203444 136131 105672 169904 153891 45011 14096 95668 162714 73813 86419 132927
6106A32927L6337o6812J3166K8962K3855o1094j9310n6263p6735J68158K3340
$$ 132927 169264 102452 115618 144580 168435 107341 88031 31768 -44967 123191 146531
6095A46531j043K5013m6847r5216n0115P6169N1985k8685O1776m4992k6778N30
$$ 146531 145488 170501 123654 28438 -21677 54492 106477 77792 139568 94576 67798 68328
6083F8328K2918m3415p637M2069O1010o7563q2083K5313K8307l5544K1128j6989
$$ 68328 91246 47831 40194 82263 143273 75710 -6373 18940 47247 11703 32831 15842
6071A5842J1666P0649K0087N5270j33644M6907P4898j07031J13727O3486q5875
$$ 15842 27508 98157 118244 173514 39870 86777 161675 54644 168371 231857 145982
6060A45982L8937m8654o8432J9856j7684Q0826p1206j04739J2137P6788L7572
$$ 145982 184919 136265 67833 87689 70005 150831 79625 -25114 -12977 63811 101383
6049A01383P542l0335r4899P7022o8843J32353L2793K9559j43991m3835K1989
$$ 101383 108925 78590 -16309 60713 -8130 124223 157016 186575 42584 -1251 20738
6038B0738J1293L3954n585L4039j04631J45573l0583j13643N392M4049k0721k0837
$$ 20738 32031 65985 60400 94439 -10192 135381 104798 -8845 -3453 40596 19875 -962
6026i62J47184k2421o3282J6063M9525K3533m3791j2783k3901O769m3432P3498
$$ -962 146222 123801 60519 76582 126107 149640 105849 93066 69165 75934 32502 106000
6014A06000N936R4p170R893j06822M6260N8504J7188J4836l9661k4232J6800j6218
$$ 106000 111936 112030 104860 114753 7931 54191 112695 129883 144719 105058 80826 97626 81408
6001H1408L3968k9589j13134J64164m0307m9783M1363p7814j5272L7698K9815
$$ 81408 115376 85787 -27347 136817 96510 46727 88090 10276 -4996 32702 62517
5990F2517M4507j8592l7328k1488k0672R6033R3824j44002J6913m1649j5200Q3613
$$ 62517 107024 88432 51104 29616 8944 104977 198801 54799 71712 30063 14863 98476
5978I8476Q2983p5211m3508p8747n2589l2606R4771J01376j1145l5132N6719O2068
$$ 98476 181459 106248 62740 -16007 -68596 -101202 -6431 94945 83800 48668 105387 167455
5966A67455j40764K7110q3669P5424R0320r1400k9892p2332j8472l2250Q6557
$$ 167455 26691 53801 -29868 45556 135876 44476 14584 -57748 -76220 -108470 -21913
5955b1913l6474J1247n776Q5583o4290N2996L8430K1672l2402K7324k7713m414
$$ -21913 -58387 -47140 -52916 32667 -31623 21373 59803 81475 49073 76397 48684 44270
5943D4270J18549p7134K2891n5288Q4185k809l5180j5123N428j75323Q4931K347
$$ 44270 162819 85685 108576 53288 137473 134664 99484 84361 89789 -85534 -603 1744
5931A744k7059m0491M0016Q1857j12285J05923m2757K4421M5153p4854J49547
$$ 1744 -25315 -65806 -25790 56067 -56218 49705 6948 31369 76522 1668 151215
5920A51215J1245n9359K0829q641o6538M0685k7057n4307K1002l3172j5900L9043
$$ 151215 162460 103101 123930 115289 48751 89436 62379 8072 29074 -4098 -19998 19045
5908A9045Q865N00K93l750j7898j1710P3126m3320J1266N0227o376j4170K0236
$$ 19045 27910 28410 28703 24953 7055 -4655 68471 25151 36417 86644 80268 66098 86334
5895H6334j6485j9725l034J8349L5880j0443m9842M1051m7596j6951k5884J18052
$$ 86334 69849 50124 47090 65439 101319 90876 41034 82085 34489 17538 -8346 109706
5883A09706j6204M3340O155L1823j7348N4413J1035j60868l4184L2340P4740J07982
$$ 109706 93502 136842 142997 174820 157472 211885 222920 62052 27868 60208 134948 242930
5871B42930n9045N2778j0287j03181Q2883J17086L3560q4012K6934j7581P6320
$$ 242930 183885 236663 226376 123195 206078 323164 356724 272712 299646 282065 358385
5860C58385R2049j3158J27074r8948p1587N2318J2954J02995j26483q4305j13630
$$ 358385 450434 437276 564350 465402 393815 446133 459087 562082 435599 351294 237664
5849B37664p773O4537j9137q1690M1467P1464j2928P115N6393p9216j6789J9777
$$ 237664 229891 294428 275291 193601 235068 306532 293604 300719 357112 277896 261107 280884
5837B80884O116p141l2390n8652Q6904j54634J7907P6323n743j5968Q9620n7310
$$ 280884 287000 279859 247469 188817 275721 121087 138994 215317 209574 193606 283226 225916
5825B25916n6643Q0154o2097P17M6876p1920J22041N5974Q5358L0570n6385p0110
$$ 225916 169273 249427 187330 188047 234923 163003 285044 341018 426376 456946 400561 330451
5813C30451R6894j31773Q9062M5978J52100P1529m2751K9642J9983N269L4378
$$ 330451 427345 295572 384634 430612 582712 654241 611490 641132 661115 666384 700762
5802G00762N7055q421L3206l3225Q7503J18243R5409q6138j23212J8166M9066
$$ 700762 757817 749396 782602 749377 836880 955123 1050532 964394 841182 859348 908414
5791I08414n1088r6562o587m4611r4205j00262q3335M315k22423O6711Q3213n9603
$$ 908414 857326 760764 754177 709566 615361 515099 431764 436079 213656 280367 363580 303977
5779C03977j35388N2109K3758p4563j4733Q6403n6460O3333j15396k265k3267
$$ 303977 168589 220698 244456 169893 155160 241563 185103 248436 133040 130775 107508
5768A07508L8944m5612J08378q5187l9236P1890N7070m8800n7933k0857q1168
$$ 107508 146452 100840 209218 124031 84795 156685 213755 164955 107022 86165 4997
5757D997J7451l2383J03076m7563j6142k8041Q5708m4278J9425J6146o402M2139
$$ 4997 22448 -9935 93141 45578 29436 1395 87103 42825 62250 78396 71994 114133
5745A14133j53544p6099P9008P7783l753K8555o8423J8728L501M2055K8237q2322
$$ 114133 -39411 -115510 -36502 41281 37528 66083 -2340 16388 19889 61944 90181 7859
5733G859l3139L8135J9503k1596J3090p1046J7918L2512J6951l3038m2221P9j2452
$$ 7859 -25280 12855 32358 10762 23852 -47194 -29276 3236 20187 -12851 -55072 -54993 -67445
5720f7445J05368o1699O2611o7524l9937P5981k277m8125J2674L7811q887N5275
$$ -67445 37923 -23776 38835 -28689 -68626 7355 5078 -43047 -30373 7438 -1449 53826
5708E3826j05730O0394n113j6084n0379K0093R2895L6964j02214K97j4751n7922
$$ 53826 -51904 8490 3377 -12707 -63086 -42993 49902 86866 -15348 -15051 -29802 -87724
5696h7724K9605M1177j15527R7898J9377n6355N7762n3484p2891M5385P1982j7365
$$ -87724 -58119 -16942 -132469 -34571 -15194 -71549 -13787 -67271 -140162 -94777 -22795 -40160
5684d0160m6149j9645L6965J9184k1344r6404M7923M6495P2613L0395J392k7988
$$ -40160 -86309 -105954 -68989 -49805 -71149 -167553 -119630 -73135 -522 29873 31265 3277
5672C277k373q44P517L7239n4430j4081M3951j8569L2666K1740P659l6584m3390
$$ 3277 904 60 7577 44816 -9614 -23695 20256 1687 34353 56093 63752 27168 -16222
5659a6222p0489N8367J0224m8849N6353J43838q8657p3491l5903N2148K358k1641
$$ -16222 -86711 -28344 -18120 -66969 -10616 133222 44565 -28926 -64829 -12681 -10323 -31964
5647c1964P7601l8690N3096k5676j11898L9946J5837l7732K3406m5109J2292J34592
$$ -31964 45637 6947 60043 34367 -77531 -37585 -21748 -59480 -36074 -81183 -68891 65701
5635F5701l6366j6304R414p096m3017M4874j0829l983l1693k3841P176r107M8088
$$ 65701 29335 13031 22445 15349 -27668 17206 6377 2394 -29299 -53140 -45964 -55071 -6983
5622f983k0334j8837k1106J21415N6184p0350j01739j2649Q0869l919m321M7372
$$ -6983 -27317 -46154 -67260 54155 110339 39989 -61750 -74399 6470 2551 -1770 45602
5610D5602p6827k299L9377r735m4794K013R9936J9051r7275J1194N1234k9137
$$ 45602 -31225 -33524 5853 -3882 -48676 -46663 53273 72324 -24951 -13757 37477 8340
5598H340J4050m5368n489P3755o1182Q9544R941L5286n9686j1722j03344k7259
$$ 8340 22390 -22978 -28467 45288 -15894 73650 83591 118877 59191 47469 -55875 -83134
5586h3134J02069q5922J9535N1911n7136N5105O6985N1967j86285j2554L7391
$$ -83134 18935 -66987 -47452 4459 -52677 2428 69413 121380 -64905 -77459 -40068
5575d0068o0033O9305O8302K7945r78n5196k7329m9374j407L2067j8861N5358
$$ -40068 -100101 -30796 37506 65451 64473 9277 -18052 -67426 -68833 -36766 -55627 -269
5563b69M6531j01813P1309R1484r7803k1639l1346k2608O4620r485O7075k0571
$$ -269 46262 -55551 15758 107242 9439 -12200 -43546 -66154 -1534 -11019 56056 35485
5551C5485j4356Q6308q931j28624m0376l9998j20679P4060R2236J9641N8378m9107
$$ 35485 21129 107437 98506 -30118 -70494 -110492 -231171 -157111 -64875 -45234 13144 -35963
5539c5963N142K3321O355K2454L912m1734m5501J13875k7508j67969J11528J5509
$$ -35963 -30821 -7500 -1145 21309 25221 -16513 -62014 51861 24353 -143616 -32088 -16579
5527a6579J1613M5090k483l4574k434j7464j6090J3290j5828O4698l025l7693
$$ -16579 -4966 40124 37641 3067 633 -16831 -32921 -19631 -35459 29239 26214 -11479
5515a1479j4442K6215k6725K520P64j7413M5322k275J07450q6521O6883l8502
$$ -11479 -25921 294 -26431 -23911 -23147 -40560 4762 2487 109937 23416 90299 51797
5503E1797p1958P9363n0730N82K5371R1222p3632m3242j877P1046J8242K3484
$$ 51797 -20161 59202 8472 9054 34425 125647 52015 8773 6896 77942 96184 119668
5491A19668o5284J3805P398q3804r226p139n6853L3679r6024R2962J21803p7917
$$ 119668 54384 68189 75587 -8217 -17443 -24582 -81435 -47756 -143780 -50818 70985 -6932
5479f932j8009N6578o0419n7086j6048O3268J1165r816J9557N0393o7357P6805
$$ -6932 -24941 31637 -28782 -85868 -101916 -38648 -27483 -37299 -17742 32651 -34706 42099
5467D2099o8725O5913r712j8876L1478K3529n2670L1096K3591P0099r6205J0948
$$ 42099 -26626 39287 29575 10699 42177 65706 13036 44132 67723 137822 41617 52565
5455E2565n3383k3375k9504j7530n1627N4344J27669o8845j4155m6389l339J40329
$$ 52565 -818 -24193 -53697 -71227 -122854 -68510 59159 -9686 -23841 -70230 -73569 66760
5443F6760p5154J0938p850j6813J7777n2032j8021M0884N8772l6655M8125n178
$$ 66760 -8394 2544 -5306 -22119 -4342 -56374 -74395 -33511 25261 -11394 36731 31553
5431C1553p5133q911M0160K5756N4127m2147K0421k4183L5108M8872k0792o8371
$$ 31553 -43580 -52491 -12331 13425 67552 25405 45826 21643 56751 105623 84831 16460
5419A6460L4012L9381j13613O111J0212r520p749M5294M079n1517k6178N8515
$$ 16460 50472 89853 -23760 -17649 -7437 -16957 -24706 20588 24667 -26850 -53028 5487
5407E487K1902r0723K3387N6534k9200n0580R2616Q613P3510j11057P3043L6262
$$ 5487 27389 -63334 -39947 16587 -12613 -63193 29423 38036 111546 489 73532 109794
5395A09794q8204j58160R8436k465N6573N0803p1898k6077O2229J012K0734j3146
$$ 109794 21590 -136570 -38134 -40599 15974 66777 -5121 -31198 31031 32043 52777 39631
5383C9631l7208j9822K7922Q554R1763m1854j2503J3198l0940L961k3856r9375
$$ 39631 2423 -17399 10523 19077 110840 68986 56483 69681 38741 42702 18846 -80529
5371h0529J0986N9637L4194Q4250r4893K4027J34272p5498q3828J03558Q7460
$$ -80529 -69543 -9906 24288 108538 13645 37672 171944 96446 12618 116176 203636
5360B03636k811o9181j81664Q4451m4867L5390J5882M3390l4254P030j0029j3455
$$ 203636 200825 131644 -50020 34431 -10436 24954 40836 84226 49972 57002 46973 33518
5348C3518N8457O849n1667K2972J2051m5960N558l438k2170k3342R9775j6352
$$ 33518 91975 98824 47157 70129 82180 36220 41778 38340 16170 -7172 92603 76251
5336G6251o3463J731J15296J7644p0487q4702K14150j23330q8482J31272K5647
$$ 76251 12788 14519 129815 147459 76972 -7730 206420 83090 -5392 125880 151527
5325A51527j24841J6622m4019o465R4791p5217L8759n7991k6408J3967N9584N8608
$$ 151527 26686 43308 -711 -7176 87615 12398 51157 -6834 -33242 -19275 40309 98917
5313I8917J4838p2752N6560m1559k2069L0927j8575J06612j27101J03220l1288
$$ 98917 113755 41003 97563 56004 33935 64862 46287 152899 25798 129018 97730
5302I7730l5685n1607O3454P291o772k7162j8929N2695n0427J8909N8108L094
$$ 97730 62045 10438 73892 81183 74411 47249 28320 81015 30588 49497 107605 110699
5290A10699r2395j9895N2837P0905m0028K9588p0485M5473O4835m3299m5527l2730
$$ 110699 18304 -1591 51246 122151 82123 111711 41226 86699 151534 108235 62708 29978
5278B9978q065J23021j8011m7577L7982J7879J1107l5051l0762k95L7572j6660
$$ 29978 21913 144934 126923 79346 117328 135207 146314 111263 80501 80206 117778 101118
5266A01118o2723n2304r79N0602l0943M2841k3618j2979N8840o0857J2773N6667
$$ 101118 38395 -13909 -14888 35714 4771 47612 23994 11015 69855 8998 21771 78438
5254G8438M4563j9162j20771M7768K2837j8347J02612J0689m0224K1059J03759
$$ 78438 123001 103839 -16932 30836 53673 35326 137938 148627 108403 129462 233221
5243B33221q1087m2830l2479n5663J8933L102j1944J9546N4337N191o4075k0242
$$ 233221 152134 109304 76825 21162 40095 43197 31253 50799 105136 110327 46252 26010
5231B6010k338M3248L517K10j18057J2370M191Q6174l3227P6538k7190J0878K27
$$ 26010 23672 66920 70437 70647 -47410 -35040 -30849 55325 22098 98636 71446 82324 82551
5218H2551k7179p2975K6115J5442R641k2876k2920N5982P4223m6611L4918o2655
$$ 82551 55372 -17603 8512 23954 33595 10719 -12201 43781 118004 71393 106311 43656
5206D3656N5366o3120K9188J0826j00762j536J13528M9506r7527n6770N5452J9465
$$ 43656 99022 35902 65090 75916 -24846 -26382 87146 136652 39125 -17645 37807 57272
5194E7272q7767N1554j04354O2712J07525l803o6187j4150R3739Q1655m9137o7682
$$ 57272 -30495 21059 -83295 -20583 86942 83139 16952 2802 96541 178196 129059 61377
5182F1377o7512k2946R2997P8068j55325j6876L4908R2392m4786j4423k0043K1001
$$ 61377 -6135 -29081 63916 141984 -13341 -30217 4691 97083 52297 37874 17831 38832
5170C8832l593l3767M8845Q3953j57965J1487J45234l5666p5311J10630l083K2990
$$ 38832 35239 1472 50317 134270 -23695 -12208 133026 97360 22049 132679 129596 152586
5158A52586k0982N7762K1937j33491j04377J00273j292k9733P6304q0217J76174
$$ 152586 131604 189366 211303 77812 -26565 73708 72416 42683 118987 38770 214944
5147B14944m1570n8353O6640P6026o9275r8473p7306K6556J09267n1310N8833
$$ 214944 173374 115021 181661 257687 188412 89939 12633 39189 148456 97146 155979
5136A55979q5411p3045J7597N1969P851M5869k7441p9801p952J16675L911m423
$$ 155979 70568 -2477 15120 67089 74940 120809 93368 13567 5615 122290 126201 121778
5124A21778P8210J2319k5878l3625R404l6338J3101Q1853r0232l395q0509J66657
$$ 121778 199988 212307 186429 152804 162208 125870 138971 220824 130592 127197 46688 213345
5112B13345j10827L6408J22823j08403k4590r252q5188J01640m4001o4318R7600
$$ 213345 102518 138926 261749 153346 128756 119504 34316 135956 91955 27637 125237
5101A25237N4868m7720j19673J22709J38347J8312r4927o2452P4732m1143j15133
$$ 125237 180105 132385 12712 135421 273768 292080 197153 134701 209433 168290 53157
5090E3157O4132O1771J1649L1012j33953M4182L6300o3852l7081k1708J62161
$$ 53157 117289 179060 190709 221721 87768 131950 168250 104398 67317 45609 207770
5079B07770q537m3450K3244k165J483q91m6206M4729m9030M5302l9086K9311o9239
$$ 207770 199233 155783 179027 176862 178345 177454 131248 175977 126947 172249 133163 162474 93235
5066I3235L8794p3583J09992p6134K598L0512o2453J03840q1846M6650L837M4201
$$ 93235 132029 58446 168438 92304 94902 125414 62961 166801 84955 131605 135442 179643
5054A79643L9227j7649O5132j04292k5971p590R084L46J76512r6108q6549j4726
$$ 179643 218870 201221 266353 162061 136090 128500 137584 137930 314442 218334 131785 117059
5042A17059p121P7849J6170q0699N1878P2078J9899m309q4788m165P5466j099
$$ 117059 109938 187787 203957 123258 175136 247214 267113 262804 178016 173851 249317 248218
5030B48218M127N594K0889N3996O4755n6401j02371o694k9586j07373L6855P3632
$$ 248218 252345 257939 278828 332824 397579 341178 238807 232113 202527 95154 132009 205641
5018B05641M8655J02517l5153j6600q9203l547K453M4422J5835K1197l3338J8829
$$ 205641 254296 356813 321660 305060 215857 212310 214763 259185 275020 296217 262879 281708
5006B81708l6479m3214J424O026M4967P799m8954j9876K9566P8430k020O6048
$$ 281708 245229 202015 203439 209465 254432 262231 213277 193401 222967 301397 299377 365425
4994C65425o0245O289l5766K0800J7821j8826J02529L1055n570j11379o3298l4798
$$ 365425 305180 311469 275703 296503 314324 295498 398027 429082 423512 312133 248835 214037
4982B14037j0789P5735j4050J10838n296r2292N2570L8208m1354P625O3969M7902
$$ 214037 203248 278983 264933 375771 370475 278183 330753 368961 327607 335232 399201 447103
4970D47103r9543o4155P8974j0516l9826L8900M4403l7480l7140n1601m245J5715
$$ 447103 347560 283405 362379 351863 312037 350937 395340 357860 320720 269119 264874 280589
4958B80589N348k7027K3656K9791J1022M9762o8848J0867J319K58l2975n3368
$$ 280589 285937 258910 282566 312357 323379 373141 304293 315160 316479 316737 283762 230394
4946B30394K3685l0037J15930q9605q3388J15570j6820M2289L3154j3519J4427
$$ 230394 254079 224042 339972 250367 166979 282549 265729 308018 341172 327653 342080
4935C42080j33718J03078M210j1980M3374n1328l1018M3344L7326J08566m2337
$$ 342080 208362 311440 315650 303670 347044 295716 264698 308042 345368 453934 411597
4924D11597j3959n7893o662M5944J0225o1290j5758k3947K7245Q4116n8090M1389
$$ 411597 397638 339745 333083 379027 389252 327962 312204 288257 315502 399618 341528 382917
4912C82917k7558m9972L7209J9287k9927P1184o270p5479K6394Q5307j18746O2650
$$ 382917 355359 305387 342596 361883 331956 403140 396870 321391 347785 433092 314346 376996
4900C76996M7456j4916r470n8647J2172L5261n7895Q807J22428n5019j6083K4355
$$ 376996 424452 409536 400066 341419 353591 388852 330957 339764 462192 407173 391090 415445
4888D15445M1645o5127J2627N8954n5333o1247p6922M8485J5799J18684J00269
$$ 415445 457090 391963 404590 463544 408211 346964 270042 318527 334326 453010 553279
4877E53279m8589l2130r4094R5648L6788j78126J2140L425j1865m5494P0385j4978
$$ 553279 504690 472560 378466 474114 510902 332776 344916 348341 336476 290982 361367 346389
4865C46389p960o6073R1714J6916P671M2752K8056k4156l1078J0716j2201j7366
$$ 346389 338429 272356 364070 380986 388657 431409 459465 435309 404231 414947 402746 385380
4853C85380n5054J21309n3707K0628l1808P1072n2038K3470J02988m0791k0277
$$ 385380 330326 451635 397928 418556 386748 457820 405782 429252 532240 491449 471172
4842D71172Q3195q5595m5836l374K865L2696j0663O3675j4645J4243l5292K3663
$$ 471172 554367 468772 422936 419562 422427 455123 444460 508135 493490 507733 472441 496104
4830D96104K4072l3522J15209p2376n7954j9361l1912M0671l2858J0250j4870
$$ 496104 520176 486654 601863 529487 471533 452172 420260 460931 428073 438323 423453
4819D23453P2276o7815J5439l1998J07338n5688J875J12413p4972n758L6330l7172
$$ 423453 495729 427914 443353 411355 518693 463005 464880 577293 502321 496563 532893 495721
4807D95721J01032p1661j9104q4735M1353J14207K5934l8591j12138q193m0953
$$ 495721 596753 525092 505988 421253 462606 576813 602747 564156 452018 443825 402872
4796D02872N6903J02819n8826l2904Q1958K3029N009k5821K8835k6994J09486
$$ 402872 459775 562594 503768 470864 552822 575851 580860 555039 583874 556880 666366
4785F66366n7859j13202J19063m1160m4880M3617O9239o0524M4328p3622n7031
$$ 666366 608507 495305 614368 573208 528328 571945 641184 580660 624988 551366 494335
4774D94335K0286L6274L1429J2072r737M3664k741n4275Q8497k384K836K3577
$$ 494335 514621 550895 582324 594396 584659 628323 625582 571307 659804 657420 660256 683833
4762F83833N576L9696J4194o4184M9995M231j0856j3393J05121l8609P3564l0230
$$ 683833 689409 729105 743299 679115 729110 733341 722485 709092 814213 775604 849168 818938
4750H18938j06614k0299R0442k1781p3736M1189J0621k9572N1899R5143Q4912
$$ 818938 712324 692025 782467 760686 686950 728139 738760 709188 761087 856230 941142
4739I41142l4080q577M8252N8978p7128Q5827n2261J23771m8067O7272k6733K0621
$$ 941142 907062 898485 946737 1005715 928587 1014414 962153 1085924 1037857 1105129 1078396 1099017
4727A099017N9945n9383L3773j9723J19382n9214L1888L8531p8427M64l9338k0155
$$ 1099017 1158962 1099579 1133352 1113629 1233011 1173797 1205685 1244216 1165789 1166253 1126915 1106760
4715A106760k1154J2594N5327O5991o5141n2740l7632n0718k8167O777L7465O1018
$$ 1106760 1085606 1098200 1153527 1219518 1154377 1101637 1064005 1013287 985120 991897 1029362 1090380
4703A090380k7648L7079o2809m8643J36766J3139l7035R957m785K344N3104l2438
$$ 1090380 1062732 1099811 1037002 988359 1125125 1138264 1101229 1111186 1106401 1108745 1161849 1129411
4691A129411k710m8957J8496M105P9647o5943M449m6073J3938m1130O9033P1686
$$ 1129411 1126701 1077744 1096240 1100345 1179992 1114049 1118498 1072425 1086363 1045233 1114266 1185952
4679A185952N6n8546K0996J15406j3757j4597l791K0513o195k6686m9612P6363
$$ 1185952 1186008 1127462 1148458 1263864 1250107 1235510 1231719 1252232 1246037 1219351 1169739 1246102
4667A246102J9913k6797K7410N9473J16789l3499q655m1833j8836q2687J01014
$$ 1246102 1266015 1239218 1266628 1326101 1442890 1409391 1400736 1358903 1340067 1257380 1358394
4656A358394N6651J19602j8325j7680K4243K3742m1514r30N6591N70P2221J4047
$$ 1358394 1415045 1534647 1516322 1498642 1522885 1546627 1505113 1504183 1560774 1561344 1633565 1647612
4644A647612k3224m2416M6452L7334j0935l8750P2052M6741N0890J42350m2165
$$ 1647612 1624388 1581972 1628424 1665758 1654823 1616073 1688125 1734866 1785756 1928106 1885941
4633A885941J6283O719m2065q0882J25803N2669k8113n921m3450O6844J04595
$$ 1885941 1902224 1908943 1866878 1785996 1911799 1964468 1936355 1930434 1886984 1953828 2058423
4622B058423R7885j35162L0101L7127J5120J11220Q1836l2411m7588O554J823
$$ 2058423 2156308 2021146 2051247 2088374 2103494 2214714 2296550 2264139 2216551 2223105 2224928
4611B224928N4852N1823Q6719K4509P473M3316j9926Q1751K3235j1919J9374n782
$$ 2224928 2279780 2331603 2418322 2442831 2450304 2493620 2473694 2555445 2578680 2566761 2586135 2580353
4599B580353R6294J07148j4843Q5912r3007R4655L1735Q3288Q2662p037L6741
$$ 2580353 2676647 2783795 2768952 2854864 2761857 2856512 2888247 2971535 3054197 3047160 3083901
4588C083901L5593P8728K2000J7933k3127K6256J13560J58056Q0354r352o9588
$$ 3083901 3119494 3198222 3220222 3238155 3215028 3241284 3354844 3512900 3593254 3583902 3514314
4577C514314K2834q307K04423m2420P1503M7163L4823R7363J11356L4419N7101
$$ 3514314 3537148 3528841 3733264 3690844 3762347 3809510 3844333 3941696 4053052 4087471 4144572
4566D144572J22169k4383R5598N6979Q2073J61716R2251O9379J35348J57670J84754
$$ 4144572 4266741 4242358 4337956 4394935 4477008 4638724 4730975 4800354 4935702 5093372 5278126
4555E278126R9802J16097R7743J81414O6975J5690J57768K09043J32255K04819
$$ 5278126 5377928 5494025 5591768 5773182 5840157 5855847 6013615 6222658 6354913 6559732
4545F559732J36584K84470K09598K11918K96295J57234K94259K18452L63990L35617
$$ 6559732 6696316 6980786 7190384 7402302 7698597 7855831 8150090 8368542 8732532 9068149
4535I068149K29577L70131K72847J85750L75759L40459L49899K75718M15563M19798
$$ 9068149 9297726 9667857 9940704 10126454 10502213 10842672 11192571 11468289 11883852 12303650
4525A2303650L91057N48130M57197N57681N12443O30000O17021O01707O92207
$$ 12303650 12694707 13242837 13700034 14257715 14770158 15400158 16017179 16618886 17311093
4516A7311093O71878P73519R25139Q99479R73962J065990J075292J117097J376751
$$ 17311093 17982971 18756490 19681629 20581108 21555070 22621060 23696352 24813449 26190200
4507B6190200J407902J572467J742196K007296K094195K353805K627534K847050
$$ 26190200 27598102 29170569 30912765 32920061 35014256 37368061 39995595 42842645
4499D2842645L006156L289906L582755L585568L357285K982261K319870J833400
$$ 42842645 45848801 49138707 52721462 56307030 59664315 62646576 64966446 66799846
4491F6799846J406208J051558P26299K46848m3998r85882j533729j942852k557575
$$ 66799846 68206054 69257612 69983911 70230759 70186761 69200879 67667150 65724298 63166723
4482F3166723k914732l122769l184623k914769k969044k679663k399253k104866
$$ 63166723 60251991 57129222 53944599 51029830 48060786 45381123 42981870 40877004
4474D0877004j943625j729782j354526j281638j037990r47612p22367o47946n14961
$$ 40877004 38933379 37203597 35849071 34567433 33529443 32581831 31859464 31211518 30696557
4465C0696557l19191k93837j41044p6966l8938M126P2016J59482L04147L67720
$$ 30696557 30377366 30083529 29942485 29865519 29826581 29830707 29902723 30062205 30366352 30734072
4455C0734072K89492M98023N82146N61605N75002O53484O00079P41636Q17520
$$ 30734072 31023564 31521587 32103733 32665338 33240340 33893824 34493903 35235539 36053059
4446C6053059Q04752R36440Q19760R77655J048297R23243J171014J202917J294311
$$ 36053059 36857811 37794251 38614011 39591666 40639963 41563206 42734220 43937137 45231448
4437D5231448J214218J237652J560441J661282J493024J795217J840045J836505
$$ 45231448 46445666 47683318 49243759 50905041 52398065 54193282 56033327 57869832
4429E7869832K027545J974510K147381K199213K318967K491526K515824K479333
$$ 57869832 59897377 61871887 64019268 66218481 68537448 71028974 73544798 76024131
4421G6024131K748014K678671K774945K764636K709829K691862K640212K552760
$$ 76024131 78772145 81450816 84225761 86990397 89700226 92392088 95032300 97585060
4413I7585060K459690K152414J960180J677265J340913R73499P58728L65794k32862
$$ 97585060 100044750 102197164 104157344 105834609 107175522 108149021 108907749 109273543 109040681
4404A09040681m62437p62901j187144j501986j943292k122087k280876k417624
$$ 109040681 108578244 107815343 106628199 105126213 103182921 101060834 98779958 96362334
4396I6362334k540077k819992k848727k794856k773902k830843k862650k866719
$$ 96362334 93822257 91002265 88153538 85358682 82584780 79753937 76891287 74024568
4388G4024568k654608k520150k492874k471235k404200k218475k151397k031313
$$ 74024568 71369960 68849810 66356936 63885701 61481501 59263026 57111629 55080316
4380E5080316k037536j908440j694246j741927j691272j539818j456533j288175
$$ 55080316 53042780 51134340 49440094 47698167 46006895 44467077 43010544 41722369
4372D1722369j337570j273873j080388j124301r69541r79489r32087q14062q50239
$$ 41722369 40384799 39110926 38030538 36906237 35936696 34957207 34025120 33211058 32360819
4363C2360819p79516q63653p68327o82735q73900p15919o43496p79125q28130
$$ 32360819 31581303 30717650 29949323 29266588 28392688 27676769 27033273 26254148 25426018
4354B5426018o07505o78136n66242o13477o17739m60589n72624m56646m63364
$$ 25426018 24818513 24140377 23574135 22960658 22342919 21882330 21309706 20853060 20389696
4345B0389696m31536l05099m84422l56747k02235l15420l03743k82412k24623
$$ 20389696 19958160 19653061 19168639 18811892 18609657 18294237 17990494 17708082 17483459
4336A7483459j93712j64433J4872j17215j73983r8341o0602N7478Q1803o796J30486
$$ 17483459 17289747 17125314 17140186 17022971 16848988 16750647 16690045 16747523 16829326 16822530 16953016
4325A6953016J70541K88601L40021L33957N08576M71284O24556N42674R27099
$$ 16953016 17123557 17412158 17752179 18086136 18594712 19065996 19690552 20233226 21160325
4316B1160325R84481J067462J084061P44801O01909L09460J93536N5189l8097
$$ 21160325 22144806 23212268 24296329 25041130 25643039 25952499 26146035 26201224 26163127
4307B6163127L1621R0806j33769n53697q53859r42006r88076j214944j317343
$$ 26163127 26194748 26285554 26151785 25598088 24744229 23802223 22814147 21599203 20281860
4298B0281860j207375j275588j145215j043885r20874q66442p08037o53305o53283
$$ 20281860 19074485 17798897 16653682 15609797 14688923 13822481 13114444 12461139 11807856
4289A1807856n27142n31439l95095m94087l36118l16094l72732k59906k96607
$$ 11807856 11280714 10749275 10354180 9860093 9523975 9207881 8835149 8575243 8278636
4280H278636k60724k05380j58001k41098j75958j42060k56916j30890j21239j32682
$$ 8278636 8017912 7812532 7654531 7413433 7237475 7095415 6838499 6707609 6586370 6453688
4270F453688j84714j48261j56004j29613j22644j0428o6609j5861m6926j31952
$$ 6453688 6268974 6120713 5964709 5835096 5712452 5702024 5635415 5619554 5572628 5440676
4260E440676j46497j3034j37438p4273L4599r1535j78682j16407k8170m6663j3938
$$ 5440676 5294179 5281145 5143707 5069434 5104033 5012498 4833816 4717409 4689239 4642576 4628638
4249D628638j60293o5969j8596j56890j7625k5385j74978k5081k4417J3587m5641
$$ 4628638 4468345 4402376 4383780 4226890 4209265 4183880 4008902 3983821 3959404 3972991 3927350
4238C927350j47226q4891o2560P2043n3506j21852J2653j16861m4022j33803m71
$$ 3927350 3780124 3695233 3632673 3704716 3651210 3529358 3542011 3425150 3381128 3247325 3246854
4227C246854P890j6253j05841L7478p7096J8981o4559R871l4991j16129J204l420
$$ 3246854 3254744 3238491 3132650 3170128 3093032 3112013 3047454 3057325 3022334 2906205 2907409 2903989
4215B903989p7335J605n6877q4913M154M2041k5304o6317Q6945p2328j24016J00418
$$ 2903989 2826654 2828259 2771382 2686469 2690623 2732664 2707360 2641043 2727988 2655660 2531644 2632062
4203B632062O7844m7851N3933J9875o9815l1107j26859M7267J01022j72033O4771
$$ 2632062 2699906 2652055 2705988 2725863 2656048 2624941 2498082 2545349 2646371 2474338 2539109
4192B539109O4755o7739J7884k086J7112J3908J6293r6735m6613J52345O2323
$$ 2539109 2603864 2536125 2554009 2551923 2569035 2582943 2599236 2502501 2455888 2608233 2670556
4181B670556p1596O9560k5747l2043J29181k4444J25306M1128N9577m847K2253
$$ 2670556 2598960 2668520 2642773 2610730 2739911 2715467 2840773 2881901 2941478 2936631 2958884
4170B958884J15533K0546O7230P9598R6762J03175O8859J41792J49360R5149L0003
$$ 2958884 3074417 3094963 3162193 3241791 3338553 3441728 3510587 3652379 3801739 3896888 3926891
4159C926891P8167P7223K09046J42557R7766K22219J73215K10063K15471J86863
$$ 3926891 4005058 4082281 4291327 4433884 4531650 4753869 4927084 5137147 5352618 5539481
4149E539481J98181J99110L17888K37856K79670K93335M83615L92557L26965L35876
$$ 5539481 5737662 5936772 6254660 6492516 6772186 7065521 7549136 7941693 8268658 8604534
4139H604534L61775O01729N66360O39652P24943P55353P57641R26689R97455J261639
$$ 8604534 8966309 9568038 10134398 10774050 11498993 12254346 13011987 13938676 14936131 16197770
4129A6197770J209164J268334J367958J264716J302462J051736J078539J037431
$$ 16197770 17406934 18675268 20043226 21307942 22610404 23662140 24740679 25778110
4121B5778110J077999R71811O39855L85198p6043m10629n07223p34805p39309
$$ 25778110 26856109 27827920 28467775 28852973 28776930 28366301 27859078 27124273 26384964
4112B6384964j075459j222579j247872j382874j208584j265136j274859j217733
$$ 26384964 25309505 24086926 22839054 21456180 20247596 18982460 17707601 16489868
4104A6489868j283947j128062r91340r55098p92061p85766o88705o12297m76327
$$ 16489868 15205921 14077859 13086519 12131421 11339360 10553594 9864889 9252592 8776265
4095H776265n22376n08409k08313k49567l75463k73410k44875j47699j22052k46258
$$ 8776265 8253889 7745480 7537167 7287600 6912137 6638727 6393852 6246153 6124101 5877843
4085E877843j84694q5633o6759j56615o0697j17806q1834N226N1048k7053P9241
$$ 5877843 5693149 5607516 5540757 5384142 5323445 5205639 5123805 5129031 5180079 5153026 5232267
4074E232267o1812J0042O6261N2008l543P4406J30650R2528J14120L8388K76368
$$ 5232267 5170455 5180497 5246758 5298766 5295223 5369629 5500279 5592807 5706927 5745315 6021683
4063F021683J37783K52577K83470L08085M15290M21526K13126K32127J65148K03127
$$ 6021683 6159466 6412043 6695513 7003598 7418888 7840414 8053540 8285667 8450815 8653942
4053H653942K22595K41596L54570L11428K00109j18770j96200j72440k73926k67627
$$ 8653942 8876537 9118133 9472703 9784131 9984240 9865470 9669270 9496830 9222904 8955277
4043H955277k52281l08259k34789k67204m82811l96829l05661l90538m09910l24248
$$ 8955277 8702996 8394737 8159948 7892744 7409933 7013104 6707443 6316905 5906995 5582747
4033E582747l93279l81210j89482k98360j57112j75813k65566l17057p4014r6726
$$ 5582747 5189468 4808258 4618776 4320416 4163304 3987491 3721925 3404868 3330854 3234128
4023C234128j80813j22528m4478l4867j60773k5403j77189j00327O4837j58057
$$ 3234128 3053315 2930787 2886309 2851442 2690669 2665266 2488077 2387750 2452587 2294530
4013B294530r5208l1120n346j2493j39178k7224j33l7598m9397j8515r0703o9207
$$ 2294530 2199322 2168202 2162856 2150363 2011185 1983961 1983828 1946230 1896833 1878318 1787615 1718408
4001A718408j2693m3832j30970O6136m1719NJ0199j7697j17292J45263o9618j87194
$$ 1718408 1705715 1661883 1530913 1597049 1555330 1555335 1565534 1547837 1430545 1575808 1506190 1318996
3989A318996L9137m1059o0380M0486l7896l7783K4286o802k7526J05338l1538
$$ 1318996 1358133 1317074 1256694 1297180 1259284 1221501 1245787 1238985 1211459 1316797 1285259
3978A285259j15194J22491j6231o9746R2401q5364q6083k4596j2969K8387p5509
$$ 1285259 1170065 1292556 1276325 1206579 1298980 1213616 1127533 1102937 1089968 1118355 1042846
3967A042846k7838L4698R1777k7599j06785N5461N2475m3045l8859N8350N8706
$$ 1042846 1015008 1049706 1141483 1113884 1007099 1062560 1115035 1071990 1033131 1091481 1150187
3956A150187q9761M431o6296l0234Q5778M2154n8168j6357k4341K347L7439m6409
$$ 1150187 1060426 1064857 998561 968327 1054105 1096259 1038091 1021734 997393 999740 1037179 990770
3944I90770r555P0378n1873n958l8139M7537J3176K6912m9962k0743K7639O624
$$ 990770 981215 1051593 999720 993762 955623 1003160 1016336 1043248 993286 972543 1000182 1006806
3932A006806N140r905p2345O7564J29043k6534n8607o9286L4978K9843j109L1626
$$ 1006806 1011946 1002041 929696 997260 1126303 1099769 1041162 971876 1006854 1036697 1035588 1067214
3920A067214O5743M7480j67271n6576j4657J6651l1415O5675P3545j5493N9810
$$ 1067214 1132957 1180437 1013166 956590 941933 958584 927169 992844 1066389 1050896 1110706
3909A110706J0334p6202o4037l4203R1133L5255p0982K9502M5623N2370o0210
$$ 1110706 1121040 1044838 980801 946598 1037731 1072986 1002004 1031506 1077129 1129499 1069289
3898A069289J5255m6139L2604K1370k4342m033L8483L9053R485q8586l8844R6466
$$ 1069289 1084544 1038405 1071009 1092379 1068037 1064004 1102487 1141540 1151025 1062439 1023595 1120061
3886A120061L7174q8740o8409M2565n3370l917J01059l922Q4343j14165j5829
$$ 1120061 1157235 1068495 1000086 1042651 989281 985364 1086423 1082501 1166844 1052679 1036850
3875A036850p139L8295R1470J3165r4871j817J01865K1724N9442K1124j8880n7926
$$ 1036850 1029711 1068006 1159476 1172641 1077770 1075953 1177818 1199542 1258984 1280108 1261228 1203302
3863A203302k4169O6006O9938r162k6958L8555K0983o1523K00997J7225q570N5722
$$ 1203302 1179133 1245139 1315077 1305915 1278957 1317512 1338495 1276972 1477969 1495194 1486624 1542346
3851A542346O7103j976N1099O8663O3047Q2062P3724L4777J0385j1791R4604J72363
$$ 1542346 1609449 1607473 1658572 1727235 1790282 1872344 1946068 1980845 1991230 1979439 2074043 2246406
3839B246406J65029L0468P0344R1252M9834J51827J31744R6705J90172J68142
$$ 2246406 2411435 2441903 2512247 2603499 2653333 2805160 2936904 3033609 3223781 3391923
3829C391923J32299J31839J49595J14524L07650Q0059J70025K61595K25338K08117
$$ 3391923 3524222 3656061 3805656 3920180 4227830 4307889 4477914 4739509 4964847 5172964
3819E172964K58657K76346L47134K96959L67986L21692L02258M83309M08920N79977
$$ 5172964 5431621 5707967 6055101 6352060 6720046 7041738 7343996 7827305 8236225 8816202
3809H816202M22044O42733O81389P65241P98171R06138R89475J051851J037751
$$ 8816202 9238246 9880979 10562368 11327609 12125780 13031918 14021393 15073244 16110995
3800A6110995J166195J123820J260299J250528J281992J227144J128697R20929
$$ 16110995 17277190 18401010 19661309 20911837 22193829 23420973 24549670 25470599
3792B5470599Q46195R39810Q76981P02198N23063J22240j02475j92734l34065
$$ 25470599 26316794 27256604 28133585 28835783 29358846 29481086 29378611 29185877 28851812
3783B8851812l38705n08189p67604j018651j168023j128099j090680j088813j241360
$$ 28851812 28513107 28004918 27237314 26218663 25050640 23922541 22831861 21743048 20501688
3774B0501688j295117j397643j270898j088979j113742j021974j010763q61053
$$ 20501688 19206571 17808928 16538030 15449051 14335309 13313335 12302572 11441519
3766A1441519r31084o36622o55571n48809n42672n02318m58834l99189l33067
$$ 11441519 10510435 9873813 9218242 8669433 8126761 7624443 7165609 6766420 6433353
3757F433353l25784k07818k58561j73334k51469l37498j31602j25723j44391L8801
$$ 6433353 6107569 5899751 5641190 5467856 5216387 4878889 4747287 4621564 4477173 4515974
3747D515974k16788j86892j19296j06287l6137j61064j29277k12357m5210k7375
$$ 4515974 4299186 4112294 3992998 3886711 3850574 3689510 3560233 3347876 3302666 3275291
3737C275291j58723j7840j11250o99r9536l2647m1453k9820j39655j73496q7323
$$ 3275291 3116568 3098728 2987478 2986779 2887243 2854596 2813143 2783323 2643668 2470172 2382849
3726B382849j9683J3236n3488O2702j41342j66972J9526R7055j13881j299j3581
$$ 2382849 2363166 2376402 2322914 2385616 2244274 2077302 2096828 2193883 2080002 2078703 2065122
3715B065122m5819L7257n9838P0257L3979j06006m1074l7796n3886k556L4889
$$ 2065122 2019303 2056560 1996722 2066979 2100958 1994952 1953878 1916082 1862196 1859640 1894529
3704A894529m3380L0530O9558k4763j04245J8595L8331R2171l6400m8676N5625
$$ 1894529 1851149 1881679 1951237 1926474 1822229 1840824 1879155 1971326 1934926 1886250 1941875
3693A941875J3604Q0931q6511R5583k4981K3830k059J3855O0781n6917n2602O4688
$$ 1941875 1955479 2036410 1949899 2045482 2020501 2044331 2042272 2056127 2116908 2059991 2007389 2072077
3681B072077K5338k7033O0043M3239m6000L080l8763P4781J33443J17111k4587
$$ 2072077 2097415 2070382 2130425 2173664 2127664 2130744 2091981 2166762 2300205 2417316 2392729
3670B392729J022R8105n2922p842Q4822J24677n88O4124M0140j2447l0780K6762
$$ 2392729 2393751 2491856 2438934 2431092 2515914 2640591 2640003 2704127 2744267 2731820 2701040 2727802
3658B727802j6767O255n3598p1174n6258J25671l5934K6852k7543j03698j9721
$$ 2727802 2711035 2717290 2663692 2592518 2536260 2661931 2625997 2652849 2625306 2521608 2501887
3647B501887K9466j44044k2321r0235n6088K4093k43020M9007m071O8715o6595
$$ 2501887 2531353 2387309 2364988 2274753 2218665 2242758 1999738 2048745 2044674 2113389 2046794
3636B046794n4059j6184M7938Q1148j53073q0494P5745l4236l3549J1557m0815
$$ 2046794 1992735 1976551 2024489 2105637 1952564 1872070 1947815 1913579 1880030 1891587 1850772
3625A850772N0901l3266j3221q033L4297O248m7969K9609k6173n2018J24565J12053
$$ 1850772 1901673 1868407 1855186 1847153 1881450 1887698 1839729 1869338 1843165 1791147 1915712 2027765
3613B027765m9860p7177O4125L552L3879m8151j7138k8202N6657o624K774Q2712
$$ 2027765 1977905 1900728 1964853 1968405 2002284 1954133 1936995 1908793 1965450 1958826 1961600 2044312
3601B044312M1463M1666p5289K5910l6791p7970R0450N3510k1215J13754M2226
$$ 2044312 2085775 2127441 2052152 2078062 2041271 1963301 2053751 2107261 2086046 2199800 2242026
3590B242026M0424O879P4204J7265j1546J14073N9799P4841M5764r4484R919J1584
$$ 2242026 2282450 2289329 2363533 2380798 2369252 2483325 2543124 2617965 2663729 2569245 2579164 2590748
3578B590748Q7913R5473j2571J0570M10j187J92461l1151N4584K9037J50022Q7816
$$ 2590748 2678661 2774134 2761563 2772133 2772543 2771356 2963817 2932666 2987250 3016287 3166309 3254125
3566C254125L8783K4637j5939O8658j07511J73054J34631P5073j6770R876N2496
$$ 3254125 3292908 3317545 3301606 3370264 3262753 3435807 3570438 3645511 3628741 3638617 3691113
3555C691113j0303P6173R5835J38130L7834K8819J34920j9148k1215P5934J88207
$$ 3691113 3680810 3756983 3852818 3990948 4028782 4057601 4192521 4173373 4152158 4228092 4416299
3544D416299n678M517j7750J03024J43733O1371J22664k2686q3344N7994K70946
$$ 4416299 4410621 4415138 4397388 4500412 4644145 4705516 4828180 4805494 4722150 4780144 5051090
3533E051090J08037K4646J34218N331J33165J07701R0573J33758J74990J00455
$$ 5051090 5159127 5183773 5317991 5323322 5456487 5564188 5654761 5788519 5963509 6063964
3523F063964Q2029K33169K48096J19802K52121R5236J51025K56546L58263K56595
$$ 6063964 6145993 6379162 6627258 6747060 6999181 7094417 7245442 7501988 7860251 8116846
3513H116846J16814L13926K26893M43984L45941L21125M13025M68526M40336M91379
$$ 8116846 8233660 8547586 8774479 9218463 9564404 9885529 10298554 10767080 11207416 11698795
3503A1698795M28110M76833N29062M47369O57979O36888O18334P31833O12164
$$ 11698795 12126905 12603738 13132800 13580169 14238148 14875036 15493370 16225203 16837367
3494A6837367Q56263Q77051Q93500Q37180R72921J214959J114593J126914J166906
$$ 16837367 17693630 18570681 19464181 20301361 21274282 22489241 23603834 24730748 25897654
3485B5897654J364615J436885J478039J561827J713745J737210J846621J866918
$$ 25897654 27262269 28699154 30177193 31739020 33452765 35189975 37036596 38903514
3477C8903514K005738K059876K124182K254847K290039K456757K518649K577778
$$ 38903514 40909252 42969128 45093310 47348157 49638196 52094953 54613602 57191380
3469E7191380K506394K660681K761559K813871K865284K811007K799994K904745
$$ 57191380 59697774 62358455 65120014 67933885 70799169 73610176 76410170 79314915
3461G9314915K814521K871595K689150K673062K682101K604911K455855K314137
$$ 79314915 82129436 85001031 87690181 90363243 93045344 95650255 98106110 100420247
3453A00420247K047063K074173J767041J623395J438272J162660R69628P42800
$$ 100420247 102467310 104541483 106308524 107931919 109370191 110532851 111502479 112245279
3445A12245279M66361J97497J15679k80474n73010q40598j119805j289085j648624
$$ 112245279 112711640 112909137 113024816 112744342 112171332 111330734 110210929 108921844 107273220
3436A07273220j730561j886613k230369k356385k424586k699807k823055k822966
$$ 107273220 105542659 103656046 101425677 99069292 96644706 93944899 91121844 88298878
3428H8298878l026953k980017l044189k962747l071312l145715l010856l009846
$$ 88298878 85271925 82291908 79247719 76284972 73213660 70067945 67057089 64047243
3420F4047243k967720k800101k785305k643535k645306k447416k337977k270838
$$ 64047243 61079523 58279422 55494117 52850582 50205276 47757860 45419883 43149045
3412D3149045k203239j973414j963080j733490j542677j632690j450996j357923
$$ 43149045 40945806 38972392 37009312 35275822 33733145 32100455 30649459 29291536
3404B9291536j310590j121670j085904j054301r98057q08797q23185p51564o39124
$$ 29291536 27980946 26859276 25773372 24719071 23721014 22912217 22089032 21337468 20698344
3395B0698344o88665o74853m96773m78489m39587m91285m01341l87537l20236
$$ 20698344 20009679 19334826 18838053 18359564 17919977 17428692 17027351 16639814 16319578
3386A6319578k63025k82655l05981l21739j64336k77298k90800k07764k60091
$$ 16319578 16056553 15773898 15467917 15146178 14981842 14704544 14413744 14205980 13945889
3377A3945889j57820j76086j90764l9936j93293j22180j10983j46311j83697k42132
$$ 13945889 13788069 13611983 13421219 13381283 13187990 13065810 12954827 12808516 12624819 12382687
3367A2382687j45120k1650j70596o0297k1969j55191j47546k3715j39610k21086
$$ 12382687 12237567 12215917 12045321 11985024 11963055 11807864 11660318 11636603 11496993 11275907
3357A1275907m3954j36350j00264p2496k61641p2749n44N286j16061j52352j48335
$$ 11275907 11231953 11095603 10995339 10922843 10661202 10588453 10587909 10593195 10477134 10324782 10176447
3346A0176447q7420k7808p6751p8022L96m7335m5475o7757j7708p487j83003R6834
$$ 10176447 10089027 10061219 9984468 9906446 9906842 9859507 9814032 9746275 9728567 9721080 9538077 9634911
3334I634911R0346N4421O8680m8756M3082Q7404L3993J05631J48231J33035K7412
$$ 9634911 9725257 9779678 9848358 9799602 9842684 9930088 9964081 10069712 10217943 10350978 10378390
3323A0378390J67220J41522J52189J95433J07858K37437K51781J67771K71878
$$ 10378390 10545610 10687132 10839321 11034754 11142612 11380049 11631830 11799601 12071479
3314A2071479L12114K49362L29028L40047K60117L90706M06243L95450L94156
$$ 12071479 12383593 12632955 12961983 13302030 13562147 13952853 14359096 14754546 15148702
3305A5148702M09103M06630N25571N57743M93144N56309O35253N70697O70309
$$ 15148702 15557805 15964435 16490006 17047749 17540893 18097202 18732455 19303152 19973461
3296A9973461P68494Q04172O48960P89651R33535R74768Q92869J018418J240700
$$ 19973461 20741955 21546127 22195087 22984738 23918273 24893041 25785910 26804328 28045028
3287B8045028J260182J269694J295591J565288J632424J729342J862538K155606
$$ 28045028 29305210 30574904 31870495 33435783 35068207 36797549 38660087 40815693
3279D0815693K302512K524342K794410K883570L390410L638927L794816M074318
$$ 40815693 43118205 45642547 48436957 51320527 54710937 58349864 62144680 66218998
3271F6218998M258281M285150M154691L954189L627360L034392K470280K024936
$$ 66218998 70477279 74762429 78917120 82871309 86498669 89533061 92003341 94028277
3263I4028277J369128R69401M27879J46001k40929o68894r67607j749584k252713
$$ 94028277 95397405 96366806 96794685 96940686 96699757 96030863 95063256 93313672 91060959
3254I1060959k537676l078296l383233l601033l667482l721351l597215l388207
$$ 91060959 88523283 85444987 82061754 78460721 74793239 71071888 67474673 64086466
3246F4086466l295590k906324k547514k461641k083770j907081j649519j481425
$$ 64086466 60790876 57884552 55337038 52875397 50791627 48884546 47235027 45753602
3238D5753602j218073j106982q64786q30866o18425m35604m64777l31675r0646
$$ 45753602 44535529 43428547 42563761 41732895 41114470 40678866 40214089 39882414 39791768
3229C9791768n2922P7328R5127J40160L84302M56078N48499N86363P39795P67979
$$ 39791768 39738846 39816174 39911301 40051461 40435763 40891841 41440340 42026703 42766498 43534477
3219D3534477R22333J018243J077208J113636J276574J272688J296672J464920
$$ 43534477 44456810 45475053 46552261 47665897 48942471 50215159 51511831 52976751
3211E2976751J322363J535736J439351J480565J533483J488107J679249J440921
$$ 52976751 54299114 55834850 57274201 58754766 60288249 61776356 63455605 64896526
3203F4896526J578860J583999J446146J510214J601816J599727J648059J712608
$$ 64896526 66475386 68059385 69505531 71015745 72617561 74217288 75865347 77577955
3195G7577955J701949J732120J932230K007743K195832K468804K431294K695390
$$ 77577955 79279904 81012024 82944254 84951997 87147829 89616633 92047927 94743317
3187I4743317K965120L164229L547987L841532M234016M485446N013469N427937
$$ 94743317 97708437 100872666 104420653 108262185 112496201 116981647 121995116 127423053
3179A27423053N816937O444567O972536P395396P830749Q529281R067149R512556
$$ 127423053 133239990 139684557 146657093 154052489 161883238 170412519 179479668 188992224
3171A88992224R911918J0377758J0928687J1408647J1844201J2301812J2573489
$$ 188992224 198904142 209281900 220210587 231619234 243463435 255765247 268338736
3164B68338736J2820330J3110972J3224636J3115046J2734780J2530679J2129769
$$ 268338736 281159066 294270038 307494674 320609720 333344500 345875179 358004948
3157C58004948J1190165J0542362R527136Q389080P390412O234769M811740L216243
$$ 358004948 369195113 379737475 389264611 397653691 405044103 411278872 416090612 419306855
3149D19306855J782427J58532j584582l380889n004419o588051q080253r567855
$$ 419306855 421089282 421247814 419663232 416282343 411277924 404689873 396609620 387041765
3141C87041765j0601314j1685686j2536556j3123602j3870745j4188353j4382252
$$ 387041765 376440451 364754765 352218209 339094607 325223862 311035509 296653257
3134B96653257j4535914j4429137j4306689j3935763j3395239j2799693j2171494
$$ 296653257 282117343 267688206 253381517 239445754 226050515 213250822 201079328
3127B01079328j1586806j0739314j0009759r245563q477585p691587p031910o528525
$$ 201079328 189492522 178753208 168743449 159497886 151020301 143328714 136296804 129768279
3119A29768279n728923n148949m844821m438439l935037l573880l272181l011456
$$ 129768279 124039356 118890407 114045586 109607147 105672110 102098230 98826049 95814593
3111I5814593k697812k682185k440285k341490k124967k008536j974935j932209
$$ 95814593 93116781 90434596 87994311 85652821 83527854 81519318 79544383 77612174
3103G7612174j888670j876225j900864j930006j898619j916554j932233j981899
$$ 77612174 75723504 73847279 71946415 70016409 68117790 66201236 64269003 62287104
3095F2287104j833032j984277k007025j792329j829107j935050j769979j711677
$$ 62287104 60454072 58469795 56462770 54670441 52841334 50906284 49136305 47424628
3087D7424628j840635j651704j678142j568472j480572j470271j379533j344286
$$ 47424628 45583993 43932289 42254147 40685675 39205103 37734832 36355299 35011013
3079C5011013j187826j291039j118005j078009j131027q82454q97421q93303q13817
$$ 35011013 33823187 32532148 31414143 30336134 29205107 28322653 27425232 26531929 25718112
3070B5718112o99521q01194p48378o37907n62308n82642n23831n37188n51541
$$ 25718112 25018591 24217397 23469019 22831112 22268804 21686162 21162331 20625143 20073602
3061B0073602n99823m39406m23223m46196m44902m06435k81171m11414l88687
$$ 20073602 19473779 19034373 18611150 18164954 17720052 17313617 17032446 16621032 16232345
3052A6232345l03489l52022l87694m18999l15052k42272k24565k37545k92688
$$ 16232345 15928856 15576834 15189140 14770141 14455089 14212817 13988252 13750707 13458019
3043A3458019k32747k21171k42825k77077k91135k01119k75373k41378k14292
$$ 13458019 13225272 13004101 12761276 12484199 12193064 11991945 11716572 11475194 11260902
3034A1260902k30530j11742k09799k46342k13829j61207j81206k37417j10804
$$ 11260902 11030372 10918630 10708831 10462489 10248660 10087453 9906247 9668830 9558026
3025I558026j69966j29071k30640j89159j48316o0197j84166j48842j18599k04905
$$ 9558026 9388060 9258989 9028349 8839190 8690874 8630677 8446511 8297669 8179070 7974165
3015G974165n8561m6950j99197j01430j12813j01012q5508j29866j28673j6347
$$ 7974165 7915604 7868654 7669457 7568027 7455214 7354202 7268694 7138828 7010155 6993808
3005F993808l9477j33604j82297K1223p7747o2165r6533n1784q3825j24802p3797
$$ 6993808 6954331 6820727 6638430 6659653 6581906 6519741 6423208 6371424 6287599 6162797 6089000
2994F089000N4617k6019l4407j38148j0481N9366r4391j59742j67211K4986k5250
$$ 6089000 6143617 6117598 6083191 5945043 5934562 5993928 5899537 5739795 5572584 5597570 5572320
2983E572320j9454j58137j685j17870J4149r2079l6809j01741M895j10171l2300
$$ 5572320 5552866 5394729 5393044 5275174 5289323 5197244 5160435 5058694 5063589 4953418 4921118
2972D921118l0128p1445n3577n2951p732j41879j9295j0435M1112K0094M8247
$$ 4921118 4890990 4819545 4765968 4713017 4705285 4563406 4544111 4533676 4574788 4594882 4643129
2961D643129K551j36123l6054m34O7674P9585n6862K4576L1389O0286R5385o4534
$$ 4643129 4645680 4509557 4473503 4473069 4540743 4620328 4563466 4588042 4619431 4679717 4775102 4710568
2949D710568P0290m9292p584J01680k9847O534J79807O9653r6477J0309Q2794
$$ 4710568 4780858 4731566 4723982 4825662 4795815 4802349 4982156 5051809 4955332 4965641 5048435
2938E048435J8124K9425p6362R4726m3145q6425P4313p473r2900J6519l5806r9926
$$ 5048435 5066559 5095984 5019622 5114348 5071203 4984778 5059091 5051618 4958718 4975237 4939431 4839505
2926D839505J751K9333j09381k40664O7366p6901j9264k34133n3076n0294p1631
$$ 4839505 4841256 4870589 4761208 4520544 4587910 4511009 4491745 4257612 4204536 4154242 4082611
2915D082611j95394j55329N7696r7386j36922M4295j19624j15520j4049J0094
$$ 4082611 3887217 3731888 3789584 3692198 3555276 3599571 3479947 3364427 3350378 3360472
2905C360472j17136j63157j71778o4205J42354j18798n2197p7848l7622M3481
$$ 3360472 3243336 3080179 2908401 2844196 2986550 2867752 2815555 2737707 2700085 2743566
2895B743566n7036l7729j4686m1155l0512R5541j53041q4022J24464j68255K1905
$$ 2743566 2686530 2648801 2634115 2592960 2562448 2657989 2504948 2420926 2545390 2377135 2399040
2884B399040k7056J2180p273m753q8569K2408j6277m8817m3953P695k1493p3066
$$ 2399040 2371984 2384164 2376891 2372138 2283569 2305977 2289700 2240883 2196930 2204625 2183132 2110066
2872B110066l4771q7551K4338m3842j00363M2222m4469O1983J8916l2559L4358
$$ 2110066 2075295 1987744 2012082 1968240 1867877 1910099 1865630 1927613 1946529 1913970 1948328
2861A948328l6737j60996k6098j2218q2460O314N8937L4029q3306o7591j3515
$$ 1948328 1911591 1750595 1724497 1712279 1629819 1636133 1695070 1729099 1645793 1578202 1564687
2850A564687O4969l0557q6836K1132j4570K4948j9792j2204L5201n7226k6072
$$ 1564687 1629656 1599099 1512263 1533395 1518825 1543773 1523981 1511777 1546978 1489752 1463680
2839A463680l6756m022j8773N157k9085j10416J16678K6899k4241R238j9124L7819
$$ 1463680 1426924 1422902 1404129 1409286 1380201 1269785 1386463 1413362 1389121 1398359 1379235 1417054
2827A417054n7620m1549L7622K8515O2310o5038p7064j3530j1576Q9426p7972
$$ 1417054 1359434 1317885 1355507 1384022 1446332 1381294 1304230 1290700 1279124 1368550 1290578
2816A290578J9724k2128J8876m5845K6509K0330Q0623p7347N1679M5151o398q4500
$$ 1290578 1310302 1288174 1307050 1261205 1287714 1308044 1388667 1311320 1362999 1408150 1401752 1317252
2804A317252J02505L6481k934J5171Q3926n1738o3964R4270p9087k3626K0923
$$ 1317252 1419757 1456238 1453304 1468475 1552401 1500663 1436699 1530969 1451882 1428256 1449179
2793A449179M3672o1815Q2350k5516l4791N1791m7204J09947J10958m8507K4426
$$ 1449179 1492851 1431036 1513386 1487870 1453079 1504870 1457666 1567613 1678571 1630064 1654490
2782A654490Q5524O1470O3127L1212o5919J1532q8455m2852o6771q8122J6644
$$ 1654490 1740014 1801484 1864611 1895823 1829904 1841436 1752981 1710129 1643358 1555236 1571880
2771A571880k1366p0034O4186l814p2636Q668j8694j4843K0051Q9104j14592L5432
$$ 1571880 1550514 1480480 1544666 1540852 1468216 1476884 1458190 1443347 1463398 1552502 1437910 1473342
2759A473342R7238r7349o4743L4973o4074K0650k1561j26718m5471j5243k5278
$$ 1473342 1570580 1473231 1408488 1443461 1379387 1400037 1378476 1251758 1206287 1191044 1165766
2748A165766j36956k1132N8517j2608q6462n4118j4284k3589l280j2688j20538
$$ 1165766 1028810 1007678 1066195 1053587 967125 913007 898723 875134 871854 859166 738628
2737G38628N8100J4587N9300k6645m288l2789Q66k4322r3909K7798R3287m4375
$$ 738628 796728 811315 870615 843970 839682 806893 807759 783437 689528 717326 810613 766238
2725G66238j5293j10258K29P9228o6665j3362J04996J1519k8015p9516m105m7355
$$ 766238 750945 640687 640916 720144 653479 640117 745113 756632 728617 649101 644996 597641
2713E97641J0483J5374n5382k3597j6293Q9176j8784p2116l1315l8322J769N1083
$$ 597641 608124 623498 568116 544519 528226 617402 598618 526502 495187 456865 458634 509717
2701E09717M8299Q763r2081K0165K9382m7577k9624o7703q010J21777m4752J117
$$ 509717 558016 566779 474698 494863 524245 476668 447044 379341 371331 493108 448356 449473
2689D49473O9563R955k4705l6973k8022Q9543P8731Q7776j04813k28028J7960
$$ 449473 519036 528991 504286 467313 439291 528834 607565 695341 590528 362500 380460
2678C80460N1826N0647p334r2906N2259o0284n4257P9984M136p4126l663n408
$$ 380460 432286 482933 475599 382693 434952 374668 320411 400395 404531 330405 326742 321334
2666C21334L2269J06564l2475q9006R136M9590Q3230l1782L2383J7090L177J04026
$$ 321334 353603 460167 427692 338686 347822 397412 480642 448860 481243 498333 501510 605536
2654F05536q0942p8921J0423k6813l0821n3986K5565l0013N3758K4623p1592n9695
$$ 605536 524594 445673 456096 429283 398462 344476 370041 340028 393786 418409 346817 287122
2642B87122J18513j7090L9927Q1224j11292l9376P1044N4850R638j9412M4122
$$ 287122 405635 388545 428472 509696 398404 359028 430072 484922 494560 475148 519270
2631E19270R1239r275r0861M5712O7657n1684r0816q9849O5075K8991j8315m1837
$$ 519270 610509 601234 510373 556085 623742 572058 481242 391393 456468 485459 467144 425307
2619D25307l0692L27j1211r803N6062j6292o6871Q318m5771n02l6396m83L3763
$$ 425307 394615 394942 383731 373928 429990 413698 346827 355145 309374 308872 272476 271993 305756
2606C05756j6966p002j5501P0115K0138p9941k8311k8756O4044P4955l8073J1275
$$ 305756 288790 281788 266287 336402 356540 276599 248288 219532 283576 358531 320458 331733
2594C31733K7558p7532j029O2909l8149k9339O1167j4465m9338q717k8513L5786
$$ 331733 359291 281759 280730 343639 305490 276151 337318 322853 273515 264798 236285 272071
2582B72071k6478m6352J2055M7144k0938o001N8899J02898j24019l5672l425J322
$$ 272071 245593 199241 211296 258440 237502 231501 290400 393298 269279 233607 230182 231504
2570B31504P3345p6236k5152K3599k5659k1500K9818O3931k964k8025q0026M0026
$$ 231504 304849 228613 203461 227060 201401 179901 209719 273650 270686 242661 162635 202661
2558B02661N8489K8109m5946k5274p45L1449j0975J0253K691n2698Q678L093l8708
$$ 202661 261150 289259 243313 218039 217294 248743 237768 248021 250712 198014 206692 209785 171077
2545A71077l5661r998q9050J46823M1182o9570q297n6788j8014N4010O1145P99
$$ 171077 135416 125418 36368 183191 224373 154803 146506 89718 71704 125714 186859 187658
2533A87658J06691q1576j0910M5952k2685q4811m6052L1423J073P1604n2785j649
$$ 187658 294349 212773 201863 247815 225130 140319 94267 125690 126763 198367 145582 143933
2521A43933L0024J1214o5368j5158M7318o0562K844k3741Q4901J4490J8901M0340
$$ 143933 173957 185171 119803 104645 151963 91401 94245 70504 155405 169895 188796 229136
2509B29136r2926k0720O1793l9880j2227j3562N5639j9402m2249J6815P3951r5239
$$ 229136 136210 115490 177283 137403 125176 111614 167253 147851 105602 122417 196368 101129
2497A01129K3514L2490j5921M710P4439K4964q3631r4277O0688K1478n831l7697
$$ 101129 124643 157133 141212 145922 220361 245325 161694 67417 128105 149583 143752 106055
2485A06055m3183n3532q812N3444N7160K9220J345l4633n1197L2861p2556L9964
$$ 106055 62872 9340 528 53972 111132 140352 141697 107064 55867 88728 16172 56136
2473E6136m5224R2531M5083L448r2736N4362j04m0755J3976J21214J6937n4624
$$ 56136 10912 103443 148526 151974 59238 113600 113496 72741 86717 207931 224868 170244
2461A70244n0388j08152k4972J79438O0240J2406j53639L1481O8791j22455j42288
$$ 170244 119856 11704 -13268 166170 226410 238816 85177 116658 185449 62994 -79294
2450g9294J49164k6171o4618R7451K9132J693N2817M5415M406o0924j8232l407
$$ -79294 69870 43699 -20919 76532 105664 107357 160174 205589 209995 149071 130839 127432
2438A27432m2537L2591o8804K0132J06729k6749n216l669l4294j84o2997L0470
$$ 127432 84895 117486 48682 68814 175543 148794 143578 139909 105615 105431 42434 72904
2426G2904K0098L1103K378p0489P7216J1142q4840M3845O1326L5331n0515j8550
$$ 72904 93002 124105 126483 55994 133210 144352 59512 103357 164683 200014 149499 130949
2414A30949L9509k8348j795k8085o0576N1307l1310p6178L7466O9766N7265L4135
$$ 130949 170458 142110 140315 112230 51654 102961 71651 -4527 32939 102705 159970 194105
2402A94105L4730m5476n2335Q328q422q8558L1700J7648L161J39116n9253J9651
$$ 194105 228835 183359 131024 139352 130930 42372 74072 91720 94881 233997 174744 194395
2390A94395r259l1464m125Q8278N160n3718n2478L3331p688j05732k497L6978
$$ 194395 185136 153672 149547 237825 242985 189267 136789 170120 162432 56700 54203 91181
2378I1181K945k7986j1585j15297R8000j8727J5271J35937n1718J7213k9476M3512
$$ 91181 94126 66140 54555 -60742 37258 18531 33802 169739 118021 135234 105758 149270
2366A49270o0356q118j9368R4517K5528j14882k3870q1994L8038K9943m1185j6572
$$ 149270 88914 80796 61428 155945 181473 66591 42721 -39273 -1235 28708 -12477 -29049
2354b9049L8009N1329L9706o2824K6085J21152p2962o1136N9165j20640P5821
$$ -29049 8960 60289 99995 37171 63256 184408 111446 50310 109475 -11165 64656
2343F4656j8869J5262k4019n8502J17006o792N5015m3690o1178p835o2001j0650
$$ 64656 45787 61049 37030 -21472 95534 88742 143757 100067 38889 31054 -30947 -41597
2331d1597K2911R05Q0815O2673L329k4252K4420l0876j59507Q2400K4424K6103
$$ -41597 -18686 -17781 63034 125707 129036 104784 129204 98328 -61179 21221 45645 71748
2319G1748K4760L1690j0882p336o8896O254Q284K72O0031r1878L4373L7903N9661
$$ 71748 96508 128198 117316 109980 41084 47338 55622 55894 115925 24047 58420 96323 155984
2306A55984m637q3323r5731R9923m1951K6594N3663k6685l4814l0953j5414O2741
$$ 155984 151347 68024 -27707 72216 30265 56859 110522 83837 49023 18070 2656 65397
2294F5397q1739J34892o0415k473M6527J6972k9616j6234r6122j678Q9356P3789
$$ 65397 -16342 118550 58135 55662 102189 119161 89545 73311 -22811 -24489 64867 138656
2282A38656j05502K3527N4346M909o5734j6271M1927o092N6254r440k7857r0655
$$ 138656 33154 56681 111027 115936 50202 33931 75858 69766 126020 116580 88723 -1932
2270a932J341J47238l9984j978K1497j2952J05231n5557m4685n2150J547Q309
$$ -1932 -591 146647 106663 104685 126182 113230 218461 162904 118219 66069 67616 75925
2258G5925R7782l8938j02105L4799J554Q218l8393k4255M6268L265o8884J2771
$$ 75925 173707 134769 32664 67463 69017 77235 38842 14587 60855 64120 -4764 8007
2246H007O3723j17194N1043P8560o1683K7636M9759k5839Q2684l0203j04673n0196
$$ 8007 71730 -45464 5579 84139 22456 50092 99851 74012 156696 126493 21820 -28376
2234b8376m1426Q6375J40063l7735j2434q4810Q3136K743l982J5318n9820k8031
$$ -28376 -69802 16573 156636 118901 106467 21657 104793 107536 103554 118872 59052 31021
2222C1021q2678k0085O6168p3794M6016L8042K2631o7317j4022J50398P572k9384
$$ 31021 -51657 -71742 -5574 -79368 -33352 4690 27321 -39996 -54018 96380 103952 74568
2210G4568m8731p9935J97943q6470m0187n7932K3544Q0045q1980R664j6770J63462
$$ 74568 25837 -54098 143845 57375 17188 -40744 -17200 62845 -19135 -9471 -26241 137221
2198A37221l3486o6461O4276q3454L3923N5061q4743O1780K7991j58627Q4693
$$ 137221 103735 37274 101550 18096 52019 107080 22337 84117 112108 -46519 38174
2187C8174K5712L3794r0542K2744k2400K1278K4529J2618o2909K3128J1580o8400
$$ 38174 63886 97680 7138 29882 7482 28760 53289 65907 2998 26126 37706 -30694
2175c0694K5116L2535J2860J13010p1071r7603M0425O9667J8429p9807k5838k6371
$$ -30694 -5578 26957 39817 152827 81756 -15847 24578 94245 112674 32867 7029 -19342
2163a9342L3210j9286L1286P962M643p6098Q3209o2801K7731o9483P1801J04270
$$ -19342 13868 -5418 25868 33830 38473 -37625 45584 -17217 10514 -58969 12832 117102
2151A17102r4514l2385L4167k2794l9885O8881J8737n2746k1374k8226J21891
$$ 117102 22588 -9797 24370 1576 -38309 30572 49309 -3437 -24811 -53037 68854
2140F8854L0381j01656m875l942N9625J11497j12386J4747m7154L4287k339p7305
$$ 68854 99235 -2421 -7296 -11238 48387 159884 47498 62245 15091 49378 47039 -30266
2128c0266o7112J00987N3776k3027Q5294q7879J4824k7863K3597N244L8552j10669
$$ -30266 -97378 3609 57385 34358 119652 31773 46597 18734 42331 47575 86127 -24542
2116b4542Q9087R829m4191L5578j5347K2186j2193R324N8824L6400J1255M3232
$$ -24542 64545 74374 30183 65761 50414 72600 60407 69731 128555 164955 176210 219442
2104B19442n0242o3709J8487j3918m9503J12373K5621L8389l0925J07822o3325
$$ 219442 169200 105491 123978 110060 60557 172930 198551 236940 206015 313837 250512
2093B50512q1452J76455m4242J6305Q2240j21582N8848R8100P499R0348J67309
$$ 250512 169060 345515 301273 317578 399818 278236 337084 435184 442683 533031 700340
2082G00340O4722o2471J18457J12038n6141P0657p3378l1666j616j4291j22964
$$ 700340 765062 702591 821048 933086 876945 947602 874224 842558 840942 826651 703687
2071G03687j26136n7021P725o4698n7982q2711m9047R288K4321l6768j5733K0927
$$ 703687 577551 520530 528255 463557 405575 322864 273817 283105 307426 270658 254925 275852
2059B75852o8593q0549J09816M5184o6260o9593k7184K097L9246p4030M2311P6856
$$ 275852 207259 126710 236526 281710 215450 145857 118673 120770 160016 85986 128297 205153
2047B05153o4824p2916k2790J14290n0276l617m8197L657O8222q74k2129l3047
$$ 205153 140329 67413 44623 158913 108637 105020 56823 60480 128702 127828 105699 72652
2035G2652J30164j33932k4413M5383k9568p35j2503J06812k6189K9279j54556
$$ 72652 202816 68884 44471 89854 60286 59551 47048 153860 127671 156950 2394
2024B394l7892J73303J6699n4610j01497j4892l0998L6817O0048n9320q082J0246
$$ 2394 -35498 137805 154504 99894 -1603 -16495 -47493 -10676 49372 -9948 -18030 -7784
2012g784K7753N0039k2882O2604k6769j23341L312L8149N2411J1636L8278m7974
$$ -7784 19969 70008 47126 109730 82961 -40380 -37068 1081 53492 65128 103406 55432
2000E5432J1318K1819j17618n8367J26383m5369m9150K0313L7072l8603r94J06623
$$ 55432 66750 88569 -29049 -87416 38967 -6402 -55552 -35239 1833 -36770 -37764 68859
1988F8859q3544r395K1430j8767J3465n165n0653M5789Q5486j45444Q3772O0679
$$ 68859 -14685 -24080 -2650 -21417 -7952 -13117 -63770 -17981 67505 -77939 5833 66512
1976F6512l7007q5565K4777L2697l8965L7071O2922J5933Q0225j62037o764r6979
$$ 66512 29505 -56060 -31283 1414 -37551 -480 62442 78375 158600 -3437 -10201 -107180
1964a07180Q0667P7505l0527L4717l3579k2372j0754j09627Q8890k6527Q193P4091
$$ -107180 -26513 50992 20465 55182 21603 -769 -11523 -121150 -32260 -58787 -50594 23497
1952B3497j0864j18657M3475Q6425K0583k0961m8093o4k8812O1895m91O0853j6346
$$ 23497 12633 -106024 -62549 23876 44459 23498 -24595 -24659 -53471 8424 7933 68786 52440
1939E2440L0613j2993k9226K0262r7695K4611K9351o7436M375p721N2990k0067
$$ 52440 83053 70060 40834 61096 -36599 -11988 17363 -50073 -45698 -53419 -429 -20496
1927b0496N0741Q723m3270P0857N0524l3798j9173m0495Q8694q945m4105j08205
$$ -20496 30245 38968 -4302 66555 117079 83281 64108 23613 112307 103362 59257 -48948
1915d8948o4378N5338J872L0757N2640K3019n3772L5621m8942p0237L1268J4534
$$ -48948 -113326 -57988 -56116 -25359 27281 50300 -3472 32149 -16793 -87030 -55762 -41228
1903d1228J14508l655K9706j9880q6795R726J5200J3150n3424m598K0281o9041
$$ -41228 73280 69625 99331 79451 -7344 2382 17582 30732 -22692 -27290 -7009 -76050
1891g6050J6712M3625p134n3788R1327l921L3256L6400l4426q1898L8216j6382
$$ -76050 -59338 -15713 -22847 -76635 14692 10771 44027 80427 46001 -35897 2319 -14063
1879a4063m7025K3781J07424P270j17598l8281P1738Q071n6354L9719j8946l3469
$$ -14063 -61088 -37307 70117 77387 -40211 -78492 -6754 1317 -55037 -15318 -34264 -67733
1867f7733j4932M4396j3937O4435m4575o287m8713R5752k5139p9513J37682p65
$$ -67733 -82665 -38269 -52206 12229 -32346 -38633 -87346 8406 -16733 -96246 41436 40671
1855D0671q1986O586j8893N4096P8414j5700k7394r4802P4141j7041l4670J2732
$$ 40671 -41315 -34729 -53622 474 78888 63188 35794 -59008 15133 -1908 -36578 -23846
1843b3846k3226O8581m0552N0943L2818r1254R3136n0588N9620j18561N3070J2417
$$ -23846 -47072 21509 -19043 31900 64718 -26536 66600 16012 75632 -42929 10141 22558
1831B2558m1741J0784m2475m9402M4343O907J1515p4631Q8338j4554l3849K4711
$$ 22558 -19183 -8399 -50874 -100276 -55933 -49026 -37511 -112142 -23804 -38358 -72207 -47496
1819d7496K4185M5324J4222N6920L4150q6945j40680K8225N7729j4716N0671J9435
$$ -47496 -23311 22013 36235 93155 127305 40360 -100320 -72095 -14366 -29082 21589 41024
1807D1024k210j7466n6787J4753j8000m1283q801M3673l9785J06974m1656K2305
$$ 41024 38814 21348 -35439 -20686 -38686 -79969 -88770 -45097 -84882 22092 -19564 2741
1795B741J6621n8119p83M070J8519P4876l5882p0864K1492m742K2434l754L5042
$$ 2741 19362 -38757 -39540 -35470 -16951 57925 22043 -48821 -27329 -32071 -9637 -13391 21651
1782B1651P2041o2544M1276m6741k2129K4750Q10n1697M1375P006k13684M5067
$$ 21651 93692 31148 72424 25683 3554 28304 29114 -22583 18792 25798 -187886 -142819
1770a42819P1401R1723L7653p3377p417R450O8635k3695R090p0881Q9489j7140
$$ -142819 -71418 20305 57958 -15419 -22836 -13386 55249 31554 40644 -30237 59252 42112
1758D2112k6111N11L5710j8236m3269j8488o3350J1418L1465M0704J481M4974
$$ 42112 16001 16512 52222 33986 -9283 -27771 -91121 -79703 -48238 -7534 -6053 38921
1746C8921k8002l5871m6058K8784N634M4389j000k5045J5882P4885q4396l2134
$$ 38921 10919 -24952 -71010 -42226 -36592 7797 6797 -18248 -2366 72519 -11877 -44011
1734d4011j1857K2134P6854j00976l5856R5779J4605r3695L3752Q8951k0580o4910
$$ -44011 -55868 -33734 43120 -57856 -93712 2067 16672 -77023 -43271 45680 25100 -39810
1722c9810k4569K4334L3766k4239Q425j08255K6699K6177L6868Q915N3466J7444
$$ -39810 -64379 -40045 -6279 -30518 -22093 -130348 -103649 -77472 -40604 -31689 21777 39221
1710C9221K8093j16764N2659K2872J1788q3502J6567N0687N1193k8791k4740j04907
$$ 39221 67314 -49450 3209 26081 37869 -45633 -29066 21621 72814 44023 19283 -85624
1698h5624J7619J47071j00898k0662O7535P467j36414J27380r030K2570p8500
$$ -85624 -68005 79066 -21832 -42494 25041 32508 -103906 23474 14444 37014 -41486
1687d1486o1460o3516N4041J59358p2600m3074L215K8877R0999n3463j7438M7181
$$ -41486 -102946 -166462 -112421 46937 -25663 -68737 -65522 -36645 54354 891 -16547 30634
1675C0634k1943K9634l2671r5763J07550P2983k8019j82130o2155J34546N4624
$$ 30634 8691 38325 5654 -90109 17441 90424 62405 -119725 -181880 -47334 7290
1664G290l8795N8768L4985r1767M4153k9867K534P8330M186p0973P9367l0335
$$ 7290 -31505 27263 62248 -29519 14634 -15233 -12699 65631 69817 -1156 78211 47876
1652D7876N3961k8557L84p894q3709l4022j05723O5112M5115L0844q891o2879
$$ 47876 101837 73280 73664 65770 -17939 -51961 -157684 -92572 -47457 -16613 -25504 -88383
1640h8383R39L6825R1769M6725o9651K1701m7981L691J11092n0329N60p0884k6231
$$ -88383 -87444 -50619 41150 87875 18224 39925 -8056 -4365 106727 56398 56958 -13926 -40157
1627d0157j0115O4138K2244L8052M4344l9155q5900J257J8335r3451P8135k2205
$$ -40157 -50272 13866 36110 74162 118506 79351 -6549 -5292 13043 -80408 -2273 -24478
1615b4478J7710p3243J0913J6658O111L8575j6769K1762J795k3870K9867p4933
$$ -24478 -6768 -80011 -69098 -52440 -46329 -7754 -24523 -2761 -966 -24836 5031 -69902
1603f9902p7391M5801P0779o7040N3988r7953O8401J06784M9475p6162p2436j6329
$$ -69902 -147293 -101492 -30713 -97753 -43765 -141718 -73317 33467 82942 6780 -65656 -81985
1591h1985O8147N577m1455m3881o0672J05584J079o9632N4564k0780L7731j3938
$$ -81985 -13838 -8261 -49716 -93597 -154269 -48685 -47606 -117238 -62674 -83454 -45723 -59661
1579e9661N5449j4945M9387k2056j9776M2445j3105o9248O6645J9276k7656k6523
$$ -59661 -4212 -19157 30230 8174 -11602 30843 17738 -51510 15135 34411 6755 -19768
1567a9768j7786R2942q4812J8104j8882j6510K666J1889k3314N2542j20079j2288
$$ -19768 -37554 55388 -29424 -11320 -30202 -46712 -44046 -32157 -55471 -2929 -123008 -135296
1555a35296L6441R6987j14224J8039K3348j327M6361O408n5910O321J13609k1452
$$ -135296 -98855 -1868 -116092 -98053 -74705 -76032 -29671 -23263 -79173 -72852 40757 19305
1543A9305o1598M8861m7519l604J6359M3992m7458J08759J6681j10147j4166L125
$$ 19305 -42293 6568 -40951 -44555 -28196 15796 -31662 77097 93778 -16369 -30535 -27410
1531b7410P2460o95l4629q3788L8875P563j5499M2779O7373n9081L636l8820K140
$$ -27410 45050 44355 9726 -74062 -35187 -27624 -43123 -344 67029 7948 11584 -27236 -25096
1518b5096K8717L1284k6839L2807l5157j35011P8925q0633O464R7812j0573k5485
$$ -25096 3621 34905 8066 40873 5716 -129295 -50370 -131003 -124539 -26727 -37300 -62785
1506f2785j6138J0667l0522r1581J29268Q0947p6245M0557J4794n1139N8209J8696
$$ -62785 -78923 -68256 -98778 -190359 -61091 19856 -56389 -15832 -1038 -52177 6032 24728
1494B4728k7330k0236M5301l5792k1353J1364n1679K8618Q4011L6398j21888L3475
$$ 24728 -2602 -22838 22463 -13329 -34682 -23318 -74997 -46379 37632 74030 -47858 -14383
1482a4383M177j5703j0713K5234n2502q894L029K1613o5774J28342K6368K4843
$$ -14383 -10206 -25909 -36622 -11388 -63890 -72784 -69755 -48142 -113916 14426 40794 65637
1470F5637Q759r5800O9490l5230o1748L8732L0430p543N2486q7937j6831l9691
$$ 65637 74396 -21404 48086 12856 -48892 -10160 20270 12727 65213 -22724 -39555 -79246
1458g9246P3318O2900j09821j9774N5592K678r1897O8970l2710K6567O5530M4765
$$ -79246 -5928 56972 -52849 -72623 -17031 -14353 -106250 -37280 -69990 -43423 22107 66872
1446F6872j20781p9860O334J46238K7481j20260J03518j44765O5964n5113k4585
$$ 66872 -53909 -133769 -127435 18803 46284 -73976 29542 -115223 -49259 -104372 -128957
1435a28957R8828r0433K254Q2906k7976R4980n8602K6087P333l9136P665k5080
$$ -128957 -30129 -120562 -118308 -35402 -63378 31602 -27000 -913 6420 -32716 -25051 -50131
1423e0131K2290J21248p0696n6340O0309O470P30P2482l7070l5100j5448n0152
$$ -50131 -27841 93407 22711 -33629 26680 33150 33880 106362 69292 34192 18744 -31408
1411c1408M1733j9920J8391M8015q6146j9804L1539J2173N1481k6505J7702p1277
$$ -31408 10325 -9595 8796 56811 -29335 -49139 -17600 -5427 46054 19549 37251 -34026
1399c4026p8559L418P8368O3346j9084K3331J9343J3166l2942l3048p7711N6392
$$ -34026 -112585 -109167 -30799 32547 13463 36794 56137 69303 36361 3313 -74398 -18006
1387a8006O34m7125P6158M4750R4612j36808J7561Q126l0683j4248n6234l882
$$ -18006 -17372 -64497 11661 56411 151023 14215 31776 39902 9219 -5029 -61263 -65145
1375f5145l0010L2818J09625q2354k7024L9265m5298l1039J16556j04550q0985
$$ -65145 -95155 -62337 47288 -35066 -62090 -22825 -68123 -99162 17394 -87156 -168141
1364a68141K04903r6912N9744j05676o3175Q9057K5383j7649P7358k8058M3849
$$ -168141 36762 -60150 -406 -106082 -169257 -80200 -54817 -72466 4892 -23166 20683
1353B0683j7048j00452J2985N4602M9648k9201K7126l7663j4292n9816M4373N0323
$$ 20683 3635 -96817 -83832 -29230 20418 -8783 18343 -19320 -33612 -93428 -49055 1268
1341A268o9695L552o686K3276M9286J4926M6558n4075r185j08060Q9075j16615
$$ 1268 -68427 -64875 -71561 -48285 1001 15927 62485 8410 -775 -108835 -19760 -136375
1329a36375M4571l9961L5845L2671O2099j6179o406m3071L0976J9374J759L7237
$$ -136375 -91804 -131765 -95920 -63249 -1150 -17329 -23735 -66806 -35830 -16456 -14697 22540
1317B2540k3517m3336m3804P2399j8249P7479p5117J3839L2937l5136p7737J2618
$$ 22540 -977 -44313 -88117 -15718 -33967 43512 -31605 -17766 15171 -19965 -97702 -85084
1305h5084P3140M1419l9647N1751r5418l3969L7434M8523n1025K0860l4112K6797
$$ -85084 -11944 29475 -10172 41579 -53839 -87808 -50374 -1851 -52876 -32016 -66128 -39331
1293c9331m1421j6306P3365j52016k0104J06415K9117k1483L6628K5069j6101
$$ -39331 -80752 -97058 -23693 -175709 -195813 -89398 -60281 -81764 -45136 -20067 -36168
1282c6168P2016r202n2713R236P951Q0099j7446k0803l5592M4594p198j14011
$$ -36168 35848 26646 -26067 -16831 -8880 71219 53773 32970 -2622 41972 34774 -79237
1270g9237j4279P0450n6304R9282n2985N77J4231r445p6604K7821L7825L832O0421
$$ -79237 -93516 -23066 -79370 19912 -33073 -32496 -18265 -27710 -104314 -76493 -38668 -34836 25585
1257B5585j07445R9343J6610N7838p3682k4439J1893l3658R3598p2067k4575j3742
$$ 25585 -81860 17483 34093 91931 18249 -6190 5703 -27955 65643 -6424 -30999 -44741
1245d4741K3765Q849L8475j29826M8033J0721m2053L5223n5170j0808K5017n3915
$$ -44741 -20976 -12127 26348 -103478 -55445 -44724 -86777 -51554 -106724 -117532 -92515 -146430
1233a46430P9671P1754l2834l3392j9004J03191K6724M0641q0160n8082k855L5628
$$ -146430 -66759 4995 -27839 -61231 -80235 22956 49680 90321 10161 -47921 -50776 -15148
1221a5148l1576j1973O111J7291J4836L102o1520L7968L1042n9137p9935K1086
$$ -15148 -46724 -58697 -52586 -35295 -20459 -17357 -78877 -40909 -9867 -69004 -148939 -127853
1209a27853O6856J4583M6572K744K0437L1315r3586L5151j5561j7068k9398J529
$$ -127853 -60997 -46414 158 2902 23339 54654 -38932 -3781 -19342 -36410 -65808 -64279
1197f4279J8327J60242n3319J9453K6438p4475o908l9279L2453J3010n2181l3169
$$ -64279 -45952 114290 60971 80424 106862 32387 25479 -13800 18653 31663 -20518 -53687
1185e3687n9225K1544N081j534J23093k9120k2943m6192N9759m5398K9903q6552
$$ -53687 -112912 -91368 -86287 -87821 35272 6152 -16791 -62983 -3224 -48622 -18719 -105271
1173a05271P3931M7964O9985m9977k4912L2324q6738J2903j6166k8946k8055N5702
$$ -105271 -31340 16624 86609 36632 11720 44044 -42694 -29791 -45957 -74903 -102958 -47256
1161d7256k281r1003N9674J23387L7519k3534j15660L1140m9855J25012m1035
$$ -47256 -49537 -140540 -80866 42521 80040 56506 -59154 -28014 -77869 47143 6108
1150F108j9755M6377o6409k6762k4842R2730M3350n1662n2241P514R0064j33702
$$ 6108 -13647 32730 -33679 -60441 -85283 7447 50797 -865 -53106 -45592 44472 -89230
1138h9230P5620M1550m2668n1332M0079n225m4599k4850J7703M0379P6128j6141
$$ -89230 -13610 27940 -14728 -66060 -25981 -31206 -75805 -100655 -82952 -42573 33555 17414
1126A7414k2399K203L4865q3r8920N5940J182o7628R296n8468L1056L7871J620
$$ 17414 -4985 -2782 32083 32000 -66920 -10980 -9798 -77426 -68130 -126598 -95542 -57671 -56051
1113e6051l3882L3653k6394n2029K7393K7704L6514N6148M4593m6399r3032P0099
$$ -56051 -89933 -56280 -82674 -134703 -107310 -79606 -43092 13056 57649 11250 -81782 -11683
1101a1683O0950K5130J3812j12100Q5448M0395q9749r9540J05578j7935n6882
$$ -11683 49267 74397 88209 -23891 61557 101952 12203 -87337 18241 306 -56576
1090e6576k0153J39478o1451n3232R7550o3806j4093M8436o6278o792P6541m2434
$$ -56576 -76729 62749 1298 -51934 45616 -18190 -32283 16153 -50125 -56917 19624 -22810
1078b2810Q646r05L3246p7760k1583K2934J0635N8379k3379P4058P4344j2171
$$ -22810 -14164 -15069 18177 -59583 -81166 -58232 -47597 10782 -12597 61461 135805 123634
1066A23634j71839k5477K5537P7888l8981K3211R694j3165M1036N3220j50518
$$ 123634 -48205 -73682 -48145 29743 -9238 13973 23667 10502 51538 104758 -45760
1055d5760k5665p618P3111R0630K1779o5254p9860M7081k4309j6121R3070j12563
$$ -45760 -71425 -79043 -5932 84698 106477 41223 -38637 8444 -15865 -31986 61084 -51479
1043e1479m6845O4502J28792m5504L8194j9173o409r3676j0479O5828l3974q8050
$$ -51479 -98324 -33822 94970 49466 87660 68487 62078 -31598 -42077 23751 -10223 -98273
1031i8273O9593J2362j6184M5209K8854L9080o2813n5656N6260N5552k440p4907
$$ -98273 -28680 -16318 -32502 12707 41561 80641 17828 -37828 18432 73984 71544 -3363
1019c363N5003m0851j03478O6819O6164L3243q2400J5647J0833R1296j9723p0283
$$ -3363 51640 10789 -92689 -25870 40294 73537 -8863 6784 17617 108913 89190 18907
1007A8907l8439O2824q507L1492l853r4606o0134L8604p711L2093k7094k148O4003
$$ 18907 -19532 43292 34785 66277 62424 -32182 -92316 -53712 -61423 -29330 -56424 -58572 5431
994E431n151n3231R0982k755j9669N157k3622O648P3543j41458J5538J4219m5387
$$ 5431 280 -52951 38031 35276 15607 20764 -2858 3790 77333 -64125 -48587 -34368 -79755
981g9755J23257q6834M9327r3050q4578P8571J18105K739O0000M1610o7238p6837
$$ -79755 43502 -43332 5995 -87055 -171633 -93062 25043 27782 87782 129392 62154 -14683
969a4683J1639J3051j11283P6433J7808J10847r8159o3364k6311O2063k047j09892
$$ -14683 -3044 10007 -101276 -24843 -7035 103812 5653 -57711 -84022 -21959 -24006 -133898
957a33898J13316k03j9006k8637l5774R1687J0268P4900p9062j1725o6922R7815
$$ -133898 -20582 -20785 -39791 -68428 -104202 -12515 -2247 72653 -6409 -18134 -85056 12759
945A2759k6125N1747N9125r8428p899R0036m2072K0882K5623m8119k883j101r345
$$ 12759 -13366 38381 97506 -922 -8821 81215 39143 60025 85648 37529 34646 33545 24200
932B4200n232K035p4840J18255L8395R417q6550m4471J1845J2128K0767l2949
$$ 24200 18968 21003 -53837 64418 102813 112230 25680 -18791 -6946 5182 25949 -7000
920g000N3329j7445Q3533j10356j12628P5978J8123L1149p03L3226L8787m8445
$$ -7000 46329 28884 112417 2061 -110567 -34589 -16466 14683 13980 47206 85993 37548
908C7548N0147p0881k96M0693o8993K2348P1872p4856M7791l3681k2637m2490
$$ 37548 87695 16814 16518 57211 -11782 10566 82438 7582 55373 21692 -945 -43435
896d3435j7273L2427n1510l5418N8658j11199O9114J76438j17396K9495O6290
$$ -43435 -60708 -28281 -79791 -115209 -56551 -167750 -98636 77802 -39594 -10099 56191
885E6191m2738j01587Q1116J1464N6579M9483n2956j23514p511m036L9641O1746
$$ 56191 13453 -88134 -7018 4446 61025 110508 57552 -65962 -73473 -77509 -37868 23878
873B3878J3800m6651m3728J4526N873j07090P9602M4116j1203m6012J01435L6992
$$ 23878 37678 -8973 -52701 -38175 -32302 -139392 -59790 -15674 -26877 -72889 28546 65538
861F5538j7233o3264M7179l5045p0441N7574m9240P0221j1614p6122p0752O6923
$$ 65538 48305 -14959 32220 -2825 -73266 -15692 -64932 5289 -6325 -82447 -153199 -86276
849h6276J9660Q5692K634q5118J9200j3242Q1439j0087o761o3322M1470n7501
$$ -86276 -66616 19076 21710 -63408 -44208 -57450 23989 13902 7141 -56181 -14711 -72212
837g2212P194L3133j1677j5215l1389k1740M3729j081P1105K110J32988k7480
$$ -72212 -65018 -31885 -43562 -58777 -90166 -111906 -68177 -69258 1847 3957 136945 109465
825A09465O1654r2301q4985R2981j00429m0523O1031K7089p7499j5246Q3919j1520
$$ 109465 171119 78818 -6167 86814 -13615 -54138 6893 33982 -43517 -58763 25156 13636
813A3636q2328N9166O9800J6956o7557k0485K9476n9276O7093N5020q5677L811
$$ 13636 -68692 -9526 60274 77230 9673 -10812 18664 -40612 26481 81501 -4176 -365
801c65K5277l8497j7201q0328M6485K5503n4604O8193L9540n4889L2118K6996
$$ -365 24912 -13585 -30786 -111114 -64629 -39126 -93730 -25537 14003 -40886 -8768 18228
789A8228M9861j4754m7422Q2963j01799N7130j8361n1778J29402k3561o87J38283
$$ 18228 68089 53335 5913 88876 -12923 44207 25846 -25932 103470 79909 79222 217505
777B17505j23480J0409m0296J4474m7539n7792J9053J6671P9956m1606k805j3644
$$ 217505 94025 104434 64138 78612 31073 -26719 -7666 9005 88961 47355 44550 30906
765C0906l576k3857L3250M5967K5564l4733j39663q8720Q0469K7046N2323j750
$$ 30906 27330 3473 36723 82690 108254 73521 -66142 -154862 -74393 -47347 4976 3226
753C226j8826J6066o3111N9133o94O5744Q6155j28957k083q6526J15779L1402
$$ 3226 -15600 466 -62645 -3512 -4206 61538 147693 18736 16653 -69873 45906 77308
741G7308j81761M624R735P5406K7264l69n5304p3417P2540O711m134M8131p8285
$$ 77308 -104453 -99829 -90094 -14688 12576 12207 -43097 -116514 -43974 -37263 -41397 6734 -71551
728g1551O3523l3782O3222r0762O113l1232J3590K5651J04026L2692n1576P32
$$ -71551 -8028 -41810 21412 -69350 -63237 -94469 -80879 -55228 48798 81490 29914 30646
716C0646J2431m6220j957n3487N3321Q5238r8087j9745P5303j5511o0777L1704
$$ 30646 43077 -3143 -5100 -58587 -5266 79972 -18115 -37860 37443 21932 -38845 -7141
704g141O6767P8422j12331l3251j3386K8725M1470R507K8972k6889o1577L441
$$ -7141 59626 138048 25717 -7534 -20920 7805 49275 58782 87754 60865 -712 2729
692B729M2906m4553p9202l660P4962N9710O1074j04333J6079Q5422L4159o1500
$$ 2729 45635 1082 -78120 -81780 -6818 52892 113966 9633 25712 111134 145293 83793
680H3793R82j29j5368j06558J23046r2038L2277L9360N2497j39608M9246N2971
$$ 83793 84775 84646 69278 -37280 85766 -6272 26005 65365 117862 -21746 27500 80471
668H0471q6155K2191n6487k058j03693O6008j4830L8743j8286J25784K4409N7313
$$ 80471 -5684 16507 -39980 -42038 -145731 -79723 -94553 -55810 -74096 51688 76097 133410
656A33410j22581R2018J0085n6491j5752r4441q5631R0879J6634q5777L6198N2784
$$ 133410 10829 102847 112932 56441 40689 -53752 -139383 -48504 -31870 -117647 -81449 -28665
644b8665n176p3045N9320M9733j9675K1007j3264N4296r2463J5235J2541O0061
$$ -28665 -33841 -106886 -47566 2167 -17508 3499 -9765 44531 -47932 -32697 -20156 39905
632C9905L7789j3001J3999k2254L6516j8193j26371J18079N9064j6953k25l006
$$ 39905 77694 64693 78692 56438 92954 74761 -51610 66469 125533 108580 108355 105349
620A05349J2853m2685p7877k6263R4999k2807l6749Q5040p8076L0729l368n4725
$$ 105349 118202 75517 -2360 -28623 66376 43569 6820 91860 13784 44513 41145 -13580
608a3580R8754p8675r4383K1332J36778j4810m2321K7546j0754j5307r0142J02149
$$ -13580 85174 6499 -87884 -66552 70226 55416 13095 40641 29887 14580 -75562 26587
596B6587L441k6997Q8561m4798M0898M2718j5529l6496J7329p3148k6250l7056
$$ 26587 30028 3031 91592 46794 87692 130410 114881 78385 95714 22566 -3684 -40740
584d0740L211J17289j6r9221R9928m3583n5113M2489l6504p4671K6700J4421L3358
$$ -40740 -37529 79760 79744 -19477 80451 36868 -18245 24244 -12260 -86931 -60231 -45810 -12452
571a2452k2710q174L08L6281P705l855P3640l1279j5185j8392J7889l1273L4064
$$ -12452 -35162 -43336 -43028 -6747 958 -2897 70743 39464 24279 5887 23776 -7497 26567
558B6567o4299l9517J17713L8559K5461J1471j09887O1638O86j34014p1433P1497
$$ 26567 -37732 -77249 40464 79023 104484 115955 6068 67706 68392 -65622 -137055 -65558
546f5558L2577O1753M842p0242m3922R1793p8855K7088J5530L456J10510l5851
$$ -65558 -32981 28772 33614 -36628 -80550 11243 -67612 -40524 -24994 -21538 88972 53121
534E3121l6940m5121R156n1496K6113J2467l95k531j3653M7220J9288J0450K3576
$$ 53121 16181 -28940 -19784 -71280 -45167 -32700 -33095 -35626 -49279 -2059 17229 27679 51255
521E1255l4166j3345K1646L1955l4627j1989R0756m8428l6800r076l736Q385J2120
$$ 51255 17089 3744 25390 57345 22718 10729 101485 53057 16257 7181 3445 11830 23950
508B3950K3220m2779K7620r1221J29792j1735l5854K9432K7368j5229l3914m115
$$ 23950 47170 4391 32011 -59210 70582 58847 22993 52425 79793 64564 30650 26535
496B6535M3862L1209O241n0549n6736J11567o1994j11117J1253K4135N8432k5313
$$ 26535 70397 101606 107847 57298 562 112129 50135 -60982 -49729 -25594 32838 7525
484G525j7280N6960q8294J03359p4198k4579Q2686K1056O0976M4999j3072j60839
$$ 7525 -9755 47205 -41089 62270 -11928 -36507 46179 67235 128211 173210 160138 -701
472g01J5985K941l2130M0645o3501J28130N0760j02277J2728K123O743n5260N8983
$$ -701 15284 18225 -13905 26740 -36761 91369 142129 39852 52580 54703 61446 6186 65169
459F5169m1277J00053p8554p7139l1984J7873M6850O7127r940j6487l8048N4637
$$ 65169 23892 123945 45391 -31748 -63732 -45859 991 68118 58178 41691 3643 58280
447E8280J4131p7783M322k5556K5010j6968L3360o2697j2636Q433K0671j05039
$$ 58280 72411 -5372 -1050 -26606 -1596 -18564 14796 -47901 -60537 -52104 -31433 -136472
435a36472M1689o03K5148J55499J03362j84438k7190K6418k4337N2768p8640R7997
$$ -136472 -94783 -95386 -70238 85261 188623 4185 -23005 3413 -20924 31844 -46796 51201
423E1201p5217K3756l659j2319K5740m1713k3415P3282L2004L2615M3273p2057
$$ 51201 -24016 -260 -3919 -16238 9502 -32211 -55626 17656 49660 82275 125548 53491
411E3491l0830L5328l064L0068l0011j8349j9695l9494L2796r8085O9136O7361
$$ 53491 22661 57989 54925 84993 54982 36633 16938 -22556 10240 -87845 -18709 48652
399D8652J8930O8622l0177j66506J23896N4277p2054M5251K001o1529q929l0797
$$ 48652 67582 136204 106027 -60479 63417 117694 45640 90891 92892 31363 22434 -8363
387h363J872m154j3183o1232P0673Q2759O993n645m6815J0307N5929q0371L8955
$$ -8363 -6491 -10645 -23828 -85060 -14387 68372 75365 69720 22905 33212 89141 8770 47725
374D7725K9142p129l8250Q2457p9988q8310O4659n348k0896j5247J05207r6294
$$ 47725 76867 69738 31488 113945 33957 -54353 10306 4958 -15938 -31185 74022 -22272
362b2272k218P6696J16466k497n1963n1881q062N5247j37518J05824J9841k3628
$$ -22272 -24490 52206 168672 166175 114212 62331 54269 109516 -28002 77822 97663 74035
350G4035K5934j50044j9850Q5344m2018J0313J53107J8536r567k4098Q3167r6632
$$ 74035 99969 -50075 -69925 15419 -26599 -16286 136821 155357 145790 121692 204859 108227
338A08227p5822J7326L5344Q691l6571j11022o108Q0007O4473Q066r2890k2174
$$ 108227 32405 49731 85075 93766 57195 -53827 -59935 20072 84545 92611 -279 -22453
326b2453J32066J5982o0908n8737j4745l1089J06013N2145N7008j25642j04641
$$ -22453 109613 125595 64687 5950 -8795 -39884 66129 118274 175282 49640 -55001
315e5001N8878J8828J06930o4773l5876k0371o9525J22502j0120M2284m0950o9390
$$ -55001 3877 22705 129635 64862 28986 8615 -60910 61592 51472 93756 52806 -16584
303a6584K3560N7411n5091l1671J53296n7774M0905k6647n0337K9829J3623m2650
$$ -16584 6976 64387 9296 -22375 130921 73147 114052 87405 37068 66897 80520 37870
291C7870l9025R331O98J00735L2887j07170m4320R0998k1850k1444K5043N6118
$$ 37870 -1155 8176 8874 109609 142496 35326 -8994 82004 60154 38710 63753 119871
279A19871k3528m7406l5148l9561O8063k9353m8130n2256j3990L9599J34365L6804
$$ 119871 96343 48937 13789 -25772 42291 12938 -35192 -87448 -101438 -61839 72526 109330
267A09330p0327N2659n8319l6556M7164M533p4586J0858L8061j9346K7288j89384
$$ 109330 39003 91662 33343 -3213 43951 48484 -26102 -15244 22817 3471 30759 -158625
255a58625O0049R6292J20277l9463l3305K6353M1264k6155q7064m8949N9323p2594
$$ -158625 -98576 -2284 117993 78530 45225 71578 112842 86687 -377 -49326 9997 -62597
243f2597L5494J4149O5355M5161j36279M1943j4328q251Q861O4185o185l781n7644
$$ -62597 -27103 -12954 52401 97562 -38717 3226 -11102 -19353 -10492 53693 47508 43727 -13917
230a3917k0456J00350o0486j4263n1344R9085L9994J3103K3942j3320j4714P864
$$ -13917 -34373 65977 5491 -8772 -60116 38969 78963 92066 116008 102688 87974 95838
218I5838M0362l6733l5750l5117Q2298N1627j90815N3281q4613N742P5573N3597
$$ 95838 136200 99467 63717 28600 110898 162525 -28290 24991 -59622 -53880 21693 75290
206G5290j11762J739J46397k0211k9022L1413j9695q2714l7055J06335R1038l8977
$$ 75290 -36472 -34733 111664 91453 62431 93844 74149 -8565 -45620 60715 151753 112776
194A12776R351k6137j26068J2998N3598L1128O1901j9693k8907r2342P1957o155
$$ 112776 122127 95990 -30078 -17080 36518 67646 129547 109854 80947 -11395 60562 54407
182E4407K1650l1843J22945j72630j3885Q5810N4398p1116L233k147j6258q5703
$$ 54407 76057 44214 167159 -5471 -19356 66454 120852 49736 52969 50822 34564 -51139
170e1139J15030J1381R115K1861J454L0134r1800m8284O2997J3490k1016Q0351
$$ -51139 63891 75272 84387 106248 107702 137836 46036 -2248 60749 74239 53223 133574
158A33574q5277r042J8016l4740L9172q5932L1749k7011N0335m9231M600J10234
$$ 133574 48297 39255 57271 22531 61703 -24229 7520 -19491 30844 -18387 -13787 96447
146I6447m5911k2269q177N531Q1314o7582p2649J02542l6951k2575O6579J6731
$$ 96447 50536 28267 20090 25621 106935 39353 -33296 69246 32295 9720 76299 93030
134I3030l6204o749Q478O4272q9091N114j1942K8074l423m1749M3936l8214R6063
$$ 93030 56826 50077 58555 122827 33736 38850 26908 54982 51559 9810 53746 15532 111595
121A11595K5625n3142o0384k1026Q860J00611o7377j16172K0720L7139M5629K7823
$$ 111595 137220 84078 23694 2668 11528 112139 44762 -71410 -50690 -13551 32078 59901
109E9901L6880P654J9358p3327L5024k1636j9089Q0511o0143n1667M9804M529
$$ 59901 96781 104435 123793 50466 85490 63854 44765 125276 65133 13466 63270 67799
97F7799K5168l9631L6466l8082l2872K0623N7248m3573n6888L4753k2664P5165
$$ 67799 92967 53336 89802 51720 18848 39471 96719 53146 -3742 31011 8347 83512
85H3512n4925m0884Q7277j5414k8021R40Q7070r2885J6676J545l4745K3424k0657
$$ 83512 28587 -12297 74980 59566 31545 32485 119555 26670 43346 44891 10146 33570 12913
72A2913N2457l1981o4390j6915M1393Q677N6641l6318M9990J7860l2371M5042
$$ 12913 65370 33389 -31001 -47916 -6523 2154 58795 22477 72467 90327 57956 102998
60A02998o1563J4800o0154M191O753j6245K5182L5053m9380m5235O4199k7645
$$ 102998 41435 56235 -3919 272 7025 -9220 15962 51015 1635 -43600 20599 -7046
48g046k3916Q1209r622m225P0019j1120Q1470j04375k7739k3426n0159M9812l1368
$$ -7046 -30962 50247 40625 36400 106419 95299 176769 72394 44655 21229 -28930 20882 -10486
35a0486N6017j6987L533R543L5788j5200L3441K2147j11363l5433l68N1023L1068
$$ -10486 45531 28544 32077 41620 77408 62208 95649 117796 6433 -29000 -29368 21655 52723
22E2723o7959J05252J0352m3150k0627M4494l7554P7943k7888k217m512K9099
$$ 52723 -15236 90016 100368 57218 36591 81085 43531 121474 93586 91369 86857 115956
10A15956j2919p7465K4427N332k6471J5758m2509J4359M6276j6263
$$ 115956 103037 25572 49999 55331 28860 44618 2109 16468 62744 46481
0D6481
$$ 46481
$$ Imaginary data points
##PAGE= N=2
##DATA TABLE= (X++(I..I)), XYDATA
16383a451191J1969N8451p5154J5110J08092k2558J15346j047j0891J5603O1439
$$ -1451191 -1439222 -1380771 -1455925 -1440815 -1332723 -1355281 -1239935 -1240982 -1251873 -1236270 -1174831
16372a174831m1876O3865p973P113M0346k5572Q6498k888k0001K5305l9194K8453
$$ -1174831 -1216707 -1152842 -1160815 -1153702 -1113356 -1138928 -1052430 -1055318 -1075319 -1050014 -1089208 -1060755
16360a060755M3431L1291N1563L0613k6035R005J1093J8019q479l4679N5252M4246
$$ -1060755 -1017324 -986033 -934470 -903857 -929892 -920887 -909794 -891775 -900254 -934933 -879681 -835435
16348h35435N079O0044N9200q0837o356K9424l775M5228K6316k3058J5145L7184
$$ -835435 -830356 -770312 -711112 -791949 -798305 -768881 -772656 -727428 -701112 -724170 -709025 -671841
16336f71841J7990J4380P4583K8751J3989L8512k8523O6529O4130R46k2073j670
$$ -671841 -653851 -639471 -564888 -536137 -522148 -483636 -512159 -445630 -381500 -380554 -402627 -404297
16324d04297J0585l4794Q8291M2520o6711j9470J1088N1485j1754J3429N9304
$$ -404297 -393712 -428506 -340215 -297695 -364406 -383876 -372788 -321303 -333057 -319628 -260324
16313b60324q863j1684M6478J7663K5372n0756k7510Q2570P5485j5848k9380n5771
$$ -260324 -269187 -280871 -234393 -216730 -191358 -242114 -269624 -187054 -111569 -127417 -156797 -212568
16301b12568N5744J04179M129k0021k846O3103o743L5744K1872j13821M5429K743
$$ -212568 -156824 -52645 -48516 -68537 -71383 -8280 -15023 20721 42593 -71228 -25799 -23056
16289b3056M2432l4075P0552L3856r629L6435J3364P2514N23P832K2102m8307
$$ -23056 19376 -14699 55853 89709 80080 116515 129879 202393 202916 210748 232850 184543
16277A84543m3447Q0149P4291k7852k9031P2267K6603L1546r9652J8274J04975
$$ 184543 141096 221245 295536 267684 238653 310920 337523 369069 269417 287691 392666
16266C92666N3726q3830O0554o950p4355M3558n546q821M140J30831j2304n089
$$ 392666 446392 362562 423116 416166 341811 385369 379823 371002 375142 505973 493669 488580
16254D88580k4719L4769M2354N3122J7920j2728p8906m693J17507j6309L1085
$$ 488580 463861 498630 540984 594106 612026 599298 520392 515699 633206 616897 647982
16243F47982q771k3321n3707J01831N0645m1058K0480k536q8394J20942L8028
$$ 647982 639211 615890 562183 664014 714659 673601 694081 691545 603151 724093 762121
16232G62121r7978R7351n7417P8279K867n1515R0618j0734r3287k868J04633l2973
$$ 762121 664143 761494 704077 782356 785223 733708 824326 813592 720305 717437 822070 789097
16220G89097J06024j5490k0548l4125P7797O0527o135o3380O0528k3957k7536
$$ 789097 895121 879631 859083 824958 902755 963282 957147 893767 954295 930338 902802
16209I02802q349J6753M4383j31764Q8726M3034m4102N7062m615J7861o4258N2448
$$ 902802 894453 911206 955589 823825 912551 955585 911483 968545 963930 981791 917533 969981
16197I69981R2966q9003M6549N3443j03061p5897P8454Q2386q0668M9713n592
$$ 969981 1062947 973944 1020493 1073936 970875 894978 973432 1055818 975150 1024863 1019271
16186A019271n2043n247M726O3543p616m545K551k9696l1842Q4126M9541j1688
$$ 1019271 967228 961981 966707 1030250 1022634 1018089 1020640 990944 959102 1043228 1092769 1081081
16174A081081N1071M8831j9573l1968k2699o3406Q6125L9214N7289m3066m7869
$$ 1081081 1132152 1180983 1161410 1129442 1106743 1043337 1129462 1168676 1225965 1182899 1135030
16163A135030P0994m8952p2366P1951Q151M5342l500J6026K751l2691j2178l066
$$ 1135030 1206024 1157072 1084706 1156657 1164808 1210150 1206650 1222676 1225427 1192736 1180558 1177492
16151A177492K5862q3248N7679K7734K7942o9029J20278p681j0763K0879j522
$$ 1177492 1203354 1120106 1177785 1205519 1233461 1164432 1284710 1277029 1266266 1287145 1285623
$$ [...]
##END NTUPLES=NMR SPECTRUM
##END=
