##TITLE=1H_CA-9279-1
 DMSO-d6
 8 sc, 
 9.10.2024
##JCAMPDX= 6.0         $$ Bruker NMR JCAMP-DX V2.0
##DATA TYPE= NMR SPECTRUM
##DATA CLASS= NTUPLES
##ORIGIN= UXNMR, Bruker Analytische Messtechnik GmbH
##OWNER= root
$$ XWIN-NMR		Version 3.5
$$ Wed Oct  9 14:16:56 2024 Russian Standard Time (UT+4h)  she@DPX200
##.OBSERVE FREQUENCY= 200.1318
##.OBSERVE NUCLEUS= ^1H
##.ACQUISITION MODE= SIMULTANEOUS
##.ACQUISITION SCHEME= undefined
##.AVERAGES= 8
##.DIGITISER RES= 18
##SPECTROMETER/DATA SYSTEM= spect
##.PULSE SEQUENCE= zg30
##.SOLVENT NAME= DMSO
##.SHIFT REFERENCE= (INTERNAL, DMSO, 0, 21.0223)
##AUDIT TRAIL= $$ (NUMBER, WHEN, WHO, WHERE, WHAT)
$$ ##TITLE= Audit trail, XWIN-NMR		Version 3.5
$$ ##JCAMPDX= 5.01
$$ ##ORIGIN= Bruker BioSpin GmbH
$$ ##OWNER= she
$$ F:/spectra/data/she/nmr/H-F/1/pdata/1/auditp.txt
$$ ##AUDIT TRAIL=  $$ (NUMBER, WHEN, WHO, WHERE, WHAT)
(   1,<2024-10-09 14:15:37.25 +0400>,<she>,<DPX200>,
      <created by zg, POWCHK disabled, PULCHK disabled
       configuration hash MD5:
       00 E9 B6 7A A2 85 ED C7 34 08 36 98 17 FE 4E 26
       data hash MD5: 16K
       4A E6 30 97 4B D0 3F 0A 3D 9E 5E 40 00 78 A9 E1>)
(   2,<2024-10-09 14:15:41.67 +0400>,<she>,<DPX200>,
      <Start of raw data processing
       efp BC_mod = 2 LB = 0.24 FT_mod = 6 PKNL = 1 PHC0 = -26517.22 PHC1 = 25.58743 SI = 16K 
       data hash MD5: 16K
       56 4E 45 FA 5A B5 85 F9 76 97 4C E2 E0 4C 10 90>)
(   3,<2024-10-09 14:16:05.65 +0400>,<she>,<DPX200>,
      <pk PHC0 = -1.999179 PHC1 = 5 
       data hash MD5: 16K
       D6 34 AD 73 4F 7C 32 3C D2 5A 1F 6F DB 3E B4 C3>)
(   4,<2024-10-09 14:16:10.35 +0400>,<she>,<DPX200>,
      <abs ABSG = 5 
       data hash MD5: 16K
       81 75 5C FE 54 9D 35 18 B9 4F 62 1D E8 C4 4E DA>)
$$ ##END=
$$ 
$$ hash MD5
$$ A0 39 DC FC 26 92 4B 78 7B 14 8D 2F 40 3A DF BC
##$RELAX= 
##$RELAX= 
##$RELAX= 
##$RELAX= 
##$RELAX= 
##$RELAX= 
$$ Bruker specific parameters
$$ --------------------------
##$DU= <F:/spectra>
##$EXPNO= 1
##$NAME= <H-F>
##$PROCNO= 1
##$TYPE= <nmr>
##$USER= <she>
##$AMP= (0..31)
100 100 100 100 100 100 100 100 100 100 100 100 100 100 100 100 100 100 
100 100 100 100 100 100 100 100 100 100 100 100 100 100 
##$AQSEQ= 0
##$AQ_mod= 1
##$AUNM= <au_zg>
##$AUTOPOS= <>
##$BF1= 200.13
##$BF2= 200.13
##$BF3= 200.13
##$BF4= 200.13
##$BF5= 200.13
##$BF6= 200.13
##$BF7= 200.13
##$BF8= 200.13
##$BYTORDA= 1
##$CFDGTYP= 0
##$CFRGTYP= 5
##$CHEMSTR= <none>
##$CNST= (0..31)
1 1 145 1 1 1 1 1 1 1 1 1 1 1 1 1 1 1 1 1 1 1 1 1 1 1 1 1 1 1 1 1 
##$CPDPRG= <>
##$CPDPRG1= <>
##$CPDPRG2= <>
##$CPDPRG3= <>
##$CPDPRG4= <mlev>
##$CPDPRG5= <mlev>
##$CPDPRG6= <mlev>
##$CPDPRG7= <mlev>
##$CPDPRG8= <mlev>
##$CPDPRGB= <>
##$CPDPRGT= <>
##$D= (0..31)
0 1.2 0 0 0 0 0 0 0 0.06 0 0.03 0 0 0 0 0.0002 0 0 0 0 0 0 0 0 0 0 0 0 
0 0 0 
##$DATE= 1728468936
##$DBL= (0..7)
120 120 120 120 120 120 120 120 
##$DBP= (0..7)
150 150 150 150 150 150 150 150 
##$DBP07= 0
##$DBPNAM0= <>
##$DBPNAM1= <>
##$DBPNAM2= <>
##$DBPNAM3= <>
##$DBPNAM4= <>
##$DBPNAM5= <>
$$ [...]
##$SUBNAM3= <"">
##$SUBNAM4= <"">
##$SUBNAM5= <"">
##$SUBNAM6= <"">
##$SUBNAM7= <"">
##$SUBNAM8= <"">
##$SUBNAM9= <"">
##$SW= 24.0689170037331
##$SWIBOX= (0..15)
0 0 2 0 0 0 0 0 0 0 0 0 0 0 0 0 
##$SW_h= 4816.95568400771
##$TD= 16384
##$TD0= 1
##$TE= 0
##$TE2= 300
##$TE3= 300
##$TEG= 300
##$TL= (0..7)
0 120 120 120 120 120 120 120 
##$TP= (0..7)
150 150 150 150 150 150 150 150 
##$TP07= 0
##$TPNAME0= <>
##$TPNAME1= <>
##$TPNAME2= <>
##$TPNAME3= <>
##$TPNAME4= <>
##$TPNAME5= <>
##$TPNAME6= <>
##$TPNAME7= <>
##$TPOAL= (0..7)
0.5 0.5 0.5 0.5 0.5 0.5 0.5 0.5 
##$TPOFFS= (0..7)
0 0 0 0 0 0 0 0 
##$TUNHIN= 0
##$TUNHOUT= 0
##$TUNXOUT= 0
##$USERA1= <user>
##$USERA2= <user>
##$USERA3= <user>
##$USERA4= <user>
##$USERA5= <user>
##$V9= 5
##$VALIST= <valist>
##$VCLIST= <CCCCCCCCCCCCCCC>
##$VD= 0
##$VDLIST= <DDDDDDDDDDDDDDD>
##$VPLIST= <PPPPPPPPPPPPPPP>
##$VTLIST= <TTTTTTTTTTTTTTT>
##$WBST= 1024
##$WBSW= 4
##$XGAIN= (0..3)
0 0 0 0 
##$XL= 0
##$YL= 0
##$YMAX_a= 311680
##$YMIN_a= -370181
##$ZGOPTNS= <>
##$ZL1= 120
##$ZL2= 120
##$ZL3= 120
##$ZL4= 120
##$ABSF1= 21.01642
##$ABSF2= -3.052713
##$ABSG= 5
##$ABSL= 3
##$ALPHA= 0
##$AQORDER= 0
##$ASSFAC= 0
##$ASSFACI= 0
##$ASSFACX= 0
##$ASSWID= 0
##$AUNMP= <proc_1d>
##$AZFE= 0.1
##$AZFW= 0.1
##$BCFW= 0
##$BC_mod= 2
##$BYTORDP= 0
##$COROFFS= 0
##$CY= -3
##$DATMOD= 1
##$DC= 0
##$DFILT= <>
##$DTYPP= 0
##$F1P= 0
##$F2P= 0
##$FCOR= 1
##$FTSIZE= 16384
##$FT_mod= 6
##$GAMMA= 0
##$GB= 0
##$INTBC= 1
##$INTSCL= 3.70164e-10
##$ISEN= 128
##$LB= 0.24
##$LEV0= 0
##$LPBIN= 0
##$MAXI= 10000
##$MC2= 0
##$MEAN= 0
##$ME_mod= 0
##$MI= 1.114404
##$NCOEF= 0
##$NC_proc= -6
##$NLEV= 6
##$NOISF1= 3.799351
##$NOISF2= 2.8
##$NSP= 0
##$NTH_PI= 0
##$NZP= 0
##$OFFSET= 21.0223
##$PC= 1
##$PHC0= -26519.22
##$PHC1= 30.58743
##$PH_mod= 1
##$PKNL= yes
##$PPARMOD= 0
##$PSCAL= 0
##$PSIGN= 0
##$REVERSE= no
##$SF= 200.130001286629
##$SI= 16384
##$SIGF1= 3
##$SIGF2= 2
##$SINO= 5.538805
##$SIOLD= 16384
##$SREGLST= <1H.CDCl3>
##$SSB= 0
##$STSI= 16384
##$STSR= 0
##$SW_p= 4816.95568400771
##$SYMM= 0
##$S_DEV= 0
##$TDeff= 16384
##$TDoff= 0
##$TI= <>
##$TILT= no
##$TM1= 0
##$TM2= 0
##$TOPLEV= 0
##$USERP1= <user>
##$USERP2= <user>
##$USERP3= <user>
##$USERP4= <user>
##$USERP5= <user>
##$WDW= 1
##$XDIM= 16384
##$YMAX_p= 337571389
##$YMIN_p= -1712436
$$ End of Bruker specific parameters
$$ ---------------------------------
##NTUPLES= NMR SPECTRUM
##VAR_NAME=  FREQUENCY,     SPECTRUM/REAL,   SPECTRUM/IMAG
##SYMBOL=    X,             R,               I
##VAR_TYPE=  INDEPENDENT,   DEPENDENT,       DEPENDENT
##VAR_FORM=  AFFN,          ASDF,            ASDF
##VAR_DIM=   16384,         16384,           16384
##UNITS=     HZ,            ARBITRARY UNITS, ARBITRARY UNITS
##FACTOR=    0.29402158847633, 1,            1
##FIRST=     4207.1930701845, 0,             0
##LAST=      -609.762613823212, 0,           0
##MIN=       -609.762613823212, -1712436,    0
##MAX=       4207.1930701845, 337571389,     0
$$ Real data points
##PAGE= N=1
##DATA TABLE= (X++(R..R)), XYDATA
$$ [...]
10220 -34764 -46761 -47512 -19747 11741 60146 16622 -50601 -68918 6101 -2272 -37294 11143
10208 11143 13829 -8158 -47204 62086 -1937 70520 29063 14840 51794 38289 79283 54880
10196 54880 -6175 -19633 8685 -65561 -8193 -52323 11595 88448 130112 40394 -112365
10185 -112365 -3618 58013 37253 33035 -3031 -20414 -74945 -35967 -15006 -64665 31891
10174 31891 84231 61082 32147 9271 3576 -62015 -89421 -125044 -67869 -256 -55994 -37135
10162 -37135 -23337 -50382 -18074 -55769 -66628 4342 -3674 -13177 9060 27821 159681 78810
10150 78810 97745 -5121 -63028 -99556 -96935 -124173 -81631 65660 47688 -4381 -8103 -18393
10138 -18393 1051 48636 -48495 -25118 -9905 93794 -3010 11169 22417 -61789 -8798
10127 -8798 36843 -1968 -121124 58323 151640 25201 -16497 15710 -29242 7212 -35792
10116 -35792 -29304 81831 47024 6056 -56370 -81369 46053 91892 35942 -48871 13808
10105 13808 -7466 -53110 -4917 25568 -10131 -31264 -40526 -93912 -32460 8171 -39871 -42825
10093 -42825 12928 -53425 -54868 11536 12128 -8295 33214 -10136 11641 79421 -33365 30532
10081 30532 74096 49795 35975 5565 1170 -32038 13117 -5231 104840 -28119 -102467
10070 -102467 -4818 170 68895 72010 51178 65578 -5906 -10055 -67569 -95275 -63036 4228
10058 4228 37457 2168 -17913 -62278 -61437 53794 70481 -62533 -71372 -16640 -13013 2629
10046 2629 -21443 -91738 -24479 57535 -30766 69325 105324 36813 29965 -119015 -59191 36179
10034 36179 -24964 -49966 -42738 -46388 -50929 18895 56403 -46652 -7289 101225 86109 13240
10022 13240 -10875 -14314 -60810 4258 35842 -19405 23448 7717 52742 -42588 -51494 14980
10010 14980 -32458 84299 26286 -23033 68020 59469 92093 102799 73909 49534 -92743
9999 -92743 -18049 3732 -1748 14327 -2080 -22434 -10974 54717 -12781 6168 -145627 -125949
9987 -125949 -63318 -125142 -3901 66418 -32604 28328 52690 98084 -34288 3338 -38395
9976 -38395 -8866 39118 -81935 -22181 -31781 7605 26204 72394 12819 25795 44681 65380
9964 65380 89754 22627 -9904 -4789 -18503 -36188 -48006 68470 18321 -44581 -93314 69446
9952 69446 48473 53009 26559 -16100 6593 -31853 -123180 -5026 -3643 100562 173038 71521
9940 71521 93370 85413 34486 15897 94927 104293 40732 -25880 138201 31132 -2730 -8601
9928 -8601 29210 14953 83327 33011 -65038 29125 -43706 -118176 13387 -22188 -67201 -36367
9916 -36367 16203 29744 -63648 39599 79351 11493 -19389 62184 73095 65901 43005 -24202
9904 -24202 -67090 -61380 26860 6261 16622 -64771 -136388 -94598 -81418 -15510 10325 -142046
9892 -142046 -129607 -23162 -33559 -48211 -77660 -105313 -64740 4650 -59784 -99841 -93933 -4079
9880 -4079 37429 6995 16215 91717 8413 -49566 -16200 -35167 -19833 -65770 -23363 -43404
9868 -43404 26687 24085 63233 27348 -7179 -47541 -54643 16650 100393 117851 -83963 -90593
9856 -90593 2803 41832 -37451 -72127 25258 -41038 53884 142289 5206 -15198 -59582 -98137
9844 -98137 -46649 -58402 -133156 -70553 -95359 -31367 -111086 -124436 -89814 -39667 49850 54981
9832 54981 -37571 26444 71028 -25252 53321 1054 8428 -20232 58004 37656 -11384 -31406
9820 -31406 39260 66167 -51868 32225 1065 71723 12360 -11417 -11136 46941 -6102 55069
9808 55069 89758 106059 45217 -2276 -5087 52707 80098 50323 100223 17556 77236 52182
9796 52182 -19022 -84726 1827 53771 107938 158856 94398 50932 83700 5391 15405 -91022
9784 -91022 -79911 32975 13475 15067 63341 28309 38113 -27472 7745 99 32891 -11571
9772 -11571 -63424 51202 -29989 14655 23144 -35236 -91277 -78805 -45099 -89391 -8638 -135819
9760 -135819 31399 34379 29437 -9187 19674 12859 -55340 -4186 -79559 -113708 -94799 -8132
9748 -8132 -30985 -128059 -77388 -36300 -19018 -3015 -23040 82752 109349 106139 68358 66620
9736 66620 19239 98778 63586 27019 89736 27074 24598 33391 -73683 -28220 -42217 -42814
9724 -42814 -7889 -10793 -13404 -34182 -31498 131542 68447 -18679 26637 100791 89975 28646
9712 28646 18248 22493 -46788 -11010 17012 48304 16745 -22237 114890 98329 -63021 16948
9700 16948 149033 107240 -39637 -53724 -66170 -107815 -94707 -20726 -23460 48126 39232 -69085
9688 -69085 9467 35227 61625 153677 156995 71586 511 -47224 -71460 -4986 10006 19472
9676 19472 -608 -44307 -3378 12624 68021 36569 20032 9923 -23048 -45588 16265 -56827
9664 -56827 -66448 -111643 -55715 -89262 -42287 56343 -40257 21799 -44257 -59367 -25001 12320
9652 12320 19287 -31247 -14916 6689 20892 56559 -76836 -31843 -77970 -49195 -18840 -69387
9640 -69387 -18591 3646 -106879 -86351 -52022 -50177 -7374 -30120 71446 49402 -59203
9629 -59203 -71025 -9872 -87403 -81006 -93085 18847 51817 -6115 -99554 -34440 -13260 -45036
9617 -45036 -25069 -41978 -73 42170 42274 78789 -7854 -90911 -56638 20858 22421 -5368
9605 -5368 23345 -64749 -129421 -112743 -62267 -85641 12465 -121187 -130546 -5962 -30131 17676
9593 17676 -60437 -4379 -15681 -28512 19160 -69355 -105377 19007 9911 -16540 28859 15279
9581 15279 39555 8937 -113545 16997 101113 42812 104419 -18914 -44837 -8396 -8758 -4695
9569 -4695 -30558 -28414 -58869 -99464 -107096 -107931 -16664 -28680 15814 -8064 -30804 -25177 -8844
9556 -8844 99906 -39261 37601 -15762 -49755 -41512 9357 13479 11982 -465 10830 -61959
9544 -61959 -78161 -20814 -78050 -72493 -91181 -135322 -57964 69395 9745 -85468 -26921 39829
9532 39829 -13391 -19221 1255 -38476 -22217 -57969 -13295 12847 22023 103992 70499 46534
9520 46534 3696 129154 48868 15840 5748 -49358 -6097 22604 -33714 30088 104449 -11512
9508 -11512 74360 44295 -19720 -22145 -6696 29500 85256 116222 11248 -61168 -68744 -135710
9496 -135710 -65522 32954 -6572 12706 30857 -38173 57896 46572 -58934 -57616 -81033 -180460
9484 -180460 -67313 -19363 1507 83366 46563 60023 -18194 -23376 -15184 109105 29344 86393
9472 86393 42564 -37976 -63989 -53019 3934 55766 -22253 39233 -3173 -26803 153135 68449
9460 68449 13766 58569 36628 19073 47609 71489 -22201 39219 29351 -34954 -85005 -35714
9448 -35714 -1966 33450 15322 12583 -20733 -15989 37217 28600 129675 -11835 -10671 -12420
9436 -12420 -30338 -74636 -38278 -60239 -172483 -131990 -21048 109283 41354 5326 -30860
9425 -30860 -83060 -26929 -15471 2192 14861 46860 -76611 -72937 18147 -99360 -36591 -72394
9413 -72394 993 46415 -26132 3553 20770 34507 43257 78664 54041 129165 41164 -7802
9401 -7802 24535 54250 23577 -2025 -28153 21595 30355 85205 46491 128218 71841 -1892
9389 -1892 8903 -61863 -62564 -51651 43635 16766 -15811 9981 -38492 -74289 -24256 288
9377 288 -33701 -15826 -12271 42245 72242 13347 64577 41467 -12447 15723 -44542 -66604
9365 -66604 14419 -58389 -48804 61644 81172 7756 38872 -8560 21692 5591 57012 66151
9353 66151 40678 16047 52389 -7122 4131 16927 -11358 105918 122669 49952 76502 37704
9341 37704 -106558 -46753 29421 82801 20016 28368 43903 30506 7288 55504 79361 72337
9329 72337 56805 58792 -43305 -20528 -58413 -26278 40002 35423 39761 -99393 -46364 9064
9317 9064 78042 97729 689 32467 29608 -17000 -137705 -3222 785 14044 -31227 -103425
9305 -103425 38957 128832 55392 -30664 -34411 -154347 -47286 53086 18400 -65797 -1342
9294 -1342 23140 -7403 37030 16034 31771 -98515 20514 18306 22070 17972 -46050 26061
9282 26061 98972 109295 85369 78628 23007 57147 63604 -28955 -80192 -17868 23255 15271
9270 15271 -12231 16416 87082 21052 -34301 71831 -25674 96738 -71695 -23989 40101
9259 40101 -40049 -45677 -44308 -3503 -25848 -14024 49733 88160 22059 675 -47237 -38604
9247 -38604 35098 69767 94454 38911 -54680 17327 -44482 -48442 -63369 -14856 -72791 -107218
9235 -107218 -192711 -37575 77127 73340 13648 -54245 -34185 -10227 -12024 16875 10239 -73624
9223 -73624 -47621 -1595 24460 -6730 93483 33210 46503 -7991 -51232 16407 -18700 -31567
9211 -31567 97988 18743 25876 12485 -496 71323 -58784 -349 -9328 -26638 73153 27475
9199 27475 98950 -10158 98548 -90225 -39148 80194 -18163 38485 -9236 -14596 -51585
9188 -51585 -42365 -10073 -34256 -89415 -114742 16855 43486 -88068 17923 22274 13979 20340
9176 20340 -22722 -50217 18470 -16222 16659 -81268 -123340 5364 -65149 -67582 -7217 26377
9164 26377 25143 -208 48298 -22480 -42578 -60034 4827 59192 31740 -30171 26721 105071
9152 105071 31352 -1457 -23423 30883 -83030 -18272 -20634 -67959 24934 101008 29871 -79317
9140 -79317 -81628 -68237 -85792 -98885 -108630 -2562 3611 -13747 -1 -14762 -57129 -153588
9128 -153588 -86508 -71312 -99177 19504 56236 36870 112202 16067 -3972 -58711 -25628
9117 -25628 -19256 1361 -86939 -166789 -72291 12196 -39143 5840 60197 39282 -10695 71584
9105 71584 -69945 -34326 -12540 -82896 10286 -25907 12955 -36415 -88159 -58108 -31773 20645
9093 20645 -31916 23570 -76454 -96645 27718 -52783 72303 83132 17750 -45818 -74981
9082 -74981 -28641 34657 -62369 73899 153895 19620 26614 -17631 -46638 -76436 35016
9071 35016 3770 -48385 48647 -22899 62648 47145 58413 -8018 6379 25218 27864 -15276
9059 -15276 -16964 -20516 -36160 -49409 -59697 12037 22239 34735 -39286 -710 49162 9250
9047 9250 -34813 -20248 -40054 -17251 39255 -5736 92006 3202 -92974 -51310 21161 19356
9035 19356 5526 10499 -23449 866 -29266 -12698 39324 48081 16451 -71942 -41636 57214
9023 57214 -12619 90506 113873 75640 74311 76304 45678 -4316 -41035 -123094 -19162 315
9011 315 -30168 -50847 26557 28918 -38040 -19330 -2100 72660 -49200 -70237 -53537 -31645
8999 -31645 -14612 4395 20731 75462 36460 96644 81898 82814 19306 27141 50495 59932 -5362
8986 -5362 31886 34987 -4406 -4813 -56473 -92636 1654 -23127 -35928 -101906 -51002 26276 42672
8973 42672 19002 -55661 43802 -79708 -81738 -1310 17200 61842 48888 24087 13061 40768
8961 40768 38443 38503 31133 102094 144105 37684 99441 101079 58477 14115 73332 29613 -18811
8948 -18811 17800 94201 76945 74683 46664 96625 69838 -86883 -94875 -75355 -47498 6705
8936 6705 53160 57737 -27526 -46246 -12301 5083 41679 95404 75337 48612 -25460 -63604
8924 -63604 -143245 -4779 -68996 -55834 -165012 -15522 -35502 -51260 59143 48592 38985
8913 38985 8798 -25507 7543 52302 -5763 37636 18819 31469 60833 53510 51498 -74205
8901 -74205 -15389 41316 -17898 -7294 -30604 49424 141204 35793 -82926 34199 13977
8890 13977 5600 -57050 -9783 -7260 14620 38785 42639 18630 23769 26639 54311 33468 -55686
8877 -55686 -13241 -43712 -2564 10258 -46314 -64856 -25702 32054 -37981 -1333 31697 -42990
8865 -42990 -111290 -13900 15402 133271 103393 58948 61448 30767 44349 37844 98231 56446
8853 56446 -52940 62524 69540 5390 -27548 -39419 -42705 91341 25369 -51059 -25675 -8993
8841 -8993 13852 -133331 -5050 36694 -57542 -53054 -5062 47007 -10357 10502 72660 76880
8829 76880 34420 1719 6755 -3101 12949 55746 82501 48215 42224 -35913 -94404 -2256
8817 -2256 -73229 -42223 34024 18702 -38599 -52137 2757 -10483 34505 39653 86199 119129
8805 119129 33866 -3353 5974 41720 46983 17863 7866 -51156 35833 94555 41926 91615
8793 91615 51951 -80558 -89684 3490 27759 29338 80388 -755 9433 -58109 -68849 -2243
8781 -2243 -78561 44830 112911 108548 69907 67213 8930 -64491 -81020 -6483 66485 31967
8769 31967 -23826 -90078 -100671 -64264 22287 34877 76939 106622 132666 148389 39585 89813
8757 89813 3050 -5860 96108 67174 64307 50790 57525 37016 40471 80405 -4107 50439
8745 50439 35615 16765 -54897 -65890 43079 73100 -12805 -31343 -33360 7800 68109 2516
8733 2516 -33415 14308 100622 1291 58805 129913 102123 39426 68753 33804 51701 -36365
8721 -36365 -54108 -4021 77778 5312 13502 -20979 -56587 -42133 6204 -12408 12610 18718
8709 18718 4605 -49443 -113638 -131121 -68834 1280 -8710 88139 123928 6015 -11093 99536
8697 99536 42630 40648 114630 83546 83233 9877 -17227 -93652 -85679 -20916 -11144 22654 -22548
8684 -22548 -71524 -12375 84834 -1083 -25019 -73164 -112255 -4592 -19116 -20895 28227 35509
8672 35509 67817 91623 -20179 7458 -36235 7133 115446 72997 -15494 -34824 72636
8661 72636 34099 -2549 -61125 -95803 34261 46033 99498 147190 39345 140677 88101
8650 88101 59269 42835 57425 -15314 -12955 40025 117171 47860 5331 -89119 -17832 63515
8638 63515 58957 4784 5527 3826 29333 54469 9252 -19111 -33078 9189 76829 11608 -60045
8625 -60045 43623 42914 -6899 46175 81668 66790 61413 -7614 76885 118081 46093 141210
8613 141210 132574 120750 69412 102375 91450 91122 58039 77608 66738 23927 45466 55423
8601 55423 19998 5427 -12909 -13135 17411 -2799 -110 68875 11775 -77018 18889 36648
8589 36648 28090 -35770 118789 100575 12798 -33379 -18580 -53720 -8601 84707 90565 116906
8577 116906 111558 71048 94121 6644 -15404 103196 145103 74937 56666 -74238 -145866
8566 -145866 -64157 -39389 -59022 91136 102490 100788 51603 142614 98340 93463 -30036 6452
8554 6452 237309 171685 53811 -8743 103197 89521 60295 48026 73189 -18458 -22556 6546
8542 6546 42459 147170 60973 39102 40150 10659 13563 59558 16952 29906 73183 62450
8530 62450 65471 19574 -40061 19192 -58006 -58664 48890 60275 76172 51017 163423 155400
8518 155400 68698 -7516 70536 82921 122015 73344 43509 -79616 63808 86761 77471
8507 77471 81702 180975 201852 104596 119930 -766 16125 97130 139743 123165 96869 101218
8495 101218 216702 121876 67053 107669 45330 85638 136427 134735 -10502 55281 115791
8484 115791 109858 196796 68678 -46617 8973 51911 28451 -17618 -17603 78413 54027 143015
8472 143015 161886 188175 117645 39889 96019 146988 244370 127818 111721 115152 79141 93418
8460 93418 29936 -45847 34489 -3687 -12458 -2800 54672 3302 14037 20518 90713 85329 112817
8447 112817 156616 148948 172795 157630 151581 97804 173610 130682 60362 78045 111425 107385
8435 107385 140765 27729 99267 95965 171776 76743 84267 55085 45179 160625 160880 183118
8423 183118 108066 162852 161426 119411 187121 189903 122328 150399 192705 149041 172559 193252
8411 193252 151830 138183 120054 189846 219517 314815 296997 236089 254936 152566 180251
8400 180251 231828 209769 260860 257415 225209 204627 251059 218111 146775 201860 241035 264684
8388 264684 266911 193453 217331 230757 231740 171060 110775 186660 143947 199690 265573 212029
8376 212029 235060 203358 170293 259087 157305 183413 212049 233867 207285 172412 173158 153136
8364 153136 152659 117000 153736 318769 283134 250860 327070 284263 281429 335201 317989 236232
8352 236232 248312 346474 387596 309994 290885 400602 387027 311649 380945 328960 347037
8341 347037 439661 346001 345944 364627 368504 321748 340938 297553 274583 371882 296836 343490
8329 343490 326063 328748 419786 364764 357062 369536 458327 553805 518446 466373 401843 462476
8317 462476 400758 393566 447559 483681 490103 461006 449840 437372 475166 491385 618806 463169
8305 463169 462645 563493 461791 494236 494369 547167 516901 530930 509684 527487 460443 567289
8293 567289 535606 643305 687530 672214 711320 588936 656762 645689 650167 589750 563120
8282 563120 677398 714426 603116 652770 636835 714831 779965 680403 706100 655143 746273
8271 746273 742478 650998 661730 646407 728678 775832 766656 864012 824012 847167 796258 785294
8259 785294 864884 796183 768932 764664 734125 738510 819565 840982 817021 800503 735992 754990
8247 754990 774180 757439 718210 758265 720436 748112 778771 798669 818602 845777 851007 772298
8235 772298 874040 792218 788464 756388 729534 756060 838359 793259 778404 774336 807237 853690
8223 853690 934284 882643 830701 819784 845906 821799 760344 758115 771696 797561 824558 764848
8211 764848 721547 767529 854169 722677 735584 672216 696890 730555 739127 623908 668442
8200 668442 777883 616093 638549 668812 651910 627055 593383 750599 1647586 1090455 767898
8189 767898 723374 618150 744686 712127 623587 535900 525710 547610 588434 625800 776500
8178 776500 660050 606717 623179 631597 568525 565414 464460 516984 474587 423150 569303
8167 569303 581312 461854 484966 520879 450455 366121 472498 451728 461060 436226 471161
8156 471161 470563 460853 442129 395388 458879 468841 422553 415192 407201 380755 458698 389426 365083
8143 365083 372366 324147 314627 414085 349272 274374 375742 391137 469227 370624 335100 350574
8131 350574 397064 330638 308463 357098 365164 402820 384474 391689 412184 297360 225988 226832
8119 226832 275691 406650 326372 315305 236350 246920 295702 254999 323168 317957 255825 310772
8107 310772 331328 399294 362024 331904 268336 254430 266290 313889 309882 150903 109821 239904
8095 239904 216409 81180 139285 182014 123632 154675 258457 234522 316659 358881 228054
8084 228054 282646 337182 208759 147438 248572 252531 134474 229072 246908 171151 246214
8073 246214 302763 317623 253456 122733 171110 262828 284248 234885 216658 222551 219706 298681
8061 298681 148692 106930 223734 176202 231138 230264 189791 211847 302630 306045 239692 213162
8049 213162 237958 213184 283768 295936 234522 250653 236118 272356 308758 210363 148176 169787
8037 169787 204382 299092 291050 199243 195202 155943 162403 227573 222767 252054 406769 296671
8025 296671 282983 204909 161073 191160 155541 196549 215372 304528 177212 187286 232914
8014 232914 267635 267655 247345 188169 168104 224179 260907 228654 293390 285184 241351 137414
8002 137414 158077 228131 125681 257845 189955 153232 210991 233967 187880 164465 202364
7991 202364 166369 168570 124723 310997 315335 292426 236059 230413 195899 131864 121063 207047
7979 207047 167724 106526 157372 215256 241302 255073 284118 250153 292486 257574 192273 186718
7967 186718 174914 137248 152000 186291 254101 240103 191073 166689 153699 173671 182518 287872
7955 287872 291831 111292 205765 203375 248005 180182 224019 241772 124613 98708 135408 184764
7943 184764 109087 104236 187897 202608 249381 217828 191668 225038 147855 247273 291655 228801
7931 228801 186766 190814 108127 241741 288154 291757 219631 201835 237898 253730 252384 268278
7919 268278 240102 232920 232630 240524 265846 170186 152497 123315 264401 250777 173723 206962
7907 206962 250966 162222 245098 335540 603466 542466 254545 317683 332443 306721 275557
7896 275557 247630 258969 265322 267046 362444 159675 175720 246580 281175 186211 174831 152536
7884 152536 98897 227145 205039 231115 258519 226737 163577 234550 264122 191581 250097
7873 250097 284235 270836 243528 230092 234308 169933 275127 224935 217467 213402 188468 245572
7861 245572 261253 274173 213340 137956 209181 238406 212287 221619 177242 211575 314266 384548
7849 384548 283473 247423 344401 324414 269455 178540 168365 215342 198158 202228 188971 241279
7837 241279 255863 137945 244157 283328 253593 300070 252383 228293 307065 314345 246991
7826 246991 247186 244495 298936 274726 362482 407081 363044 384228 323667 198990 179942 310307
7814 310307 254356 386279 396601 315035 371467 355791 356699 323383 274695 273878 267770 231249
7802 231249 224646 212071 337841 428989 459685 477331 361143 295830 306942 348293 475834
7791 475834 350714 326192 331980 382591 363806 413043 378371 385559 320603 365789 358716 400177
7779 400177 416795 288318 288727 299093 331734 334158 448690 336888 302538 281587 376401 270596
7767 270596 307725 358481 514366 430882 377453 401024 349921 369338 360007 400807 394689 289027
7755 289027 404972 404054 413900 447682 397113 511163 562672 579057 465708 447983 504237 519714
7743 519714 430646 456019 512993 435585 346320 508318 467392 507945 521831 441831 412890
7732 412890 550744 645822 578657 483401 417378 546621 465524 475278 393517 463263 464431 498260
7720 498260 485641 488398 598491 659006 592657 485204 530908 585432 529702 589435 555434
7709 555434 474418 590146 552159 556338 588632 544558 485355 510319 488632 560674 614787 573345
7697 573345 593808 590397 623990 642242 633918 579678 547492 643628 604581 648064 667437 656792
7685 656792 640878 564101 517390 617670 516122 553552 494063 608404 633776 695602 651093
7674 651093 626196 698742 748254 836665 781622 633775 713059 667062 573098 661329 733641
7663 733641 711169 787484 817705 787349 816487 871686 782825 674567 766433 816270 827189
7652 827189 871453 924643 912435 829099 827543 916426 889160 905839 860673 931519 994249 855754
7640 855754 824002 941405 964804 963447 996072 1005952 988514 901024 975048 1064003 986487 1117322
7628 1117322 1096492 958014 977165 1089424 1086964 1170962 1200138 1096091 1143415 1157800 1129469
7617 1129469 1153176 1244965 1290493 1261804 1205729 1153439 1218464 1244501 1308091 1329244 1368314
7606 1368314 1292284 1277452 1373156 1393744 1374344 1402208 1449928 1424903 1364481 1343924 1418853
7595 1418853 1563642 1581986 1596552 1535726 1614532 1600006 1653850 1584295 1660294 1654009 1642297
7584 1642297 1675341 1652565 1684632 1727677 1788573 1862196 1836760 1812241 1989805 1931186 1901578
7573 1901578 1988281 1977015 2066798 2052045 2077684 2238696 2114409 2139671 2242881 2228648 2384439
7562 2384439 2345029 2344969 2432998 2418805 2465920 2567200 2568502 2563356 2622793 2741255 2886481 2803876
7550 2803876 2837277 2911023 2896999 2923313 3028925 3060179 3141822 3087574 3145121 3317642 3395913
7539 3395913 3530062 3434978 3527317 3556050 3548656 3620967 3798159 3942290 4044686 4060826 4084788
7528 4084788 4291731 4369275 4373607 4521835 4524347 4666079 4867906 4861200 4945159 5054495 5296114
7517 5296114 5325344 5414707 5675811 5749070 5880719 5898015 6133073 6225839 6317192 6503671 6612828
7506 6612828 6751101 6952999 7190662 7326904 7535660 7662887 7803052 7973356 8194020 8361833
7496 8361833 8686020 8770596 8969945 9258557 9465123 9596749 9898049 10138961 10403128 10635777
7486 10635777 10761465 11045786 11374935 11650265 11909417 12136264 12409858 12594318 12891189
7477 12891189 13138683 13294531 13604356 13842194 14050983 14296122 14468221 14590751 14864457
7468 14864457 15166412 15331904 15567630 15649140 15834502 15916084 15895199 15991259 16032025 16042050
7458 16042050 16130365 16094018 16088909 16002397 15938175 15837953 15739711 15501501 15410013 15310528 15106169
7447 15106169 14855657 14580235 14324622 14040859 13964266 13627791 13257336 13005801 12826955 12647990
7437 12647990 12334811 12072961 11687630 11449985 11097152 10849377 10682758 10348344 10146976
7428 10146976 9871332 9614848 9448861 9164111 8848237 8700544 8558113 8319872 8097853
7419 8097853 7865817 7667349 7480086 7162761 6921959 6774856 6677682 6594155 6410877 6172374
7409 6172374 6104139 5809920 5773839 5728607 5496189 5284976 5189925 5076190 5015631 4951917 4750269
7398 4750269 4590584 4423624 4371061 4202342 4011175 3935233 3915934 3925999 3857951 3760840 3767843
7387 3767843 3651927 3441751 3424652 3368853 3244326 3201594 3199555 3031776 2945581 2943209 2856262
7376 2856262 2812644 2788174 2643124 2572838 2587354 2590057 2500575 2446834 2326475 2279044 2216487
7365 2216487 2162478 2220559 2151924 2048517 1970258 1927749 1995624 1875555 1872496 1788228 1750507
7354 1750507 1857922 1813859 1803803 1734488 1660590 1666924 1642407 1604869 1501752 1453509 1491513
7343 1491513 1515218 1345151 1331564 1360494 1412577 1318650 1294187 1310383 1314974 1214724 1256623
7332 1256623 1293704 1220209 1171978 1079946 968609 1003968 975572 981199 1005055 1000161 982378 917211
7320 917211 930178 913005 926521 842785 900721 993835 929882 865888 948088 792326 705102
7309 705102 708436 790762 677263 722280 725240 680507 616498 614528 591709 549109 595655 625686
7297 625686 735575 696336 561168 564406 644994 661418 643327 598192 573082 665584 681246
7286 681246 545971 469046 465765 485859 404330 466988 502673 442343 422624 423582 329911 412740
7274 412740 357019 356457 330192 332046 333318 328322 346697 384147 322358 249245 387728 431039
7262 431039 335496 296975 417981 342150 458561 341302 346083 387899 307869 377035 392204
7251 392204 206717 193782 233666 253539 198145 195240 168761 130540 230600 119413 214368
7240 214368 367244 369020 203713 234032 299607 255800 268310 99004 216197 282713 287483
7229 287483 188008 207888 249244 265547 260139 189827 208100 235353 154131 164659 195806 272372
7217 272372 242016 146897 184901 145452 176198 131708 131283 170924 139269 144670 88708 106536
7205 106536 130993 218230 172434 172348 115192 135756 183710 215894 57370 81429 154653 166853
7193 166853 128512 135490 120419 28307 138909 121386 37865 58727 89822 89916 76353 70240
7181 70240 80534 211 25186 122979 131547 155251 40276 67388 73153 109695 80834 15706
7169 15706 97675 77238 44186 5950 78553 -26291 -45 -6500 33148 -62813 -59569 -111301
7157 -111301 -46632 -42440 82641 123085 95199 69854 96094 33385 9164 18431 -18973 -13177
7145 -13177 48995 166303 42528 -45482 33584 23231 132061 75305 31386 2820 38061
7134 38061 30620 17011 24722 -15562 88080 131078 92591 34292 25466 37746 28369 79849
7122 79849 65719 6364 -6757 64004 37363 -35916 -3211 -75900 -63295 23321 -17363 -16273
7110 -16273 43246 19218 102629 17210 5718 -7999 7384 69838 8994 -112023 -39605 -10084
7098 -10084 -702 85608 10011 -62677 -51402 -2242 -59460 -70030 -85227 -21910 25879 46138
7086 46138 -1656 -54861 -11327 -15381 -62173 -125370 -108021 41343 41826 54400 42465 -89265
7074 -89265 -9051 -127273 -34220 -861 -13273 153886 35148 -3039 -30685 -5119 36307
7063 36307 -8497 17867 12548 89680 67783 32425 -1389 -31331 -30602 -122615 -83036 -44538
7051 -44538 30571 -5538 -54767 -41952 -60322 32025 29147 -98392 70118 42171 12247 9498
7039 9498 12264 36469 -8056 -47566 -52115 -68529 -118333 -3120 -63340 -120062 -110373 -94705
7027 -94705 -76668 -28810 -40518 -134599 -48146 7568 55799 -34698 -259 114863 71486 72863
7015 72863 115926 55840 -73193 -69962 -27651 44897 8942 -10931 106183 160168 59445
7004 59445 28652 10594 -9708 -5781 -52759 -84934 -30742 13558 95142 55814 26613 -26009
6992 -26009 34139 57882 54977 32067 -20590 -68767 -19781 20470 -40847 -117949 -94001 2192
6980 2192 79827 -22705 -22067 -46585 -6527 7543 21339 -26179 -92565 -70774 76551 31440
6968 31440 40192 5801 -42779 -112248 -153989 -104595 -118721 -25043 -67285 -32012 -119838 -70188
6956 -70188 31596 -3911 28758 -13437 51839 45415 52559 -14692 -137133 -57758 -105270 -61615
6944 -61615 57503 -33106 -83708 -38829 -2790 945 -67530 28735 57218 -57624 -106828 -52818
6932 -52818 -18664 -36571 -69174 -93072 -49685 60206 -86303 -108281 -8984 22929 47750
6921 47750 68822 30359 30773 -58036 -156924 -107955 -26845 -4931 -6760 -107993 -66621 -64200
6909 -64200 -48538 -72456 -149443 -115507 -28496 -445 -57427 -20036 11483 -99963 -187375 -203429
6897 -203429 -143079 -41935 -83283 -41187 -92922 -57081 -65628 -112844 -138284 -100295 -90835 -30060
6885 -30060 -4227 38827 -137414 -151718 -37547 -10637 -43204 -107378 -51663 -14572 22614
6874 22614 -39852 6828 28641 -51146 -89547 -37486 -96329 -113925 -57013 -10744 -30329 -24056
6862 -24056 -42150 -15326 -61596 -55275 -6239 2965 -98402 -68803 -26547 -28771 -70399 -120322
6850 -120322 -130557 -84038 -37611 -70596 -155139 -74432 -57436 -104919 -127400 -71555 -786 -87256
6838 -87256 -76431 -8895 -85952 19490 -41437 -70573 -75642 -54795 -97116 -55762 29147 -13216
6826 -13216 -34210 -8141 -7811 5058 -42395 -128225 -167942 -51132 -43773 -56824 -11509 -107196
6814 -107196 -78170 -37572 39405 -80616 -55514 -15873 -41568 -65762 -74526 -117686 -146379 -108326
6802 -108326 -48783 56415 -92795 -143139 -29811 -44999 2216 -79285 -76754 -43830 -8192
6791 -8192 -72269 -155401 -168411 -120058 -106990 -72131 -76294 -13225 131867 135534 15001 9069
6779 9069 7847 20188 -103260 -17347 -71145 -40281 -44076 -10742 -58622 -119583 -26507 -135355
6767 -135355 -89798 -102206 -58377 75309 75850 -27522 -53517 -131468 -62249 -146270 -114133 -29978
6755 -29978 -59587 -73673 -10497 -109706 -87605 -31555 -49166 -40999 -65009 -111400 -34860 -1259
6743 -1259 -16739 -71816 -125290 -41014 -140766 -69612 14916 27908 -155283 -119039 -55287 -90584
6731 -90584 -119684 -161548 -109307 -49784 -53010 -66400 -99943 -153900 -85516 -107278 -49188 -15190
6719 -15190 -59859 -35159 -165518 -128896 7840 4236 -136674 -121095 -80371 -5147 -29259
6708 -29259 -24638 -14528 46446 23826 52472 -48369 -97172 -10049 -96872 -68814 -84009 13262
6696 13262 1069 -41552 -3726 -41756 -117205 -61620 -82256 -114427 -24196 -34149 -67546 2606
6684 2606 -70282 -80317 -54824 -88036 -168805 -106946 -38961 -59162 -44570 -59092 -30998 -89785
6672 -89785 -97106 -70021 -69865 -87528 -92883 -88358 -82609 -145778 -85472 -97218 -91175 -127609 -121639
6659 -121639 -48476 -109568 -89208 -122103 -125409 -46036 -25517 47952 49126 -41986 -103194 -51869
6647 -51869 78150 33306 -27698 -56426 -115611 -115935 -65967 -160273 -102920 -107461 -226555 -174106
6635 -174106 -86925 -161357 -112707 -97996 -17078 54619 -17112 -53423 -77096 -86179 -101946 -45968
6623 -45968 -86198 -72700 -40318 -52668 -85703 -81374 -8926 -38652 -109343 -92236 -121780 -137642
6611 -137642 -75211 -105696 -74850 -20817 -88333 -58500 -30931 -57205 30691 4518 -62457 -71151
6599 -71151 -16802 -20441 -13154 48304 -42066 -54254 -38265 -68976 24727 -56910 1644 -101180
6587 -101180 -71556 -84363 -88277 -174451 -84254 -93940 -211494 -79443 -29467 -85192 -104579 -4551
6575 -4551 -2253 -102546 -155085 -89089 -64185 -155179 -99483 -97621 -25711 -36722 -42695 -17855
6563 -17855 -123378 -128540 -128048 -39594 -71971 -51405 -42613 -622 27828 15984 17493 42408 -50783
6550 -50783 -91386 -6983 -4019 42685 59963 -1061 -5830 -106305 -135051 -125055 -133349 -64357
6538 -64357 -92323 -3117 -45674 -88219 -22805 -53268 -11186 3874 7078 -8723 -59870 -117661
6526 -117661 -164001 -153825 -43922 -43389 -74044 -110112 -67375 -55464 -48600 -16216 55437 -30413
6514 -30413 31122 -46637 -16411 -21931 -83998 -55896 -30943 -138940 -72022 -62681 -53240 24650
6502 24650 -40845 -9273 -2114 19625 87124 80097 -70839 -15650 -13802 -48728 -40011 -20211
6490 -20211 30316 -56809 -81823 -75628 -21980 -2374 8429 -24347 -93864 -68742 -30460 20267
6478 20267 24996 -45056 19783 -9191 -70164 -49047 -31595 -144330 -141104 -117864 -46434 -97763
6466 -97763 -16367 53247 -108907 -32096 -16828 11363 34685 -13334 -16876 -44472 -90967 -42033
6454 -42033 -19453 70818 -4851 38777 16312 -51035 -52064 25637 19511 38117 27624 -44512
6442 -44512 -84595 -89098 -38491 -64463 -12039 -30766 17252 47443 -40027 4132 -36814 -152075
6430 -152075 -61924 -42150 -44985 -62846 21667 -28392 -83221 -55686 29396 30380 -23188 21259
6418 21259 -75504 -18057 76184 -51061 -10870 -5928 -127127 -103194 -27725 56664 -42021 17490
6406 17490 6728 30765 83626 -10369 -65817 -5690 30891 19032 97834 112434 84314 17191
6394 17191 17077 38723 -35926 -34784 10455 22819 -44109 501 -27448 -58991 -56100 -24052 -56760
6381 -56760 -24421 8317 -27351 -97264 10034 69762 36224 -100230 -60557 -7488 18645
6370 18645 44296 74633 52224 98557 16378 -1479 -40189 -19962 72294 17630 58491 -4658
6358 -4658 -104771 -106913 -73541 -25694 -5953 -80458 -34313 -91167 -65645 14208 -31670 -104826
6346 -104826 -82771 -43530 -48022 -27779 -71561 -156097 -130534 -21178 -22522 -45386 -35323 -105557
6334 -105557 -48753 -81715 -52461 -45753 -135094 -74974 -44164 -92264 -66430 13501 -100022 -34945
6322 -34945 -75776 -63096 1683 -46482 8412 -55159 -45627 -25000 59659 13725 -56607 -91031
6310 -91031 -11261 -19770 28049 30484 -5220 -25372 -104615 -114072 -131214 -91314 -61434 -103838
6298 -103838 -12367 -29867 -76037 -37781 -17048 -7812 -2721 -57721 -38560 -93787 4871 -12139
6286 -12139 -31053 19623 -20847 349 -92871 -189471 -111755 -104666 20758 -5796 27007 -33607
6274 -33607 -19804 -41252 -72107 -8641 -26594 -111694 -53184 -5510 29226 -2823 -64972 -8483
6262 -8483 -74027 -116107 -99940 -16348 -80424 -7035 57480 -13068 -24299 -48938 -19901 69118
6250 69118 -35065 -4626 61099 78988 -85013 -26228 48689 513 -64681 -82601 -101637
6239 -101637 -130326 -96718 -58152 -40822 -58270 -136264 -130460 -53336 -26361 16793 -37929 -34673
6227 -34673 -38273 -5664 -21103 -83472 -85576 -7576 -72319 -44479 30136 15967 56878 -5257
6215 -5257 20901 -101762 -50081 -146770 -98328 -74230 -63273 -66043 -69905 -41758 -120814 -87417
6203 -87417 3294 -42195 -5380 -26729 -56146 -86116 -145714 -126339 -12460 -75208 -98573 -135304
6191 -135304 -91501 -86566 -84761 -48959 -102045 -162488 -36351 8144 -36675 -60670 -115782 -13555
6179 -13555 -6828 -26221 -68991 -89992 -86356 -45929 -26179 -38807 -4580 -18902 -39914 -20287
6167 -20287 -55682 -25432 -137643 -49892 24032 80318 105537 34213 19602 28007 43067 15239
6155 15239 157419 14221 38712 196399 75196 150800 75373 65306 -24158 -17781 37834
6144 37834 64874 2816 66138 85802 64516 8929 44326 48422 43127 84139 122066 114187
6132 114187 106737 90957 28084 -44494 37856 81855 -34551 -10794 -10550 68660 -42604 166
6120 166 46726 8205 57097 -23387 95886 151859 70724 68542 41392 -25914 36596 -22390
6108 -22390 -38980 39569 66938 10496 89294 96438 68390 100799 38081 6781 74531 81390
6096 81390 130180 90475 115735 11897 -16500 79404 38685 61811 27444 -27481 -7915 80977
6084 80977 4779 10551 89215 -25313 -40258 -33157 60715 47544 38619 9251 -37277 64826
6072 64826 57604 -5471 -29545 -31773 3834 72886 -63986 4084 28570 -76147 -28044 8655
6060 8655 -68524 -20766 2987 73650 90766 16969 15762 30422 -24221 5928 -83042 13451
6048 13451 -49066 -11304 44667 48181 552 -15917 -47060 -40956 13349 -64269 -125264 -60433
6036 -60433 -43439 22037 73832 -24066 1145 -27589 -52477 -81609 -7685 -105682 -53154 -7543
6024 -7543 -48877 123220 72942 111532 78965 112646 28158 22863 14757 -90049 -7244 -17517
6012 -17517 -91835 45106 67622 62073 52608 -63700 -6750 61414 75768 62389 23586 -35222
6000 -35222 -35152 -33877 36532 86445 156181 99986 82274 93911 21321 1273 14685 2025 16677
5987 16677 102815 76034 -8529 62817 -25238 -57018 11358 39354 47358 9386 712 4832
5975 4832 -16479 -79329 -80560 30991 22044 -33243 48710 35412 19152 -19134 -8125 3716
5963 3716 7339 -70567 -45315 5868 46261 52488 21752 4242 1275 61628 10304 64967 147798
5950 147798 -6102 -276 105039 81534 134079 113823 68503 33495 55062 95261 92763 119868
5938 119868 149236 54934 -34337 24065 14935 74147 81215 77001 118324 94412 56730 -5847
5926 -5847 125779 -20390 28364 -12597 74812 159100 128629 16352 40767 68275 96543
5915 96543 953 -53479 38491 -32416 -95300 -90417 -39859 12926 -11860 39458 -47082 -52612
5903 -52612 -65880 4025 168527 32024 11724 92420 34972 -10824 -9553 -90486 -40422 32644
5891 32644 29561 18281 -53451 -79283 1890 22433 -23749 -46293 123525 95370 100879 104652
5879 104652 55052 65822 117463 85939 65086 50413 31540 28789 41675 -82149 -54803 90320
5867 90320 99537 80413 57934 144223 148053 87043 58516 40566 66673 96652 109201 45123
5855 45123 49035 124724 26395 -1076 50568 95010 85627 92878 124538 64351 18184 96903
5843 96903 96415 114708 66008 125559 66218 19718 39894 30239 -15180 42779 72767 -10393
5831 -10393 110429 74105 56878 16594 64234 76373 103053 30708 -23627 29492 32743 113182
5819 113182 75772 83447 116878 508 32643 60539 32553 19321 18826 17873 40035 -22591
5807 -22591 8036 34912 -52302 -66470 -14949 -47524 62428 -33639 -29099 30719 32652 -3524
5795 -3524 27961 32394 -17872 -27550 17963 47315 51547 133071 69060 28242 -1544 -42121 18874
5782 18874 24548 22012 2431 -2174 6843 -17316 -20803 -47671 15043 76190 72342 55937 107704
5769 107704 103510 52481 54676 76283 58477 -11766 -52582 -10036 -7919 -100098 35031 11803
5757 11803 45097 52518 73851 83754 100408 72748 85896 161060 41124 71744 13130 12804
5745 12804 170062 65826 32503 49439 49418 44318 91851 1910 -85307 -20155 393 24743
5733 24743 -54249 61594 210847 131362 60427 38908 2268 70978 76226 68083 13841 4113
5721 4113 19250 124051 36105 61865 128034 -20918 -402 91780 46598 45466 65467 35538
5709 35538 40346 88859 87273 100327 27171 21556 28050 62413 51996 21372 109142 140251 58055
5696 58055 128011 44689 111223 112382 82772 93929 95468 38880 96182 147962 26644 -31875
5684 -31875 82539 138610 237775 78004 168005 180623 129495 96593 73870 23742 135828
5673 135828 88354 72909 109618 -11410 118176 130730 163661 108190 56643 -1891 40284
5662 40284 95962 106069 105845 80033 69421 63343 56256 111273 122706 247903 158854 203141
5650 203141 185497 82175 114356 120258 73096 55156 36235 104900 65868 119875 69708 44350
5638 44350 145174 98146 103394 73327 63053 81605 75735 79662 50440 145357 152881 187918
5626 187918 215808 97128 108325 106476 100328 118408 117866 77483 77842 135492 86845 91029 91455
5613 91455 58032 55123 44656 38620 34878 -5037 11480 36217 38176 20635 30338 -31030 5881
5600 5881 101532 140617 62569 45160 86064 152124 28529 18459 68925 83166 75391 95992
5588 95992 114617 167725 97865 31429 -7186 -36033 59659 92224 114806 123227 94588 34305
5576 34305 62886 123623 143179 140422 117600 72313 91865 142475 112060 2035 43879 39310
5564 39310 46927 -3493 77232 32036 54906 54124 10352 99461 116684 106563 89571 88969 4178
5551 4178 67898 184740 49222 12217 121694 87328 105947 136487 99504 95267 90774 43284
5539 43284 62544 57565 84890 162179 102434 77002 182342 75592 48039 112568 61557 36779
5527 36779 20482 58400 79114 109892 161434 97810 86279 75373 114997 72155 33571 60885
5515 60885 107384 59711 169831 184853 27330 51767 89332 114951 73975 83223 79306 14716
5503 14716 33688 113301 159241 164170 150308 167194 162525 67523 140655 143066 28732 139408
5491 139408 157451 100273 101505 30684 108949 215183 167759 63264 10098 120248 107657
5480 107657 135325 114764 44736 95517 108830 115381 162681 165847 207779 193187 220598 132245
5468 132245 133827 150113 36218 29434 1866 106000 145692 115970 200589 110454 185187 147931
5456 147931 172015 197434 145434 102831 116300 90933 8192 58278 130916 149779 122574 126531
5444 126531 223365 262107 279627 180591 83532 199771 232536 251390 269334 129204 173132
5433 173132 140395 187052 249524 190525 173652 176561 179943 285649 183709 191738 248225 254823
5421 254823 198602 163311 263479 207394 138149 158289 209951 196145 160386 159692 139873 186687
5409 186687 254228 250029 236823 238157 149455 159338 220272 230473 209182 163393 271348 212804
5397 212804 204940 78327 187205 249931 345190 219574 230770 226802 210490 241732 286408
5386 286408 301782 232427 275850 242773 218335 226839 203939 319698 300826 245049 208747 227922
5374 227922 288893 248786 248142 234116 202142 194072 216438 145908 244474 289692 265740 151356
5362 151356 278592 296044 224273 291158 196633 185217 212461 208824 205272 262841 169115 156292
5350 156292 188874 370419 337818 287223 375088 436763 359511 343753 269279 265154 295498 230722
5338 230722 194881 198679 289232 280750 300222 257599 272241 369364 387408 378499 389179 301379
5326 301379 338307 315814 216640 243949 398878 293077 299292 403026 387368 355884 332493
5315 332493 337296 390456 330143 279302 304275 325772 336965 337688 273471 284179 421855 417202
5303 417202 322824 384064 352034 239568 234147 271859 423434 408645 463981 455148 430076 502488
5291 502488 488624 391266 430184 397518 421497 355120 431052 362683 289230 414370 387467
5280 387467 353733 445692 452738 389089 436056 440025 404395 478756 472750 372717 472176 457064
5268 457064 448958 411774 476306 476366 472377 474979 471578 497468 524762 601933 654220 588624 562004
5255 562004 541522 611572 682367 632480 545017 566420 620035 561432 661654 755859 761182 665875
5243 665875 485176 620597 783567 749265 743308 812078 730015 749182 756371 745274 804627
5232 804627 896399 865861 869156 825057 930215 987363 980889 922945 972806 995358 1091362 1095683
5220 1095683 1061872 1050090 1084145 1111122 1190712 1312144 1275421 1338728 1470717 1445124 1492385
5209 1492385 1602066 1631694 1790066 1824106 1778867 1887909 1983102 1920505 2020695 2090251 2319750
5198 2319750 2362541 2427192 2472118 2696992 2749772 2953962 3155668 3239960 3448942 3591454
5188 3591454 3740494 3952427 4183155 4335265 4600315 4902769 5157389 5463899 5873455 6348651
5178 6348651 6611768 7060043 7646997 8126329 8629423 9145145 9706255 10012816 10239245 10570631
5168 10570631 10644771 10746034 10731433 10603153 10659294 10568870 10335508 10088550 9706665 9238835
5158 9238835 8635857 8040176 7510991 6996558 6556023 6135883 5869291 5564357 5257196 4948802
5148 4948802 4787972 4655925 4424499 4268641 4105083 4137267 4021060 3926360 3937092 3907795
5138 3907795 3791736 3775844 3793385 3761980 3770307 3741468 3763987 3698442 3768871 3727612 3785590
5127 3785590 3941645 4064304 4150514 4190679 4221918 4414642 4462863 4599683 4789661 5019398
5117 5019398 5162448 5351429 5501002 5636626 5936625 6209252 6449072 6799916 7070945 7521266
5107 7521266 7903241 8260917 8688337 9137043 9790852 10333912 11005131 11676928 12415061 13345344
5097 13345344 14232936 15177299 16315925 17159403 18013648 18728880 19252893 19406004 19432100
5088 19432100 19265582 19040239 18726149 18384535 18388885 18493193 18609281 18754922 18906858 19142255
5078 19142255 19137464 18998131 18487427 17678929 16817142 15670332 14613238 13530743 12523832
5069 12523832 11637306 10810150 10101892 9428064 8782398 8231495 7712878 7286201 6887300
5060 6887300 6533424 6164080 5811428 5578192 5373735 5012273 4814926 4647340 4391393 4295545
5050 4295545 4113964 3904289 3816949 3755076 3669635 3482455 3302272 3146741 3133606 3011168
5040 3011168 2957823 2758340 2662814 2612137 2615191 2580829 2395448 2448278 2368780 2328061 2254422
5029 2254422 2135032 2068071 2062587 1926955 1934297 1910664 1905481 1923672 1860996 1785308 1695591 1664722
5017 1664722 1648900 1690154 1704166 1531945 1532853 1510603 1624257 1620874 1532790 1515356 1429991 1338947
5005 1338947 1319173 1411421 1421685 1430277 1351772 1270563 1195657 1278302 1328100 1392582 1225496
4994 1225496 1262851 1288322 1264006 1330968 1305177 1363335 1337824 1277615 1265275 1340806 1383809
4983 1383809 1440416 1433141 1318610 1412400 1532400 1521054 1644822 1654884 1760979 1759140 1758006
4972 1758006 1817377 1790987 1905302 2032042 2158387 2246292 2280777 2407642 2532102 2597104
4962 2597104 2770982 2937013 3175382 3285445 3526304 3924502 4139514 4560035 4772217 4992859
4952 4992859 5201218 5469459 5738266 5891854 6001197 6200863 6208248 6175826 5957681 5623061
4942 5623061 5334985 4938097 4763813 4636456 4372823 4023370 3726392 3419193 3213236 2898276
4932 2898276 2860514 2627657 2427139 2197728 2171463 2022462 1888793 1810432 1717881 1650953
4922 1650953 1686139 1667303 1582682 1494183 1518834 1517826 1355253 1291187 1307354 1314123 1307440 1359880
4910 1359880 1337465 1274208 1216722 1155594 1097352 1114058 1067090 1067736 1046686 1130282 1068615 1063334
4898 1063334 1047832 1010899 967132 968061 956436 983376 931754 947623 988906 910022 944673 933683
4886 933683 1040238 1012972 877564 903393 918521 862418 870408 917318 942659 905466 832593
4875 832593 826667 798632 736071 808174 807364 838256 836476 829642 881391 902839 949176 930753 907605
4862 907605 928565 832394 779188 838224 893016 912451 870079 906465 926090 918259 838600 892654
4850 892654 951208 939386 872841 876876 753060 791822 780653 828301 835637 875653 925844 960118
4838 960118 874437 886231 897478 975312 1008816 962379 994473 1037283 997550 1100580 1098839 1114754
4826 1114754 1022634 1006966 1020706 965254 971704 1034431 1127536 1014723 1074584 1029118 1006198
4815 1006198 971917 1009918 1014280 1185005 1130887 1083797 1042488 1042559 1096525 1063832 983992 987489
4803 987489 1048564 1104454 1149090 1117347 1075460 1092918 1083921 1098380 1106938 1086828 1077493 1121513
4791 1121513 1242531 1227990 1309554 1248911 1151582 1183484 1140470 1255363 1216502 1258743 1291799
4780 1291799 1404696 1401534 1459924 1491377 1493549 1585326 1595330 1558253 1645521 1686919 1639448 1648146
4768 1648146 1667203 1708567 1827814 1817568 1870661 1930004 1935359 1892125 1960419 2044351 2128236
4757 2128236 2272220 2242721 2239833 2355194 2407327 2541525 2594624 2624293 2754922 2815219 2901403
4746 2901403 3009914 3128647 3218855 3363399 3500080 3558961 3680786 3897037 4099473 4419414
4736 4419414 4626451 4922148 5106517 5329892 5537493 5688320 5820943 6000078 6082843 6189845
4726 6189845 6268038 6328818 6342811 6328177 6351819 6201911 6149046 5942807 5834028 5619666 5379674
4715 5379674 5168551 5103991 4991563 4762525 4782262 4771904 4641537 4544642 4599669 4653087 4605381
4704 4605381 4568495 4649761 4681132 4710146 4727620 4938658 5050196 5193947 5290729 5536566 5616652
4693 5616652 5723476 5896833 5960462 6128917 6200605 6128809 6320066 6465060 6494669 6656996
4683 6656996 6788862 7008106 7281955 7437317 7687129 7893701 8084004 8347914 8662440 8996385
4673 8996385 9306681 9580416 9717327 9796995 9803416 9838995 9728198 9843926 9980905 10170261
4663 10170261 10309637 10506696 10808342 11020043 11320034 11444073 11565983 11777808 11914460
4654 11914460 12084241 12301263 12582666 12750605 12765146 12773225 12544169 12345138 12273654 12130611
4644 12130611 12226936 12506653 12591455 12877013 13152899 13335599 13491971 13543710 13567189 13540350
4634 13540350 13479759 13542442 13541030 13642500 13566321 13527634 13371916 13132286 12990378 12792236
4624 12792236 12776075 12694985 12550528 12442777 12426355 12322312 12213837 11917756 11633813 11236778
4614 11236778 10955199 10553343 10186290 9958624 9662421 9374453 9204364 8957640 8697378
4605 8697378 8602386 8365262 8133932 8113215 8201055 8125278 7987288 7996455 8029578 7970415 7784597
4594 7784597 7653713 7534373 7406248 7242239 7050242 7022652 6983180 6898241 6771602 6799954
4584 6799954 6826340 6745639 6684630 6736124 6849297 6843709 6847985 6820625 6821107 6842246 6864603 6922217
4572 6922217 6927449 6789893 6880374 6919740 6913394 7017436 7068713 7148190 7196733 7167846 7323593
4561 7323593 7329220 7556769 7646221 7745426 7819104 7782114 7969168 8136959 8252349 8466746 8565293
4550 8565293 8671071 8845103 9059467 9328372 9523277 9712537 9877044 10123629 10439094 10658324
4540 10658324 10971871 11339725 11629825 11979902 12332813 12799154 13250678 13753823 14293145
4531 14293145 14742394 15335851 15900776 16568701 17186408 17764230 18476054 19218091 20062587
4522 20062587 20850624 21757120 22702775 23605495 24599867 25881356 27154935 28377775 29834200
4513 29834200 31479178 33099292 34927115 36918854 38999652 41211970 43623708 46230600
4505 46230600 49015617 52155040 55600635 59418698 63569020 68102879 73279423 78949493
4497 78949493 85541280 92920350 100878606 109073631 116969186 123733160 128761718 131947699
4489 131947699 133476811 133817958 133899152 133774345 133270135 131996273 129010258 123824935 116950604
4480 116950604 108959915 100604340 92442665 85226454 79088999 73836439 69281451 65551991
4472 65551991 62340923 59688943 57550733 55686206 54127695 52909789 51927036 51140453
4464 51140453 50402632 50064513 49964058 50002171 50165815 50492632 50998893 51602950 52417107 53311701
4454 53311701 54380635 55375536 56685803 58178120 59967975 61871895 64010729 66303708
4446 66303708 68921618 71736038 74744914 78010071 81633993 85730609 90015050 94864559
4438 94864559 100187828 105749786 111778129 118236532 125196325 132969321 141288360 150432897
4430 150432897 160576315 171604658 183984732 197761816 213141654 230211347 249210627
4423 249210627 269387496 289827866 309185843 325115921 335270552 337571389 331387422
4416 331387422 317452824 297855254 275229837 251844799 229392337 208922655 190758860
4409 190758860 174532897 160208392 147396499 136209596 126229994 117294140 109311696
4402 109311696 102197942 95783572 89852816 84681534 79809810 75445397 71640206 68240347
4394 68240347 65139753 62255980 59508380 56901056 54329687 51904880 49521000 47438159
4386 47438159 45515085 43615590 41811517 40027423 38468617 37064580 35820604 34520327
4378 34520327 33347510 32260643 31145742 30197727 29243509 28242584 27315975 26467752 25663701
4369 25663701 24876833 24170145 23481658 22757939 22126658 21475982 20825795 20297801 19683310
4360 19683310 19111292 18798070 18248411 17670601 17285514 16809458 16277263 15894605 15463450
4351 15463450 14864458 14508335 14127036 13724701 13264077 12927743 12565523 12143969 11761997
4342 11761997 11464679 11153387 10919738 10619218 10264707 9989170 9790199 9474669 9206310
4333 9206310 8910050 8661678 8508412 8232091 7939532 7799296 7641717 7432923 7326953 7125935
4323 7125935 6918610 6856727 6643720 6443408 6442213 6426611 6189248 6046498 5935895 5854233
4313 5854233 5686477 5637816 5551812 5431843 5435446 5323493 5147594 5104884 5071603 4918605 4847867
4302 4847867 4789471 4740533 4640184 4610246 4557944 4521824 4484284 4438867 4276494 4230213 4170136
4291 4170136 4056081 4027425 3907651 3796036 3799136 3683213 3678160 3565855 3531100 3402935 3388103
4280 3388103 3297293 3238914 3284892 3233228 3294941 3216178 3231835 3237822 3217278 3239354 3139981 3047017
4268 3047017 3136213 3174215 3125896 3185816 3273361 3280576 3225513 3293471 3410404 3386128 3454298
4257 3454298 3502657 3453004 3485743 3485305 3625424 3757594 3709035 3673863 3711006 3541485 3608185
4246 3608185 3611407 3583133 3547746 3412110 3430728 3451998 3414386 3405070 3357111 3274665 3223422 3183871
4234 3183871 3094334 3167849 3202270 3203013 3209561 3084875 3240207 3299307 3308288 3330772 3269597 3386895
4222 3386895 3440204 3519204 3545192 3586364 3755351 3879001 3899133 4065842 4095265 4210847 4358014
4211 4358014 4488663 4764279 4878463 5031487 5161248 5272886 5545614 5684072 5881763 6145661
4201 6145661 6460819 6727377 7068438 7391601 7758479 8205105 8585693 9018394 9545114 10180687
4191 10180687 10617921 11275106 12010066 12679325 13494175 14276877 15198538 16295478 17404969
4182 17404969 18654592 19940661 21504311 23292811 25260552 27392848 29933789 32797099
4174 32797099 35783162 38819069 41749630 44574403 47092673 49470287 51754549 54026416
4166 54026416 56224988 58121133 59391763 59404529 58222209 56049652 53250117 50302916
4158 50302916 47517507 44821373 42104989 39276906 36245058 33152438 30124321 27095374
4150 27095374 24520190 22252311 20252173 18705987 17301111 16084823 14941939 13872047
4142 13872047 13086934 12281443 11644999 11115388 10511551 9908483 9487297 8976354 8581840
4133 8581840 8272252 7949220 7562847 7347511 7064518 6748152 6469147 6282807 6025462 5748751
4123 5748751 5574887 5433354 5198268 5013739 4839582 4748076 4571715 4447052 4382081 4174918
4113 4174918 4057081 3856136 3775466 3704819 3526323 3495519 3406378 3346459 3168250 3151717 3148549
4102 3148549 3079981 3071972 2966303 2937785 2826726 2701967 2529943 2547441 2559036 2507176 2389428
4091 2389428 2350853 2360589 2356329 2193444 2111681 2187335 2172337 2139356 2090129 2041923 2088084 2018293
4079 2018293 1934154 1801283 1736946 1688211 1673780 1575325 1628080 1544535 1462433 1501826 1432665
4068 1432665 1371147 1280334 1331575 1321993 1260599 1208203 1122184 1110471 1121898 997660 1036362
4057 1036362 1061949 1041099 1057630 962548 997615 899156 961395 1033636 1014960 975166 886883
4046 886883 924046 893241 925082 887456 852423 890291 895010 843450 781847 747003 834771 781926
4034 781926 728468 802464 778723 809168 800581 768034 653444 691366 735093 751993 731350 800546
4022 800546 736608 685554 737552 779898 747030 750242 665742 691237 721364 737619 691564 623376
4010 623376 745435 695995 643864 549567 601661 646259 575965 612271 583381 509063 518352 544981
3998 544981 497257 418902 492464 538575 410128 467457 451189 485334 564813 501677 433289
3987 433289 399288 389854 339838 285378 406628 317211 381445 417728 473106 386271 372738 493414
3975 493414 496805 415956 390017 384328 329824 362397 328199 429284 413757 411667 377529 360595
3963 360595 346670 478558 372223 382558 414628 405159 363868 505075 535553 501191 475679
3952 475679 377965 413924 456520 504658 534357 452837 420908 387166 385071 474545 415371 412198
3940 412198 541969 484198 470329 476380 476886 474723 423696 489904 563332 538457 548585 513271
3928 513271 522642 474375 370889 390934 422760 480676 526296 466388 457593 508369 403847 455012
3916 455012 432938 481143 424848 458477 509248 546029 591447 548525 535138 499591 498882 544465
3904 544465 514098 521621 559225 503111 543324 540809 547436 605243 693287 570617 523829 503646
3892 503646 513127 549676 611659 595830 559842 675028 618469 565516 632723 561935 632341 656521
3880 656521 655756 665919 730032 745520 735851 724710 812938 895939 805249 771640 758888 724892
3868 724892 856437 774727 841274 827536 938415 936532 892936 952812 938909 1023126 1130914
3857 1130914 1164147 1147382 1163461 1193942 1163052 1195701 1281511 1245774 1335295 1457936 1508589
3846 1508589 1485434 1548141 1611039 1571681 1641440 1818022 1868791 1919252 2050025 2132042 2134418
3835 2134418 2250766 2291934 2458020 2534981 2707248 2837383 2948231 3075717 3308136 3461899
3825 3461899 3606822 3816825 4036942 4315372 4540531 4679015 4968991 5335640 5754242 6086221
3815 6086221 6309917 6758776 7208517 7543007 8077969 8661503 9319050 10083575 10811028 11635289
3805 11635289 12719804 13848791 14973648 16306983 17872332 19443606 21018106 22547072
3797 22547072 24014905 25610081 27282025 28785307 30383020 31735058 32787943 33587665
3789 33587665 34424403 35200849 35857000 35989910 35533271 34866153 33884301 32875593 31838687
3780 31838687 30498240 29069822 27485352 25732494 23923529 22245689 20715736 19248299
3772 19248299 17616618 16130922 14746032 13447293 12298016 11316657 10453288 9672116 9129120
3763 9129120 8521329 8028248 7643439 7201213 6858698 6600702 6236010 6048246 5730072 5452741
3753 5452741 5294928 5168132 4885166 4710888 4580071 4419398 4325888 4302645 4124467 3975415
3743 3975415 3913740 3841235 3758449 3666841 3579713 3470666 3445422 3379840 3379346 3254254 3151700
3732 3151700 2982185 2854720 2982516 2888394 2732958 2659329 2612547 2567502 2436802 2335038
3722 2335038 2248437 2250177 2282561 2156660 2071750 2062163 2041114 1916351 1955723 1810175 1765537
3711 1765537 1791194 1799485 1761216 1748376 1664219 1537713 1586539 1563483 1534885 1552715 1488105
3700 1488105 1479510 1411805 1440410 1422272 1501375 1512268 1428942 1453504 1411261 1355657 1379734 1481321
3688 1481321 1488803 1427295 1398464 1397914 1395318 1463791 1381269 1352573 1409689 1479071 1480413 1413057
3676 1413057 1388210 1453927 1485578 1345908 1403657 1400556 1444682 1463029 1460616 1373366 1374515 1481961
3664 1481961 1458367 1494570 1527791 1518512 1449268 1408600 1475331 1511381 1394473 1434652 1385310
3653 1385310 1444903 1381255 1384950 1425643 1542123 1465062 1361544 1393401 1325007 1254963 1332279
3642 1332279 1303608 1300106 1321899 1397843 1414624 1422487 1353065 1263449 1291662 1322957 1285669 1267623
3630 1267623 1262620 1252908 1343514 1301830 1249674 1212781 1287754 1332882 1363387 1353227 1299596 1333368
3618 1333368 1389199 1448965 1481241 1425040 1380008 1295894 1403509 1442160 1510551 1464991 1516333
3607 1516333 1651999 1668416 1678619 1687397 1652540 1706222 1801206 1880206 1813831 1846061 1895430
3596 1895430 1938542 2016133 2024662 2043793 2073603 2097474 2110652 2109561 2128674 2158083 2305947 2302254
3584 2302254 2347479 2438914 2495231 2545762 2628840 2529271 2512663 2706951 2707839 2747681 2814413 2983651
3572 2983651 2986263 3031338 3060411 3185598 3288862 3524676 3645809 3676069 3727152 3889108 4031994
3561 4031994 4117815 4258491 4460379 4609469 4810132 4976771 5143931 5320336 5470964 5716514
3551 5716514 5911926 6111519 6283517 6505986 6719714 7016469 7286827 7611546 7905112 8254553
3541 8254553 8632369 8982881 9422573 9785229 10268421 10784692 11286653 11809986 12410881 12948014
3531 12948014 13614498 14330895 15092734 15822527 16639166 17480699 18401771 19336826 20250886
3522 20250886 21253450 22301429 23239307 24326297 25467487 26579378 27817735 29004233
3514 29004233 30177068 31423232 32533464 33663174 34858806 36040869 37131418 38181232
3506 38181232 39163459 39972784 40888562 41628206 42323264 43075053 43813625 44318857 44842306
3497 44842306 45190259 45400413 45532927 45573312 45572908 45514248 45459748 45371822 45224067 45048134 44986663
3486 44986663 44812516 44645840 44536384 44464107 44408101 44429726 44497709 44610669 44896328 45283278
3476 45283278 45833538 46458907 47113199 47848277 48749120 49754592 50771328 51905403 53144848
3467 53144848 54395189 55836693 57330544 58641072 60044190 61510995 62742297 64047005
3459 64047005 65234144 66301480 67250059 68090510 68821818 69524008 70108550 70468169 70666252
3450 70666252 70617441 70361584 69984718 69429641 68508084 67479439 66358569 65145073 63697778
3441 63697778 62114008 60533530 58758084 56914944 55026841 53026760 50918804 48943903
3433 48943903 46774852 44842517 42798336 40951572 39155236 37223761 35400567 33724498
3425 33724498 31957605 30266093 28840411 27444912 26065179 24824595 23846644 22681013
3417 22681013 21690379 20711336 19807548 19000144 18231862 17547219 16897268 16371907 15792410
3408 15792410 15200737 14864070 14364227 14014326 13701485 13443790 13145511 12905482 12597813
3399 12597813 12357215 12195432 11849872 11613752 11425202 11276061 11059472 10910780 10819622 10657000
3389 10657000 10717824 10633508 10430163 10321213 10325143 10313713 10183156 10171709 10258058 10199734 10013697
3378 10013697 10059453 10000622 10085154 10072492 10190000 10265345 10342820 10455029 10572090 10668592 10641403
3367 10641403 10702410 10740903 10806324 10981280 11146039 11308750 11371148 11515446 11615523 11869358
3357 11869358 12011230 12079111 12378427 12537437 12791995 13032252 13257115 13580994 13988023 14297455
3347 14297455 14572823 14907955 15460794 15938397 16614046 17113188 17691169 18403403 19063559
3338 19063559 19906941 20795371 21712100 22643520 23625775 24555772 25671796 26786545 27515600
3329 27515600 28393106 29229930 29997801 30806599 31563041 32134961 32732631 33479910 34347745
3320 34347745 35130681 35820835 36520749 37265935 38134762 38935235 40005382 41213008 42651303
3311 42651303 44134559 45873448 47888669 50115195 52761998 55595018 58810021 62500569
3303 62500569 66522894 71030141 75811688 80940141 86333489 91585083 96596523 101052053
3295 101052053 104779325 107692690 109690184 111077795 112034952 112701038 113188115 113446868 113556759
3286 113556759 113117486 112219213 110817378 108819080 106391401 103749559 101128741 98650037
3278 98650037 96662942 95326682 94614049 94478375 95007789 96291903 98151813 100799373 104066673
3269 104066673 108124763 112945438 118529093 125019830 132547588 140756997 149460757 158580112
3261 158580112 167440425 175282143 181567718 186112578 188796217 189777069 189723829 188921013 187743483
3252 187743483 186408195 184629993 182385283 179139773 174694707 168807979 161426487 152889515
3244 152889515 143692087 134249839 125169175 116710130 109045939 102294942 96319534 90957431
3236 90957431 86345864 82279295 78639127 75517573 72473849 69803148 67465112 65225030
3228 65225030 63253299 61226408 59510478 57993759 56618920 55433343 54389345 53347238
3220 53347238 52310729 51484317 50786650 50200997 49790427 49449264 49219004 49162287 49195712 49469048
3210 49469048 49939866 50473552 51305662 52199108 53156609 54292664 55659360 57177160 58785698
3201 58785698 60576994 62157050 63836679 65472424 67132938 68801528 70360761 71874318
3193 71874318 73278932 74690031 76087016 77202213 78101724 78925659 79460392 79803981 80332873
3184 80332873 80584222 80750838 81181748 81509330 82085922 82768739 83368893 84076796 85106690
3175 85106690 86005595 87173396 88539022 90109961 91860153 93865395 96003832 98345397
3167 98345397 101013442 104027894 107213808 110614444 114381109 118083208 122234498 126414009
3159 126414009 130502612 134626903 138879135 143067040 146973144 150869025 154601743 157876807
3151 157876807 160725128 163194138 165198336 166487191 167274956 167617796 167343486 166575220 165251410
3142 165251410 163341840 160921430 158034240 154649742 150690431 146155201 141125456 135959409
3134 135959409 130543640 125020228 119629570 114370398 109250690 104226208 99179607 94295868
3126 94295868 89576102 85054878 80700331 76579707 72694283 69071190 65721997 62728479
3118 62728479 59947994 57308175 55038145 52954737 50949987 49160020 47556894 45937853
3110 45937853 44420614 42907104 41593072 40309065 39017673 37757926 36716283 35561847
3102 35561847 34626913 33604411 32768905 31997492 30965573 30011949 29100427 28239196 27293726
3093 27293726 26448801 25675474 24956075 24113365 23408422 22715264 22041011 21318218 20612427
3084 20612427 19998219 19285244 18575049 18009354 17500646 16949678 16397826 15928206 15473524
3075 15473524 15044678 14601826 14182638 13772616 13425736 13067864 12805191 12316911 12000850
3066 12000850 11706580 11469931 11130289 10878454 10660125 10282840 10143808 9871017 9596480
3057 9596480 9342164 9198827 9047348 8875173 8638885 8472342 8271363 8193068 8095974 7893005
3047 7893005 7758525 7598975 7520739 7510268 7376234 7288272 7224075 7079926 6811939 6813923 6748510
3036 6748510 6678114 6673082 6533114 6440257 6344039 6293338 6193139 6020709 5832591 5808765 5644725
3025 5644725 5532564 5431706 5300362 5110718 5025849 5034063 5050766 4929008 4825267 4796449
3015 4796449 4609753 4655501 4532413 4476996 4483011 4514963 4420124 4275210 4344295 4372221 4474186
3004 4474186 4380593 4289816 4312509 4278195 4214956 4027333 3943937 3980890 3849826 3782372 3791382
2993 3791382 3803440 3737031 3708566 3717031 3686941 3667196 3716065 3668499 3641273 3625990 3685029 3741584
2981 3741584 3718741 3638888 3565725 3560444 3443061 3424393 3378445 3309571 3311812 3262525 3219046 3172676
2969 3172676 3179131 3049976 3010991 3034150 3033380 3018356 2919475 2955894 2998467 2976716 3013048 2958502
2957 2958502 2964998 2964058 2887684 2955910 2933825 2893138 2848687 2721417 2903846 2910984 2852139 2903051
2945 2903051 2873894 2983569 3002758 3017358 3087271 3130216 3083106 3053046 3012888 3044687 3024567
2934 3024567 3027724 3072571 3042898 3040113 3096303 3044007 3027784 2950441 2994041 3000176 3020403 2959554
2922 2959554 2902366 2898727 2936325 2921198 2851478 2797296 2761833 2798371 2730060 2676449 2663639 2655803
2910 2655803 2716855 2777052 2672851 2709579 2659161 2592706 2597240 2678465 2712782 2638314 2667055
2899 2667055 2613602 2571482 2578899 2668981 2626649 2531906 2584920 2507722 2558404 2666080 2687355
2888 2687355 2691409 2684649 2701315 2674236 2709944 2672080 2742079 2759567 2867709 2954567 2890690 2882731
2876 2882731 2890770 2882668 2824344 2871260 3068670 3018705 3045799 3100756 3174156 3233997 3251073 3317636
2864 3317636 3366409 3492410 3590638 3661036 3724421 3704926 3866580 3869762 3876043 3847327 3862421
2853 3862421 4072183 4286450 4322762 4389188 4545852 4748170 4855423 5008648 5175996 5365203
2843 5365203 5597288 5762509 5950959 6119829 6402962 6619501 6861911 7162935 7399232 7699664
2833 7699664 7985674 8342919 8804316 9109764 9589476 10090003 10590799 11039854 11560651 12162395
2823 12162395 12743711 13465503 14373843 15172410 15932922 16855066 17929855 19040109 20197518
2814 20197518 21590671 23069675 24619491 26352025 28190757 30072306 32106495 34276751
2806 34276751 36687296 39499556 42529432 45965284 49767681 54117478 59290695 65443483
2798 65443483 73159550 82994924 94893708 108869935 122915046 134859077 136224654 130933605
2790 130933605 121274525 108472741 96133098 86692420 80737124 76860074 74448250 72950865
2782 72950865 72256312 72474578 73693857 75988332 79784574 85345618 93171188 103162581
2774 103162581 114585082 126046870 133653757 130570473 122315919 109737687 95118843
2767 95118843 81460078 70921899 63180099 57127689 51917147 47338913 43416972 40144820
2759 40144820 37229411 34747851 32567985 30526756 28802481 27086529 25538043 24161365
2751 24161365 23128986 22202306 21231256 20543716 19863568 19131438 18420312 17673023 16910079
2742 16910079 16055284 15360682 14809011 14326936 13760005 13205384 12777528 12421780 11977218
2733 11977218 11719912 11383897 11034454 10724455 10549325 10183490 9845106 9554854 9303509
2724 9303509 8877154 8663307 8467960 8227876 7916289 7659647 7486276 7242456 7119067 6948394
2714 6948394 6793086 6748411 6451340 6277115 6240781 6118422 5897273 5610413 5414962 5321206
2704 5321206 5246998 5161544 5102518 4957003 4734756 4559639 4444814 4335066 4192375 4167286
2694 4167286 4064989 3931460 3871620 3882952 3745309 3553666 3553560 3501242 3379843 3251932 3151672
2683 3151672 3066974 3072565 2988017 2865106 2809378 2709503 2693685 2758167 2778069 2656036 2534230
2672 2534230 2603583 2573656 2481201 2495677 2482376 2356696 2368301 2242925 2224644 2251494 2230642
2661 2230642 2219727 2206045 2137466 2133151 2112149 2102137 2011186 1905452 1889225 1932528 1908440
2650 1908440 1849974 1882216 1780952 1764296 1705667 1718630 1746151 1710542 1739099 1640894 1518564
2639 1518564 1424793 1474260 1439277 1513347 1535251 1516879 1430610 1400905 1465521 1430822 1433286 1441842
2627 1441842 1338603 1322200 1372652 1342102 1253231 1216308 1199180 1275345 1324836 1225655 1115552
2616 1115552 1074485 1159002 1142008 1149277 1156157 1149621 1163164 1215098 1139747 1278989 1280267 1246533
2604 1246533 1126313 1167250 1134671 1124728 1168845 1165042 991503 986730 1024369 1108442 1139314 1140980
2592 1140980 1085222 1086442 1066668 1069291 1074778 1170358 1195531 1186797 1254713 1332743 1372576 1497777
2580 1497777 1544634 1464730 1499217 1449367 1354328 1222247 1153482 1131557 1141103 1169026 1113301
2569 1113301 1155178 1094360 1096236 1145569 1103556 1141480 1254179 1312550 1168447 1245975 1278745
2558 1278745 1294408 1198249 1155697 1083636 968542 870331 966499 971980 900681 861465 838342
2547 838342 831082 804631 794812 806012 676768 624744 634813 629686 683109 637188 591300 622521
2535 622521 665762 680083 673314 651809 701911 663160 670473 607535 595063 607816 588630 614701
2523 614701 537416 591034 533086 539740 558039 493503 443308 569631 478259 463782 461368 458193
2511 458193 526046 558943 440253 501478 556728 456134 423744 400792 388653 416751 487129
2500 487129 426544 502317 435074 389962 373744 390040 319744 423428 480872 360096 397629
2489 397629 479307 379557 415946 542928 447133 391891 426921 503718 420068 352638 329984
2478 329984 309338 359602 404004 377496 357869 353000 316520 356151 393432 382462 429986 397221
2466 397221 395754 316554 310637 377442 339813 317486 316528 294910 224683 238855 371344 246061
2454 246061 307628 266066 202942 311691 330391 398006 318845 244971 286800 288403 282904 346673
2442 346673 334184 336849 229322 259115 221440 229379 281957 323925 376020 252028 209210 240702
2430 240702 240946 232720 400683 366179 378937 247355 287451 408959 347149 321303 300680 293310
2418 293310 264413 265414 292613 262311 246560 232231 174206 144941 171895 272492 237036 226302
2406 226302 282375 386445 274415 275770 357896 327851 254070 301862 208146 243272 275310
2395 275310 204075 151872 211402 254850 263342 233765 228705 243304 307747 316954 235842 318792
2383 318792 163943 142881 273048 331008 315464 274614 260098 193567 159603 157229 268990
2372 268990 223175 206695 155917 151888 249554 206252 151406 192635 152760 133717 162067 260331
2360 260331 260871 218157 152408 238922 264712 174460 131392 106985 106467 106748 225361 243650 229400
2347 229400 188481 164757 144775 148308 87915 73696 176880 94350 62102 111147 160265 170984
2335 170984 218510 222599 226499 242635 122700 135879 110992 121033 223805 299573 246151 187696
2323 187696 287223 189166 145616 221036 178710 198406 160041 224517 147350 114131 96746 3101
2311 3101 17709 167158 268198 192095 186389 206181 187576 209678 192644 144171 124387 180714
2299 180714 183065 140219 74329 138940 134850 131053 137239 175388 168900 164829 180009 209386 209798
2286 209798 227515 165658 164199 227092 163960 185574 63646 88157 126206 37936 -17959 105699
2274 105699 142018 77296 111080 107583 118478 119860 224907 182739 142386 210266 162713 149283
2262 149283 175637 163614 297370 263015 190605 224683 144904 72617 114583 195185 207727
2251 207727 240018 120053 161001 107515 66869 62060 169760 246163 167961 202190 197623 137576
2239 137576 156340 129969 156259 173143 164876 146338 65638 66258 81039 139118 46356 -21090
2227 -21090 45479 104557 96172 138829 177897 211994 115639 212005 222856 154444 222683 308093
2215 308093 213559 213215 193572 108183 102424 231430 204878 161391 210698 101016 33625 96588
2203 96588 42679 65565 99973 -56160 46793 31770 90920 78182 147367 152093 192227 156363
2191 156363 85565 166412 165094 73883 55161 102239 95756 145261 155654 151451 133187 210802
2179 210802 66498 -17392 145854 154678 39956 81768 194359 136772 102609 122118 188992
2168 188992 169693 139101 163937 123569 80060 151011 213302 216843 125764 124065 95227 159236
2156 159236 124219 161876 151316 117137 200251 166487 111226 80037 12802 -11560 31073 72905
2144 72905 107968 94738 20419 79584 139710 85962 153114 177935 247724 147652 102233 34106
2132 34106 -25147 46515 15155 109169 168047 96848 115308 183549 206405 147699 158347 215000
2120 215000 180798 146994 114651 161620 228777 149244 143360 74709 116488 65041 196952 100818
2108 100818 97807 165441 74660 131156 155937 215183 135053 65960 4829 93980 98010 229952
2096 229952 300522 254683 235172 357618 360167 318813 327754 313361 380954 341760 350278 467846
2084 467846 428032 414052 515644 490594 454369 495470 730722 891155 1105719 1162607 1233828
2073 1233828 1179309 1021441 920190 772564 590407 517754 553464 457381 394934 350553 335723
2062 335723 281724 372182 310087 273239 267190 245102 299606 186634 122049 134348 59732 142767
2050 142767 106835 132928 147497 133404 129187 136200 153240 127354 239735 127373 103761 169731
2038 169731 113496 119803 115683 176964 174312 211602 263774 215447 102758 33580 31011 36186
2026 36186 79345 138459 113471 98933 123298 158654 3955 47509 169535 115895 110412 113729
2014 113729 90864 22760 144382 104198 40083 85015 155578 62539 -26626 62582 98716
2003 98716 125396 64930 23245 75219 57316 54941 120983 116667 17506 39259 124524 96115
1991 96115 89522 170701 193109 151103 157952 132482 87492 37786 -5544 6018 54850 97894
1979 97894 128154 114936 42875 95984 51216 86496 91817 63369 41227 29264 -43765 -12166
1967 -12166 -7208 -6645 -63063 -80683 -5230 86973 67091 37287 -36899 -78433 -24964 68827
1955 68827 106966 16715 19410 98985 46352 44379 90243 67430 139272 107898 7573 -61534
1943 -61534 -84901 -10288 17675 17621 -1483 90668 81410 56512 129721 78220 130222 34087 23102
1930 23102 77156 39747 112699 127503 22287 56743 14767 26896 127358 96553 135081
1919 135081 135272 115376 56617 100526 141391 45949 64307 81377 105592 180008 62844 3165
1907 3165 13666 12467 83595 -8751 67519 84993 9867 -5298 15317 15591 -12308 -5037 33333
1894 33333 158411 150675 64885 25518 1721 120799 89583 83932 15789 56696 79232 65178
1882 65178 109819 56335 -41184 -17564 54804 129116 -7162 23537 -16752 55236 5909 105587
1870 105587 74019 -45511 13562 33824 57139 -42714 -9959 9783 81021 58157 54272 95659
1858 95659 98373 63392 22306 -3212 49820 13838 47049 43839 25496 11848 7932 -62344
1846 -62344 -34657 -27184 -17809 34913 36826 9909 -51949 -76459 -96232 -91552 19194 -14165
1834 -14165 -54911 -40699 61396 83776 33355 45202 -31641 -69042 -3673 49311 112125 29326
1822 29326 -63620 -28906 72039 25312 28269 29677 34591 53263 832 -24435 -16942 -21436 -49009
1809 -49009 14125 30956 -36757 -66411 16705 11568 45675 25176 25616 95099 112458 26627
1797 26627 50121 30410 -30509 -38087 -110017 15815 20150 56771 24190 -93765 17144 24256
1785 24256 31893 15285 12244 -40826 -7924 117691 57847 136936 110044 104682 74959 8157
1773 8157 2312 56880 105032 83368 31871 -21184 -17278 -73675 27957 95197 46715 60891
1761 60891 12258 59339 74773 84605 74179 40895 9683 703 48829 41788 11383 -15204
1749 -15204 47826 43533 -6813 -2754 44866 71199 3533 -23749 182 44082 5661 39495
1737 39495 14454 -17631 -58953 6874 30773 54412 -7241 -24490 15550 -93164 -55249 -42626
1725 -42626 14185 -47367 15965 37949 38500 -6235 -79614 -64054 9316 18548 42437 -23705
1713 -23705 -66380 904 957 -31022 -102384 -29879 56850 55614 36558 -78078 -18107 -6874
1701 -6874 -20163 34635 35831 -29151 -109340 -78579 -103036 -11320 57807 52639 -14533 7749
1689 7749 18179 103195 36669 13401 19589 -41358 -16762 -9483 10372 42523 27915 26846 131686
1676 131686 55153 57738 -40875 -88320 6297 34459 -42782 24450 90650 -15537 -69584 -51337
1664 -51337 -13508 85630 98890 106978 36202 -37481 -78885 5128 -44867 -28437 95382 18092
1652 18092 24895 48797 -5281 106288 -7056 24774 97305 88754 69823 55418 56619 35400
1640 35400 69839 -54255 -95474 23281 -53161 -22685 -44211 55421 34431 -35181 112651
1629 112651 -41494 -9158 -57089 52888 17543 72505 37836 -64675 -129885 -55564 -72193
1618 -72193 -15906 60384 128549 25525 27131 7908 -6902 58387 46862 57418 99014 135389
1606 135389 -68383 -33140 21862 43071 12996 -527 63049 19232 -51499 -52104 -151034 -146849
1594 -146849 -20876 -23416 15732 4257 7064 86991 87538 -15239 -82037 -2782 3415 -14009
1582 -14009 -12589 603 22841 53430 114025 10529 32320 3668 -10295 -4300 44200 50994
1570 50994 17956 -6953 36874 39705 -8054 -29593 -41975 -11257 70383 -830 4321 49069
1558 49069 -75850 77256 -31192 -50437 884 -76904 -111575 -55966 -76750 -15313 13167
1547 13167 -695 -37419 -13570 16190 123461 17204 -70858 -20755 92016 81650 100759
1536 100759 4937 -41007 -15061 29358 59489 10526 84202 -4091 -11397 50292 95532 -26986
1524 -26986 50347 58578 103512 24038 -10133 2333 -1586 -89021 -9291 78608 64454 48582
1512 48582 21966 88190 71449 57900 19251 95166 -20763 -26308 -20188 -7788 31939 102177
1500 102177 88519 20809 -16293 -30461 91892 17682 -5410 35814 -119286 -49697 -54618
1489 -54618 -125624 -14556 -86695 -159318 -29443 -97895 -134877 50222 37420 -36872 -41876
1478 -41876 3219 3933 -94343 -26429 9851 54763 6943 11931 19134 -12051 41245 18792 -26242
1465 -26242 108172 57784 -41660 -11525 52088 17263 -1146 36020 -1146 -51 -34809 -54332
1453 -54332 -69381 20072 -63786 37263 50913 -7355 27815 -30141 -73365 -1118 50305 16927
1441 16927 63348 113857 17386 -63281 -23240 128183 7237 44867 74422 96084 -29790
1430 -29790 -59118 14542 -35488 39605 12850 -29968 -17366 -9836 -23327 299 21766 41189
1418 41189 -87970 -88882 29393 -20685 36228 97862 154233 132443 33969 86052 65992 -43916
1406 -43916 -93970 -99094 30956 -20389 49608 62512 -8195 41795 22068 -14416 -78371 -82516
1394 -82516 -72001 -20986 45045 -60426 -6443 23920 -68878 -63864 -86693 -7711 -62382 38433
1382 38433 55387 -17316 -1982 -41428 -25086 25292 34923 -30212 -31612 -45245 47398 72879
1370 72879 30097 33287 -7059 48850 85014 71405 -48129 -12794 -43566 -20278 -23333 36158
1358 36158 -3352 -1819 21727 61878 -63206 -3384 -48535 -82484 71303 40765 43762 18534
1346 18534 -64941 -7619 116 11901 80708 24591 -48457 -47148 52526 -10726 -36253 52093
1334 52093 5112 -40654 64060 33319 34435 -23344 -2785 -97366 -116683 -56103 13580 33579
1322 33579 7112 -47310 -20336 56926 40367 68256 19563 -69354 12560 38000 -73341 -46085
1310 -46085 -18166 61734 16661 8577 27280 -120935 18846 14776 18077 25698 -77803 -46817
1298 -46817 79096 -30489 -66841 -128714 -3792 33404 -97776 -286 -60049 72863 37438
1287 37438 26799 4551 -63812 -42243 -6125 46513 -53621 -68733 -10996 11395 75349 32026
1275 32026 31202 -74008 17350 -10801 34702 35667 37835 43391 43 -7268 -36666 -44205 67238
1262 67238 10533 -24993 -12113 -3060 80747 111159 105983 114737 -6073 -9937 35410 -50727
1250 -50727 13826 40876 36654 -10794 -1626 37397 72096 3047 50572 -31067 -20427 66428
1238 66428 2006 -43875 -48762 -129230 -103037 24677 -11496 -12400 68592 76507 81776 104434 38442
1225 38442 -5563 -23188 -64354 75529 55101 9272 29206 65293 12986 -16820 -40595 -29885
1213 -29885 -14973 21770 -38076 -23751 16044 11860 23601 -75467 -103886 -66249 -35726 9660
1201 9660 20132 -31987 -168 -36670 -21868 -54417 -83969 -75925 -66470 10660 -45906 -91532
1189 -91532 -63791 4232 -70967 -63030 -114569 -10440 21558 -9876 -42200 59959 22109 54020
1177 54020 11146 -77541 23213 -70354 -85231 10824 115890 127889 59013 66297 4046 -8985
1165 -8985 14830 9447 17443 64011 48080 62627 48291 13669 -17556 -23354 49348 37562 104515
1152 104515 52062 4521 60654 34410 43545 -12717 -102142 -17193 77 22580 -99197 -28700
1140 -28700 23789 -65061 -97467 -60438 25164 1696 -48401 10364 123676 46124 -239 -54151
1128 -54151 -65953 19899 -16745 -42363 -41520 8815 25236 22005 18619 -37118 -109153 71438
1116 71438 -21333 39433 97353 50496 -153925 -62265 10242 -33654 66783 72285 27655 27772
1104 27772 -11484 83979 42046 -81978 -8319 105769 -13421 -40920 -33847 50160 -12321
1093 -12321 -30306 7660 -43288 -12325 42280 50723 -77576 -35675 -116325 -75895 18239 -75702
1081 -75702 -76452 11148 -88636 -7954 -10479 -28145 31038 50169 70894 102726 -1159 -58034
1069 -58034 -71611 -93930 -76064 -30462 5885 -81607 -50257 -64680 -37145 -10712 111167 -3360
1057 -3360 -20428 70480 -13426 -53884 -35429 -68707 -77306 37135 -21992 -40216 -96166 -39748
1045 -39748 -5407 -73089 -38378 40407 18969 38043 13264 92968 66136 106122 56954 106465
1033 106465 130372 50046 111360 146705 91118 70097 -100984 -57884 -20837 -48544 -164142
1022 -164142 -50427 106386 57970 51098 -68355 54501 16805 -55610 -361 -68090 1198
1011 1198 2399 -175383 -73944 -14699 -6926 40455 -101156 -80719 -66389 -47817 -69523 -33266
999 -33266 -78665 -71924 -108236 -60055 77629 29713 -21813 52662 11349 -79622 -78913 -45797
987 -45797 24365 1354 5544 -67497 -144282 -42975 87696 51339 121364 48941 49609 -9426
975 -9426 -50180 -29390 -27034 -31977 -32987 -45842 -79491 -73791 -25827 -137148 -85539 -56029 -42636
962 -42636 50804 -50843 -129166 -32473 39721 71501 14504 -57229 -38957 -74141 -120462 16249
950 16249 71699 67891 -14183 -81925 -6457 36460 34821 34742 -56790 -50423 -84870 -42313 -6736
937 -6736 7734 40537 76934 56267 -60096 5151 18444 -17709 -116538 5366 -116351 -51754
925 -51754 -79745 -15264 -41024 -70354 26645 21375 35005 52005 65658 -73820 -45554 -25761
913 -25761 -105610 -71154 -99579 -85896 32193 -55334 -25276 -10442 -68491 -64242 -64853 30908
901 30908 43812 -53222 -72926 28324 64079 99972 31418 -47702 63632 30008 59659 90397
889 90397 80212 3648 -32585 15605 8473 47455 79702 75402 9359 -4083 49741 62457
877 62457 -53455 4303 24510 -19992 -45908 -38579 -11739 19971 73688 14031 52019 57966
865 57966 2939 122084 229498 193510 196301 153569 38645 32262 -63834 -85698 -61557 -40454
853 -40454 20271 -91428 52507 5016 -5765 55078 12180 63444 -6701 44225 26624 43921
841 43921 91427 -28789 -42889 -139384 -118435 -65284 -25631 43898 46506 -12425 -4782 -3353
829 -3353 24910 -35195 48989 14798 57982 65357 3683 98812 93745 -3538 -60173 -60564 24902
816 24902 28591 -40359 -34778 748 -10953 -82341 -53542 -100419 -33652 105978 27610 -5149
804 -5149 83523 62480 9925 45811 -48677 -65634 25992 -103243 -66130 45432 -69539 -48504
792 -48504 -81902 7519 59547 -1502 70446 2836 42594 55918 -66714 -58890 -80421 27346
780 27346 -21718 -13894 -55688 -129480 -219 88797 71932 -52736 55680 -29505 -22609 -40782
768 -40782 -11989 9091 15564 -31264 -65530 -97842 -56715 -55240 -35179 33163 20640 -16001
756 -16001 -44419 23191 -30830 15791 2032 -28476 -40358 -1664 59490 36016 46860 51684
744 51684 31269 -73950 -6999 -24862 -30020 -36210 27373 -15539 29158 28319 4985 6805 19878
731 19878 97538 9321 -48666 -104094 61754 100321 -68937 -46559 -41767 -23413 -37675 -87094
719 -87094 -141307 -54245 -69862 -17140 -61003 -40977 -37650 -59926 13886 -7684 -46073 -40761
707 -40761 49311 36855 -29477 2337 43805 54262 15252 -36526 -71573 -4416 68150 19929
695 19929 -6264 -30688 3376 -16564 -91750 -85486 -42418 -38426 103408 91881 38419 -54664
683 -54664 -22062 5673 45421 55732 -11436 25428 65326 44130 -11493 -32239 -41294 -41391 -24623
670 -24623 -70759 -61710 111679 17460 -17045 -44706 142 18156 37819 -37884 48800 72368
658 72368 62637 -34202 -63575 -12890 -5991 21236 104549 78768 -10316 31523 -26277 -91897
646 -91897 -102020 -99881 3333 41564 -93965 -28378 -71969 -46598 92132 156902 42329
635 42329 -2915 29824 85013 61665 79104 14093 91623 -18916 -22975 -73442 -37185 -77125
623 -77125 -26403 -50983 -34522 -56363 -145466 -129721 -31018 28333 110934 26460 -99433 -79380
611 -79380 -20553 -60134 -97984 -79869 -83338 -165768 -159261 -42067 -116132 -110618 -43125 -28706
599 -28706 -26396 -61404 12379 -21706 -3004 27579 79293 99657 31527 -38402 -12410 -44381
587 -44381 2411 38506 5196 -137105 -68011 6188 -50401 -71209 -18556 7686 7630 -23784
575 -23784 -128846 11996 -17743 91092 43158 -120639 -113470 52312 69618 -44090 -96986
564 -96986 61507 -22414 -82159 -38368 -109441 -31377 70893 -1336 3978 33848 -104188 575
552 575 1088 -82566 -50631 -24492 -2654 15231 -21627 49509 52618 -134194 -73086 -138216 -120095
539 -120095 -64284 13 -337 76881 34571 47509 -72136 -19299 -9697 -4608 -28554 -45322
527 -45322 -2585 -2402 -79200 -76166 24812 44333 -92041 -11267 2753 31661 89 74723
515 74723 114642 59894 -16395 -94545 -164039 -94862 -7646 -36996 -14186 1609 -9595 -70847
503 -70847 -31841 -6187 -46628 -2690 -14230 -53277 -37281 -35231 41564 42011 27611 -59210 78034
490 78034 36407 -99679 -36797 -46455 -77880 -95976 -139208 -166947 -98204 22202 22640 -100284
478 -100284 -43170 -28547 -121056 -112414 5338 48664 -1262 52879 48660 -55837 -50979 67306
466 67306 26211 -123347 -81240 36678 9243 16880 4311 31310 19640 -55180 12951 36594
454 36594 -64741 -146223 -121709 -132055 -158705 -105635 -64514 -50542 -116429 -34082 -44394 -5361
442 -5361 -16866 70499 135749 97683 271 -8922 -110122 -22540 -70976 -73614 -45559 -11748
430 -11748 446 13502 -14875 -121148 -85519 -6683 76151 130615 54883 69971 -85577 -7788
418 -7788 26950 31855 -21131 -27759 -922 -48992 62560 61165 54878 46623 20019 107139 -19186
405 -19186 -35552 -74203 -69605 8411 -81282 -151951 -64896 -35799 -69459 -116132 -134598 -37090
393 -37090 -50201 -97536 -109482 -22947 -44706 5974 -47009 -41983 -66041 -26530 -35976 48747
381 48747 -14424 3976 -9016 -53321 -39813 -65781 -120706 -112067 -47582 63452 5267 48629
369 48629 54062 10760 -37703 77893 10943 -65305 -37436 8390 21737 -19889 -47717 -56364
357 -56364 57364 -26833 -116007 -79426 -95034 -51459 31776 -68631 -136120 -37925 -71761 -159405
345 -159405 -97737 3263 47521 -40277 -8024 -72713 -89684 -98895 -183387 -83681 -85555 -48327
333 -48327 -63331 -22375 -65559 -9438 -16730 -31142 -31325 22904 -44933 -36350 -2828 -140887 -162116
320 -162116 -42472 -33618 -106253 -26802 -60115 -23162 -27806 -33484 -9657 34169 -84578 -119606
308 -119606 -46336 19123 29733 39708 -89252 -100220 -50848 -30050 -5499 -44290 -41810 -38908
296 -38908 -4717 3825 -20469 -72761 26815 -4710 -90507 -2539 -72346 -68101 -35727 113741
284 113741 -10971 -98149 -146029 -56511 -110175 -25233 15686 -29857 10262 10886 -5944 -95315
272 -95315 -54063 -59305 -37372 -29584 4995 -4366 -122499 -22064 -48233 -12687 -32747 -74570
260 -74570 -68144 17585 30209 -42686 -77823 -106886 -106970 -44122 -12582 -42465 48 -52817 -79971
247 -79971 -24847 99815 -77452 -7044 -11933 1016 -37443 -10141 25597 -5252 43091 65063
235 65063 -57067 -104550 -116131 -103050 -88874 -35400 -31782 -50571 -106406 -64530 -73269 -28874
223 -28874 3721 55955 23161 19684 39691 -73812 -106267 -80315 -86177 -33655 -84574 -79074
211 -79074 -120296 -227254 -159495 42853 27547 -42790 -77923 -123102 -23707 -6936 -165904
200 -165904 -182238 -16860 -48657 -64237 -32307 -84341 -160887 -78345 23601 -15151 -53809
189 -53809 -132655 -91943 -71564 -113351 -67483 -104954 -81513 -21029 2665 -103822 -14939 -81485
177 -81485 -33902 -65249 -79320 -80398 464 -2346 -115678 -46430 1138 -9776 -74697 -97650
165 -97650 -21872 3326 -23783 -59216 -52935 -11754 2719 -82191 -46594 -80785 -108954 -52755
153 -52755 -126044 -126884 -132920 -95879 -61582 -42735 -119083 -46307 80566 10278 -53491 -53927 -10872
140 -10872 -41419 -58538 -89650 -44077 1103 5371 -3885 -15469 -85334 -68650 -65446 -23314 -42327
127 -42327 -19484 -44263 -87506 6710 79235 90639 -23982 -27304 -62124 -49572 -4207 -31132
115 -31132 -22768 17142 -12973 9555 2108 30548 17353 -70867 -113777 -84594 -51419 -23805
103 -23805 -121307 -82695 -71795 -62331 -29333 -42875 -17579 -84392 -29025 -54178 -77884 -60522
91 -60522 -17953 14593 -54711 28338 11764 56295 -32299 -67043 -84618 -89305 -56708 -76908
79 -76908 -10731 -50734 -72076 -53244 -31671 19185 6894 -69000 -42725 -60209 -78247 -65969
67 -65969 -45403 -72024 -107996 -80465 -98791 -168281 -75393 -62657 -56741 -119005 -111737 -72648 -52696
54 -52696 -74076 -75200 -101234 -102164 -28617 5218 -20955 -76257 -43776 -22656 17106 25254 -28074
41 -28074 -50278 -145517 -149818 -129828 -81207 -87540 -55895 -107549 -122975 -140347 -96608 4233
29 4233 3125 45391 63384 -6516 -51958 -14468 -103669 -150615 -142752 -97432 -80215 -23013 -74140
16 -74140 -67251 -56696 -28641 -70465 -85313 -40819 -7683 -21130 -64708 -13647 -28482 -14055
4 -14055 -6864 -51041 -4090 -76678
0 -76678
$$ Imaginary data points
##PAGE= N=2
##DATA TABLE= (X++(I..I)), XYDATA
16383 -1418401 -1382344 -1378749 -1383238 -1365391 -1331223 -1356522 -1311588 -1339110 -1318585 -1270899 -1297563 -1226855
16371 -1226855 -1197573 -1164849 -1136521 -1102725 -1111793 -1113266 -1020757 -1001021 -1062796 -1070383 -1070066 -983836
16359 -983836 -934932 -907701 -863221 -910662 -904554 -910564 -900521 -867682 -846824 -795564 -797056 -808851
16347 -808851 -802895 -747154 -677300 -712525 -674157 -634265 -577994 -561030 -615937 -567622 -581079 -553737
16335 -553737 -506542 -537622 -489619 -450898 -469609 -441532 -392572 -434855 -416020 -418430 -349299 -343194
16323 -343194 -354961 -335439 -343620 -366238 -331049 -291771 -224174 -251230 -276299 -212285 -182629 -80160
16311 -80160 -140737 -78173 -94985 -95170 -88339 -117003 -108091 -120134 -85654 38143 5075 -21898
16299 -21898 6854 103868 42977 36440 111032 63947 114075 142580 99606 79040 146625 188524
16287 188524 164284 199678 166222 179406 296674 311712 324067 287051 258281 348746 337968
16276 337968 430619 449926 424191 421951 469387 499410 447581 421443 440107 454125 455592 521420
16264 521420 520905 484453 530384 578530 526032 509041 572036 516477 586194 588268 673368 688174
16252 688174 688391 678679 711000 710583 636786 732381 718269 748852 741033 719582 746377 715350 776168
16239 776168 835570 786572 809049 832241 818794 814357 830461 869973 832749 970733 1005605
16228 1005605 943724 879069 888966 875013 835320 885247 955247 938140 921185 986844 1018909
16217 1018909 968149 890129 1000099 1080506 1068549 1053451 1058185 1114398 1102145 1069252 1157701
16206 1157701 1077568 1030332 1119675 1101616 1088040 1125169 1039082 1037536 1108113 1186444 1152231
16195 1152231 1212158 1185309 1206831 1281122 1240944 1205099 1230186 1257103 1221698 1235449 1155708
16184 1155708 1137736 1214601 1239300 1254533 1234397 1192463 1205013 1280191 1190684 1237070 1224121
16173 1224121 1240906 1261428 1322861 1393504 1340650 1309238 1349729 1273307 1348087 1324170 1311440
16162 1311440 1292190 1377090 1304117 1358021 1427043 1457623 1279460 1311721 1446438 1371035 1338123
16151 1338123 1405045 1442042 1381305 1363109 1274285 1366558 1360726 1423799 1423985 1307392 1354138 1449153
16139 1449153 1416270 1398151 1387120 1372973 1479467 1466961 1567567 1552404 1459430 1403925 1451706
16128 1451706 1482738 1412062 1419317 1475561 1458205 1534465 1606439 1426601 1477128 1516093 1472035
16117 1472035 1451230 1599312 1565471 1582155 1581276 1639025 1541005 1530302 1603962 1492811 1416707
16106 1416707 1573413 1639635 1649858 1616452 1637318 1532997 1549668 1531454 1508543 1559506 1546939
16095 1546939 1546374 1490394 1568948 1574086 1623501 1605493 1668864 1678702 1641369 1559079 1497757 1604528
16083 1604528 1577202 1617245 1679287 1640245 1628756 1617521 1571506 1584762 1639591 1591871 1551336
16072 1551336 1591814 1496002 1563399 1571532 1522343 1548736 1510604 1515851 1579120 1554999 1559382 1619083
16060 1619083 1719660 1591048 1524777 1558507 1624696 1574244 1535841 1582117 1645523 1610941 1638360
16049 1638360 1611668 1627819 1681623 1658128 1639045 1612590 1676800 1681841 1550119 1598061 1632233
16038 1632233 1591671 1670915 1679656 1675214 1601055 1641093 1615548 1504260 1491235 1586440 1568305
16027 1568305 1500795 1588938 1600691 1486000 1558693 1607092 1584325 1617516 1566723 1548629 1594287
16016 1594287 1560178 1588346 1552783 1550521 1564871 1550579 1591050 1549915 1494823 1601172 1595754
16005 1595754 1609756 1600945 1608067 1592836 1554428 1577255 1562437 1602011 1576100 1542732 1579891 1503446
15993 1503446 1598087 1729013 1705693 1717274 1681575 1697363 1706374 1566987 1588134 1718943 1738304
15982 1738304 1658461 1627665 1684648 1648477 1653966 1673342 1624783 1580969 1556550 1609751 1534460
15971 1534460 1559851 1477455 1587676 1634794 1580215 1637524 1676536 1637726 1544608 1517397 1569558
15960 1569558 1583014 1574472 1546610 1551551 1648997 1637701 1614720 1611489 1644793 1646913 1605741 1538774
15948 1538774 1562260 1579888 1608835 1554328 1554117 1620229 1585317 1588583 1607277 1633285 1608025 1591124
15936 1591124 1601829 1636697 1696468 1614326 1657815 1702500 1652817 1645170 1557476 1625676 1626214 1600988
15924 1600988 1629941 1600986 1612505 1784916 1771911 1649192 1724982 1661668 1624073 1648665 1650374
15913 1650374 1659960 1591511 1624795 1618205 1565547 1672819 1679844 1622233 1614492 1658991 1453945 1491138
15901 1491138 1585794 1512225 1504951 1616945 1663808 1654841 1707093 1664410 1602732 1634637 1620963
15890 1620963 1617868 1692588 1692168 1599384 1605405 1609259 1583584 1632367 1574430 1582390 1661885 1646384
15878 1646384 1686049 1802283 1720715 1711953 1569405 1669165 1624244 1586653 1557287 1618567 1661657
15867 1661657 1599443 1525219 1586379 1743728 1648898 1541081 1505190 1675860 1617667 1622626 1695827
15856 1695827 1751239 1733940 1745714 1740726 1645435 1748248 1689725 1657802 1618519 1574922 1664986
15845 1664986 1603468 1608859 1655013 1639386 1629101 1664953 1643623 1578517 1596602 1624520 1649770
15834 1649770 1707684 1615238 1674566 1653232 1630683 1649534 1672960 1753164 1685434 1565621 1632557
15823 1632557 1610569 1696057 1721275 1695037 1687603 1620014 1624977 1665470 1699488 1692088 1666025 1612408
15811 1612408 1548490 1552275 1588416 1659486 1743722 1793769 1718041 1678841 1659059 1686291 1637784
15800 1637784 1571940 1647249 1629535 1543717 1573359 1655101 1635546 1623627 1634404 1649574 1596750
15789 1596750 1610749 1596316 1608651 1643098 1652100 1624343 1615493 1699730 1734074 1686271 1650926 1629087
15777 1629087 1510534 1590368 1587097 1600428 1629006 1553507 1523789 1571994 1545624 1610320 1687209
15766 1687209 1704804 1746850 1656978 1551670 1596068 1683525 1583658 1595533 1617469 1574124 1594417
15755 1594417 1662980 1652527 1642904 1731754 1771098 1705283 1635772 1587572 1641555 1667405 1694848
15744 1694848 1696831 1727196 1638321 1691460 1682657 1625474 1633442 1735379 1735618 1709592 1666815 1775897
15732 1775897 1705843 1671578 1668979 1671582 1747966 1680980 1705121 1654381 1628166 1642225 1693934 1659734
15720 1659734 1617135 1575520 1583342 1661108 1672787 1573072 1674061 1689856 1692895 1663837 1630339
15709 1630339 1668626 1613502 1668742 1673643 1680368 1696175 1674664 1662620 1674533 1608863 1701235 1648908
15697 1648908 1631993 1688183 1650223 1647532 1654787 1576268 1604665 1689642 1737660 1657647 1589923 1670050
15685 1670050 1653176 1651203 1580462 1522319 1609669 1718022 1683185 1635327 1666203 1713109 1698872
15674 1698872 1594100 1581972 1689459 1652607 1735449 1662873 1663176 1603778 1634180 1632204 1664017
15663 1664017 1697440 1690849 1640526 1734859 1732120 1725452 1698848 1687234 1685333 1587442 1643112 1641766
15651 1641766 1659124 1634430 1593739 1563394 1611795 1700958 1789025 1714790 1684453 1694823 1662854
15640 1662854 1674424 1616567 1619652 1665522 1642844 1596107 1660190 1624475 1613158 1744435 1669453
15629 1669453 1659718 1640339 1691560 1669213 1725463 1736187 1725307 1696557 1638702 1599544 1695207
15618 1695207 1623833 1672515 1712630 1695185 1714761 1728598 1652059 1665666 1702038 1696230 1654357
15607 1654357 1625097 1763565 1682915 1610217 1653475 1705233 1683693 1633090 1660516 1679468 1684550
15596 1684550 1745373 1709249 1680489 1596271 1596586 1723318 1719566 1702298 1628129 1726428 1741516 1679323
15584 1679323 1728243 1722891 1717606 1653625 1660443 1684987 1698757 1587023 1618053 1631114 1633784 1699499
15572 1699499 1763963 1595253 1532342 1680210 1734309 1583608 1578650 1572552 1638230 1692988 1665111
15561 1665111 1692808 1695648 1575382 1569503 1721420 1722090 1696163 1660296 1688110 1680557 1667508 1671315
15549 1671315 1723523 1692618 1686672 1664833 1642989 1758588 1693588 1648936 1729104 1727895 1709826
15538 1709826 1687464 1694891 1703407 1763220 1719798 1662392 1767168 1756312 1692516 1686800 1740617 1740020
15526 1740020 1755300 1708979 1805251 1726430 1669238 1679117 1758325 1798345 1771912 1720922 1678236
15515 1678236 1705391 1733686 1706952 1726711 1748354 1695129 1693894 1721332 1726026 1726783 1671099 1660279
15503 1660279 1710434 1672293 1749355 1655680 1627352 1669708 1626061 1581840 1715664 1635654 1585938
15492 1585938 1538400 1604450 1609448 1573657 1693248 1681668 1672476 1665175 1663157 1757848 1735295 1755242
15480 1755242 1709831 1683977 1793648 1753586 1694005 1665046 1662173 1646637 1667225 1761668 1782506
15469 1782506 1721382 1645698 1692293 1751326 1759594 1775466 1733638 1852417 1868349 1675261 1627524
15458 1627524 1615546 1670649 1706307 1791443 1794692 1708465 1697375 1632704 1642494 1721387 1693764 1621594
15446 1621594 1606147 1612453 1570525 1603270 1631812 1687550 1642642 1676346 1714716 1750717 1768863
15435 1768863 1652805 1654276 1707072 1757957 1795014 1646442 1580100 1719332 1617145 1572322 1690649
15424 1690649 1720265 1779561 1713958 1654622 1706178 1683555 1594871 1662526 1736782 1794190 1806458
15413 1806458 1747489 1699949 1676379 1649361 1568961 1706870 1709384 1832863 1882165 1901874 1777970
15402 1777970 1680196 1740974 1770378 1733111 1731697 1677207 1816146 1725985 1562219 1706029 1693848
15391 1693848 1622186 1700776 1755225 1661563 1676319 1678047 1616458 1668188 1744003 1723843 1665859
15380 1665859 1672634 1682358 1736467 1785822 1813086 1723795 1740011 1705306 1729122 1778934 1745365 1773045
15368 1773045 1743529 1814643 1696000 1730291 1685214 1643323 1600771 1657915 1674058 1777101 1672152
15357 1672152 1670209 1656971 1603879 1657125 1668680 1670182 1621178 1703163 1623138 1637507 1623890 1700570
15345 1700570 1737021 1634368 1608172 1645239 1615209 1673278 1599259 1658324 1733568 1718628 1708355
15334 1708355 1650496 1696135 1712510 1751241 1742952 1759007 1776719 1707128 1657321 1666133 1686502 1680092
15322 1680092 1727825 1688042 1725402 1765772 1757214 1816383 1792208 1787547 1715109 1781093 1757403 1659097
15310 1659097 1749100 1714289 1708712 1699655 1699931 1688247 1650821 1714264 1691781 1653392 1691373 1730280
15298 1730280 1724527 1629692 1683958 1777001 1660648 1762372 1670241 1667537 1823438 1733589 1683693
15287 1683693 1680470 1671964 1670904 1642216 1697068 1731407 1723269 1735459 1812841 1856969 1810357 1727859
15275 1727859 1769019 1736279 1669139 1650377 1656660 1740866 1720014 1745164 1697222 1767883 1779118
15264 1779118 1806403 1770286 1690256 1673985 1687121 1722344 1696551 1718772 1644365 1677824 1701233
$$ [...]
##END NTUPLES=NMR SPECTRUM
##END=
