##TITLE=1H_CA-9278-1
 CDCl3
 8 sc, 
 7.8.2024
##JCAMPDX= 6.0         $$ Bruker NMR JCAMP-DX V2.0
##DATA TYPE= NMR SPECTRUM
##DATA CLASS= NTUPLES
##ORIGIN= UXNMR, Bruker Analytische Messtechnik GmbH
##OWNER= root
$$ XWIN-NMR		Version 3.5
$$ Wed Aug  7 13:35:54 2024 Russian Standard Time (UT+4h)  she@DPX200
##.OBSERVE FREQUENCY= 200.1313
##.OBSERVE NUCLEUS= ^1H
##.ACQUISITION MODE= SIMULTANEOUS
##.ACQUISITION SCHEME= undefined
##.AVERAGES= 8
##.DIGITISER RES= 18
##SPECTROMETER/DATA SYSTEM= spect
##.PULSE SEQUENCE= zg30
##.SOLVENT NAME= Acetone
##.SHIFT REFERENCE= (INTERNAL, Acetone, 0, 21.5365)
##AUDIT TRAIL= $$ (NUMBER, WHEN, WHO, WHERE, WHAT)
$$ ##TITLE= Audit trail, XWIN-NMR		Version 3.5
$$ ##JCAMPDX= 5.01
$$ ##ORIGIN= Bruker BioSpin GmbH
$$ ##OWNER= she
$$ F:/spectra/data/she/nmr/H-F/1/pdata/1/auditp.txt
$$ ##AUDIT TRAIL=  $$ (NUMBER, WHEN, WHO, WHERE, WHAT)
(   1,<2024-08-07 13:34:17.57 +0400>,<she>,<DPX200>,
      <created by zg, POWCHK disabled, PULCHK disabled
       configuration hash MD5:
       00 E9 B6 7A A2 85 ED C7 34 08 36 98 17 FE 4E 26
       data hash MD5: 16K
       1C 41 C6 DF DA 92 EF C2 CE A8 FA 4B 79 E8 7B FC>)
(   2,<2024-08-07 13:34:23.06 +0400>,<she>,<DPX200>,
      <Start of raw data processing
       efp BC_mod = 2 LB = 0.24 FT_mod = 6 PKNL = 1 PHC0 = -25626.14 PHC1 = -8.012508 SI = 16K 
       data hash MD5: 16K
       26 52 35 0A CA E3 24 9D 49 53 F7 39 F5 47 3E 91>)
(   3,<2024-08-07 13:34:48.53 +0400>,<she>,<DPX200>,
      <pk PHC0 = -8.164256 PHC1 = 17.6 
       data hash MD5: 16K
       47 08 E9 08 95 CF 4F 29 73 6C EF 50 36 EF 91 E1>)
(   4,<2024-08-07 13:34:55.71 +0400>,<she>,<DPX200>,
      <abs ABSG = 5 
       data hash MD5: 16K
       CE 66 DA B8 0E D2 79 95 B2 0A 59 B8 BE 4F F2 60>)
$$ ##END=
$$ 
$$ hash MD5
$$ 5D 8F 6B BF DF 50 CF 8E 22 07 5E 72 60 33 B4 90
##$RELAX= 
##$RELAX= 
##$RELAX= 
##$RELAX= 
##$RELAX= 
##$RELAX= 
$$ Bruker specific parameters
$$ --------------------------
##$DU= <F:/spectra>
##$EXPNO= 1
##$NAME= <H-F>
##$PROCNO= 1
##$TYPE= <nmr>
##$USER= <she>
##$AMP= (0..31)
100 100 100 100 100 100 100 100 100 100 100 100 100 100 100 100 100 100 
100 100 100 100 100 100 100 100 100 100 100 100 100 100 
##$AQSEQ= 0
##$AQ_mod= 1
##$AUNM= <au_zg>
##$AUTOPOS= <>
##$BF1= 200.13
##$BF2= 200.13
##$BF3= 200.13
##$BF4= 200.13
##$BF5= 200.13
##$BF6= 200.13
##$BF7= 200.13
##$BF8= 200.13
##$BYTORDA= 1
##$CFDGTYP= 0
##$CFRGTYP= 5
##$CHEMSTR= <none>
##$CNST= (0..31)
1 1 145 1 1 1 1 1 1 1 1 1 1 1 1 1 1 1 1 1 1 1 1 1 1 1 1 1 1 1 1 1 
##$CPDPRG= <>
##$CPDPRG1= <>
##$CPDPRG2= <>
##$CPDPRG3= <>
##$CPDPRG4= <mlev>
##$CPDPRG5= <mlev>
##$CPDPRG6= <mlev>
##$CPDPRG7= <mlev>
##$CPDPRG8= <mlev>
##$CPDPRGB= <>
##$CPDPRGT= <>
##$D= (0..31)
0 1.2 0 0 0 0 0 0 0 0.06 0 0.03 0 0 0 0 0.0002 0 0 0 0 0 0 0 0 0 0 0 0 
0 0 0 
##$DATE= 1723023257
##$DBL= (0..7)
120 120 120 120 120 120 120 120 
##$DBP= (0..7)
150 150 150 150 150 150 150 150 
##$DBP07= 0
##$DBPNAM0= <>
##$DBPNAM1= <>
##$DBPNAM2= <>
##$DBPNAM3= <>
##$DBPNAM4= <>
$$ [...]
##$SUBNAM3= <"">
##$SUBNAM4= <"">
##$SUBNAM5= <"">
##$SUBNAM6= <"">
##$SUBNAM7= <"">
##$SUBNAM8= <"">
##$SUBNAM9= <"">
##$SW= 24.0689771365484
##$SWIBOX= (0..15)
0 0 2 0 0 0 0 0 0 0 0 0 0 0 0 0 
##$SW_h= 4816.95568400771
##$TD= 16384
##$TD0= 1
##$TE= 0
##$TE2= 300
##$TE3= 300
##$TEG= 300
##$TL= (0..7)
0 120 120 120 120 120 120 120 
##$TP= (0..7)
150 150 150 150 150 150 150 150 
##$TP07= 0
##$TPNAME0= <>
##$TPNAME1= <>
##$TPNAME2= <>
##$TPNAME3= <>
##$TPNAME4= <>
##$TPNAME5= <>
##$TPNAME6= <>
##$TPNAME7= <>
##$TPOAL= (0..7)
0.5 0.5 0.5 0.5 0.5 0.5 0.5 0.5 
##$TPOFFS= (0..7)
0 0 0 0 0 0 0 0 
##$TUNHIN= 0
##$TUNHOUT= 0
##$TUNXOUT= 0
##$USERA1= <user>
##$USERA2= <user>
##$USERA3= <user>
##$USERA4= <user>
##$USERA5= <user>
##$V9= 5
##$VALIST= <valist>
##$VCLIST= <CCCCCCCCCCCCCCC>
##$VD= 0
##$VDLIST= <DDDDDDDDDDDDDDD>
##$VPLIST= <PPPPPPPPPPPPPPP>
##$VTLIST= <TTTTTTTTTTTTTTT>
##$WBST= 1024
##$WBSW= 4
##$XGAIN= (0..3)
0 0 0 0 
##$XL= 0
##$YL= 0
##$YMAX_a= 803916
##$YMIN_a= -847017
##$ZGOPTNS= <>
##$ZL1= 120
##$ZL2= 120
##$ZL3= 120
##$ZL4= 120
##$ABSF1= 20.98415
##$ABSF2= -3.085043
##$ABSG= 5
##$ABSL= 3
##$ALPHA= 0
##$AQORDER= 0
##$ASSFAC= 0
##$ASSFACI= 0
##$ASSFACX= 0
##$ASSWID= 0
##$AUNMP= <proc_1d>
##$AZFE= 0.1
##$AZFW= 0.1
##$BCFW= 0
##$BC_mod= 2
##$BYTORDP= 0
##$COROFFS= 0
##$CY= -3
##$DATMOD= 1
##$DC= 0
##$DFILT= <>
##$DTYPP= 0
##$F1P= 0
##$F2P= 0
##$FCOR= 1
##$FTSIZE= 16384
##$FT_mod= 6
##$GAMMA= 0
##$GB= 0
##$INTBC= 1
##$INTSCL= 3.70164e-10
##$ISEN= 128
##$LB= 0.24
##$LEV0= 0
##$LPBIN= 0
##$MAXI= 10000
##$MC2= 0
##$MEAN= 0
##$ME_mod= 0
##$MI= 1.114404
##$NCOEF= 0
##$NC_proc= -4
##$NLEV= 6
##$NOISF1= 3.799351
##$NOISF2= 2.8
##$NSP= 0
##$NTH_PI= 0
##$NZP= 0
##$OFFSET= 21.53653
##$PC= 1
##$PHC0= -25634.3
##$PHC1= 9.587492
##$PH_mod= 1
##$PKNL= yes
##$PPARMOD= 0
##$PSCAL= 0
##$PSIGN= 0
##$REVERSE= no
##$SF= 200.129398384279
##$SI= 16384
##$SIGF1= 3
##$SIGF2= 2
##$SINO= 5.538805
##$SIOLD= 16384
##$SREGLST= <1H.CDCl3>
##$SSB= 0
##$STSI= 16384
##$STSR= 0
##$SW_p= 4816.95568400771
##$SYMM= 0
##$S_DEV= 0
##$TDeff= 16384
##$TDoff= 0
##$TI= <>
##$TILT= no
##$TM1= 0
##$TM2= 0
##$TOPLEV= 0
##$USERP1= <user>
##$USERP2= <user>
##$USERP3= <user>
##$USERP4= <user>
##$USERP5= <user>
##$WDW= 1
##$XDIM= 16384
##$YMAX_p= 360907728
##$YMIN_p= -207974
$$ End of Bruker specific parameters
$$ ---------------------------------
##NTUPLES= NMR SPECTRUM
##VAR_NAME=  FREQUENCY,     SPECTRUM/REAL,   SPECTRUM/IMAG
##SYMBOL=    X,             R,               I
##VAR_TYPE=  INDEPENDENT,   DEPENDENT,       DEPENDENT
##VAR_FORM=  AFFN,          ASDF,            ASDF
##VAR_DIM=   16384,         16384,           16384
##UNITS=     HZ,            ARBITRARY UNITS, ARBITRARY UNITS
##FACTOR=    0.29402158847633, 1,            1
##FIRST=     4310.09270032871, 0,            0
##LAST=      -506.862983679001, 0,           0
##MIN=       -506.862983679001, -207974,     0
##MAX=       4310.09270032871, 360907728,    0
$$ Real data points
##PAGE= N=1
##DATA TABLE= (X++(R..R)), XYDATA
$$ [...]
$$ plain form
6202 -15219 10329 37319 18981 11560 -6865 -1994 23517 41287 28914 9959 -11423 11935
6190 11935 3674 10237 32407 59856 10411 33567 21752 8166 5584 31462 8253 390 7795
6177 7795 -2475 16844 30973 59534 57631 24576 -21805 -17287 -37308 -14883 -7431 -6339 -6595
6164 -6595 -29682 14319 -3901 -8372 -18916 41214 52425 14526 -7745 -32110 5877 40746
6152 40746 75361 96470 19135 9885 -8809 -7058 -155 -6350 25778 28005 25569 27101 2704
6139 2704 9210 25055 9549 35751 45042 27493 41389 16996 4796 21889 32892 14560
6127 14560 51505 52548 34800 8183 -7029 -28415 -16833 -4201 -5221 -11872 1388 10654 -13216
6114 -13216 -16862 -2680 17286 11737 25634 41478 -3286 -23626 -21658 -42482 -45462 -41971 -17672
$$ packed form
6202a5219K5548K6990j8338p421j8425M871K5511J7770j2373j8955k1382K3358
6190A1935q261O563K2170K7449m9445K3156j1815j3586k582K5878k3209p863P405
6177G795j0270J9319J4129K8561j903l3055m6381M518k0021K2425P452J092k56
6164f595k3087M4001j8220m471j0544O0130J1211l7899k2271k4365L7987L4869
6152D0746L4615K1109p7335r250j8694J751O903o195L2128K227k436J532k4397
6139B704O506J5845j5506K6202R291j7549J3896k4393j2200J7093J1003j8332
6127A4560L6945J043j7748k6617j5212k1386J1582J2632j020o651J3260R266k3870
6114a3216l646J4182J9966n549J3897J5844m4764k0340J968k0824k980L491K4299
$$ plain form
6101 -17672 -630 11382 -18918 278 13165 -3198 3585 12461 6622 2266 -362 9555 -9092
6088 -9092 -12682 15521 -20257 -10904 -6781 -10945 -26453 718 -18626 -18001 -8144 -43964 -33730
6075 -33730 -28581 14153 -12252 -43801 -55841 -36184 -23364 -22575 15741 2840 -37936 -25330
6063 -25330 -43383 -11247 12094 12273 -3895 25419 25762 -19729 -30872 -11555 300 -23152 -58717
6050 -58717 -47034 6632 -17454 -6253 -5044 -4255 -59447 -65580 -37830 -35892 -26365 -9608 -16607
6037 -16607 -32656 -12806 -30359 -24794 -36543 -36297 -35667 -6220 -26839 -48078 -30173 -27642 -53431
6024 -53431 -11061 -5583 -12383 -6420 -22066 -55282 -35418 26510 9440 -31917 -42623 6853
6012 6853 23552 33238 17505 -24004 2683 -178 -24871 -15676 -21629 -26504 5707 -3576 -19612
$$ packed form
6101a7672J7042J2012l0300J9196J2887j6363O783Q876n839m356k628R917j8647
6088i092l590K8203l5778R353M123m164j5508K7171j9344O25R857l5820J0234
6075c3730N149M2734k6405l1549j2040J9657J2820P89L8316j2901m0776J2606
6063b5330j8053L2136K3341J79j6168K9314L43m5491j1143J9317J1855k3452l5565
6050e8717J1683N3666k4086J1201J209P89n5192o133K7750J938R527J6757o999
6037a6607j6049J9850j7553N565j1749K46O30K9447k0619k1239J7905K531k5789
6024e3431M2370N478o800N963j5646l3216J9864O1928j7070m1357j0706M9476
6012F853J6699R686j5733m1509K6687k861k4693R195n953m875L2211r283j6036
$$ plain form
5999 -19612 -31246 -42313 7361 2885 -21431 -45002 -29084 -37814 -48864 -18092 -19624 -6060
5987 -6060 -35155 -28519 -27441 -31596 -38670 -21935 -41127 -21393 -7386 18575 -4664 -12271 -4255
5974 -4255 46913 2526 -44649 -26066 -57248 -37679 -6680 3337 -41757 -23520 -10317 -18221
5962 -18221 -28393 -9764 -34550 -21299 -22489 -31395 -30328 -18846 -20141 -36582 -23335 -8914 23665
5949 23665 15813 -37733 -20070 11467 -26109 -28436 -6707 -29457 -22566 -24290 10050 -18584 -42384
5936 -42384 -48367 -76647 -50297 -20864 -18138 -15851 -31579 -6546 -16154 -36884 -4637 -4112 -23746
5923 -23746 -2213 12593 -8289 -14689 -15794 16920 23842 13735 -11239 -35599 -1131 176 6449
5910 6449 2823 -20018 -34912 -41468 -24516 -16219 -7181 -67413 -31757 4992 -27150 -7322 -9387
$$ packed form
5999a9612j1634j1067M9674m476k4316k3571J5918q730j1050L0772j532J3564
5987f060k9095O636J078m155p074J6735j9192J9734J4007K5961k3239p607Q016
5974d255N1168m4387m7175J8583l1182J9569L0999J0017m5094J8237J3203p904
5962a8221j0172J8629k4786J3251j190q906J067J1482j295j6441J3247J4421L2579
5949B3665p852n3546J7663L1537l7576k327K1729k2750O891j724L4340k8634k3800
5936d2384n983k8280K6350K9433K726K287j5728K5033r608k0730L2247N25j9634
5923b3746K1533J4806k0882o400j105L2714O922j0107k4974k4360L4468J307O273
5910F449l626k2841j4894o556J6952Q297R038o0232L5656L6749l2142J9828k065
$$ plain form
5897 -9387 14653 -16067 -54637 3636 -22370 -11784 19705 36355 -24003 -77406 -23465 -16501
5885 -16501 -61099 -53912 -3808 -34765 -21937 -34403 -18094 -10621 -39930 -37948 -46424 -56123 -57806
5872 -57806 -65164 -63038 -35399 250 -18965 -73183 -55186 -36027 -6521 -17431 -19197 673
5860 673 -11710 -31739 -45783 -61584 -54330 -55165 -44328 -25041 -5768 -36733 -30418 -9876 -19146
5847 -19146 -41157 -40688 -21086 -18450 34851 -39661 -54881 -51050 -47965 -14652 7548 -3404 -10864
5834 -10864 -21116 -7542 -22789 10566 25291 25669 21413 24208 -8430 -11414 -1159 12518 3771
5821 3771 -4951 3777 -9187 7978 -33041 -11847 19317 23976 -7735 31213 26722 -22128 -23449
5808 -23449 -40526 -15313 3727 996 -17380 -45028 -25137 13686 -33116 -43379 18849 -33503
$$ packed form
5897i387K4040l0720l8570N8273k6006J0586L1489J6650o0358n3403N3941O964
5885a6501m4598P187N0104l0957J2828j2466J6309P473k9309J982q476r699j683
5872e7806p358K126K7639L5649j9215n4218J7997J9159K9506j0910j766J9870
5860F73j2383k0029j4044j5801P254q35J0837J9287J9273l0965O315K0542r270
5847a9146k2011M69J9602K636N3301p4512j5220L831L085L3313K2200j0952p460
5834a0864j0252J3574j5247L3355J4725L78m256K795l2638k984J0255J3677q747
5821C771q722Q728j2964J7165m1019K1194L1164M659l1711L8948m491m8850j321
5808b3449j7077K5213J9040k731j8376k7648J9891L8823m6802j0263O2228n2352
$$ plain form
5796 -33503 -9532 -29143 -32337 -16401 30158 1377 396 3189 -14424 -659 -14411 -2998 25321
5783 25321 13185 -6102 9593 -2375 -21201 16658 22199 -5196 -21020 7797 -23799 -36660
5771 -36660 -8998 -7192 -8330 -36629 -13591 16583 -6880 -28539 23717 -12719 25173 20489
5759 20489 10847 -30659 15348 7152 -23480 -20456 -24704 30045 3900 -26387 -6603 -7198 14272
5746 14272 -6584 24035 10568 -28819 3984 4353 20320 10584 -4536 -7833 9814 12774 -23067
5733 -23067 -23548 -5522 -14506 -1565 -15774 -11479 16532 31100 34798 17174 33224 33175 18967
5720 18967 7115 6774 35537 -3774 18389 -11966 -6691 -8449 -20182 535 -13972 -47922 -26306
5707 -26306 7386 -3435 -8854 -12921 -20696 -44118 -61955 -41149 -22979 -11733 -22342 5877
$$ packed form
5796c3503K3971j9611l194J5936M6559k8781r81K793j7613J3765j3752J1413K8319
5783B5321j2136j9287J5695j1968j8826L7859N541k7395j5824K8817l1596j2861
5771c6660K7662J806j138k8299K3038L0174k3463k1659N2256l6436L7892m684
5759B0489r642m1506M6007q196l0632L024m248N4749k6145l0287J9784n95K1470
5746A4272k0856L0619j3467l9387L2803L69J5967r736j5120l297J7647K960l5841
5733b3067m81J8026q984J2941j4209M295K8011J4568L698j7624J6050m9j4208
5720A8967j1852l41K8763l9311K2163l0355N275j758j1733K0717j4507l3950K1616
5707b6306L3692j0821n419m067p775k3422j7837K0806J8170J1246j0609K8219
$$ plain form
5695 5877 6030 -593 -21861 -3635 3337 -7369 2022 -8844 2386 -22982 18187 22458 -19750
5682 -19750 30087 -11261 -52564 -17410 -25682 -9346 901 -17018 7966 17906 4386 -37668
5670 -37668 -34975 -20278 -23130 -2507 -24309 -17514 -7243 24421 -12546 -5084 -5277 -23598 3504
5657 3504 -7666 18062 7170 -32707 -7024 -18181 8279 -16914 -40316 -4794 3388 20767
5645 20767 2990 -10077 -14683 21173 22167 -93 -9128 24356 14295 11245 29911 13090 -1565
5632 -1565 -5739 8063 -23283 -11749 24192 -24578 -57445 -29372 -6168 -7373 -4048 1333 4672
5619 4672 -12362 3154 -3574 -29668 -1086 -17948 17616 18378 31264 23404 32045 12612 -24908
5606 -24908 -32519 -51921 1988 -208 -13757 -27088 -9288 19138 -13420 2790 6692 1582 -3481
$$ packed form
5695E877J53o623k1268J8226O972j0706R391j0866J1230k5368M1169M271m2208
5682a9750M9837m1348m1303L5154q272J6336J0247j7919K4984R940j3520m2054
5670c7668K693J4697k852K0623k1802O795J0271L1664l6967P462j93j8321K7102
5657C504j1170K5728j0892l9877K5683j1157K6460k5193k3402L5522Q182J7379
5645B0767j7777j3067m606L5856R94k2260r035L3484j0061l050J8666j6821j4655
5632a565m174J3802l1346J1534L5941m8770l2867K8073K3204j205L325N381L339
5619D672j7034J5516o728k6094K8582j6862L5564P62J2886p860Q641j9433l7520
5606b4908p611j9402N3909k196j3549j3331J7800K8426l2558J6210L902n110n063
$$ plain form
5593 -3481 -27786 -47718 -25493 -27816 -30554 -28742 -25092 -12643 -31231 -23413 -6689 -9167 -37148
5580 -37148 -65164 -18677 -2970 -11301 -21718 -13957 -9809 -44492 -52497 -68537 -26954 -53517 -60933
5567 -60933 -20711 -43086 -29622 -37710 -47531 -4156 -14779 -31570 -45199 -46674 -326 22733
5555 22733 1798 9651 -9589 -47363 -19766 -15658 -24324 -34636 417 -1057 263 -22262 -39587
5542 -39587 -25714 -6099 10948 -34766 -20059 -32437 -27674 -55677 -12160 -5054 2392 -4440 928
5529 928 -12627 -55944 -48661 -67466 -63410 -51984 -28452 -8330 -25706 -25586 -27673 -41322 -23129
5516 -23129 -58883 -24840 -38493 -3361 6611 9731 -3207 -23573 -46355 -19522 -16738 -6334
5504 -6334 -13095 19290 26733 7863 3091 -12617 1504 29958 18728 7897 11050 5907 1157
$$ packed form
5593c481k4305j9932K2225k323k738J812L650J2449j8588P818J6724k478k7981
5580c7148k8016M6487J5707q331j0417P761M148l4683q005j6040M1583k6563p416
5567f0933M0222k2375J3464q088r821M3375j0623j6791j3629j475M6348K3059
5555B2733k0935P853j9240l7774K7597M108q666j0312L5053j474J320k2525j7325
5542c9587J3873J9615J7047m5714J4707j2378M763k8003M3517P106P446o832N368
5529I28j3555m3317P283j8805M056J1426K3532K0122j7376J20k087j3649J8193
5516b3129l5754L4043j3653L5132R972L120j2938k0366k2782K6833K784J0404
5504f334o761L2385P443j8870m772j5708J4121K8454j1230j0831L153n143m750
$$ plain form
5491 1157 -2546 -6368 -25248 -5769 -539 -35245 -50500 -42629 -48220 20659 -8475 -3949 15112
5478 15112 23596 -24521 -22836 -38138 -50628 -44040 -32496 4233 4620 -10104 -8453 -14684 -16738
5465 -16738 -10873 -8469 -25837 -32846 -21694 -22528 -21720 -8141 -19641 -8524 8547 -28834 -49419
5452 -49419 -28874 -28413 -31608 -37531 -26554 -25683 -17940 -385 -22430 -29551 -55981 -41315 -20881
5439 -20881 -20282 -30674 -8921 7207 11523 1539 -18789 -34330 -23966 -16447 -32778 -24742 -892
5426 -892 -38529 -65879 -13217 -5942 -2404 -13718 -26116 -29488 -54551 -44722 -12241 -2943 -3997
5413 -3997 8782 -342 -13942 15055 6693 -20398 -26283 -18356 -15863 -11696 -21474 -7834 -27430
5400 -27430 -24180 -29014 -57742 -30665 -41248 -41250 -20564 -29227 -25401 -25246 -44649 -35812 5207 2010
$$ packed form
5491A157l703l822j8880J9479N230l4706j5255P871n591O8879k9134M526J9061
5478A5112Q484m8117J685j5302j2490O588J1544L6729L87j4724J651o231k054
5465a6738N865K404j7368p009J1152q34Q08J3579j1500J1117J7071l7381k0585
5452d9419K0545M61l195n923J0977Q71P743J7555k2045p121k6430J4666K0434
5439b0881N99j0392K1753J6128M316r984k0328j5541J0364P519j6331Q036K3850
5426h92l7637k7350N2662P275L538j1314j2398l372k5063R829L2481R298j054
5413c997J2779r124j3600K8997q362k7091n885P927K493M167r778J3640j9596
5400b7430L250m834k8728K7077j0583kK0686q663L826J55j9403Q837M1019l197
$$ plain form
5386 2010 -14992 1274 -6876 -22929 563 4461 8244 -3577 -7601 -32641 -51404 -22414 -23807
5373 -23807 3143 2790 8945 -1529 -8844 16798 9454 -12951 -16932 11582 4544 31344 14723
5360 14723 22515 15509 -9407 -1802 6805 14734 19242 4400 -27703 -23012 -33525 -39771 9174
5347 9174 39918 15946 1365 13710 -32726 -15516 -2612 -23397 19563 -29541 -38754 -27719
5335 -27719 14759 -7450 -38257 -35384 -15991 -28823 2042 -7902 1134 306 8550 -26244 -37142
5322 -37142 -35657 -19304 -16524 -7988 1290 -14168 3778 -3875 -11563 -24288 -19887 -22451 -13836 -35295
5308 -35295 -12894 -22336 -5235 -15399 -18123 -11538 -33352 -26535 -1606 17884 -20733 -4133 -11107
5295 -11107 -24826 -24880 -22437 15341 25011 17574 768 19854 38997 15220 16343 22827 25536 29216
$$ packed form
5386B010j7002J6266q150j6053K3492L898L783j1821m024k5040j8763K8990j393
5373b3807K6950l53O155j0474p315K5642p344k2405l981K8514p038K6800j6621
5360A4723P792p006k4916P605Q607P929M508j4842l2103M691j0513o246M8945
5347I174L0744k3972j4581J2345m6436J7210J2904k0785M2960m9104r213J1035
5335b7719M2478k2209l0807K873J9393j2832L0865r944R036q28Q244l4794j0898
5322c7142J485J6353K780Q536R278j5458J7946p653p688j2725M401k564Q615k1459
5308c5295K2401r442J7101j0164k724O585k1814O817K4929J9490l8617J6600o974
5295a1107j3719n4K443L7778R670p437j6806J9086J9143k3777J123O484K709L680
$$ plain form
5281 29216 -9869 -32723 11441 40566 94373 85076 70451 55398 48665 18541 58221 67598
5269 67598 16082 57706 40330 39069 51654 31185 38036 42177 -6932 17678 31320 14237
5257 14237 34310 22266 10183 2345 17839 -21073 -26700 -22243 -4409 32304 60797 67350 44223
5244 44223 26236 49760 88428 87107 75592 44250 38614 74733 76702 42418 55342 36373
5232 36373 27933 10820 -14654 -17733 5741 5260 6731 17156 26593 -8789 -847 -6921 -1740 6030
5218 6030 -6151 -12223 -32643 -17421 2394 -6154 10002 -11057 -42437 -42989 -19017 -21965 -27491
5205 -27491 13105 11709 -24896 -18008 -43807 -13632 -19377 -24236 -27148 -22827 -1563 -16962 -23371
5192 -23371 20215 10533 6896 5019 -26236 -27808 -20954 10584 5913 -10172 15842 16628 -29408
$$ packed form
5281B9216l9085k2854M4164K9125N3807r297j4625j5053o733l0124L9680R377
5269F7598n1516M1624j7376j261J2585k0469O851M141m9109K4610J3642j7083
5257A4237K0073j2044j2083p838J5494l8912n627M457J7834L6713K8493O553k3127
5244D4223j7987K3524L8668j321j1515l1342n636L6119J969l4284J2924j8969
5232C6373q440j7113k5474l079K3474m81J471J0425R437l5382P942o074N181P770
5218F030j2181o072k0420J5222J9815q548J6156k1059l1380n52K3972k948n526
5205b7491M0596j396l6605O888k5799L0175n745m859k912M321K1264j5399o409
5192b3371M3586r682l637j877l1255j572O854L1538m671j6085K6014P86m6036
$$ plain form
5179 -29408 -46358 8602 1724 8636 -5428 -45701 -19516 -23211 -25530 -20155 -29380 -39736 -16277
5166 -16277 -17862 -26963 -17226 -11991 -20178 3030 7232 -6128 -19523 -13498 -8358 -34347 -34417 -24733
5152 -24733 -17103 19863 32740 -31148 -47054 -30448 -39806 -22874 27151 40950 5168 -3096
5140 -3096 -24794 -16777 -17291 -18601 -35143 -50022 -48858 -29630 -36318 -47002 -64832 -77752 -69314
5127 -69314 -8878 7862 32761 -20243 -3432 20373 13645 16881 -3738 -1243 -20803 -24089 -44733
5114 -44733 -7899 -8718 -9018 25794 285 -26266 -34630 -5954 6067 -23490 -20703 -27348 14391
5101 14391 -53051 -29758 -41808 -49584 -1001 -21407 -35935 -26214 -17865 15019 -856 -5512 19789
5088 19789 4659 5111 -56256 -12733 -19293 -1681 3836 33481 25578 3767 5137 -13949 -38288
$$ packed form
5179b9408j6950N4960o878O912j4064m0273K6185l695k319N375r225j0356K3459
5166a6277j585r101R737N235q187K3208M202j3360j3395O025N140k5989p0R684
5152b4733P630L6966J2877o3888j5906J6606r358J6932N0025J3799l5782q264
5140c096k1698Q017n14j310j6542j4879J164J9228o688j0684j7830j2920Q438
5127f9314O0436J6740K4899n3004J6811K3805o728L236k0619K495j9560l286k0644
5114d4733L6834q19l00L4812k5509k6551q364K8676J2021k9557K787o645M1739
5101A4391o7442K3293j2050p776M8583k0406j4528R721Q349L2884j5875m656K5301
5088A9789j5130M52o1367M3523o560J7612N517K9645p903k1811J370j9086k4339
$$ plain form
5075 -38288 -59414 -56532 -20722 -21512 6594 8049 -28070 -28585 -52117 -40199 -19634 -7312 -16917
5062 -16917 -23573 -37428 18015 30860 -38910 -50802 -30712 -12972 -18706 357 -21598 -59263
5050 -59263 -45656 10241 -35639 -44018 -45281 -1208 -595 6705 32011 22090 4614 -31469 1180
5037 1180 -5416 -888 12143 -24420 -30420 17165 -11850 -39529 -39654 -26382 -19467 -32591 -23060
5024 -23060 -8566 8697 12906 -3816 35366 22957 8097 -18590 -26917 -7283 -9968 7276
5012 7276 2141 13656 -11457 -25419 -12516 -29073 14158 16931 28709 28681 6410 1248 -7635
4999 -7635 -11580 4311 -15699 8553 -11500 -9451 -11161 -18833 -5218 16903 -3429 -9180 23240
4986 23240 -23657 -40316 -7702 -2182 -3438 3565 -12417 -7859 17350 12130 17176 28551 30694
$$ packed form
5075c8288k1126K882L5810p90K8106J455l6119n15k3532J1918K0565J2322r605
5062a6917o656j3855N5443J2845o9770j1892K0090J7740n734J9063k1955l7665
5050e9263J3607N5897m5880q379j263M4073O13P300K5306r921j7476l6083L2649
5037A180o596M528J3031l6563o000M7585k9015k7679j25J3272O915j3124R531
5024b3060J4494J7263M209j6722L9182j2409j4860k6687q327J9634k685J7244
5012G276n135J1515k5113j3962J2903j6557M3231K773J1778k8k2271n162q883
4999g635l945J5891k0010K4252k0053K049j710p672J3615K2121k0332n751L2420
4986B3240m6897j6659L2614N520j256P003j5982M558K5209n220N046J1375K143
$$ plain form
4973 30694 12902 5883 -9667 -5953 -5056 -15769 -23472 -39413 -14525 28707 16225 14965 19679
4960 19679 8687 2134 15343 6798 44626 -2492 18549 40374 23975 11915 6756 -5331
4948 -5331 -18296 26506 34384 8549 4373 35907 12364 7826 -16988 10011 5560 53263 64885
4935 64885 40876 6490 34554 60328 47291 11660 36995 32425 -10230 14286 58436 8194
4923 8194 -8154 22930 38347 29584 21983 26156 36662 25159 10399 8317 23268 28057 57404
4910 57404 97002 76326 72882 89853 40891 19111 47976 20024 30283 14970 -4144 19199
4898 19199 37649 56981 46733 34258 6065 -11436 -16281 -20080 -31703 -17002 14752 47582
4886 47582 54342 35907 -13915 -15991 -962 -23157 1337 -2383 -8982 -39484 -1951 22945 25758
$$ packed form
4973C0694j7792p019j5550L714Q97j0713p703j5941K4888M3232j2482j260M714
4960A9679j0992o553J3209q545L7828m7118K1041K1825j6399j2060n159j2087
4948e331j2965M4802P878k5835m176L1534k3543m538k4814K6999m451M7703J1622
4935F4885k4009l4386K8064K5774j3037l5631K5335m570m2655K4516M4150n0242
4923H194j6348L1084J5417q763p601M173J0506j1503j4760k082J4951M789K9347
4910E7404L9598k0676l444J6971m8962k1780K8865k7952J0259j5313j9114K3343
4898A9199J8450J9332j0248j2475k8193j7501m845l799j1623J4701L1754L2830
4886D7582O760j8435m9822k076J5029k2195K4494l720o599l0502L7533K4896K813
$$ plain form
4873 25758 -19552 -18697 -11409 -9865 18517 -15228 -39770 15035 31334 -14050 -45117 -16455 11776
4860 11776 20355 20492 940 -23928 -11594 -18468 12530 28119 8363 12202 11212 14890 31374
4847 31374 -22687 -27864 -13248 11264 -13062 -39678 -21415 -15927 -10166 -25882 -1735 441 5791
4834 5791 6578 14911 -249 12593 -31 8735 -14922 -3092 -21062 -34679 5963 -12915 -18787
4821 -18787 -40113 -5625 -23390 -58443 -30730 21586 3179 23777 39920 -17994 14056 9330
4809 9330 31936 18622 -9905 -29625 -824 1185 -14390 4468 -10428 -4849 -6091 -9354 31526
4796 31526 14583 -14642 3674 4231 -11862 22282 12183 44212 20807 5964 17484 -6734
4784 -6734 5373 -2109 -20066 -1253 -11247 5169 -10845 -35005 -33565 -8651 -14316 -42829 -9684
$$ packed form
4873B5758m5310Q55P288J544K8382l3745k4542N4805J6299m5384l1067K8662K8231
4860A1776Q579J37j9552k4868J2334o874L0998J5589j9756L839r90L678J6484
4847C1374n4061n177J4616K4512k4326k6616J8263N488N761j5716K4147K176N350
4834E791P87Q333j5160J2842j2624Q766k3657J1830j7970j3617M0642j8878n872
4821a8787k1326L4488j7765l5053K7713N2316j8407K0598J6143n7914L2050m726
4809I330K2606j3314k8527j9720K8801K009j5575J8858j4896N579j242l263M0880
4796C1526j6943k9225J8316N57j6093L4144j0099L2029k3405j4843J1520k4218
4784f734J2107p482j7957J8813r994J6416j6014k4160J440K4914n665k8513L3145
$$ plain form
4771 -9684 -34207 4915 14604 23030 15786 23872 13869 2003 -2399 31463 16668 12830 -1993
4758 -1993 -30987 -17587 -8546 -4770 -18069 -2006 28031 3720 6676 11051 -2892 8048 7379
4745 7379 15401 -612 20293 30084 21875 -17647 -6824 37941 31538 45329 56237 8402 17243
4732 17243 27073 11891 18421 28427 26921 27050 -11719 -7198 3577 6743 15941 116 11621
4719 11621 1294 -682 -9052 -2713 -24408 -18768 -19379 -10217 16378 30075 39174 30376 -629 23474
4705 23474 6036 37994 57311 37355 57907 20249 36380 2326 5737 -30505 -5051 15261
4693 15261 21945 31627 19763 30147 45340 51486 60699 54633 34744 41641 46114 53780 46413 64449
4679 64449 27219 69812 36671 12818 23687 28390 47920 55747 32465 249 13479 6339
$$ packed form
4771i684k4523L9122R689Q426p244Q086j0003j1866m402L3862j4795l838j4823
4758a993k8994J3400R041L776j3299J6063L0037k4311K956M375j3943J0940o69
4745G379Q022j6013K0905R791q209l9522J0823M4765o403J3791J0908m7835Q841
4732A7243R830j5182O530J0006j506J29l8769M521J0775L166R198j5825J1505
4719A1621j0327j976q370O339k1695N640o11R162K6595J3697R099q798l1005K4103
4705B3474j7438L1958J9317j9956K0552l7658J6131l4054L411l6242K5454K0312
4693A5261O684R682j1864J0384J5193O146R213o066j9889O897M473P666p367J8036
4679F4449l7230M2593l3141k3853J0869M703J9530P827k3282l2216J3230p140
$$ plain form
4667 6339 12150 8751 23331 56231 39514 37212 21075 -7359 41730 46111 29288 15828 38968
4654 38968 56189 28843 20301 13185 38690 5457 39108 50081 25191 18843 7555 20200
4642 20200 54787 28638 46885 73615 56012 39455 36982 43013 21865 43527 68401 47605
4630 47605 71214 69928 84657 50965 51867 80695 64574 57824 44238 49068 50238 57527 56615 51413
4616 51413 60838 65532 75897 77703 74550 56567 65826 73683 46873 50214 75709 54205 39177
4603 39177 62502 47426 66815 81204 118957 105859 123911 118609 121161 112200 126946 99231
4591 99231 118288 118771 95579 115854 164663 165918 159074 168956 168373 159299 163041 150822 171326 187105
4577 187105 188302 185760 239144 234645 212295 174685 158674 166759 133652 135643 123343 142588 172803
$$ packed form
4667F339N811l399J4580L2900j6717k302j6137k8434M9089M381j6823j3460K3140
4654C8968J7221k7346q542p116K5505l3233L3651J0973k4890o348j1288J2645
4642B0200L4587k6149J8247K6730j7603j6557k473O031k1148K1662K4874k0796
4630D7605K3609j286J4729l3692R02K8828j6121o750j3586M830J170P289r12n202
4616E1413R425M694J0365J806l153j7983R259P857k6810L341K5495k1504j5028
4603C9177K3325j5076J9389J4389L7753j3098J8052n302K552q961J4746k7715
4591I9231J9057M83k3192K0275M8809J255o844R882n83r074L742j2219K0504J5779
4577A87105J197k542N3384m499k2350l7610j6011Q085l3107J991j2300J9245L0215
$$ plain form
4564 172803 143179 168985 161767 154052 152746 164216 177175 164589 168923 155371 146886 175520 203029
4551 203029 222652 258489 273437 261881 218393 179097 179993 222261 237653 256645 248394 240734
4539 240734 194148 154075 143702 130791 110782 92176 84841 92715 112666 115874 102942 151811
4527 151811 83432 91657 121035 111981 96974 87562 145519 136825 80563 93515 81360 116615
4515 116615 74725 106071 79457 92600 103449 97797 117506 81620 96812 103760 85643 104551
4503 104551 129795 147560 158436 149089 131452 158348 158364 166788 197410 161846 196746 165192 128404
4490 128404 165781 202050 171096 171822 178124 160925 155080 158149 187094 216578 221406 249442 244688
4477 244688 323982 359871 308076 313884 325241 321478 303488 309876 283633 311784 329186 339173
$$ packed form
4564A72803k9624K5806p218p715j306J1470J2959j2586M334j3552q485K8634K7509
4551B03029J9623L5837J4948j1556m3488l9296Q96M2268J5392J8992q251p660
4539B40734m6586m0073j0373j2911k0009j8606p335P874J9951L208j2932M8869
4527A51811o8379Q225K9378r054j5007r412N7957q694n6262J2952j2155L5255
4515A16615m1890L1346k6614J3143J0849n652J9709l5886J5192O948j8117J8908
4503A04551K5244J7765J0876r347j7637K6896J6Q424L0622l5564L4900l1554l6788
4490A28404L7377L6269l0954P26O302j7199n845L069K8945K9484M828K8036m754
4477B44688P9294L5889n1795N808J1357l763j7990O388k6243K8151J7402R987
$$ plain form
4465 339173 375102 351001 368395 405862 406979 369339 395233 389623 443171 500388 524550 532298
4453 532298 492127 489942 450783 388356 403308 406187 370143 388102 365771 350686 352853 299821
4441 299821 328636 339527 347055 356587 336495 341306 402800 488080 475752 427156 450219 458408
4429 458408 451588 506447 530248 555603 547916 511070 444063 418006 443577 366211 361703 347467
4417 347467 387971 390218 398804 398283 413966 438178 434387 454412 495869 531576 575810 583326 612030
4404 612030 651550 557376 557668 575338 466378 430637 436948 401615 453852 423435 405138 405066 413188
4391 413188 448555 486468 484336 491952 537333 591802 640302 687598 687861 665430 655944 625668 599223
4378 599223 569157 575429 625155 628811 683929 732165 833319 937068 1055452 1210202 1211834
$$ packed form
4465C39173L5929k4101J7394L7467J117l7640K5894n610N3548N7217K4162P748
4453E32298m0171k185l9159o2427J4952K879l6044J7959k2331j5085K167n3032
4441B99821K8815J0891P528R532k0092M811O1494Q5280j2328m8596K3063Q189
4429D58408o820N4859K3801K5355p687l6846o7007k6057K5571p7366m508j4236
4417C47467M0504K247Q586n21J5683K4212l791K0025M1457L5707M4234P516K8704
4404F12030L9520r4174K92J7670j08960l5741O311l5333N2237l0417j8297p2Q122
4391D13188L5367L7913k132P616M5381N4469M8500M7296K63k2431r486l0276k6445
4378E99223l0066O272M9726L656N5118M8236J01154J03749J18384J54750J632
$$ plain form
4367 1211834 1190268 1093827 1049482 1038161 1040314 1126628 1230182 1300723 1263166 1094910 924345
4356 924345 818777 714958 667771 627367 547008 531519 495342 489773 475820 480346 474219 475814
4344 475814 454807 401076 416413 404549 436745 430133 417891 396808 414193 414360 436998 441721
4332 441721 450438 420495 394795 381551 389931 397804 438878 457689 427090 409902 424368 428974
4320 428974 462419 513085 498032 465064 446937 482280 475827 478803 491824 478965 502929 478541
4308 478541 480492 485776 529076 488004 490865 531428 552116 581866 578326 595435 614929 649870
4296 649870 625802 663084 691994 684139 652698 662579 696950 707680 712877 749198 785624 833890
4284 833890 830698 916558 944202 913634 946232 971599 993521 1013861 1088949 1135487 1187971 1177079
$$ packed form
4367A211834k1566r6441m4345j1321K153Q6314J03554P0541l7557j68256j70565
4356I24345j05568j03819m7187m0404q0359j5489l6177n569j3953M526o127J595
4344D75814k1007n3731J5337j1864L2196o612j2242k1083J7385J67K2638M723
4332D41721Q717k9943k5700j3244Q380P873M1074J8811l0599j7188J4466M606
4320D28974L3445N0666j5053l2968j8127L5343o453K976J3021j2859K3964k4388
4308D78541J951N284M3300m1072K861M0563K0688K9750l540J7109J9494L4941
4296F49870k4068L7282K8910p855l1441R881L4371J0730N197L6321L6426M8266
4284H33890l192Q5860K7644l0568L2598K5367K1922K0340P5088M6538N2484j0892
$$ plain form
4272 1177079 1207024 1256738 1247308 1301515 1386506 1447455 1534557 1606294 1705172 1809359 1924899
4261 1924899 2078366 2236987 2391347 2563215 2798071 3053328 3343379 3673768 3960254 4199307
4251 4199307 4425574 4725120 5069123 5473533 5893362 6342443 6762583 7225918 7749275 8264774
4241 8264774 8912860 9602372 10382540 11285456 12395782 13696085 15369258 17508162 20283324
4232 20283324 23642770 27624419 31649749 34475539 35023819 33922240 32415815 31495751
4224 31495751 31747787 33072808 34523537 34776898 32741028 29037876 24956253 21167575
4216 21167575 17962798 15298944 13270348 11634786 10275889 9165019 8249415 7468910
4208 7468910 6838617 6295910 5771243 5367528 5041748 4658002 4354689 4095105 3851672 3612984
$$ packed form
4272A177079K9945M9714r430N4207Q4991O0949Q7102P1737R8878J04187J15540
4261A924899J53467J58621J54360J71868K34856K55257K90051L30389K86486K39053
4251D199307K26267K99546L44003M04410M19829M49081M20140M63335N23357N15499
4241H264774O48086O89512P80168R02916J110326J300303J673173K138904K775162
4232B0283324L359446L981649M025330K825790N48280j101579j506425r20064
4224C1495751K52036J325021J450729K53361k035870l703152m081623l788678
4216B1167575l204777k663854k028596j635562j358897j110870r15604p80505
4208G468910o30293n42707n24667m03715l25780l83746l03313k59584k43433k38688
$$ plain form
4198 3612984 3408007 3287606 3097476 2967651 2830883 2660405 2551008 2433240 2335621 2232540
4188 2232540 2129362 2034686 1980905 1866050 1813901 1765610 1675732 1600499 1539060 1483333 1443027
4177 1443027 1419741 1348983 1329488 1271141 1218787 1213915 1146301 1142376 1140478 1095094 1071570 1037805
4165 1037805 1044309 1009575 1009693 976347 907344 902720 890023 881543 866897 837001 830736 850806 820311
4152 820311 786573 757514 760355 746349 737911 742563 780051 774874 768069 750672 756921 749331 749126
4139 749126 754899 756479 755491 768704 742939 724439 733938 769652 743057 739677 722216 740072 716488
4126 716488 703739 732806 761958 728292 723147 747631 737821 716516 770763 764328 741675 779030
4114 779030 796866 786606 798844 835864 866109 850408 878656 909920 937102 975635 967388 933951
$$ packed form
4198C612984k04977j20401j90130j29825j36768j70478j09397j17768r7619j03081
4188B232540j03178r4676n3781j14855n2149m8291q9878p5233o1439n5727m0306
4177A443027k3286p0758j9495n8347n2354m872o7614l925j898m5384k3524l3765
4165A037805O504l4734J18l3346o9003m624j2697q480j4646k9896o265K0070l0495
4152H20311l3738k9059K841j4006q438M652L7488n177o805j7397O249p590k05
4139G49126N773J580r88J3213k5765j8500R499L5714k6595l380j7461J7856k3584
4126G16488j2749K9067K9152l3666n145K4484r810k1305N4247o435k2653L7355
4114G79030J7836j0260J2238L7020L0245j5701K8248L1264K7182L8533q247l3437
$$ plain form
4102 933951 949407 935895 935587 959025 1024131 1079069 1076859 1050760 1005126 1017051 1006095 1033442
4090 1033442 1021989 1022758 1073233 1118644 1173800 1226609 1290394 1354476 1403332 1488629 1569294 1693951
4078 1693951 1810660 1952018 2071939 2250484 2512458 2727677 2844556 2981978 3135523 3325383
4068 3325383 3521234 3769580 4123262 4476095 4741245 5009416 5324384 5680926 6087481 6562736
4058 6562736 7135249 7801118 8544079 9545918 10805140 12430893 14639114 17781446 21587259
4049 21587259 24251278 23867805 21710814 19688208 18554290 18318038 19277548 21445418 23863597
4040 23863597 24020219 21284634 17712419 14626262 12154939 10301204 8895569 7744640
4032 7744640 6778111 6018296 5407276 4872066 4449278 4116857 3864111 3603081 3360982 3144612
$$ packed form
4102I33951J5456j3512l08K3438O5106N4938k210k6099m5634J1925j0956K7347
4090A033442j1453P69N0475M5411N5156N2809O3785O4082M8856Q5297Q0665J24657
4078A693951J16709J41358J19921J78545K61974K15219J16879J37422J53545J89860
4068C325383J95851K48346L53682L52833K65150K68171L14968L56542M06555M75255
4058F562736N72513O65869P42961J001839J259222J625753K208221L142332L805813
4049B1587259K664019l83473k156991k022606j133918k36252R59510K167870K418179
4040B3863597J56622k735585l572215l086157k471323j853735j405635j150929
4032G744640r66529p59815o11020n35210m22788l32421k52746k61030k42099k16370
$$ plain form
4022 3144612 2943887 2744359 2574103 2431566 2340842 2227585 2077226 1979900 1895210 1761786
4012 1761786 1728067 1691137 1610818 1470038 1409700 1358216 1315053 1227113 1224847 1176364 1147898
4001 1147898 1142400 1119888 1080503 1040075 968841 960081 964136 949832 912207 929017 924856 915761
3989 915761 864546 863585 839840 824736 812497 809133 820503 794000 744556 720544 642935 632100
3977 632100 655499 596786 543371 496531 468335 498959 505530 500866 516456 487492 468406 467279
3965 467279 442781 452415 434551 391674 426481 444320 429691 387836 363466 351947 393271 375837
3953 375837 345400 357135 320479 322542 369517 316213 301630 302919 325793 309609 308649 280368
3941 280368 319461 315651 279483 292164 284105 290722 289899 281702 278519 244337 270411 247827 272473
$$ packed form
4022C144612k00725j99528j70256j42537r0724j13257j50359r7326q4690j33424
4012A761786l3719l6930q0319j40780o0338n1484m3163q7940k266m8483k8466
4001A147898n498k2512l9385m0428p1234q760M055j4304l7625J6810m161r095
3989I15761n1215r61k3745j5104j2239l364J1370k6503m9444k4012p7609j0835
3977F32100K3399n8713n3415m6840k8196L0624O571m664J5590k8964j9086j127
3965D67279k4498R634j7864m2877L4807J7839j4629m1855k4370j1519M1324j7434
3953C75837l0437J1735l6656K063M6975n3304j4583J289K2874j6184r60k8281
3941B80368L9093l810l6168J2681q059O617q23q197l183l4182K6074k2584K4646
$$ plain form
3928 272473 277181 247946 243341 224445 223215 247334 257225 217610 210477 203022 229813 241197 246253
3915 246253 236405 233622 217739 242883 254836 234141 230652 230531 214222 222425 241991 190501 199474
3902 199474 201164 237840 273699 245142 219505 184307 188015 209473 232375 246160 243224 229376
3890 229376 178531 178095 209907 209205 206500 223793 266381 244422 251701 236556 234446 259060 257015
3877 257015 256006 273354 275286 263798 253667 264699 248573 247016 240020 263339 248701 237240
3865 237240 254918 265586 274973 264092 244176 264761 283671 324100 340823 315864 333923 326120
3853 326120 320656 292833 311396 291851 269746 268529 254531 240328 260719 268623 234533 225151
3841 225151 221978 260953 266415 262272 286339 306193 284049 281401 249473 252481 288089 222021 247596
$$ packed form
3928B72473M708k9235m605j8896j230K4119R891l9615p133p455K6791J1384N056
3915B46253r848k783j5883K5144J1953k0695l489j21j6309Q203J9566n1490Q973
3902A99474J690L6676L5859k8557k5637l5198L708K1458K2902J3785k936j3848
3890B29376n0845m36L1812p02k705J7293M2588k1959P279j5145k110K4614k045
3877B57015j009J7348J932j1488j0131J1032j6126j557o996K3319j4638j1461
3865B37240J7678J0668R387j0881j9916K0585J8910M0429J6723k4959J8059p803
3853C26120n464k7823J8563j9545k2105j217j3998j4203K0391P904l4090r382
3841B25151l173L8975N462m143K4067J9854k2144k648l1928L008L5608o6068K5575
$$ plain form
3828 247596 267023 273031 251496 232532 241954 217355 249859 245087 239361 240329 243737 269915 279820
3815 279820 325874 333442 326920 324046 311028 278917 284991 311919 336929 331252 352096 353074 323671
3802 323671 292297 289803 298322 257033 253754 222749 216411 231790 222719 229692 228987 228652 213218 261076
3788 261076 236802 230149 216018 219540 260855 241328 269064 263476 224609 192773 228907 261056
3776 261056 247090 248529 223867 204467 242124 210075 227475 234487 270487 247101 226641 263482
3764 263482 301822 254541 257208 257445 237828 241761 228549 263723 280206 263415 257339 251302 236657
3751 236657 253255 253104 270836 269647 241494 232106 264284 223703 220383 253867 264730 249238 220277
3738 220277 234709 234502 203307 237187 236667 204828 208784 223345 230937 250845 264415 255578 220622
$$ packed form
3828B47596J9427O008k1535j8964R422k4599L2504m772n726R68L408K6178R905
3815B79820M6054P568o522k874j3018l2111O074K6928K5010n677K0844R78k9403
3802C23671l1374k494Q519m1289l279l1005o338J5379r071O973p05l35j5434M7858
3788B61076k4274o653j4131L522M1315j9527K7736n588l8867l1836L6134L2149
3776B61056j3966J439k4662j9400L7657l2049J7400P012L6000k3386k0460L6841
3764B63482L8340m7281K667K37j9617L933j3212L5174J6483j6791o076o037j4645
3751B36657J6598j51J7732j189k8153r388L2178m0581l320L3484J0863j5492k8961
3738B20277J4432k07l1195L3880n20l1839L956J4561P592J9908J3570q837l4956
$$ plain form
3725 220622 232427 260974 221593 223004 251557 223288 236032 228826 232659 241940 290366 283638 282994
3712 282994 259938 241428 239297 233892 272205 262227 250193 277060 256241 229280 246825 221217
3700 221217 238701 254607 270749 257760 264175 258980 223932 257751 292943 286355 265035 275925
3688 275925 297228 289613 274905 305671 332618 342325 291761 283886 314497 279055 282350 296737
3676 296737 310755 317626 344774 365763 348169 325650 355015 340045 320501 325953 351892 379205
3664 379205 387308 400156 420603 425076 444941 443242 445984 448669 460097 459234 467220 488590 527741
3651 527741 527873 555985 594774 592943 624673 650103 697905 668273 689996 739883 702122 701825 708577
3638 708577 673577 633616 635424 644109 697551 702215 644280 610494 626568 601381 538261 577690
$$ packed form
3725B20622J1805K8547l9381J411K8553k8269J2744p206L833R281M8426o728o44
3712B82994k3056j8510k131n405L8313r978j2034K6867k0819k6961J7545k5608
3700B21217J7484J5906J6142j2989O415n195l5048L3819L5192o588k1320J0890
3688B75925K1303p615j4708L0766K6947R707n0564p875L0611l5442L295J4387
3676B96737J4018O871K7148K0989j7594k2519K9365j4970j9544N452K5939K7313
3664C79205Q103J2848K0447M473J9865j699K742K685J1428q63P986K1370L9151
3651E27741J32K8112L8789j831L1730K5430M7802k9632K1723M9887l7761k97O752
3638G08577l5000l9961J808Q685N3442M664n7935l3786J6074k5187o3120L9429
$$ plain form
3626 577690 550598 547444 550846 519170 516187 522456 533161 496789 485017 483416 511327 504192 486620
3613 486620 511026 488185 479799 498137 472759 473789 481716 441644 420589 475669 470523 462986 494458
3600 494458 469298 457340 474131 496114 492022 509719 494161 488301 439669 447250 470343 451105
3588 451105 492022 499959 478789 488649 512515 476650 482702 478000 490315 480293 472334 505279 501342
3575 501342 503535 508112 508823 506006 524593 533261 517500 554734 558010 539476 563282 556090 544137
3562 544137 543000 600590 592793 583532 587035 604530 620799 639697 632251 576345 633768 648266 618970
3549 618970 637192 654256 696744 671636 648765 716622 733013 745002 768414 770912 768525 774444
3537 774444 750583 723257 713614 698758 717463 745612 715195 710420 714126 690683 737518 724538
$$ packed form
3626E77690k7092l154L402l1676k983O269J0705l6372j1772j601K7911p135j7572
3613D86620K4406k2841q386J8338k5378J030P927m0072k1055N5080n146p537L1472
3600D94458k5160j1958J6791K1983m092J7697j5558n860m8632P581K3093j9238
3588D51105M0917P937k1170R860K3866l5865O052m702J2315j0022p959L2945l937
3575E01342K193M577P11k817J8587Q668j5761L7234L276j8534K3806p192j1953
3562E44137j137N7590p797r261L503J7495J6269J8898p446n5906N7423J4498k9296
3549F18970J8222J7064M2488k5108k2871O7857J6391J1989K3412K498k387N919
3537G74444k3861k7326r643j4856J8705K8149l0417m775L706k3443M6835j2980
$$ plain form
3525 724538 740924 720894 724284 699479 753475 741706 737918 785628 766687 771918 738198 807520
3513 807520 790738 800172 855066 859990 874848 868449 872914 872863 852531 867186 894617 905241 934032
3500 934032 949375 935365 942938 924195 910381 945485 987730 988739 969625 950715 951950 989360
3488 989360 997382 1009504 1050106 1048320 1080252 1078975 1116493 1141707 1137355 1162718 1161554 1146000 1151903
3475 1151903 1199436 1251231 1259260 1262696 1271580 1256501 1300836 1339682 1376621 1418055 1425678 1460783
3463 1460783 1509842 1557792 1608879 1662609 1650130 1654043 1678952 1743203 1798110 1855332 1894458 1939226
3451 1939226 1983489 1983872 1947564 1892602 1919376 1914841 1887530 1899546 1936151 1965251 1997306 1994787
3439 1994787 1956635 1953551 1951464 1947146 1963550 1963316 1958015 2036760 2088451 2076273 2087413 2084067 2136033
$$ packed form
3525G24538J6386k0030L390k4805N3996j1769l788M7710j8941N231l3720O9322
3513H07520j6782R434N4894M924J4858o399M465n1k0332J4655K7431J0624K8791
3500I34032J5343j4010P573j8743j3814L5104M2245J009j9114j8910J235L7410
3488I89360Q022J2122M0602j786L1932j277L7518K5214m352K5363j164j5554N903
3475A151903M7533N1795Q029L436Q884j5079M4335L8846L6939M1434P623L5105
3463A460783M9059M7950N1087N3730j2479L913K4909O4251N4907N7222L9126M4768
3451A939226M4263L83l6308n4962K6774m535k7311J2016L6605K9100L2055k519
3439A994787l8152l084k087m318J6404k34n301P8745N1691j2178J1140l346N1966
$$ plain form
3426 2136033 2185570 2196921 2214549 2256752 2269030 2335238 2401441 2433832 2467183 2545089 2561265
3415 2561265 2592427 2628084 2676374 2710277 2758405 2794429 2823798 2889549 2967489 2998311 3063779
3404 3063779 3138722 3169810 3238288 3283415 3362504 3433319 3517594 3573456 3651181 3733494 3785672
3393 3785672 3850501 3950545 4048858 4133575 4233138 4303605 4370346 4478020 4592234 4728714 4862022
3382 4862022 4988611 5107507 5229688 5365565 5483377 5630797 5775449 5925432 6111201 6293601
3372 6293601 6501328 6740402 6923972 7163936 7434765 7696639 7916694 8151496 8413286 8647523
3362 8647523 8957919 9258015 9574388 9904000 10249827 10631219 11048609 11516249 12020533 12562113
3352 12562113 13112922 13630249 14168574 14703938 15258882 15846206 16534020 17250558 18009946
$$ packed form
3426B136033M9537J1351J7628M2203J2278O6208O6203L2391L3351P7906J6176
3415B561265L1162L5657M8290L3903M8128L6024K9369O5751P7940L0822O5468
3404C063779P4943L1088O8478M5127P9089P0815Q4275N5862P7725Q2313N2178
3393C785672O4829J00044R8313Q4717R9563P0467O6741J07674J14214J36480J33308
3382D862022J26589J18896J22181J35877J17812J47420J44652J49983J85769J82400
3372F293601K07727K39074J83570K39964K70829K61874K20055K34802K61790K34237
3362H647523L10396L00096L16373L29612L45827L81392M17390M67640N04284N41580
3352A2562113N50809N17327N38325N35364N54944N87324O87814P16538P59388
$$ plain form
3343 18009946 18905408 19871403 20913180 21981458 23056617 24166068 25212049 26303013
3335 26303013 27496873 28907061 30607104 32804764 35575570 38851834 42305444 45188178
3327 45188178 46964849 47284574 46197970 44265146 42042822 39971774 38293727 37111067
3319 37111067 36308952 35805214 35449502 35209104 34977170 34770123 34586660 34358630 34110720
3310 34110720 33805960 33487646 33030073 32548412 32064696 31502890 30878530 30210520 29529563
3301 29529563 28833878 28100173 27320208 26546632 25764296 24976435 24151874 23441582 22703606
3292 22703606 21908112 21186308 20523305 19852486 19204377 18582913 17953311 17383596 16840204
3283 16840204 16323798 15859736 15417504 14931329 14511030 14083672 13702856 13328760 12993145
$$ packed form
3343A8009946Q95462R65995J041777J068278J075159J109451J045981J090964
3335B6303013J193860J410188J700043K197660K770806L276264L453610K882734
3327D5188178J776671L19725j086604j932824k222324k071048j678047j182660
3319C7111067q02115n03738l55712k40398k31934k07047j83463k28030k47910
3310C4110720l04760l18314m57573m81661m83716n61806o24360o68010o80957
3301B9529563o95685p33705p79965p73576p82336p87861q24561p10292p37976
3292B2703606p95494p21804o63003o70819o48109o21464o29602n69715n43392
3283A6840204n16406m64062m42232m86175m20299m27358l80816l74096l35615
$$ plain form
3274 12993145 12657152 12326076 12056872 11782412 11499227 11232262 10958231 10745002 10557129
3265 10557129 10357059 10171530 9968150 9783498 9592200 9462857 9380790 9250143 9120926 9036339
3255 9036339 8990388 8926860 8929195 8880793 8867971 8881397 8957953 8979173 9046445 9193320 9330519
3244 9330519 9428439 9509231 9609055 9773705 9993694 10256515 10597667 10957214 11290188 11687606
3234 11687606 12186907 12821560 13643906 14566654 15659485 16861632 18067444 19109866 19901130
3225 19901130 20625597 21613060 23173558 25126506 26916370 27762814 27505014 26567087 25600277
3216 25600277 24920089 24923362 25774243 26839819 26608269 24709876 22394224 20369029 18726075
3207 18726075 17530261 16889833 16630405 16327197 15443823 14262851 13226155 12444191 11799805
$$ packed form
3274A2993145l35993l31076k69204k74460k83185k66965k74031k13229j87873
3265A0557129k00070j85529k03380j84652j91298j29343q2067j30647j29217q4587
3255I036339m5951o3528K335m8402j2822J3426P6556K1220O7272J46875J37199
3244I330519R7920Q0792R9824J64650K19989K62821L41152L59547L32974L97418
3234A1687606M99301O34653Q22346R22748J092831J202147J205812J042422P91264
3225A9901130P24467R87463J560498J952948J789864Q46444k57800r37927r66810
3216B5600277o80188L273Q50881J065576k31550j898393k315652k025195j642954
3207A8726075j195814o40428k59428l03208q83374j180972j036696p81964o44386
$$ plain form
3198 11799805 11321797 11007314 10782848 10630305 10500737 10438729 10427676 10493704 10582785 10703638
3188 10703638 10870388 11024662 11275105 11526007 11848298 12172736 12508698 12850044 13284523
3179 13284523 13779414 14325454 14850933 15409162 16032660 16754561 17482461 18331921 19176668
3170 19176668 20142911 21143300 22242304 23389127 24602452 25931313 27356973 28818940
3162 28818940 30396472 32075152 33826142 35719383 37618641 39658198 41783525 43936784
3154 43936784 46123922 48414269 50702312 53050409 55406494 57785304 60168814 62557316
3146 62557316 64895681 67181266 69370359 71485528 73463434 75273511 76984182 78533416
3138 78533416 79889616 80994559 81878238 82557944 83053337 83320926 83393504 83245623 82848894
$$ packed form
3198A1799805m78008l14483k24466j52543j29568o2008j1053O6028Q9081J20853
3188A0703638J66750J54274K50443K50902L22291L24438L35962L41346M34479
3179A3284523M94891N46040N25479N58229O23498P21901P27900Q49460Q44747
3170A9176668R66243J000389J099004J146823J213325J328861J425660J461967
3162B8818940J577532J678680J750990J893241J899258K039557K125327K153259
3154D3936784K187138K290347K288043K348097K356085K378810K383510K388502
3146F2557316K338365K285585K189093K115169J977906J810077J710671J549234
3138G8533416J356200J104943Q83679O79706M95393K67589P2578j47881l96729
$$ plain form
3129 82848894 82215415 81236232 79981598 78504258 76815238 74935076 73012899 70952474
3121 70952474 68784258 66450387 64056492 61545188 58934359 56228685 53502655 50797177
3113 50797177 48134027 45518213 43005386 40558161 38180208 35876258 33654116 31521401
3105 31521401 29501016 27564349 25691549 23976877 22354476 20888951 19556361 18350517
3097 18350517 17211496 16156757 15209405 14368093 13544489 12793437 12104734 11449006 10928620
3088 10928620 10443155 9963345 9586942 9279664 8938198 8645549 8390299 8106986 7903225
3079 7903225 7711880 7506030 7333496 7196830 7065239 6961706 6855798 6750097 6729076 6657934
3069 6657934 6638194 6623792 6600524 6617066 6656797 6648969 6641746 6662665 6653852 6626615 6577778 6580736
$$ packed form
3129H2848894o33479r79183j254634j477340j689020j880162j922177k060425
3121G0952474k168216k333871k393895k511304k610829k705674k726030k705478
3113E0797177k663150k615814k512827k447225k377953k303950k222142k132715
3105C1521401k020385j936667j872800j714672j622401j465525j332590j205844
3097A8350517j139021j054739r47352q41312q23604p51052o88703o55728n20386
3088A0928620m85465m79810l76403l07278l41466k92649k55250k83313k03761
3079G903225j91345k05850j72534j36666j31591j03533j05908j05701k1021p1142
3069F657934j9740j4402k3268J6542L9731p828p223K0919q813k7237m8837K958
$$ plain form
3057 6580736 6557114 6507644 6436653 6424585 6402686 6359389 6262182 6211611 6172600 6130592 6048517
3046 6048517 5945470 5828683 5776399 5745852 5676400 5609323 5584981 5602923 5531913 5400781 5361897
3035 5361897 5330925 5287448 5273785 5187202 5185894 5114031 5092266 5073028 5085297 5020325 4968295 4913075
3023 4913075 4866277 4886054 4904589 4924861 4917817 4900619 4922579 4940479 4984811 5062806 5088311 5196663
3011 5196663 5283773 5393797 5522042 5689793 5779002 5962152 6191380 6398522 6626939 6922643
3001 6922643 7180176 7502104 7879420 8256274 8678722 9152063 9587153 10049981 10534909 11006816
2991 11006816 11537140 12160470 12757414 13414068 14193334 15050932 15979878 16940386 18048981
2982 18048981 19269913 20650734 22220319 24129965 26328518 28964961 32119775 35722816
$$ packed form
3057F580736k3622m9470p0991j2068k1899m3297r7207n0571l9011m2008q2075
3046F048517j03047j16787n2284l0547o9452o7077k4342J7942p1010j31132l8884
3035E361897l0972m3477j3663q6583j308p1863k1765j9238J2269o4972n2030n5220
3023D913075m6798J9777J8535K0272p044j7198K1960J7900M4332P7995K5505J08352
3011E196663Q7110J10024J28245J67751Q9209J83150K29228K07142K28417K95704
3001F922643K57533L21928L77316L76854M22448M73341M35090M62828M84928M71907
2991A1006816N30324O23330N96944O56654P79266Q57598R28946R60508J108595
2982A8048981J220932J380821J569585J909646K198553K636443L154814L603041
$$ plain form
2974 35722816 39512990 43091448 46070652 48043183 48888433 48889895 48345962 47644523 47059307
2965 47059307 46720095 46564501 46512447 46377073 45910338 44773408 42767496 39930323 36559271
2956 36559271 33072401 29746776 26792926 24306715 22177900 20399543 18956605 17695916
2948 17695916 16714663 15914559 15218562 14649943 14169762 13797498 13465590 13195561 12997541
2939 12997541 12828131 12626773 12531557 12487544 12426631 12419162 12393302 12428433 12477530 12557988 12642788
2928 12642788 12746872 12929996 13184831 13439630 13804534 14196220 14632228 15180572 15750502
2919 15750502 16345277 16939234 17461032 17864739 18275554 18716263 19123871 19648089 20158491
2910 20158491 20615527 21114851 21638392 22162732 22669768 23171944 23724882 24240402 24780201
$$ packed form
2974C5722816L790174L578458K979204J972531Q45250J462n43933p01439n85216
2965D7059307l39212j55594n2054j35374m66735j136930k005912k837173l371052
2956C6559271l486870l325625k953850k486211k128815j778357j442938j260689
2948A7695916r81253q00104o95997n68619m80181l72264l31908k70029j98020
2939A2997541j69410k01358r5216m4013o0913p469k5860L5131M9097Q0458Q4800
2928A2642788J04084J83124K54835K54799L64904L91686M36008N48344N69930
2919A5750502N94775N93957N21798M03707M10815M40709M07608N24218N10402
2910B0158491M57036M99324N23541N24340N07036N02176N52938N15520N39799
$$ plain form
2901 24780201 25373191 26016935 26644519 27262313 27922186 28599263 29311988 30084878 31002883
2892 31002883 31989371 32979210 34024296 35034014 35992116 36906794 37808164 38752547 39761593
2883 39761593 40844203 42110350 43361120 44688103 46115962 47602738 49286055 51032050
2875 51032050 53004588 55136993 57391412 59795438 62318618 65070929 68074221 71331317
2867 71331317 74988725 79047432 83576964 88622736 94273724 100528161 107501941 115262516
2859 115262516 123995327 133851108 145124007 158123896 173245932 190794241 211166825
2852 211166825 234137327 258582936 282256593 302332509 317122739 326693658 332305077
2845 332305077 335679636 338434385 341850670 346354562 351842654 357211170 360773730 360907728
$$ packed form
2901B4780201N92990O43744O27584O17794O59873O77077P12725P72890R18005
2892C1002883R86488R89839J045086J009718R58102R14678R01370R44383J009046
2883C9761593J082610J266147J250770J326983J427859J486776J683317J745995
2875E1032050J972538K132405K254419K404026K523180K752311L003292L257096
2867G1331317L657408M058707M529532N045772N650988O254437O973780P760575
2859A15262516Q732811R855781J1272899J2999889J5122036J7548309K0372584
2852B11166825K2970502K4445609K3673657K0075916J4790230R570919N611419
2845C32305077L374559K754749L416285M503892N488092N368516L562560J33998
$$ plain form
2837 360907728 356302598 346450223 332075174 315064444 297469991 280874444 266064659
2830 266064659 253077216 241532717 230994334 221018177 211345084 201745604 192025618 182276415
2822 182276415 172621934 163111664 153894270 145027398 136656251 128734701 121265826 114179793
2814 114179793 107266317 100537548 93911204 87437627 81161756 75208919 69687305 64668793
2806 64668793 60204889 56304138 52943210 49992003 47460478 45325171 43512443 41955831
2798 41955831 40651974 39505180 38450148 37510353 36645192 35792124 35005351 34277040 33657384
2789 33657384 33075273 32630755 32236870 31786157 31349784 30834208 30158615 29393539 28504596
2780 28504596 27571451 26540167 25529290 24535322 23618072 22685209 21775751 20877314 19995448
$$ packed form
2837C60907728m605130r852375j4375049j7010730j7594453j6595547j4809785
2830B66064659j2987443j1544499j0538383r976157r673093r599480r719986r749203
2822A82276415r654481r510270r217394q866872q371147p921550p468875p086033
2814A14179793o913476o728769o626344o473577o275871n952837n521614n018512
2806F4668793m463904l900751l360928k951207k531525k135307j812728j556612
2798D1955831j303857j146794j055032r39795q65161q53068p86773p28311o19656
2789C3657384n82111m44518l93885m50713m36373n15576o75593p65076q88943
2780B8504596r33145j031284j010877r93968r17250r32863r09458q98437q81866
$$ plain form
2771 19995448 19080281 18208606 17260879 16354880 15463565 14594629 13806347 13119381 12458616
2762 12458616 11858696 11299911 10822428 10396602 9986124 9603682 9252100 8983342 8681690
2753 8681690 8377687 8104536 7870609 7653505 7409032 7180950 7009967 6813785 6617359 6464040
2743 6464040 6254877 6111593 6003287 5847136 5705406 5497917 5406972 5278331 5161155 4990347
2733 4990347 4849311 4730677 4635798 4552229 4434673 4288321 4192884 4094046 4011918 3893871
2723 3893871 3796731 3692603 3607752 3529977 3443978 3383308 3300515 3178834 3129941 3072304 2955550
2712 2955550 2901420 2855016 2814849 2767318 2693570 2667822 2648014 2621029 2566231 2534209 2501580
2701 2501580 2450101 2446145 2444921 2425627 2417778 2368596 2333259 2297049 2308836 2281918 2279878 2274298
$$ packed form
2771A9995448r15167q71675r47727r05999q91315q68936p88282o86966o60765
2762A2458616n99920n58785m77483m25826m10478l82442l51582k68758l01652
2753H681690l04003k73151k33927k17104k44473k28082j70983j96182j96426j53319
2743F464040k09163j43284j08306j56151j41730k07489r0945j28641j17176j70808
2733D990347j41036j18634r4879q3569j17556j46352r5437r8838q2128j18047
2723C893871r7140j04128q4851p7775q5999o0670q2793j21681m8893n7637j16754
2712B955550n4130m6404m0167m7531p3748k5748j9808k6985n4798l2022l2629
2701B501580n1479l956j224j9294p849m9182l5337l6210J1787k6918k040n580
$$ plain form
2689 2274298 2241924 2210335 2161419 2118188 2124784 2110501 2109749 2091459 2039686 2016055 2020049 1994480
2677 1994480 1993567 2018310 1978581 1955167 1939538 1924550 1916031 1918611 1877811 1843073 1842586 1854355 1786704
2664 1786704 1802198 1816777 1800269 1796683 1747125 1754513 1773890 1760609 1758817 1731924 1736661 1761665
2652 1761665 1766354 1772344 1767387 1750158 1793558 1813743 1813506 1835243 1836949 1928571 1982709 2005107 2042727
2639 2042727 2161827 2218010 2274033 2425059 2504251 2597345 2677233 2770773 2819644 2892719 2918697
2628 2918697 2926338 2910781 2952186 2952791 2956737 2998456 3010291 2993865 2955260 2887595 2805267 2748645
2616 2748645 2726930 2631738 2560346 2470929 2379899 2366013 2257761 2176966 2182932 2104097 2079074
2605 2079074 2038724 1975751 1949438 1905818 1884518 1844799 1825213 1811748 1798200 1751141 1735344
$$ packed form
2689B274298l2374l1589m8916m3231O596j4283p52j8290n1773k3631L994k5569
2677A994480r13K4743l9729k3414j5629j4988q519K580m0800l4738m87J1769o7651
2664A786704J5494J4579j6508l586m9558P388J9377j3281j792k6893M737K5004
2652A761665M689N990m957j7229M3400K0185k37K1737J706R1622N4138K2398L7620
2639B042727J19100N6183N6023J51026P9192R3094P9888R3540M8871P3075K5978
2628B918697P641j5557M1405O05L946M1719J1835j6426l8605o7665q2328n6622
2616B748645k1715r5192p1392q9417r1030j3886j08252q0795N966p8835k5023
2605B079074m0350o2973k6313m3620k1300l9719j9586j3465j3548m7059j5797
$$ plain form
2594 1735344 1726239 1697613 1634946 1671278 1683288 1648663 1664251 1707345 1713434 1714249 1794927 1846975
2582 1846975 1863226 1950514 2000183 2060462 2090841 2113725 2129071 2059087 2018755 1944612 1858785
2571 1858785 1793407 1771400 1712348 1679384 1684302 1678644 1653541 1649038 1689685 1720468 1721325 1731714
2559 1731714 1776217 1859009 1933221 2048991 2224208 2385938 2688215 3118249 3508092 3575854
2549 3575854 3282905 2878000 2609244 2401550 2248213 2176165 2196200 2293250 2293651 2173556 2112796
2538 2112796 2020946 2020186 2062532 2127199 2241295 2355358 2630977 3048682 3371626 3293970 2971151
2527 2971151 2596813 2295743 2094970 2009883 1950909 1907616 1910409 1878625 1743990 1630108 1563353
2516 1563353 1508535 1461458 1457805 1489608 1469878 1410259 1387822 1359789 1389166 1365540 1342023 1388518
$$ packed form
2594A735344r105k8626o2667L6332J2010l4625J5588M3094O089Q15Q0678N2048
2582A846975J6251Q7288M9669O0279L0379K2884J5346o9984m0332p4143q5827
2571A858785o5378k2007n9052l2964M918n658k5103m503M0647L0783Q57J0389
2559A731714M4503Q2792P4212J15770J75217J61730L02277M30034L89843O7762
2549C575854k92949m04905k68756k07694j53337p2048K0035R7050M01j20095o0760
2538B112796r1850p60M2346O4667J14096J14063K75619M17705L22944p7656l22819
2527B971151l74338l01070k00773q5087n8974m3293K793l1784j34635j13882o6755
2516A563353n4818m7077l653L1803j9730n9619k2437k8033K9377k3626k3517M6495
$$ plain form
2504 1388518 1412891 1453883 1488898 1509244 1564516 1630600 1744150 1855382 1954401 2107823 2289508
2493 2289508 2559757 2887496 3357769 3997809 4769155 5139839 4773054 4100125 3547168 3077532
2483 3077532 2683163 2467928 2283298 2146596 2097283 2039363 2027999 2036240 2104142 2221483 2349914
2472 2349914 2506534 2763064 3158525 3772645 4489520 4802620 4440836 3777917 3172403 2643555
2462 2643555 2208669 1915060 1705327 1522692 1374981 1267908 1127140 1010816 957845 920807
2452 920807 886939 832151 785654 739560 701112 671021 645451 638790 618145 574089 585777 574080
2440 574080 579650 532455 513367 496140 473866 467253 448963 449588 444832 440743 452923 431880 416210
2427 416210 390880 378852 370901 406097 419846 397513 353884 346373 367826 357156 345527 339753
$$ packed form
2504A388518K4373M0992L5015K0346N5272O6084J13550J11232R9019J53422J81685
2493B289508K70249L27739M70273O40040P71346L70684l66785o72929n52957m69636
2483C077532l94369k15235j84630j36702m9313n7920j1364Q241O7902J17341J28431
2472B349914J56620K56530L95461O14120P16875L13100l61784o62919o05514n28848
2462B643555m34886k93609k09733j82635j47711j07073j40768j16324n2971l7038
2452I20807l3868n4788m6497m6094l8448l0091k5570o661k0645m4056J1688j1697
2440E74080N570m7195j9088j7227k2274o613j8290O25m756m089J2180k1043j5670
2427D16210k5330j2028p951L5196J3749k2333m3629p511K1453j0670j1629n774
$$ plain form
2415 339753 410708 398442 405972 374330 372709 403756 369108 410524 384682 367095 449621 491344
2403 491344 477408 468458 531020 536582 553382 585196 591422 554006 602668 592567 572707 584213
2391 584213 565584 547484 566129 578595 537583 539054 544905 541891 519949 548213 580606 597692
2379 597692 615097 636419 672003 659518 703748 751037 824914 902436 883516 925237 956324 979197
2367 979197 944542 933916 896126 889771 860671 794972 741066 693650 663515 596029 587013 565229
2355 565229 544393 515653 517245 526629 548283 543477 566066 594426 615841 609472 635026 645486
2343 645486 630354 666278 656402 649171 670909 627092 584938 563664 529500 497658 448320 409128
2331 409128 384950 409761 378096 361991 366833 342745 399666 376358 320431 329162 342078 336079
$$ packed form
2415C39753P0955j2266P530l1642j621L1047l4648M1416k5842j7587Q2526M1723
2403D91344j3936q950O2562N562J6800L1814O226l7416M8662j0101j9860J1506
2391E84213j8629j8100J8645J2466m1012J471N851l014k1942K8264L2393J7086
2379E97692J7405K1322L5584j2485M4230M7289P3877P7522j8920M1721L1087K2873
2367I79197l4655j0626l7790o355k9100o5699n3906m7416l0135o7486r016k1784
2355E65229k0836k8740J592R384K1654m806K2589K8360K1415o369K5554J0460
2343F45486j5132L5924r876p231K1738m3817m2154k1274l4164l1842m9338l9192
2331D09128k4178K4811l1665j6105M842k4088N6921k3308n5927Q731J2916n999
$$ plain form
2319 336079 306009 329387 290168 279141 256016 242982 244542 270830 297999 243263 260353 272462
2307 272462 273688 249065 249828 292394 276157 255580 272543 268851 275444 289447 265388 278805 247019
2294 247019 233026 203230 222285 213242 199067 219211 226394 211489 200056 204311 195316 189259 156335
2281 156335 118007 135590 123653 102162 107848 128485 94191 79980 116182 113116 143440 120655
2269 120655 108222 101982 59123 78209 66271 87544 112621 95042 86504 73431 46592 56454
2257 56454 70503 69054 57843 74635 120848 85384 69381 62270 47310 35170 34901 63763 44738
2244 44738 48066 54034 62425 74849 55893 57447 46762 56562 24937 24853 39961 5765 16956
2231 16956 48184 38992 18973 17685 13113 32764 1424 -9545 49006 22697 25250 38760 36739
$$ packed form
2319C36079l0070K3378l9219j1027k3125j3034J560K6288K7169n4736J7090J2109
2307B72462J226k4623P63M2566j6237k0577J6963l692O593J4003k4059J3417l1786
2294B47019j3993k9796J9055r043j4175K0144P183j4905j1433M255q995o057l2924
2281A56335l8328J7583j1937k1491N686K0637l4294j4211L6202l066L0324k2785
2269A20655j2433o240m2859J9086j1938K1273K5077j7579q538j3073k6839R862
2257E6454J4049j449j1211J6792M6213l5464j6003p111j4960j2140k69K8862j9025
2244D4738L328N968Q391J2424j8956J554j0685R800l1625q4J5108l4196J1191
2231A6956L1228r192k0019j288m572J9651l1340j0969N8551k6309K553J3510k021
$$ plain form
2218 36739 27370 44232 937 1081 -242 6387 12862 36149 37970 -3252 33470 24346 18192 15215
2204 15215 20351 53882 22870 22257 42184 23763 54547 67867 39325 17359 7241 19000
2192 19000 -7189 -4595 18478 44631 8395 19275 6873 38561 28685 -15091 -22601 -16642 -26403
2179 -26403 -46716 -17488 22648 23652 39095 21834 -11094 4503 4395 12030 15941 51941 -2048
2166 -2048 -18326 -9611 258 23600 36215 -21912 -17348 -8966 -10979 21235 23547 7891 49773
2153 49773 37362 31789 40892 55230 33359 38204 39206 17618 4882 23008 28383 48975 58592
2140 58592 36016 102939 101049 98734 61343 51740 91718 124419 98016 51390 74703 119049
2128 119049 140654 163553 136718 120569 134383 121511 131893 112503 88354 132304 125037 155099
$$ packed form
2218C6739r369J6862m3295J44j323O629O475K3287J821m1222L6722r124o154k977
2204A5215N136L3531l1012o13J9927j8421L0784J3320k8542k1966j0118J1759
2192A9000k6189K594K3073K6153l6236J0880j2402L1688r876m3776p510N959r761
2179b6403k0313K9228M0136J004J5443j7261l2928J5597j08P635L911L6000n3989
2166b048j6278Q715R869K3342J2615n8127M564Q382k013L2214K312j5656M1882
2153D9773j2411n573R103J4338k1871M845J002k1588j2736J8126N375K0592R617
2140E8592k2576O6923j890k315l7391r603L9978L2701k6403m6626K3313M4346
2128A19049K1605K2899k6835j6149J3814j2872J0382j9390k4149M3950p267L0062
$$ plain form
2116 155099 159196 160059 197004 178265 182280 199856 234109 247435 226009 238417 231690 258747 245118
2103 245118 237242 218337 226440 234607 222319 283440 243401 255830 248946 244372 211521 219934 245569
2090 245569 253916 273525 327545 336304 332755 326354 353957 338846 307386 306174 289096 274204 280061
2077 280061 255417 259025 266827 243868 225145 243823 236456 228944 220879 164390 193083 218103 212589
2064 212589 219585 228123 220922 265996 242414 236714 272949 233436 229028 228369 200036 182832 164602
2051 164602 134036 110929 109840 119301 144401 86176 116421 97182 94636 107424 68445 85406
2039 85406 110549 78101 93265 67046 99330 79371 52140 52497 23829 76948 77670 34230 30701
2026 30701 36091 40030 27249 9278 26316 -7682 1458 14164 19215 4324 18466 29540 15783
$$ packed form
2116A55099M097Q63L6945j8739M015J7576L4253J3326k1426J2408o727K7057j3629
2103B45118p876j8905Q103Q167j2288O1121m0039J2429o884m574l2851Q413K5635
2090B45569Q347J9609N4020Q759l549o401K7603j5111l1460j212j7078j4892N857
2077B80061k4644L608P802k2959j8723J8678p367p512q065n6489K8693K5020n514
2064B12589O996Q538p201M5074k3582n700L6235l9513m408o59k8333j7204j8230
2051A64602l0566k3107j089R461K5100n8225L0245j9239k546J2788l8979J6961
2039H5406K5143l2448J5164k6219L2284j9959k7231L57k8668N3119P22m3440l529
2026C0701N390L939j2781j7971J7038l3998R140J2706N051j4891J4142J1074j3757
$$ plain form
2013 15783 16349 16667 -9328 -29882 -8138 11984 -8821 -25528 -22807 13297 -11430 -7356 8385
2000 8385 -6798 44246 36314 -16724 -42218 -47021 -6627 25500 -21896 -13469 -6401 -19222 -11543
1987 -11543 -51097 -35691 -71078 -68787 -65453 -69956 -7028 7161 -15910 9122 7736 -44868 -753
1974 -753 -6885 -37760 15043 1263 -16801 -8658 -7842 -33911 -51040 -66382 -38442 -6571 -21070
1961 -21070 -29991 -36087 -63851 -71943 -11507 -22610 -22924 -28491 -23036 -35226 -33357 -33079 -34594 -51677
1947 -51677 -45525 -28954 -46415 -63487 -40824 -18172 -90 -10987 -33933 -34458 -44051 -5470 -15546
1934 -15546 -33792 -14230 -26593 -3244 3146 -5577 -13624 -14940 34979 64925 26417 14558 19767
1921 19767 -2875 6131 39945 1822 15318 1800 -42111 -31620 9293 8092 -33201 -45991
$$ packed form
2013A5783N66L18k5995k0554K1744K0122k0805j6707K721L6104k4727M074J5741
2000H385j5183N1044p932n3038k5494m803M0394L2127m7396Q427P068j2821P679
1987a1543l9554J5406l5387K291L334m503O2928J4189k3071K5032j386n2604M4115
1974g53o132l0875N2803j3780j8064Q143Q16k6069j7129j5342K7940L1871j4499
1961b1070q921o096k7764q092O0436j1103l14n567N455j2190J869K78j515j7083
1947e1677O152J6571j7461j7072K2663K2652J8082j0897k2946n25r593L8581j0076
1934a5546j8246J9562j2363K3349O390q723q047j316M9919K9946l8508j1859N209
1921A9767k2642R006L3814l8123J3496j3518m3911J0491M0913j201m1293j2790
$$ plain form
1909 -45991 -32068 -26357 -20409 -15074 -33409 -36768 -78766 -40996 -64050 -42179 -18948 -18950 -49101
1896 -49101 -21386 -4943 -24545 -25781 -44649 -42755 -48053 -12784 -19093 -40304 -15484 -5340 -33162
1883 -33162 -28777 -17643 -17115 -34252 -52615 -20685 -17356 -16990 26765 10914 2976 35736 8224
1870 8224 -23005 -23666 -31661 -2732 -10393 -23211 14416 4233 -25533 -60919 -36114 -23897 7442
1857 7442 19003 -18474 -10153 -1301 -37970 8979 -29138 -26946 51884 16978 -31857 -35121 -17210
1844 -17210 -177 20233 6877 -4359 -22154 -6068 18755 33869 37221 42774 -3127 5755
1832 5755 -16874 4331 16443 -5342 28293 -20146 28571 6197 21008 11257 -744 18231
1820 18231 7420 3954 -19341 9911 -10759 -11712 -2917 -320 19834 8996 20625 -12586 -17991
$$ packed form
1909d5991J3923N711N948N335j8335l359m1998L7770k3054K1871K3231kl0151
1896d9101K7715J6443j9602j236j8868J894n298L5269o309k1211K4820J0144k7822
1883c3162M385J1134N28j7137j8363L1930L329L66M3755j5851p938L2760k7512
1870H224l1229o61p995K8929p661j2818L7627j0183k9766l5386K4805J2217L1339
1857G442J1561l7477Q321Q852l6669M6949l8117K192P8830l4906m8835l264J7911
1844a7210J7033K0410j3356j1236j7795J6086K4823J5114L352N553m5901Q882
1832E755k2629K1205J2112k1785L3635m8439M8717k2374J4811r751j2001J8975
1820A8231j0811l466k3295K9252k0670r53Q795K597K0154j0838J1629l3211n405
$$ plain form
1807 -17991 17701 12369 40911 64805 53561 46992 -6935 -6300 33894 41198 36149 23426 7765
1794 7765 31891 69453 46797 47037 85460 73234 85344 118707 77705 81869 84156 80315 66847
1781 66847 124050 116494 126497 123841 101381 117426 98912 117743 143461 156024 207018 193273
1769 193273 171540 145648 189217 166284 181261 194562 225340 189887 215743 239251 285661 332768
1757 332768 374947 365640 411988 399742 494391 575405 625529 708396 854276 958224 920550
1746 920550 986814 1014283 1071152 1104989 1167921 1265533 1345742 1449917 1619047 1795242 2030518
1735 2030518 2206711 2295496 2433862 2706887 2989108 3420184 4054312 4821757 5912296 7608576
1725 7608576 9698606 10744394 9597271 7758419 6191156 5002676 4033139 3364907 2847577
$$ packed form
1807a7991L5692n332K8542K3894j1244o569n3927O35M0194P304n049j2723j5661
1794G765K4126L7562k2656K40L8423j2226J2110L3363m1002M164K287l841j3468
1781F6847N7203p556J0003k656k2460J6045j8514J8831K5718J2563N0994j3745
1769A93273k1733k5892M3569k2933J4977J3301L0778l5453K5856K3508M6410M7107
1757C32768M2179r307M6348j2246R4649Q1014N0124Q2867J45880J03948l7674
1746I20550O6264K7469N6869L3837O2932R7612Q0209J04175J69130J76195K35276
1735B030518J76193Q8785J38366K73025K82221M31076O34128P67445J090539J696280
1725G608576K090030J045788j147123j838852j567263j188480r69537o68232n17330
$$ plain form
1716 2847577 2463221 2190818 1974714 1805616 1630307 1426105 1256029 1142561 1051233 960108
1706 960108 872925 822954 784647 678303 607122 577170 540478 494196 471864 458928 437795
1695 437795 405280 405191 405931 353051 344283 359142 296782 257531 255654 257392 277375 236236 234657
1682 234657 188917 163207 179037 188408 151600 133319 117038 111250 118602 147711 123454 98943
1670 98943 133088 126367 140186 118085 110410 121467 93649 46620 51669 72279 29947 10630
1658 10630 53138 32568 33099 60629 48177 23239 20201 44481 23042 43358 26050 47444
1646 47444 25988 54840 52865 29834 21452 25411 51063 37369 27192 58952 60022 43301 17933
1633 17933 -7988 37035 52804 32962 11514 22973 18157 36915 25054 15872 25361 42182
$$ packed form
1716B847577l84356k72403k16104j69098j75309k04202j70076j13468r1328r1125
1706I60108q7183m9971l8307j06344p1181k9952l6692m6282k2332j2936k1133
1695D37795l2515q9P40n2880q768J4859o2360l9251j877J738J9983m1139j579
1682B34657m5740k5710J5830R371l6808j8281j6281n788P352K9109k4257k4511
1670I8943L4145o721J3819k2101p675J1057k7818m7029N049K0610m2332j9317
1658A0630M2508k0570N31K7530j2452k4938l038K4280k1439K0316j7308K1394
1646D7444k1456K8852j975k3031q382L959K5652j3694j0177L1760J070j6721k5368
1633A7933k5921M5023J5769j9842k1448J1459m816J8758j1861r182R489J6821
$$ plain form
1621 42182 21241 -37876 13956 22619 -3579 -26039 12694 33280 3182 15435 20765 -49142
1609 -49142 -64179 -53353 -22130 -7333 -7583 -33472 -2355 20609 -15178 -34148 -17407 -38509
1597 -38509 -69720 -11233 -4717 -40122 -11699 -40163 -27951 -46225 -63431 -29887 -25159 -21554
1585 -21554 -33952 -27985 4492 -42005 -35715 -20521 -35869 -20251 -6877 -20802 -42848 -36772
1573 -36772 -21447 -13156 -24827 -28929 -57764 -37449 -36227 -39618 -40856 -33332 -29951 -34641 -35636 -907
1559 -907 -42893 -43650 -48815 -13626 -7033 -15174 -10985 -27274 -28000 -11471 -22111 -30164 415 690
1545 690 -21953 -10587 -36796 -2003 28917 -758 5350 2549 -12980 19698 30141 27352 13627
1532 13627 -25277 -40192 -13471 17335 7054 -14929 12074 49409 27822 45136 47836 17243
$$ packed form
1621D2182k0941n9117N1832Q663k6198k2460L8733K0586l0098J2253N330o9907
1609d9142j5037J0826L1223J4797k50k5889L1117K2964l5787j8970J6741k1102
1597c8509l1211N8487O516l5405K8423k8464J2212j8274j7206L3544M728L605
1585b1554j2398N967L2477m6497O290J5194j5348J5618J3374j3925k2046O076
1573c6772J5325Q291j1671m102k8835K0315J222l391j238P524L381m690r95L4729
1559i07m1986p57n165L5189O593q141M189j6289p26J6529j0640q053L0579K75
1545F90k2643J1366k6209L4793L0920k9675O108k801j5529L2678J0443k789j3725
1532A3627l8904j4915K6721L0806j0281k1983K7003L7335k1587J7314K700l0593
$$ plain form
1520 17243 15170 23368 6962 7950 -10231 15229 11255 -1053 -5562 -9827 -9737 -2296 -10002 4063
1506 4063 -41323 -36691 -21711 -27890 -36746 -46021 -13789 -47227 -59616 -74879 -50722 -53806 -64786
1493 -64786 -4910 7081 -40143 -59883 -67323 -54363 -54758 -49505 -41293 -59011 -70653 -49544 -71108
1480 -71108 -25011 -31275 -43526 -27355 -36723 -54077 -21878 -45625 -35606 -50818 -56413 -63269 -59365
1467 -59365 -39390 -56207 -158 -24459 -36349 -53462 -24845 -30000 -65055 -87292 -60694 -19465
1455 -19465 12622 -14575 -42204 -28250 -41276 -36249 -50832 -82994 -28159 -33725 -46937 -5593
1443 -5593 4145 -155 -21381 -69877 -42635 -2249 -37370 -45194 -27651 -31920 -15949 -30287 -44883
1430 -44883 -35822 -33362 -21982 -30492 -29875 -61220 -26176 -17141 16584 24425 8680 269 -6205 -31413
$$ packed form
1520A7243k073Q198j6406R88j8181K5460l974j2308m509m265R0P441p706J4065
1506D063m5386M632J4980o179q856r275L2232l3438j2389j5263K4157l084j0980
1493f4786N9876J1991m7224j9740p440J2960l95N253Q212j7718j1642K1109k1564
1480g1108M6097o264j2251J6171r368j7354L2199k3747J0019j5212n595o856L904
1467e9365J9975j6817N6049k4301j1890j7113K8617n155l5055k2237K6598M1229
1455a9465L2087k7197k7629J3954j3026N027j4583l2162N4835n566j3212M1344
1443e593R738m300k1226m8496K7242M0386l5121p824J7543m269J5971j4338j4596
1430d4883R061K460J1380q510O17l1345L5044R035L3725P841j5745q411o474k5208
$$ plain form
1416 -31413 -44877 -37203 -34650 -38220 -52417 -30358 3815 26957 -24412 -45683 -70181 1501
1404 1501 -23510 -2163 -1594 -51300 -15618 -18044 -44404 -76991 -57006 -56801 -31601 -38447 -55334
1391 -55334 -33703 -39704 -31994 -36209 -14517 -33729 -47524 -40801 -54587 -59529 -72950 -43564 -40140
1378 -40140 -22679 -27072 -47996 -53939 -14743 -11050 -29018 -22546 -32431 -35929 -80184 -54200 -48767
1365 -48767 -24766 -17022 -13085 -21514 -18300 -21485 -72625 -49038 -43222 -17407 -44119 -14333 -29209
1352 -29209 -38556 -52188 -18638 -6804 -47786 -9539 -19923 -23017 -804 -2784 -31272 -28967 -4291
1339 -4291 8895 -3695 -27410 -54118 -30099 -28065 6046 -24086 -24002 4842 -18848 -1056 -32764
1326 -32764 -41100 -24863 -45389 -31970 -18079 -44358 -46343 -64149 -35029 -44024 -13864 -14021 -46772
$$ packed form
1416c1413j3464P674K553l570j4197K2059L4173K3142n1369k1271k4498P1682
1404A501k5011K1347N69m9706L5682k426k6360l2587J9985K05K5200o846j6887
1391e5334K1631o001P710m215K1692j9212j3795O723j3786m942j3421K9386L424
1378d0140J7461m393k0924n943L9196L693j7968O472r885l498m4255K5984N433
1365d8767K4001P744L937q429L214l185n1140K3587N816K5815k6712K9786j4876
1352b9209r347j3632L3550J1834m0982L8247j0384l094K2213j980k8488K305K4676
1339d291J3186j2590k3715k6708K4019K034L4111l0132Q4K8844k3690J7792l1708
1326c2764q336J6237k0526J3419J3891k6279j985j7806K9120q995L0160j57l2751
$$ plain form
1313 -46772 -16442 -10438 3631 -67572 -36418 -34643 -50464 -46240 -20706 -17872 -36237 -44467 -57477
1300 -57477 -20199 -20291 -15912 -26212 -44973 -64855 -46202 -17398 -35508 -38945 -66779 -65099 -62900
1287 -62900 -10631 5597 -27347 -22335 -8235 -33743 -35396 -28547 -10105 33066 12078 -32366
1275 -32366 -42646 -12006 -29605 9301 -21603 20737 21691 21928 11255 1828 -27888 -4157 -28006
1262 -28006 -23566 -21427 -54993 -30519 -44862 -20046 -24585 -2972 9176 -5594 -41303 -60961
1250 -60961 -40579 -26568 -1478 -34183 -38100 -71708 -75522 -44845 -34610 746 -33871 -53630
1238 -53630 -51714 -38925 -34231 -10485 4209 -11511 -29322 -41113 -63105 -30642 -32926 -41592 -36721
1225 -36721 -18021 -8611 -36520 -42669 -25196 -43537 -57156 -47138 -44316 -24139 -71167 -58395
$$ packed form
1313d6772L0330O004J4069p1203L1154J775j5821M224K5534K834j8365q230j3010
1300e7477L7278r2M379j0300j8761j9882J8653K8804j8110l437k7834J680K199
1287f2900N2269J6228l2944N012J4100k5508j653O849J8442M3171k0988m4444
1275c2366j0280L0640j7599L8906l0904M2340R54K37j0673r427k9716K3731k3849
1262b8006M440K139l3566K4474j4343K4816m539K1613J2148j4770l5709j9658
1250f0961K0382J4011K5090l2705l917l3608l814L0677J0235L5356l4617j9759
1238e3630J916J2789M694K3746J4694j5720j7811j1791k1992L2463k284q666M871
1225c6721J8700R410k7909o149J7473j8341j3619J0018K822K0177m7028J2772
$$ plain form
1213 -58395 -33946 -24530 -25725 -44633 -39963 -23831 -15879 -57758 -23637 -73076 -58267 -34521 -11923
1200 -11923 -42083 -40117 -44444 -34179 -16889 -26697 -4097 7919 -38007 -62361 -19956 -53395
1188 -53395 -97524 -84972 -46147 -24518 -16311 -47508 -21414 -23421 -34510 -23639 -44715 -36600
1176 -36600 -56653 -58600 -55471 -18291 -2922 -7576 12511 -20936 -22868 14127 27867 -6669 -16462
1163 -16462 -6192 -6491 -3555 2094 -13981 -23409 -13578 -7559 7118 5724 -12608 32770 -614
1150 -614 586 474 -14892 -48786 -72056 -51263 -29565 -6363 -38996 -41874 -30034 -4945 16881
1137 16881 -2582 22549 5483 -29692 -36782 -62225 -31971 -26988 -44082 -25716 -21795 -12140 -20461
1124 -20461 -16130 -28124 -58002 -33039 -7252 5669 -33029 -40358 -7371 5040 7241 3628 -18332
$$ packed form
1213e8395K4449R416j195j8908M670J6132P952m1879L4121m9439J4809K3746K2598
1200a1923l0160J966m327J0265J7290r808K2600J2016m5926k4354M2405l3439
1188e3395m4129J2552L8825K1629Q207l1197K6094k007j1089J0871k1076Q115
1176c6600k0053j947L129L7180J5369m654K0087l3447j932L6995J3740l4536r793
1163a6462J0270k99K936N649j6075r428R831O019J4677j394j8332M5378l3384
1150f14J200j12j5366l3894k3270K0793K1698K3202l2633k878J1840K5089K1826
1137A6881j9463K5131j7066l5175p090k5443L0254M983j7094J8366L921R655q321
1124b0461M331j1994k9878K4963K5787J2921l8698p329L2987J2411K201l613k1960
$$ plain form
1111 -18332 -23233 -15361 -58641 -40566 -37188 -43774 -32579 -21641 -49973 3585 9624 976 1349
1098 1349 27423 4647 -22059 -15912 -25771 -25539 -25459 -18044 -2828 -13229 -8547 21523 -18691 -19115
1084 -19115 5176 12714 -15163 -16575 -61241 -25386 -23461 -19087 -10560 -32645 -38560 -34811 -40496
1071 -40496 -48001 -5148 -23054 -26356 -19307 -63015 -20620 17830 -426 -29992 -40504 -18115
1059 -18115 -50566 -80409 -38335 -12896 -22593 -59292 -23653 -18769 -38006 -10272 -15676 -33744
1047 -33744 -21334 33200 9850 -6899 -54005 -39079 -26694 -30552 9588 -737 -1416 -32717
1035 -32717 -29831 -29325 -915 -14202 -2645 -9398 -37230 -27751 -5608 -7283 15820 -6134 -30196
1022 -30196 9829 -4186 -21614 -8533 -20397 2742 6712 -7694 -41383 -18617 -15564 -19245
$$ packed form
1111a8332m901P872m3280J8075L378o586J1195J0938k8332N3558O039q648L73
1098A349K6074k2776k6706O147r859K32Q0P415J5216j0401M682L0070m0214m24
1084a9115K4291P538k7877j412m4666L5855J925M374Q527k2085n915L749n685
1071d0496p505M2853j7906l302P049m3708M2395L8450j8256k9566j0512K2389
1059a8115l2451k9843M2074K5439r697l6699L5639M884j9237K7734n404j8068
1047c3744J2410N4534k3350j6749m7106J4926J2385l858M0140j0325o79l1301
1035c2717K886N06K8410j3287J1557o753k7832R479K2143j675K3103k1954k4062
1022c0196M0025j4015j7428J3081j1864K3139L970j4406l3689K2766L053l681
$$ plain form
1010 -19245 -26757 -10142 -40255 -66730 -89550 -48102 -37377 -41437 -19517 -31346 -6251 434
998 434 19948 -9408 -17250 -622 8116 -903 -54 -44399 -56390 -5942 2439 -28917 -36426 -18733
984 -18733 26447 -28620 -17380 5399 13210 -36140 -45220 -18580 -10565 -10321 -31032 -18958 -4981
971 -4981 -12504 -21111 -51798 128 -16257 -4212 -34235 -54520 -40539 -54021 -42309 -51104 -32023
958 -32023 -11953 -30769 6814 39803 44341 -26936 -42220 -36243 -40096 -11282 -27737 -27808 -8146
945 -8146 -16800 -37526 -28448 -938 31499 19921 11607 -13583 2262 -29 4701 -10660 -17310
932 -17310 -32151 -27097 -28111 -33824 -14657 -39713 -57751 -26385 -23592 -30001 -28281 -18552 -37032
919 -37032 -27139 -43707 -24514 6385 -15650 -31685 -11534 10126 19571 -2482 1959 54203 35483
$$ packed form
1010a9245p512J6615l0113k6475k2820M1448J0725m060K1920j1829K5095O685
998D34J9514k9356p842J6628Q738r019Q49m4345j1991N0448Q381l1356p509J7693
984a8733M5180n5067J1240K2779P811m9350r080K6640Q015K44k0711J2074J3977
971d981p523q607l0687N1926j6385J2045l0023k0285J3981j3482J1712q795J9081
958c2023K0070j8816L7583L2989M538p1277j5284N977l853K8814j6455p1J9662
945h146q654k0726R078K7510L2437j1578q314k5190J5845k291M730j5361o650
932a7310j4841N054j014n713J9167k5056j8038L1366K793o409J720R729j8480
919c7032R893j6568J9193L0899k2035j6035K0151K1660R445k2053M441N2244j8720
$$ plain form
906 35483 28874 -1859 7792 6725 -32664 -37777 9292 9011 -34611 -27231 -46355 29069 38525 -13172
892 -13172 -40703 -45727 -39539 -74279 -18891 1370 -30449 -34829 -32280 -18678 1151 -18609 -15691
879 -15691 -19741 -41620 -32647 -50493 -3412 28517 -15244 -15620 -35430 -27380 -22406 -15873 11580
866 11580 -10402 -7961 -6761 -10059 -22824 -29632 -28735 4057 32652 -30741 -21808 13341 -1877
853 -1877 -3005 -1368 -17547 -38391 -49169 -39312 -28237 5412 23340 665 19728 7744 14297
840 14297 -2828 -30 16135 10300 26333 16416 -15574 -33856 -25899 3719 -5875 -11370 945
827 945 -25469 -25169 -16614 -16771 -21518 -34538 13113 18720 46639 37628 57258 25908 -252 -50055
813 -50055 -22404 18639 2973 -2644 -18106 9593 -1323 -16738 8121 -25001 -24171 -15914 -13914
$$ packed form
906C5483o609l0733R651j067l9389n113M7069k81m3622P380j9124P5424R456n1697
892a3172k7531n024O188l4740N5388K0261l1819m380K549J3602J9829j9760K918
879a5691m050k1879Q973j7846M7081L1929m3761l76j9810Q050M974O533K7453
866A1580k1982K441J200l298j2765o808Q97L2792K8595o3393Q933L5149j5218
853a877j128J637j6179k0844j0778R857J1075L3649J7928k2675J9063j1984O553
840A4297j7125K798J6165n835J6033r917l1990j8282P957K9618r594n495J2315
827I45k6414L00Q555j57m747j3020M7651N607K7919r011J9630l1350k6160m9803
813e0055K7651M1043j5666n617j5462K7699j0916j5415K4859l3122Q30Q257K000
$$ plain form
800 -13914 -22445 -34490 10111 -4797 -26292 -10207 -7644 -9723 11047 -32565 4387 15551 -21209
787 -21209 -37457 24465 8307 13376 3127 -29518 -48553 -51446 -65865 -38014 -27305 20210
775 20210 -14278 -41945 -1590 10675 -25397 -66858 -38628 1983 15630 -8320 -32968 -20233
763 -20233 -26576 -16942 -19036 -26323 -19123 -63795 -12052 -4854 14469 45880 23066 4678 22173
750 22173 66298 23728 5893 21290 12286 39900 50583 -740 20081 38681 -1720 -21776
738 -21776 13682 14527 -40192 -6535 19418 26817 12797 -20675 -28210 -50167 -7680 7238 -12179
725 -12179 4600 -56713 -14542 4145 -26883 -22838 4047 -11154 -26045 -3896 -1992 2918 -6582
712 -6582 -24276 15429 -7407 -4632 -16805 -18052 -16497 -97 -11231 -3038 4557 -36144 -23885
$$ packed form
800a3914q531j2045M4601j4908k1495J6085K563k079K0770m3612L6952J1164l6760
787b1209j6248O1922j6158N069j0249l2645j9035k893j4419K7851J0709M7515
775B0210l4488k7667M0355J2265l6072m1461K8230M0611J3647k3950k4648J2735
763b0233o343R634k094p287P200m4672N1743P198J9323L1411k2814j8388J7495
750B2173M4125m2570j7835J5397r004K7614J0683n1323K0821J8600m0401k0056
738b1776L5458Q45n4719L3657K5953P399j4020l3472p535k1957M2487J4918j9417
725a2179J6779o1313M2171J8687l1028M045K6885j5201j4891K2149J904M910r500
712f582j7694L9705k2836K775j2173j247J555J6400j1134Q193P595m0701J2259
$$ plain form
699 -23885 2050 31121 14103 -5369 14094 4958 -22260 5760 -579 -9582 -23235 -12373 1899
686 1899 18935 1416 1218 -5876 -7710 -10959 218 -1212 14633 24948 -10631 -15724 -54709 -38754
672 -38754 -1509 2126 19 2035 3969 10197 9678 14344 -17615 -29341 -22650 -37640 14898 342
658 342 -3660 -34098 -46772 -40857 -1666 -18864 -17663 -815 4033 28503 -37821 3947 -37870
645 -37870 -20885 -31819 -48657 -14045 -6480 12471 -14774 -31952 -173 7371 12682 19349 16671
632 16671 43475 55214 9983 20911 43188 6699 14269 20341 -3899 -27283 10695 42578
620 42578 47284 -17799 33375 21278 5162 -4036 -15837 9421 29464 16459 -2404 2692 6344
607 6344 26185 -11022 -23571 -4093 15058 22834 6145 10771 30136 21828 6348 10956 -8496
$$ packed form
699b3885K5935K9071j7018j9472J9463r136k7218K8020o339r003j3653J0862J4272
686A899J7036j7519j98p094j834l249J1177j430J5845J0315l5579n093l8985J5955
672c8754L7245L635k107K016J934O228n19M666l1959j1726O691j4990N2538j4556
658C42m002l0438j2674N915L9191j7198J201J6848M848K4470o6324M1768m1817
645c7870J6985j0934j6838L4612P565J8951k7245j7178L1779P544N311O667k678
632A6671K6804J1739m5231J0928K2277l6489P570O072k4240k3384L7978L1883
620D2578M706o5083N1174j2097j6116r198j1801K5258K0043j3005j8863N096L652
607F344J9841l7207j2549J9478J9151P776j6689M626J9365q308j5480M608j9452
$$ plain form
594 -8496 -21815 -1681 11190 18941 18088 18675 -13888 -27644 -11425 9396 -11349 -7741 -1062 7696
580 7696 -6217 -8791 -3674 13442 20755 20951 17355 -21601 -4416 25436 46963 13296 16590 2134
566 2134 2068 23774 16417 21145 4486 40826 32401 63296 24323 5636 20967 -6738 47248
553 47248 33750 782 -11689 -1170 29481 64804 61376 49211 32164 16963 11543 16526 19889
540 19889 -3269 -4816 -2245 5978 -2647 -1728 19493 11975 -4003 46175 34108 48856 43900 24226
526 24226 27057 24109 -8773 22275 21184 21102 46376 32695 34687 42752 24080 3663 -5202 11703
512 11703 -1336 -7444 7238 10483 26254 14419 38312 18720 26856 37519 36889 -11648 2613
499 2613 11670 28283 46231 30760 13659 14977 49695 94535 84787 38315 47897 8210 -796
$$ packed form
594h496j3319K0134J2871P751q53N87l2563j3756J6219K0821k0745L608O679Q758
580G696j3913k574N117J7116P313J96l596l8956J7185K9852K1527l3667L294j4456
566B134o6K1706p357M728j6659L6340q425L0895l8973j8687J5331k7705N3986
553D7248j3498l2968j2471J0519L0651L5323l428j2165j7047j5201n420M983L363
540A9889k3158j547K571Q223q625R19K1221p518j5978N0178j2067J4748m956j9674
526B4226K831k948l2882L1048j091q2K5274j3681J992Q065j8672k0417q865J6905
512A1703j3039o108J4682L245J5771j1835K3893j9592Q136J0663o30m8537J4261
499B613R057J6613J7948j5471j7101J318L4718M4840r748m6472R582l9687r006
$$ plain form
486 -796 12110 13448 27220 34811 38034 -15841 14766 25453 3120 13191 -7647 3485 -20853
473 -20853 -23897 7124 -3703 9323 24170 23040 16211 44021 79189 69705 19504 30500 -2515
460 -2515 5761 29775 9704 -9015 -6966 22581 5646 -9208 3738 47698 17004 14374 26061
447 26061 28447 29998 53171 58607 50621 58048 50659 28113 3934 37031 7052 80544 57930
434 57930 -2206 17882 3877 31093 55792 61112 18378 -4490 759 9479 16324 3601 -30293
421 -30293 -15900 -12439 9705 19057 30348 4894 -15123 -10654 19525 32100 61406 84010 71025
408 71025 58598 40052 30695 42352 56703 59091 38085 -18343 -1184 31612 73500 64778 39639
395 39639 34639 50763 40519 32071 39179 32349 2342 51314 81012 22986 8701 -4832 14009
$$ packed form
486g96J2906J338J3772P591L223n3875L0607J0687k2333J0071k0838J1132k4338
473b0853l044L1021j0827J3026J4847j130o829K7810L5168r484n0201J0996l3015
460b515Q276K4014k0071j8719K049K9547j6935j4854J2946M3960l0694k630J1687
447B6061K386J551K3173N436p986P427p389k2546k4179L3097k9979P3492k2614
434E7930o0136K0088j4005K7216K4699N320m2734k2868N249Q720O845j2723l3894
421c0293J4393L461K2144R352J1291k5454k0017M469L0179J2575K9306K2604j2985
408G1025j2427j8546r357J1657J4351K388k1006n6428J7159L2796M1888q722k5139
395C9639n000J6124j0244q448P108o830l0007M8972K9698n8026j4285j3533J8841
$$ plain form
382 14009 31648 22134 43136 32996 14219 17595 5483 12429 12562 -322 14071 28088 -2551
369 -2551 -6048 21085 -1447 -8742 -637 -33762 2692 2470 29393 52088 43696 38255 8336 27174
355 27174 36621 22759 16359 38844 28893 5959 15171 14017 31261 51925 28051 32337 33252 35352
341 35352 12016 26568 23915 26955 54414 41175 35137 22496 33363 28084 21041 52636 65678
328 65678 40016 30479 8079 23122 -370 12593 7783 36615 14194 -4034 -10035 18432 14292
315 14292 -7850 32113 34072 21858 -23257 4923 47757 44580 27133 42756 29065 21366 42865
302 42865 50263 68910 40779 42559 49371 17054 45772 72775 60053 29826 1521 -1206 21773
289 21773 21587 49744 48954 71105 70340 39097 65260 54726 58842 55887 55075 38468 35053 53968
$$ packed form
382A4009J7639r514K1002j0140j8777L376j2112O946J33j2884J4393J4017l0639
369b551l497K7133k2532p295Q105l3125L6454k22K6923K2695q392n441k9919J8838
355B7174R447j3862o400K2485r951k2934R212j154J7244K0664k3874M286R15K100
341C5352k3336J4552k653L040K7459j3239o038j2641J0867n279p043L1595J3042
328F5678k5662r537k2400J5043k3492J2963m810K8832k2421j8228o001K8467m140
315A4292k2142L9963J959j2214m5115K8180M2834l177j7447J5623j3691p699K1499
302D2865P398J8647k8131J780O812l2317K8718K7003j2722l0227k8305k727K2979
289B1773j86K8157p90K2151p65l1243K6163j0534M116k955q12j6607l415J8915
$$ plain form
275 53968 15319 58593 76030 64304 51377 24351 27127 23310 42079 37412 36031 68185 46293
262 46293 34425 61630 87299 52901 44330 52603 38506 14416 50059 47651 42087 48760 25696
249 25696 11928 42304 35631 35397 42235 26514 67460 93113 45175 32044 22457 5292 17263
236 17263 26375 23404 56723 39679 27481 68720 641 11372 18364 43198 52586 7163 9234
223 9234 2745 37272 76386 34154 30631 42940 23103 3756 -8412 35096 29278 -4788 42412
210 42412 46619 46074 61867 32500 30050 13466 12060 19671 13191 29945 35218 70396 15424 3550
196 3550 14374 22897 13491 19885 25471 -5104 34431 37342 16347 15365 36707 60239 22720 8132
182 8132 11729 -8877 1060 27351 49241 30593 50255 27962 -2595 12473 8178 11229 19606
$$ packed form
275E3968l8649M3274J7437j1726j2927k7026K776l817J8769m667j381L2154k1892
262D6293j1868K7205K5669l4398q571Q273j4097k4090L5643k408n564O673k3064
249B5696j3768L0376o673k34O838j5721M0946K5653m7938j3131r587j7165J1971
236A7263R112k971L3319j7044j2198M1239o8079J0731O992K4834R388m5423K071
223I234o489L4527L9114m2232l523J2309j9837j9347j2168M3508n818l4066M7200
210D2412M207n45J5793k9367k450j6584j406P611o480J6754N273L5178n4972j1874
196C550J0824Q523r406O394N586l0575L9535K911k0995r82K1342K3532l7519j4588
182H132L597k0606R937K6291K1890j8648J9662k2293l0557J5068m295L051Q377
$$ plain form
169 19606 33009 34147 3372 13484 26641 21914 29859 -4455 -1905 29272 18488 15195 38173
156 38173 17669 31626 45359 20007 922 18070 23367 10040 32236 35482 11826 1994 2254
143 2254 -8923 -20717 12655 7606 20883 14408 24459 22675 32684 11053 9645 40794 16922
130 16922 2467 27329 62316 13734 7003 19604 20163 -9989 11374 -3482 -15220 13578 39780
117 39780 45165 -922 11571 10750 -2139 14868 1798 29255 -22941 2648 39956 10669 24687
104 24687 20268 56016 56311 11024 -27018 16016 39423 17511 -6891 -7540 4474 3944 -22420
91 -22420 -20515 -8254 -13883 -14220 10144 2198 222 4188 -34429 -23754 -16292 -42375 -35326 -9158
77 -9158 -16463 -19422 -34123 224 4973 -19225 -9206 -8798 -17797 -28613 -37304 -48982 -50239 -25987
$$ packed form
169A9606J3403J138l0775J0112J3157m727P945l4314K550L1177j0784l293K2978
156C8173k0504J3957J3733k5352j9085J7148N297j3327K2196L246k3656r832K60
143B254j1177j1794L3372n049J3277o475J0051j784J0009k1631j408L1149k3872
130A6922j4455K4862L4987m8582o731J2601N59l0152K1363j4856j1738K8798K6202
117C9780N385m6087J2493q21j2889J7007j3070K7457n2196K5589L7308k9287J4018
104B4687m419L5748K95m5287l8042M3034K3407k1912k4402o49J2014n30k6364
91b2420J905J2261n629l37K4364p946j976L966l8617J0675P462k6083P049K6168
77i158p305k959j4701L4347M749k4198J0019M08q999j0816q691j1678j257K4252
$$ plain form
63 -25987 -26327 -27415 -34123 -29838 -26376 18297 -3009 -18961 -31679 -26275 -44759 -35713 -23876 -41137
49 -41137 -40339 -16967 -18138 -29967 -23874 -13230 1469 -16505 -38801 -47116 -35292 -36037 -35318 -26097
35 -26097 -42477 -61877 -33258 -15247 -16213 -22964 -4384 -2733 -13335 -60554 -77371 -46830 -47683
22 -47683 -40277 -43564 -71120 -67230 -49648 -55056 -52887 -58287 -79546 -59414 -48660 -43223 -39210 -43796
8 -43796 -47013 -68718 -50261 -43835 -76112 -57453 -49066 -58586
0 -58586
$$ packed form
63b5987l40j088o708M285L462M4673k1306j5952j2718N404j8484R046J1837j7261
49d1137P98K3372j171j1829O093J0644J4699j7974k2296q315J1824p45P19R221
35b6097j6380j9400K8619J8011r66o751J8580J651j0602m7219j6817L0541q53
22d7683P406l287k7556L890J7582n408K169n400k1259K0132J0754N437M013m586
8d3796l217k1705J8457O426l2277J8659Q387r520
0e8586
$$ Imaginary data points
##PAGE= N=2
##DATA TABLE= (X++(I..I)), XYDATA
$$ plain form
16383 -1135933 -1119639 -1096037 -1098568 -1091653 -1063171 -1064358 -1053623 -1037897 -1028117 -1020604 -1014915 -1006727 -1007563
16370 -1007563 -1000957 -999479 -974015 -972145 -970695 -934954 -922575 -915306 -880456 -867135 -857385 -863264 -832719
16357 -832719 -812322 -835202 -805266 -801053 -793978 -769565 -744838 -747734 -729358 -748180 -745667 -723114
16345 -723114 -696541 -665783 -664236 -662274 -628659 -635057 -624629 -591456 -602302 -600044 -576631 -582578
16333 -582578 -563861 -552081 -547059 -543248 -505883 -486706 -491400 -486716 -457318 -428288 -445513 -443773
16321 -443773 -447233 -431051 -397050 -393120 -396032 -390282 -380079 -361878 -340556 -355753 -327101 -338614
16309 -338614 -328751 -313768 -303989 -252919 -273302 -256662 -223715 -212277 -220666 -213129 -191730 -192986
16297 -192986 -205380 -228584 -185348 -167656 -151045 -134774 -144141 -155774 -154768 -119233 -117229 -90837
$$ packed form
16383a135933J6294K3602k531O915K8482j187J0735J5726R780P513N689Q188q36
16370a007563O606J478K5464J870J450L5741J2379P269L4850J3321R750n879L0545
16357h32719K0397k2880K9936M213P075K4413K4727k896J8376j8822K513K2553
16345g23114K6573L0758J547J962L3615o398J0428L3173j0846K258K3413n947
16333e82578J8717J1780N022L811L7365J9177m694M684K9398K9030j7225J740
16321d43773l460J6182L4001L930k912N750J0203J8201K1322j5197K8652j1513
16309c38614R863J4983R779N1070k0383J6640L2947J1438q389P537K1399j256
16297a92986j2394k3204M3236J7692J6611J6271r367j1633J006L5535K004K6392
$$ plain form
16285 -90837 -99023 -101412 -82166 -61675 -50606 -42736 -31207 -51096 -46427 -18352 -11865 26744 33171
16272 33171 27409 64169 54902 36671 29052 54372 47512 56639 90860 95087 100739 129842 133531
16259 133531 121898 123971 133009 134693 146141 156245 163974 158053 162466 179615 188783 193147 195549
16246 195549 212410 213754 193409 212774 260831 274713 264753 269449 248789 255168 296197 287065
16234 287065 293050 302822 306364 275758 299555 301948 314384 363398 393129 399573 355612 372527
16222 372527 384166 399065 391409 410498 423596 398859 361167 375591 399704 382735 398172 415937
16210 415937 414847 427368 429433 411335 451576 471889 463544 452954 473219 462657 475694 477169
16198 477169 491476 503993 459640 521502 508015 469023 504054 523544 525504 522931 517823 515607
$$ packed form
16285i0837q186k389J9246K0491J1069P870J1529j9889M669K8075O487L8609O427
16272C3171n762L6760r267j8231p619K5320o860R127L4221M227N652K9103L689
16259A33531j1633K073R038J684J1448J0104P729n921M413J7149R168M364K402
16246A95549J6861J344k0345J9365M8057J3882r960M696k0660O379M1029r132
16234B87065N985R772L542l0606K3797K393J2436M9014K9731O444m3961J6915
16222C72527J1639J4899p656J9089J3098k4737l7692J4424K4113j6969J5437J7765
16210D15937j090J2521K065j8098M0241K0313q345j0590K0265j0562J3037J475
16198D77169J4307J2517m4353O1862j3487l8992L5031J9490J960k573n108k216
$$ plain form
16186 515607 522299 529436 526823 494794 507775 520669 544405 550857 521380 555615 600898 579790
16174 579790 582602 609042 596557 585989 591967 604629 623883 603909 606013 570673 570187 571977 609114
16161 609114 612331 604554 564120 605686 653492 632031 634132 641178 609774 625848 587329 634002
16149 634002 620841 650662 636862 628811 623408 617698 655685 670690 679996 678562 684629 670671 687499
16136 687499 672338 693683 684344 676722 674966 673690 729723 734924 687409 679118 638458 684708 691712
16123 691712 700270 667153 729251 702454 718203 716580 728657 653215 666642 700925 692633 718261
16111 718261 741960 744645 726368 704153 731770 722123 699019 727802 722401 703419 710689 730313
16099 730313 759890 754307 729972 687789 713246 733862 729412 721541 733188 755343 738382 759331
$$ packed form
16186E15607O692P137k613l2029J2981J2894K3736O452k9477L4235M5283k1108
16174E79790K812K6440j2485j0568N978J2662J9254j9974K104l5340m86J790L7137
16161F09114L217p777m0434M1566M7806k1461K101P046l1404J6074l8519M6673
16149F34002j3161K9821j3800q051n403n710L7987J5005R306j434O067j3958J6828
16136F87499j5161K1345r339p622j756j276N6033N201m7515q291m0660M6250P004
16123F91712Q558l3117O2098k6797J5749j623J2077p5442J3427L4283q292K5628
16111G18261K3699K685j8277k2215K7617r647k3104K8783n401j8982P270J9624
16099G30313K9577n583k4335m2183K5457K0616m450p871J1647K2155j6961K0949
$$ plain form
16087 759331 748259 758852 775889 752534 739465 758456 746366 736566 753124 776964 770907 778906
16075 778906 774478 787418 756838 777978 791034 756321 770383 755601 748827 767594 761955 780087
16063 780087 755735 787149 769740 756439 769643 767540 715496 740962 752794 738235 719923 714902
16051 714902 757166 789643 790041 748809 747745 738052 730898 731102 747730 735224 746323 744147 756407
16038 756407 778107 775900 745190 765027 758604 726946 751077 744548 738899 749422 752638 765512
16026 765512 761917 763554 785526 760383 747667 747227 757777 779150 804355 785992 759881 721024
16014 721024 751176 779033 760120 762020 769686 774878 753672 746776 754824 757619 750726 763666 761866
16001 761866 767604 769997 753195 784777 764890 773705 776333 766615 767872 757429 783798 788766 780039
$$ packed form
16087G59331j1072J0593J7037k3355j3069J8991j2090r800J6558K3840o057P999
16075G78906m428J2940l0580K1140J3056l4713J4062j4782o774J8767n639J8132
16063G80087k4352L1414j7409j3301J3204k103n2044K5466J1832j4559j8312n021
16051G14902M2264L2477L98m1232j064r693p154K04J6628j2506J1099k176J2260
16038G56407K1700k207l0710J9837o423l1658K4131o529n649J0523L216J2874
16026G65512l595J637K1972k5143j2716m40J0550K1373K5205j8363k6111l8857
16014G21024L0152K7857j8913J900P666N192k1206o896Q048K795o893J2940j800
16001G61866N738K393j6802L1582j9887Q815K628r718J257j0443K6369M968q727
$$ plain form
15988 780039 750313 733155 739720 762001 765289 762232 737692 770262 783668 764566 772743 723709
15976 723709 721537 737886 732194 720002 773183 786772 761652 780883 734103 735685 755970 751680
15964 751680 775877 776700 763046 759105 786493 789824 769492 810358 774772 714950 754678 750982
15952 750982 742095 768405 760659 786950 769920 775596 782075 789640 780515 764311 777305 760185 726287
15939 726287 763035 786048 756898 757888 759998 753017 761330 738304 754250 768845 782530 775582 787109
15926 787109 755749 736824 738441 713413 714606 772861 801464 793417 781413 749448 753619 761167
15914 761167 784597 772311 787007 800400 810595 804995 821567 793582 783469 780316 794771 779906
15902 779906 773082 789010 768142 767471 757981 760027 795870 758454 786392 800260 779105 769755 779531
$$ packed form
15988G80039k9726j7158O565K2281L288l057k4540L2570J3406j9102Q177m9034
15976G23709k172J6349n692j2192N3181J3589k5120J9231m6780J582K0285m290
15964G51680K4197Q23j3654l941K7388L331k0332M0866l5586n9822L9728l696
15952G50982q887K6310p746K6291j7030N676O479P565r125j6204J2994j7120l3898
15939G26287L6748K3013k9150R90K110o981Q313k3026J5946J4595J3685o948J1527
15926G87109l1360j8925J617k5028J193N8255K8603q047j2004l1965M171P548
15914G61167K3430j2286J4696J3393J0195n600J6572k7985j0113l153J4455j4865
15902G79906o824J5928k0868o71r490K046L5843l7416K7938J3868k1155r350R776
$$ plain form
15889 779531 765612 777499 785146 780182 764004 778882 795176 774409 797635 764914 759378 797144
15877 797144 782642 779160 726497 741126 783461 767688 780369 777384 780761 732851 714862 750843
15865 750843 802248 771612 780543 798372 783895 789073 745845 756231 772641 746857 754204 772209
15853 772209 798246 796608 789605 799411 789652 797720 783551 791499 782862 795824 800673 819209 811894
15840 811894 801728 825161 788651 789867 783988 835260 841567 847910 799739 786609 760903 761892 763354
15827 763354 747886 765050 790305 813180 759741 777013 788104 781751 771747 781923 745057 776323
15815 776323 763372 747737 804833 824543 821154 810290 766710 748063 768909 782087 798187 796498
15803 796498 800441 773723 762153 747319 774913 773375 758536 760921 778998 759331 803132 811641
$$ packed form
15889G79531j3919J1887P647m964j6178J4878J6294k0767K3226l2721n536L7766
15877G97144j4502l482n2663J4629M2335j5773J2681k985L377m7910j7989L5981
15865G50843N1405l0636Q931J7829j4477N178m3228J0386J6410k5784P347J8005
15853G72209K6037j638p003R806r759Q068j4169P948q637J2962M849J8536p315
15840H11894j0166K3433l6510J216n879N1272O307O343m8171j3130k5706R89J462
15827G63354j5468J7164K5255K2875n3439J7272J1091o353j0004J0176l6866L1266
15815G76323j2951j5635N7096J9710l389j0864m3580j8647K0846J3178J6100j689
15803G96498L943k6718j1570j4834K7594j538j4839K385J8077j9667M3801Q509
$$ plain form
15791 811641 819478 809203 818919 795732 793640 790121 775296 758141 780412 769819 776581 764210
15779 764210 779309 797986 797395 795528 775056 813674 787882 763509 777018 833504 769128 794170
15767 794170 770336 787331 800388 824919 818454 810932 832181 793707 811112 799183 774949 779880
15755 779880 801410 786417 756987 751151 797210 805456 814628 806577 765019 766747 792797 773497
15743 773497 766760 778053 782601 783436 762605 772760 781499 809106 808322 762567 784216 834813 827296
15730 827296 846526 808007 790952 799515 809419 783515 758472 764715 790742 795565 801389 768325
15718 768325 745434 724162 743565 780820 783530 832414 809284 765476 767481 768180 771525 767778 777287
15705 777287 760519 761281 763886 775446 778163 768082 776054 766511 743444 787245 809208 770852 759490
$$ packed form
15791H11641P837j0275R716k3187k092l519j4825j7155K2271j0593O762j2371
15779G64210J5099J8677n91j867k0472L8618k5792k4373J3509N6486o4376K5042
15767G94170k3834J6995J3057K4531o465p522K1249l8474J7405j1929k4234M931
15755G79880K1530j4993k9430n836M6059Q246R172q051m1558J728K6050j9300
15743G73497o737J1293M548Q35k0831J0155Q739K7607p84m5755K1649N0597p517
15730H27296J9230l8519j7055Q563R904k5904k5043O243K6027M823N824l3064
15718G68325k2891k1272J9403L7255K710M8884k3130m3808K005O99L345l747R509
15705G77287j6768P62K605J1560K717j0081P972r543k3067M3801K1963l8356j1362
$$ plain form
15692 759490 768896 795682 813311 830759 795645 786744 766614 753198 776825 792022 788346 779329
$$ packed form
15692G59490R406K6786J7629J7448l5114q901k0130j3416K3627J5197l676r017
$$ [...]
##END NTUPLES=NMR SPECTRUM
##END=
