##TITLE=1H_CA-9277-1
 DMSO-d6
 8 sc, 
 7.8.2024
##JCAMPDX= 6.0         $$ Bruker NMR JCAMP-DX V2.0
##DATA TYPE= NMR SPECTRUM
##DATA CLASS= NTUPLES
##ORIGIN= UXNMR, Bruker Analytische Messtechnik GmbH
##OWNER= root
$$ XWIN-NMR		Version 3.5
$$ Wed Aug  7 13:39:56 2024 Russian Standard Time (UT+4h)  she@DPX200
##.OBSERVE FREQUENCY= 200.1313
##.OBSERVE NUCLEUS= ^1H
##.ACQUISITION MODE= SIMULTANEOUS
##.ACQUISITION SCHEME= undefined
##.AVERAGES= 8
##.DIGITISER RES= 18
##SPECTROMETER/DATA SYSTEM= spect
##.PULSE SEQUENCE= zg30
##.SOLVENT NAME= Acetone
##.SHIFT REFERENCE= (INTERNAL, Acetone, 0, 21.0224)
##AUDIT TRAIL= $$ (NUMBER, WHEN, WHO, WHERE, WHAT)
$$ ##TITLE= Audit trail, XWIN-NMR		Version 3.5
$$ ##JCAMPDX= 5.01
$$ ##ORIGIN= Bruker BioSpin GmbH
$$ ##OWNER= she
$$ F:/spectra/data/she/nmr/H-F/1/pdata/1/auditp.txt
$$ ##AUDIT TRAIL=  $$ (NUMBER, WHEN, WHO, WHERE, WHAT)
(   1,<2024-08-07 13:38:38.35 +0400>,<she>,<DPX200>,
      <created by zg, POWCHK disabled, PULCHK disabled
       configuration hash MD5:
       00 E9 B6 7A A2 85 ED C7 34 08 36 98 17 FE 4E 26
       data hash MD5: 16K
       46 69 88 4D EC 5B C7 AC 4C 7B 4D 91 0C 51 06 F7>)
(   2,<2024-08-07 13:38:52.26 +0400>,<she>,<DPX200>,
      <Start of raw data processing
       efp BC_mod = 2 LB = 0.24 FT_mod = 6 PKNL = 1 PHC0 = -25634.3 PHC1 = 9.587492 SI = 16K 
       data hash MD5: 16K
       30 98 25 AF 4B 37 5A 6F F6 2E BF A8 F4 D1 C0 DB>)
(   3,<2024-08-07 13:39:07.56 +0400>,<she>,<DPX200>,
      <pk PHC0 = -3.585213 PHC1 = 0 
       data hash MD5: 16K
       CA 4F 32 8E 04 EC 85 D8 FE D6 10 40 D0 88 3D 02>)
(   4,<2024-08-07 13:39:10.89 +0400>,<she>,<DPX200>,
      <abs ABSG = 5 
       data hash MD5: 16K
       5A 40 0F C5 EB 2C 0D D5 2E 7B C7 59 3C 67 1A C2>)
$$ ##END=
$$ 
$$ hash MD5
$$ 50 D8 F6 A3 ED 11 84 4C 2B EB 8C C1 AE A8 18 C9
##$RELAX= 
##$RELAX= 
##$RELAX= 
##$RELAX= 
##$RELAX= 
##$RELAX= 
$$ Bruker specific parameters
$$ --------------------------
##$DU= <F:/spectra>
##$EXPNO= 1
##$NAME= <H-F>
##$PROCNO= 1
##$TYPE= <nmr>
##$USER= <she>
##$AMP= (0..31)
100 100 100 100 100 100 100 100 100 100 100 100 100 100 100 100 100 100 
100 100 100 100 100 100 100 100 100 100 100 100 100 100 
##$AQSEQ= 0
##$AQ_mod= 1
##$AUNM= <au_zg>
##$AUTOPOS= <>
##$BF1= 200.13
##$BF2= 200.13
##$BF3= 200.13
##$BF4= 200.13
##$BF5= 200.13
##$BF6= 200.13
##$BF7= 200.13
##$BF8= 200.13
##$BYTORDA= 1
##$CFDGTYP= 0
##$CFRGTYP= 5
##$CHEMSTR= <none>
##$CNST= (0..31)
1 1 145 1 1 1 1 1 1 1 1 1 1 1 1 1 1 1 1 1 1 1 1 1 1 1 1 1 1 1 1 1 
##$CPDPRG= <>
##$CPDPRG1= <>
##$CPDPRG2= <>
##$CPDPRG3= <>
##$CPDPRG4= <mlev>
##$CPDPRG5= <mlev>
##$CPDPRG6= <mlev>
##$CPDPRG7= <mlev>
##$CPDPRG8= <mlev>
##$CPDPRGB= <>
##$CPDPRGT= <>
##$D= (0..31)
0 1.2 0 0 0 0 0 0 0 0.06 0 0.03 0 0 0 0 0.0002 0 0 0 0 0 0 0 0 0 0 0 0 
0 0 0 
##$DATE= 1723023517
##$DBL= (0..7)
120 120 120 120 120 120 120 120 
##$DBP= (0..7)
150 150 150 150 150 150 150 150 
##$DBP07= 0
##$DBPNAM0= <>
##$DBPNAM1= <>
##$DBPNAM2= <>
##$DBPNAM3= <>
##$DBPNAM4= <>
$$ [...]
##$SUBNAM3= <"">
##$SUBNAM4= <"">
##$SUBNAM5= <"">
##$SUBNAM6= <"">
##$SUBNAM7= <"">
##$SUBNAM8= <"">
##$SUBNAM9= <"">
##$SW= 24.0689771365484
##$SWIBOX= (0..15)
0 0 2 0 0 0 0 0 0 0 0 0 0 0 0 0 
##$SW_h= 4816.95568400771
##$TD= 16384
##$TD0= 1
##$TE= 0
##$TE2= 300
##$TE3= 300
##$TEG= 300
##$TL= (0..7)
0 120 120 120 120 120 120 120 
##$TP= (0..7)
150 150 150 150 150 150 150 150 
##$TP07= 0
##$TPNAME0= <>
##$TPNAME1= <>
##$TPNAME2= <>
##$TPNAME3= <>
##$TPNAME4= <>
##$TPNAME5= <>
##$TPNAME6= <>
##$TPNAME7= <>
##$TPOAL= (0..7)
0.5 0.5 0.5 0.5 0.5 0.5 0.5 0.5 
##$TPOFFS= (0..7)
0 0 0 0 0 0 0 0 
##$TUNHIN= 0
##$TUNHOUT= 0
##$TUNXOUT= 0
##$USERA1= <user>
##$USERA2= <user>
##$USERA3= <user>
##$USERA4= <user>
##$USERA5= <user>
##$V9= 5
##$VALIST= <valist>
##$VCLIST= <CCCCCCCCCCCCCCC>
##$VD= 0
##$VDLIST= <DDDDDDDDDDDDDDD>
##$VPLIST= <PPPPPPPPPPPPPPP>
##$VTLIST= <TTTTTTTTTTTTTTT>
##$WBST= 1024
##$WBSW= 4
##$XGAIN= (0..3)
0 0 0 0 
##$XL= 0
##$YL= 0
##$YMAX_a= 407575
##$YMIN_a= -401824
##$ZGOPTNS= <>
##$ZL1= 120
##$ZL2= 120
##$ZL3= 120
##$ZL4= 120
##$ABSF1= 21.53653
##$ABSF2= -2.532677
##$ABSG= 5
##$ABSL= 3
##$ALPHA= 0
##$AQORDER= 0
##$ASSFAC= 0
##$ASSFACI= 0
##$ASSFACX= 0
##$ASSWID= 0
##$AUNMP= <proc_1d>
##$AZFE= 0.1
##$AZFW= 0.1
##$BCFW= 0
##$BC_mod= 2
##$BYTORDP= 0
##$COROFFS= 0
##$CY= -3
##$DATMOD= 1
##$DC= 0
##$DFILT= <>
##$DTYPP= 0
##$F1P= 0
##$F2P= 0
##$FCOR= 1
##$FTSIZE= 16384
##$FT_mod= 6
##$GAMMA= 0
##$GB= 0
##$INTBC= 1
##$INTSCL= 3.70164e-10
##$ISEN= 128
##$LB= 0.24
##$LEV0= 0
##$LPBIN= 0
##$MAXI= 10000
##$MC2= 0
##$MEAN= 0
##$ME_mod= 0
##$MI= 1.114404
##$NCOEF= 0
##$NC_proc= -6
##$NLEV= 6
##$NOISF1= 3.799351
##$NOISF2= 2.8
##$NSP= 0
##$NTH_PI= 0
##$NZP= 0
##$OFFSET= 21.02235
##$PC= 1
##$PHC0= -25637.89
##$PHC1= 9.587492
##$PH_mod= 1
##$PKNL= yes
##$PPARMOD= 0
##$PSCAL= 0
##$PSIGN= 0
##$REVERSE= no
##$SF= 200.129501284851
##$SI= 16384
##$SIGF1= 3
##$SIGF2= 2
##$SINO= 5.538805
##$SIOLD= 16384
##$SREGLST= <1H.CDCl3>
##$SSB= 0
##$STSI= 16384
##$STSR= 0
##$SW_p= 4816.95568400771
##$SYMM= 0
##$S_DEV= 0
##$TDeff= 16384
##$TDoff= 0
##$TI= <>
##$TILT= no
##$TM1= 0
##$TM2= 0
##$TOPLEV= 0
##$USERP1= <user>
##$USERP2= <user>
##$USERP3= <user>
##$USERP4= <user>
##$USERP5= <user>
##$WDW= 1
##$XDIM= 16384
##$YMAX_p= 508205580
##$YMIN_p= -620413
$$ End of Bruker specific parameters
$$ ---------------------------------
##NTUPLES= NMR SPECTRUM
##VAR_NAME=  FREQUENCY,     SPECTRUM/REAL,   SPECTRUM/IMAG
##SYMBOL=    X,             R,               I
##VAR_TYPE=  INDEPENDENT,   DEPENDENT,       DEPENDENT
##VAR_FORM=  AFFN,          ASDF,            ASDF
##VAR_DIM=   16384,         16384,           16384
##UNITS=     HZ,            ARBITRARY UNITS, ARBITRARY UNITS
##FACTOR=    0.29402158847633, 1,            1
##FIRST=     4207.19248363176, 0,            0
##LAST=      -609.763200375953, 0,           0
##MIN=       -609.763200375953, -620413,     0
##MAX=       4207.19248363176, 508205580,    0
$$ Real data points
##PAGE= N=1
##DATA TABLE= (X++(R..R)), XYDATA
$$ [...]
7555A2483437L17693K94182L82465M44242L34456L51882L09958M10929M66496
7546A5795740L78662M22246N35465K92705M32192N94727M38862N69623M71623
7537A9931845O19034N70580N98832N82333O48407P19541P15944O22770P62099
7528B5771385P56399Q44794Q35420O88047Q52592Q17058R30796P71832J103713
7519C3372036R22482R70912J097723Q90812R80470J118992R43932J193981R85998
7510D2477338J056380R71898J122415R15515J020203J155514Q84737Q96380R02601
7501E1402981P98100R13356P01035O73447O61523N80311M62772L25400M94090
7492E7013015K96164J04549p2321j22733j76134k74630l82890m88824m38751o22192
$$ plain form
7555 12483437 12801130 13095312 13477777 13922019 14256475 14608357 14918315 15329244 15795740
7546 15795740 16174402 16596648 17132113 17424818 17857010 18451737 18890599 19460222 19931845
7537 19931845 20550879 21121459 21720291 22302624 22951031 23670572 24386516 25009286 25771385
7528 25771385 26527784 27372578 28207998 28896045 29748637 30565695 31496491 32268323 33372036
7519 33372036 34294518 35265430 36363153 37253965 38234435 39353427 40297359 41491340 42477338
7510 42477338 43533718 44505616 45628031 46543546 47563749 48719263 49604000 50500380 51402981
7501 51402981 52201081 53114437 53815472 54488919 55150442 55730753 56193525 56518925 57013015
7492 57013015 57309179 57413728 57341407 57218674 57042540 56767910 56385020 55896196 55457445 54835253
7482E4835253n98499o60302q61033r72542q92100q31689j027305j200075r67343
7473D6824365q99697r56600j135798j208124j067838r25654j095685j075316j145611
7464C7314042j063939r82281q52681r52224q76545q02120q93482q24548r25855
7455B9140367o26237q20255q57403p55843o81549o59680o22958p05655n63971
7446B2846816o17058o73495o60832n80480n78998n05606n62075m61003m88973
7437A7718296m59333m70409l72302k24775l06988m60086l97607l46545k11770
7428A4468481l59231m00363m18469m01756j81367k34345m09468m08638j28191
7419A1526653j25625l94085j92565k25589k81010k33730o3053k36433j99375l11718
$$ plain form
7482 54835253 54236754 53576452 52715419 51742877 50850777 50019088 48991783 47791708 46824365
7473 46824365 45924668 44968068 43832270 42624146 41556308 40630654 39534969 38459653 37314042
7464 37314042 36250103 35267822 34415141 33462917 32586372 31784252 30890770 30066222 29140367
7455 29140367 28514130 27693875 26836472 26080629 25399080 24739400 24116442 23410787 22846816
7446 22846816 22229758 21556263 20895431 20314951 19735953 19230347 18668272 18207269 17718296
7437 17718296 17258963 16788554 16416252 16191477 15884489 15424403 15026796 14680251 14468481
7428 14468481 14109250 13708887 13290418 12888662 12707295 12472950 12063482 11654844 11526653
7419 11526653 11401028 11006943 10814378 10588789 10307779 10074049 10010996 9774563 9575188 9263470
7409I263470j52618k60723j95108k19288j3231j61740j77039k6790j40756k71880
7399G644297j87030j74203j19681j11940j38661k117j78893J8765j28821k24239
7389F397477k08722K5691k74502l4742k2832m5025N2846k43421k22646r2164k3817
7378E308143k6065o6649j9397o2812l5096j81663m2856j16036R586j18904r8750
7367D549501K02097j77434q2367o1010j91936j24384j52172o3792p2523m1536
7357C784444R1573k56200M3498M9556n9391j57089Q338p5405p9970N2302L1651
7346C433307j66029o6176m9010j02110M004l8172j29197N492Q3629j56957j59967
7335B658814J6858O3895k0389q4810k36751J27066o2036p7655n5244m6441m4344
$$ plain form
7409 9263470 9110852 8850129 8655021 8435733 8422502 8260762 8083723 8056933 7916177 7644297
7399 7644297 7457267 7283064 7163383 7051443 6912782 6910665 6731772 6750537 6621716 6397477
7389 6397477 6188755 6214446 5939944 5905202 5882370 5837345 5890191 5646770 5424124 5331960 5308143
7378 5308143 5282078 5215429 5196032 5133220 5098124 4916461 4873605 4757569 4767155 4648251 4549501
7367 4549501 4751598 4574164 4491797 4430787 4238851 4114467 3962295 3898503 3825980 3784444
7357 3784444 3876017 3619817 3663315 3712871 3653480 3496391 3504729 3429324 3349354 3401656 3433307
7346 3433307 3267278 3201102 3152092 3049982 3053986 3015814 2886617 2892109 2975738 2818781 2658814
7335 2658814 2675672 2739567 2719178 2634368 2397617 2524683 2462647 2384992 2329748 2283307 2238963
7324B238963N2173M8027J01279k91560J80126p65j10661N0731l8219n1289j62919
7313B015886J6415P7682j10464j52533J86831p6744l7151N2751r048j03532j7447
7302A842646p3J5736n5748n3272r2050R7576K2865p8302K1606p8357l2509L3082
7290A643200q6362J24721J6368k4895k69218N3558J29058j41410J20058l8596
7280A526482j28079p9527l5081Q3659J12312k85445J04682m8584K16818m4432
7270A422805j21289j13487K1223J2005J4666O2852j56921p0850R0094P3960j8202
7259A216856Q6631j14837m8672j02454M7276M559m137O381j24563J21146j2393
7248A075793o6179Q2824k30179M455J02277m9552M1340l8748p6612Q506J22251
$$ plain form
7324 2238963 2291136 2339163 2440442 2148882 2329008 2328243 2217582 2268313 2230094 2178805 2015886
7313 2015886 2032301 2109983 1999519 1846986 2033817 1957073 1919922 1972673 1963625 1860093 1842646
7302 1842646 1842573 1858309 1802561 1749289 1657239 1754815 1777680 1699378 1720984 1642627 1610118 1643200
7290 1643200 1556838 1681559 1697927 1673032 1403814 1457372 1586430 1445020 1565078 1526482
7280 1526482 1398403 1318876 1283795 1367454 1479766 1194321 1299003 1250419 1467237 1422805
7270 1422805 1301516 1188029 1209252 1221257 1235923 1298775 1141854 1071004 1161098 1235058 1216856
7259 1216856 1303487 1188650 1139978 1037524 1084800 1089359 1085222 1091603 967040 1088186 1075793
7248 1075793 1009614 1092438 862259 866714 968991 919439 960779 922031 845419 853925 976176
7237I76176J5340q8407J32038j1479j75353M949k3960O4635L7349l2395Q4265
7226I83158o2195l6215n573J3053J77178r9363j62065j55340K5865Q2398L896
7215G64797O3016J0433N3645m5922m9755o6271n3005k01422P7914J32124m4439
7204F41115J27075L6200j04851j8467J5865R6213Q0876o7776q9098j3753N29N8284
7192G62212k7810j75135J03667p7955O7685R5606j02867n8254M4673O1861j01237
7181E92446n498P2325l9676K3973m2540R4725J5004q2054O9976k1247q8182q60
7169E88392l0911Q4337M0711R048q4012j55400J37526j57677j76200O0795J07688
7158D24297M7608J11282J23942p4816p0042m7007m0444j9910J01186j02390L3674
$$ plain form
7237 976176 991516 903109 1035147 1023668 848315 853264 829304 893939 931288 898893 983158
7226 983158 920963 884748 879175 892228 1069406 970043 807978 652638 678503 760901 764797
7215 764797 827813 838246 891891 845969 796214 729943 676938 475516 553430 685554 641115
7204 641115 768190 804390 699539 681072 696937 793150 874026 806250 717152 703399 703928 762212
7192 762212 734402 559267 662934 584979 652664 748270 645403 587149 631822 693683 592446
7181 592446 586948 659273 619597 643570 601030 695755 710759 628705 698681 677434 589252 588392
7169 588392 557481 641818 682529 691577 607565 452165 589691 432014 255814 316609 424297
7158 424297 471905 583187 707129 632313 562271 515264 474820 454910 556096 453706 487380
7147D87380j9237r3568J25630k3377K8003P348J0464K9971k3989j09422l2555
7136C86648l3426P313R515p1783J1756N8936N9394O6371k61124J33192J20127
7125D86919j14365l7912M0198j88350J72943O4409J9188L8895J494j15607Q1666
7114D49478M3360j07863m1470P0553j37274Q4698J5816m3733M0800j1409q8910
7103B74046J09608J13355j34417k0220j44370J43120m8748m0948j67204J1490
7093I5712K34998L1080o2997k9631n8111L238K611K3177K2917o6245K7014J20786
7081C44549J09690j06497j50760J09012O3047o4514M7497m561j06489l6151q6800
7070A18023K8264k6824K8333P077O5477R1476n4810r9326L1716O7575k2844K6796
$$ plain form
7147 487380 468143 374575 500205 476828 504831 512179 522643 552614 528625 419203 386648
7136 386648 353222 360535 370050 298267 310023 368959 428353 494724 233600 366792 486919
7125 486919 372554 334642 374840 186490 359433 423842 443030 481925 483419 367812 449478
7114 449478 492838 384975 343505 414058 276784 361482 377298 333565 374365 362956 274046
7103 274046 383654 497009 362592 342372 198002 341122 292374 251426 84222 95712
7093 95712 330710 361790 298793 269162 211051 214289 216900 240077 262994 196749 223763 344549
7081 344549 454239 347742 196982 305994 369041 304527 352024 347463 240974 204823 118023
7070 118023 146287 119463 147796 154873 220350 311826 257016 157690 189406 256981 234137 260933
7058B60933q1060m6641j29101K00926Q4685q6899J5501Q7692l9863j04615R6854
7047B58412n4453J34007J9360k1774J393j27257j70202k1246J46019l6833j10063
7036A7363J56067J36364q8550j18110k4056J65208n9259q5818O4227o137J36794
7025B94093o4022j03720p1150M0253K01567j76001J7788L8082R626j9863J16268
7014B82921L6349j55330J69380j90664P3720o8851L134j24014k1411L6196J15875
7003A57305j8659O3481L9276r8664O207K6050L1575n6332m0298l8784j59565K36251
6991A47843o2278K09389l0599r7078J21004j6436j6575O3330r4799l1461J50370
6980C42710j44482m2293L0371j22398J40633K2502k17792N4308J0302K1483r4570
$$ plain form
7058 260933 179873 133232 4131 205057 289742 202843 218344 306036 266173 161558 258412
7047 258412 203959 337966 357326 335552 336945 209688 39486 18240 164259 127426 17363
7036 17363 173430 309794 221244 103134 79078 244286 185027 99209 163436 157299 294093
7025 294093 230071 126351 55201 95454 297021 121020 138808 176890 186516 166653 282921
7014 282921 319270 163940 333320 142656 216376 147525 150659 26645 5234 41430 157305
7003 157305 138646 202127 241403 142739 148946 174996 206571 150239 109941 71157 -88408 147843
6991 147843 85565 294954 264355 167277 288281 271845 255270 318600 223801 192340 342710
6980 342710 198228 155935 186306 63908 204541 227043 9251 63559 73861 95344 774
6969G74Q9962J00890N269R2564o8869j85172N7737N8270o3063l9029J06710J35426
6957B91469l6872j33995m2788J28246L6498J746l2868j47383l5536j14788J10479
6946B4208J75327j0269j05275q3362J3061m9875M622N8166j5490R9185N973n0860
6934F5411l0167Q2126k6368m463J29592j47157q4932O3954M0946L1389N9972M9024
6922B29327j03530m820O1879j6532k43392R8342P8392P4308j61445J07947J46148
6911B66624p6489j06377m6079J05610N6153o7205l7698n1784L5924j58405Q7004
6900G278J51073Q5287r4917j4143k38761O3524J7355J76828J1887j15402j25946
6889g5937J31251o559j7363R3461l7821n8111j44584O862L9724J62405m1026l0295
$$ plain form
6969 774 90736 191626 196895 289459 220590 35418 93155 151425 88362 49333 156043 291469
6957 291469 254597 120602 77814 206060 242558 244304 211436 64053 28517 -86271 24208
6946 24208 199535 189266 83991 629 13690 -36185 -31563 26603 11113 110298 116271 65411
6934 65411 35244 117370 91002 86539 216131 68974 -15958 47996 88942 120331 180303 229327
6922 229327 125797 120977 182856 166324 -77068 21274 99666 173974 12529 120476 266624
6911 266624 190135 83758 37679 143289 199442 132237 94539 42755 78679 -79726 7278
6900 7278 158351 243638 148721 134578 -104183 -40659 -23304 153524 165411 50009 -75937
6889 -75937 55314 48755 31392 124853 87032 28921 -115663 -108801 -69077 93328 52302 22007
6877B2007J94074r0570j23143L9580q5055R440r5120L5151N3897J0430r611J08483
6865F9563l7326j24972M6348J79934p2712R9355p9634n3502J06105J15624k18907
6854B9876N6103M2128j87408o8131M4248K2136j2361N2817k1515J2765k877m2639
6842g4858J86792o2458q3198M5992j07854J73546r5927P0313O4523J8432m8346
6831H6957L7195k286j11212L3338P912J04484j71961M518j1300n1422K31347J1045
6819A68615q7290j15220j32590J77871j30323J3145M3738P1346J03405J03244
6809B15941j45657o7062L8322m846J59761N8357k18111m7540l5936O2886l2285
6798a6170n3386L0794l6526J58142j17415J0257j13930M2091J50315j37334K5668
$$ plain form
6877 22007 216081 125511 2368 41948 -43107 -33667 -128787 -93636 -39739 -29309 -38920 69563
6865 69563 32237 -92735 -46387 133547 60835 160190 80556 27054 133159 248783 29876
6854 29876 85979 128107 -59301 -127432 -83184 -61048 -73409 -20592 -42107 -29342 -32219 -74858
6842 -74858 111934 49476 -33722 12270 -95584 77962 -17965 52348 116871 135303 86957
6831 86957 124152 121866 10654 43992 51904 156388 -15573 -11055 -22355 -73777 157570 168615
6819 168615 81325 -33895 -166485 11386 -118937 -105792 -62054 9292 112697 215941
6809 215941 70284 3222 41544 36698 196459 254816 36705 -10835 -46771 16115 -16170
6798 -16170 -69556 -38762 -75288 82854 -34561 -24304 -138234 -96143 54172 -83162 -57494
6787e7494N8512j4904q515J22908K8966p2766R1959M8347r7006j70879O2921L1069
6775B3118r1426L5941P590O5987Q1913J7079j29901J1323q6707J06270M5722N92
6763H7501n6035j3414l2834j3575O1042L5580o9734n0801O192k3460l8393m4624
6751a52555M3345K0646K4621r7910n4749K07836R9102j92387q1902J67058M7274
6740C0379j12718J4330n7051L7022K29258p9429k3449q4575m7405L7269m16J58724
6728A01939o9646r822r8141r2023R2891O6105J37226q4133j266n9998L6128j06247
6716h6987M6896k282q6574M8011J6788o1154n4968K15504l3641J08065r9558J554
6704A1654p4175P7022k1954p16N6065j67202P8641J09435j47800n5492J16339
$$ plain form
6787 -57494 1018 -13886 -22401 100507 129473 56707 148666 197013 100007 -70872 -7951 23118
6775 23118 -68308 -32367 -24777 41210 123123 140202 10301 21624 -65083 41187 86909 87501
6763 87501 31466 18052 -14782 -28357 32685 68265 -1469 -52270 -46078 -69538 -107931 -152555
6751 -152555 -109210 -88564 -63943 -161853 -216602 -8766 90336 -102051 -183953 -16895 30379
6740 30379 -82339 -68009 -125060 -88038 141220 61791 38342 -46233 -93638 -56369 -56785 101939
6728 101939 32293 22471 -75670 -167693 -74802 -8697 128529 44396 43130 -16868 19260 -86987
6716 -86987 -40091 -42373 -128947 -80936 -64148 -125302 -180270 35234 1593 109658 10100 11654
6704 11654 -62521 14501 -7453 -8169 47896 -119306 -40665 68770 -79030 -134522 -18183
6693a8183K7416m9455O2843j8187o3932q5921m3173J28838j10453q1659J56517
6682i5349J25454k16464J04136R0262R6700r791N3416o9285p0977k3878P567J39496
6670A31287j65538j11482r416Q0589n374K30359j73879j59745M2854P0808L5971
6659c3566O3284j18005K7636K4962Q9705N338n756n4968K8993p0438Q2428P463
6647D7076N9522j89790N6416r8559l7223N65J21259O5254n37r2652M0130K2890
6635e649j13822l3042P8545K68884j90706p406J36729J0062j14110j90818Q2647
6624g8686J6532m5601R0749p4294M3402K5490j23108n7931J3179K40216R2149
6613A42097o1548m8676l9488p7137j192P7086r6284J70480j30704K794m5401k7678
$$ plain form
6693 -18183 9233 -40222 22621 4434 -59498 -145419 -188592 -59754 -170207 -251866 -95349
6682 -95349 30105 -186359 -82223 8039 104739 94948 148364 79079 8102 -15776 -8209 131287
6670 131287 -34251 -145733 -155149 -74560 -79934 150425 -23454 -183199 -140345 -69537 -33566
6659 -33566 29718 -88287 -60651 -35689 54016 59354 53598 -1370 27623 -42815 39613 47076
6647 47076 106598 -83192 -26776 -125335 -162558 -161993 -40734 24520 23983 -68669 -28539 -5649
6635 -5649 -119471 -152513 -73968 194916 4210 -3196 133533 143595 29485 -161333 -78686
6624 -78686 -62154 -107755 -17006 -91300 -47898 -22408 -145516 -203447 -190268 49948 142097
6613 142097 80549 31873 -7615 -84752 -85944 -8858 -105142 65338 -65366 -62572 -107973 -135651
6601a35651R9350J29689r0941l8984K2658q7963N0903R8894p2610K6381M629N6619
6589F2974j16005j32712P7986L9643o316J30853k00224o077K4421J12216M3122
6578B9881j01335K7106R1113j6099j65398Q6615J30880p0512O986Q098r4647j40768
6566b08080P5459R7578l9516j22547N4637J36101l2692r7043k1089J33967o6257
6555h9482l6811K17446q2789p8631J30414n8655R4557l0194k5952L6361j16755
6544d0491J53957K6268j2042j08976K3206j64795P6925J16472j08061o4790k5842
6533a28169p7635J11652J19664L5563q934j25325J16992N8713q8648p6062n1378
6522a13567K623O7365n6776J08366k07698K0310J73338m9629m5875N4401K53292
$$ plain form
6601 -135651 -36301 93388 2447 -36537 -13879 -101842 -50939 47955 -24655 1726 6355 62974
6589 62974 -53031 -185743 -107757 -68114 -74430 56423 -143801 -149878 -125457 -13241 29881
6578 29881 -71454 -44348 46765 30666 -134732 -48117 82763 12251 19237 27335 -67312 -208080
6566 -208080 -132621 -35043 -74559 -197106 -142469 -6368 -39060 -136103 -157192 -23225 -89482
6555 -89482 -126293 91153 8364 -70267 60147 1492 96049 65855 39903 76264 -40491
6544 -40491 113466 139734 127692 18716 41922 -122873 -45948 70524 -37537 -102327 -128169
6533 -128169 -205804 -94152 25512 61075 52141 -73184 43808 102521 13873 -62189 -113567
6522 -113567 -110944 -43579 -100355 8011 -199687 -179377 -6039 -55668 -101543 -47142 206150
6511B06150r2174k32496k7975N1840N0293J6876l8061O1946J12399j24407M7670
6500C2061o4676k9593L4889N5235j07090j46016K53909L422j31908n8260J71041
6489A3014L51N1881j63558m0062J91605j53705L2049k4413n4809p8538J05267
6478a20918J2417j4453M2488m3395l6000J7205J14999K1056j37468J50442O7943
6467G4316r8252q3775n764k7647O74J1575N0858L2128p6289Q620O2581Q7457j43133
6454a06651M9627L5817n4342J21806J08959n3334n1405j25601J59538K3109r4946
6443A2577o4730j17732J55480j69320k0458J4152O3576K02894N719p0728j7419
6432e989j48246J9224J10892q129J7294o316q9796l2287M2172j33066J03012l8496
$$ plain form
6511 206150 113976 -118520 -146495 -94655 -44362 -27486 -65547 -3601 108798 -15609 32061
6500 32061 -32615 -62208 -27319 27916 -79174 -225190 28719 32141 -99767 -158027 13014
6489 13014 13365 65246 -98312 -138374 53231 -100474 -68425 -92838 -147647 -226185 -120918
6478 -120918 -108501 -122954 -80466 -123861 -159861 -142656 -27657 -6601 -144069 6373 74316
6467 74316 -23936 -107711 -113475 -141122 -140448 -128873 -78015 -45887 -122176 -113556 -50975 36482 -106651
6454 -106651 -57024 -21207 -75549 46257 155216 101882 50477 -75124 84414 107523 12577
6443 12577 -52153 -169885 -14405 -183725 -204183 -190031 -126455 76439 82158 11430 -5989
6432 -5989 -154235 -135011 -24119 -32248 -14954 -21270 -111066 -143353 -101181 -234247 -131235 -169731
6420a69731J2547O6135P0675O7275j13110N2309j92904K33708j57543J4114q1931
6409a98456J074J74016k6742N7008J6021p5506l3902j03170O9344L5011L0137
6398e5165l5748J1073N4014R5302j38882N6252J38099j8595K6000o2039l2490
6387C7821J04938r0009m6217k852j37598J68704L3118j05247j4485j00736m7988
6376b00551J27019n7325k1888R7114M6754o9711M1292j45174Q8090r4806M7795
6365a41391m9738P4663R5506J7102q2062M0022n7410m8219M1474n4931j32874
6354b97858m1862K19544P6146j2491o0736j73p5458L6269Q7709m2075N3128J43891
6342H6034r290r2264M4756j3524k6404l1341k6419n1770J20366r6915R3899j65910
$$ plain form
6420 -169731 -157184 -91049 -20374 46901 -66209 -13900 -206804 26904 -130639 -116525 -198456
6409 -198456 -197382 -23366 -50108 6900 22921 -52585 -86487 -189657 -120313 -85302 -55165
6398 -55165 -90913 -79840 -25826 69476 -69406 -13154 124945 106350 132350 70311 37821
6387 37821 142759 52750 6533 3681 -133917 34787 67905 -37342 -51827 -152563 -200551
6376 -200551 -73532 -130857 -152745 -55631 -8877 -78588 -37296 -182470 -94380 -189186 -141391
6365 -141391 -191129 -116466 -20960 -3858 -85920 -45898 -103308 -151527 -110053 -164984 -297858
6354 -297858 -339720 -120176 -44030 -56521 -117257 -117430 -192888 -156619 -68910 -110985 -57857 86034
6342 86034 76744 -15520 29236 15712 -10692 -42033 -68452 -120222 144 -96771 -2872 -168782
6330a68782J56599N5913Q7549n2477j36689J5209j2101J9502j08762N9597P3164
6319a1278M2824o544Q0582j52859j28247M8937J630K4788Q8993j91826r574J27115
6307h5459P1895j01790n7671J0070N1353P7166J21521L628n4635p1840J22481
6296H6719N433j21373m5157M1721P539j1624o9632Q8528k5205n9277J95026j53328
6284f0630o6766L8037J46219l9658j31829k7037J40052L6963p0652l3997n8146
6273a27444k7100N0767J06979P7195o7659Q8516J08124k39479M2196q1711j29708
6262a99324J5122N2843Q1137O2052K7604m6978k5483O5737j63061O1110K3825
6251d5416p7992R0035M1497j04114k3318J04512J0755J48851n0295j70381p225
$$ plain form
6330 -168782 -12183 43730 131279 78802 -57887 -42678 -54779 -35277 -144039 -84442 -11278
6319 -11278 31546 25002 105584 -47275 -175522 -126585 -124955 -100167 -11174 -203000 -212574 -85459
6307 -85459 -13564 -115354 -173025 -162955 -111602 -34436 87085 90713 36078 -35762 86719
6296 86719 92152 -29221 -74378 -32657 -25118 -36742 -106374 -17846 -43051 -102328 92698 -60630
6284 -60630 -127396 -89359 56860 17202 -114627 -141664 -1612 35351 -35301 -69298 -127444
6273 -127444 -154544 -103777 3202 80397 12738 101254 209378 -30101 12095 -69616 -199324
6262 -199324 -184202 -131359 -50222 11830 39434 -7544 -33027 32710 -130351 -69241 -45416
6251 -45416 -123408 -33373 8124 -95990 -119308 -14796 -4041 144810 94515 -75866 -83091
6240h3091O8043l938k4294q6370n2097K21465P3207k75068L6532M8829j76835
6229b53617N2421J7921O1054O3671J03936q1863Q151o1190j37370J49659J03973
6218B6746L8255n4466m0642n2057J02009n3338n6793K1791Q2358k4497j45537
6207a56171N7574J27055J376l5732P5510q0389n7100M2054p8023J19398L1749
6196D7301j51895K7001K2922R626O7214j23358L9066L466M5709j8544q168O905
6184c2755j1707J1766j02657Q2419K1561m051k2179j22980R8018N114n8548m210
6172a40209M6308N9100o2468j51163J07127L8545P2065J83379j59346J14917j08903
6161f48J1543k8059m8302r1207n2620O8094r506j7474q044L0266J45478m6938
$$ plain form
6240 -83091 -15048 -18986 -43280 -129650 -181747 39718 112925 -162143 -125611 -76782 -253617
6229 -253617 -201196 -183275 -122221 -58550 45386 -36477 -28326 -89516 -226886 -77227 26746
6218 26746 65001 10535 -30107 -82164 19845 -33493 -90286 -68495 13863 -10634 -156171
6207 -156171 -98597 28458 29834 -5898 69612 -10777 -67877 -25823 -103846 15552 47301
6196 47301 -104594 -77593 -54671 -45045 22169 -101189 -62123 -58657 -12948 -31492 -39660 -32755
6184 -32755 -44462 -32696 -135353 -52934 -31373 -35424 -57603 -180583 -82565 -77451 -135999 -140209
6172 -140209 -93901 -34801 -97269 -248432 -141305 -102760 -30695 152684 -6662 108255 -648
6161 -648 10895 -17164 -65466 -156673 -209293 -141199 -150705 -168179 -176223 -145957 -479 -47417
6149d7417m3351R5926j6367p4001j2201N5085l6705Q772N6291k7055L2014K9540
6137B0531J46969l4239j51591j31112l6235o6768N8607J78766k8514q8861p6536
6126b08983N7962J61283J31194k18401r618n559N3995k4630n3823P4363M4522
6115B305R4814k40396R9359J72584j71391J6953n1671N4591J66668n9573p0057
6104A4186K0523j3345j08194P6183m3814p802Q0221o03m5754j570l179n5929j3664
6091a02741M8O4688N1493r9911M6597l3615l194J08758J24502j69377r9093J3290
6079i8555m8003J92555q7003k3020j563J43256j02464Q3370K4531j02157O0905
6068D1852N4431n4779l9482P4642j60233L0647k0577J9643J9303k6654N4609L1954
$$ plain form
6149 -47417 -90768 5158 -11209 -85210 -97411 -42326 -79031 -70259 -13968 -41023 -9009 20531
6137 20531 167500 133261 -18330 -149442 -185677 -252445 -193838 -15072 -43586 -132447 -208983
6126 -208983 -151021 10262 141456 -76945 -86563 -92122 -38127 -62757 -116580 -42217 2305
6115 2305 97119 -143277 -43918 128666 -42725 -25772 -77443 -22852 143816 84243 14186
6104 14186 34709 21364 -86830 -10647 -54461 -62263 17958 17355 -28399 -29969 -33148 -89077 -102741
6091 -102741 -102693 -38005 13488 -86423 -39826 -73441 -76635 32123 156625 -12752 -111845 -98555
6079 -98555 -146558 45997 -41006 -64026 -65589 77667 -24797 58573 83104 -19053 41852
6068 41852 96283 41504 2022 76664 -83569 -52922 -73499 -53856 -34553 -61207 -6598 25356
6056B5356l296m2696j12623M4173P8853r0595J10561j16811l5988J37302q8131
6045i3895R3948k3421o370R8293K1878J9278p0188O6106j0523n1340R1316p5089
6033E9993r9030J11458O0800L2579k6332l5178j02429R101j52476J02958q980
6022d7536J3096J08626K6962j52j19126M7427n8144j8311K4443O238j5257J36403
6010A04669K2892j39805P2578j13330K644k7035Q3457M0615j15737k0974M5443
5999d4583K761P9894J7601l4373Q8789K4r2773r8873J9771J11930k17736J27814
5987c9754P1959p3308j27748O4649J90694q4009j50560n8229J36200n1973O9763
5976e2316j4642R0773k8145Q2593o4676j21503Q4689J78687j722j10075j25573
$$ plain form
6056 25356 22060 -20636 -133259 -89086 -10233 -100828 9733 -107078 -143066 -5764 -93895
6045 -93895 53 -23368 -29738 68555 90433 109711 39523 105629 95106 43766 135082 59993
6033 59993 -39037 72421 133221 165800 139468 104290 1861 10962 -141514 -38556 -47536
6022 -47536 -34440 74186 101148 100996 -18130 29297 -28847 -47158 -22715 -16477 -31734 104669
6010 104669 127561 -12244 60334 -52996 -50352 -77387 6070 46685 -69052 -90026 -44583
5999 -44583 -41822 38072 55673 21300 110089 110113 17340 -81533 -61762 50168 -167568 -39754
5987 -39754 32205 -41103 -168851 -104202 86492 2483 -148077 -206306 -70106 -122079 -52316
5976 -52316 -66958 23815 -4330 78263 13587 -107916 -23227 155460 153738 43663 -81910
5965h1910R2820N878j76385K2273R4946R9970j0593l6516Q109l0621p2283N1082
5953c3230N158P225m9821J15599p108j17308n879m2313J39442K54p5310N982Q9880
5940C2571n0809k1130R8176J9162o6748R373J27367K3964n5991j65659j75353
5929b25077J32172J05187L3398J7171J859o1422r4616j94062J33117J14500p2554
5918a10327L8329O5083p0704J94214Q7829k23379k1954J1608j31660J51988M584
5907d389J3901l5546K29842j19332p7455k5727L9636m7579q5217J31695o6800
5896d6971k1006j8091K23998q366j54001j70624L1722J99191J6184n8204q6629
5885i2797q1521J25718J02710J4477q5598n5173J0981L3893P1155J28211j43078
$$ plain form
5965 -81910 10910 16788 -159597 -137324 -42378 57592 46999 10483 18592 -12029 -84312 -33230
5953 -33230 -28072 -20847 -70668 44931 37823 -79485 -85364 -127677 11765 12019 -63291 -57309 32571
5940 32571 -18238 -39368 58808 77970 11222 20595 147962 171926 115935 -49724 -225077
5929 -225077 -92905 12282 45680 62851 64710 3288 -91328 -285390 -152273 -37773 -110327
5918 -110327 -71998 -6915 -77619 116595 204424 -18955 -40909 -29301 -160961 -8973 -4389
5907 -4389 9512 -26034 203808 84476 7021 -18706 20930 -26649 -111866 19829 -46971
5896 -46971 -67977 -86068 137930 129564 -24437 -195061 -163339 35852 52036 -6168 -92797
5885 -92797 -174318 -48600 54110 68587 -17011 -72184 -61203 -27310 43845 172056 28978
5874B8978j4569j31974J60734n1503o2363m400j2272P181M9498L286R4115n0533
5862A6178r9234P0935J4693N899k9109m5045J39386L6427l3357R1750m900n261
5850A58362m8298L4275j94874l5991K4745J10731m2737Q8790L2140o1266q2221
5839a6344n592Q096m6236J14383J11694M7544p0378K5700J1234L4555j08766m3647
5827F2243R8963j03572P7998j0949j0750K2090n9572K657K7940m9594o2400N7941
5815E2995r6854N7593Q7460N4047j5208P98p3640K6218l0127k8903p8276J47652
5803A03755M5557j49045N4360M0891k4911j1666j1041r0472L0968k4272J63248
5792A27372O2624j09693l0289J6555L0305j06522o3729R8090k5599k5018o9370
$$ plain form
5874 28978 14409 -117565 43169 -8334 -70697 -75097 -87369 -80188 -30690 -27404 66711 16178
5862 16178 -83056 -12121 2572 8471 -20638 -65683 73703 110130 76773 168523 163623 158362
5850 158362 110064 144339 -50535 -86526 -61781 48950 6213 95003 127143 65877 -16344
5839 -16344 -21936 -13840 -60076 54307 166001 213545 143167 168867 180101 214656 105890 62243
5827 62243 161206 57634 135632 124683 113933 136023 76451 79108 107048 57454 -4946 52995
5815 52995 -43859 13734 101194 155241 140033 140831 67191 93409 63282 34379 -43897 103755
5803 103755 149312 267 54627 95518 70607 58941 47900 -42572 -11604 -35876 127372
5792 127372 189996 80303 50014 66569 96874 -9648 -73377 24713 -886 -25904 -95274
5781i5274J09476J8662j48864P9236L3612J02084k1217p403k2040k42784J05687
5770h8825P4882p4789Q6521O2105K6479m4551l2294n0484J99573P536j78020m6791
5758e8658J33073j81205P5296J3280J1880L257M5253Q2721n8370m5020J43616
5747A65123j55j24852O0466K7101p3796Q2054J7906m9950R2213j63692q372J05671
5735A29717m6392j67725n051M1475q4766n5283K18037K4387m1713m7106K1146
5724a3274j73617J90393J83273r6892K022m9454K9436k3359j07687J8991N3666
5713A3498M9685j44648L5447J84990N6033n0183n8121J7880p2765j2658R472P3970
5701A02600m8178k8891J22513q9035n4389Q5509Q6472j02007J62839j13069j3636
$$ plain form
5781 -95274 14202 32864 -116000 -36764 -3152 98932 77715 70312 48272 -194512 -88825
5770 -88825 -13943 -88732 -2211 59894 86373 41822 9528 -40956 158617 166153 -11867 -58658
5758 -58658 74415 -106790 -31494 -18214 -6334 -3077 42176 124897 66527 21507 165123
5747 165123 164968 40116 100582 127683 53887 135941 153847 103897 196110 32418 24046 129717
5735 129717 83325 -84400 -89451 -47976 -132742 -188025 30012 54399 12686 -34420 -13274
5724 -13274 -186891 3502 186775 89883 91905 42451 71887 48528 -59159 -40168 13498
5713 13498 63183 -81465 -46018 138972 195005 144822 86701 104581 31816 19158 28630 102600
5701 102600 54422 25531 148044 59009 4620 90129 176601 74594 237433 124364 110728
5690A10728J6563N0478r890N6338r4911j75963j8769p9079J55403q690N1201j0010
5678D3399Q9388p0808j18583l4938m724M7805J12093O9255n9316m1376j02686
5667g0491K20090O4761k18148J16046j11770O2406n8378k7545M9573k057J07435
5656A31922r3571K0894R9760O554o4417K2680N9437L2926j26759l3740L9215o2916
5644C1985j1359O7018j0893K68685o5972j53735M8738j31355j99916J42885p4228
5633h8147j6848N6242J3902J0935L5800q9611M9422J77687j95222J52791k19547
5622a12596K01195N5943j54574Q3044M3443j31177J63567J51278L7515j72847
5612A64791l3309L0411P597p1653m4255L7990K3249N0646j7826K8190K4024l3902
$$ plain form
5690 110728 127291 177769 167879 224217 129306 -46657 -65426 -144505 10898 2208 53409 43399
5678 43399 132787 61979 -56604 -91542 -96266 -48461 63632 132887 73571 32195 -70491
5667 -70491 149599 214360 -3788 112258 488 62894 4516 -23029 26544 24487 131922
5656 131922 38351 59245 159005 165559 101142 123822 183259 216185 89426 55686 94901 31985
5644 31985 20626 87644 76751 345436 279464 125729 174467 43112 -156804 -13919 -88147
5633 -88147 -104995 -48753 -34851 -23916 11884 -77727 -28305 149382 -45840 106951 -112596
5622 -112596 88599 144542 -10032 73012 116455 -14722 148845 300123 337638 164791
5612 164791 131482 161893 169490 97837 53582 91572 114821 165467 147641 175831 199855 165953
5600A65953p5256p928p0625p7655k00362J52352L16590O0953p1633r9280j8266
5589G4843J5527R8940j20956j81658J81313J18308j805K3907l2845l1558l1156
5578A12860N6234r213N9990J3303j2774R04j09091J24045l6093R2083j85054P3873
5566A81067J35860n5831k5261j82844k4320l8954j9623Q5965J11469J08733k17353
5555E8908J36240N5930J03905m3127p8147M4770j66316O1573k9747k037k3575
5544A18377k5393k2283n7325K883J03513j24034K4115J79415P3515j35227j24280
5533A3276K1764J02664M5909J8929R9695j2463P341j03864r8398N7528n3734J01733
5521B00380j48024R120J14407n3098J04494J47207j92202J42866K324j31634K1425
$$ plain form
5600 165953 90697 82769 12144 -65511 -265873 -113521 203069 264022 192389 93109 74843
5589 74843 90370 189310 68354 -113304 68009 186317 184512 208419 175574 144016 112860
5578 112860 169094 159881 219871 233174 220400 221304 112213 236258 200165 292248 107194 181067
5566 181067 316927 261096 235835 52991 28671 -10283 -29906 56059 167528 276261 58908
5555 58908 195148 251078 354983 311856 233709 278479 112163 173736 143989 141952 118377
5544 118377 92984 70701 13376 16259 119772 -4262 19853 199268 272783 137556 13276
5533 13276 35040 137704 183613 202542 302237 289774 297115 193251 94853 152381 98647 200380
5521 200380 52356 61476 175883 122785 227279 374486 182284 325150 327474 195840 217265
5510B17265k4008m0040j57047R2921J37762j2499j31527J74994j14058n7644l1601
5499E4518J42937l4599K36910l0322k59062j0797J29287J05493L41j95678j06421
5488C2607J67329j605l3207J5399l6997R59K2356p1494J62395O8786o8859n4199
5476B03470R4219m2631j698K02387j11339j50032Q8333O1915j29649n6832J58927
5465C17070K9179L0313j89949J85073J69579l6887k04930M3732O9300j5549L2685
5454D29616N1406r0735J31140m0715L5184J4098j6070J20118J7886j2212n2988
5443E86728Q1221J6392p4224j4614J01222J3729l5197P3813l5893R6352J55j05028
5431G04656j6516k1556J57348J7643j14411J2436l3989o90m6611l8324n6962k295
$$ plain form
5510 217265 193257 153217 -3830 89091 226853 214354 82827 257821 143763 86119 54518
5499 54518 197455 162856 399766 369444 110382 99585 228872 334365 334706 139028 32607
5488 32607 199936 198331 165124 180523 143526 144485 166841 95347 257742 326528 257669 203470
5476 203470 297689 255058 253360 455747 344408 194376 282709 344624 214975 158143 317070
5465 317070 346249 376562 186613 371686 541265 504378 299448 343180 412480 396931 429616
5454 429616 481022 390287 521427 480712 515896 529994 513924 634042 651928 639716 586728
5443 586728 667949 684341 610117 595503 696725 710454 675257 749070 713177 809529 809684 704656
5431 704656 688140 666584 823932 841575 727164 739600 705611 704921 658310 619986 563024 560729
5419E60729m2800P9906j1498n8493J18672j43862k8113K8200N732j28361L8939
5408D19051K22351j55364j92914K67492O7716m772m4515j43422k090J13731l4123
5397E13141R1640M7816J27375k6148l6939n0553L3181K1527k957p6029J86903
5386H28957j41801p4277J49968P5384k32q969j09781p09l0392R7659m0647r6207
5374F48953K3504p1175J5641Q8446p443j15019k1954M415R4169K3116K6064r3660
5362F15057L9837J1313l592L3396o7459r308J38642j21656q3190n4274J22300
5351F21066q518j36225J97306K2189L503N2529n6958Q1140n1810l7419R4773Q7215
5339H68791q0440l8715L6585n0090l3945O82L7309J02121r055M8892k9159P5634
$$ plain form
5419 560729 517929 597835 586337 527844 646516 502654 474541 502741 508473 380112 419051
5408 419051 641402 486038 293124 560616 628332 623560 579045 435623 433533 547264 513141
5397 513141 604781 652597 779972 753824 716885 666332 699513 721040 718083 642054 828957
5386 828957 687156 612879 762847 838231 837999 829030 719249 718540 688148 785807 745160 648953
5374 648953 672457 601282 616923 705369 697926 582907 560953 565368 659537 682653 708717 615057
5362 615057 654894 666207 662615 696011 628552 619244 757886 636230 553040 498766 621066
5351 621066 612548 476323 673629 695818 699321 751850 694892 776032 724222 686803 781576 868791
5339 868791 788351 749636 786221 736131 702186 702868 740177 842298 833243 882135 852976 928610
5327I28610K0959l27q5123m8436Q8110k031Q2605l3121L0474n3051R5810P3429
5315A097908r5548j20336P2497P2275m1665p6036J89890J24261n3691k1647Q8921
5304A236829j0565Q950j12552n7135N8342P5427M1076m8336J00730j9574P2887
5293A346079j1194n2763j06181r53N2141k6337L5877M0676k9484K15309m8075
5282A415095J38942N6930j50220m2223R3736m9896J40426J00908j01955N5960
5272A657703j0857l1001J05526J55787j33854J7431J59994L8400J1581J28684
5262B099394j02739J34124K9627j5079P5224K6298P5921P8593K4207j01984j7492
5251B306094J0372J34039J4487J27664L1240J33148R7584N1398L22604j26788
$$ plain form
5327 928610 949569 949242 864119 815683 903793 901762 984367 951246 981720 928669 1024479 1097908
5315 1097908 1002360 882024 954521 1026796 985131 909095 1098985 1223246 1169555 1147908 1236829
5304 1236829 1226264 1235214 1122662 1065527 1123869 1199296 1240372 1192036 1292766 1273192 1346079
5293 1346079 1334885 1282122 1175941 1174988 1227129 1200792 1236669 1277345 1247861 1463170 1415095
5282 1415095 1554037 1610967 1460747 1418524 1512260 1462364 1602790 1703698 1601743 1657703
5272 1657703 1646846 1615845 1721371 1877158 1743304 1760735 1920729 1959129 1970710 2099394
5262 2099394 1996655 2130779 2160406 2145327 2220551 2246849 2322770 2401363 2425570 2323586 2306094
5251 2306094 2316466 2450505 2464992 2592656 2623896 2757044 2854628 2906026 3228630 3101842
5241C101842k02293K28301J85005J55430K26221O7936k0826K04386P3962Q5466
5231D105430J44062J25352J71301J75838K07117K42354P3207L01148K77422K35170
5221F058401K89804L04550K90407M31449L03795M71117M90124L54044M60785O64014
5211A0118490O50974P21961P16870Q47143Q08494P11681R99198J074521J057818
5202A7707150J079973J133852J308542J397173J276868J659527J629838J755181
5194B8948104J922252K172110K193621K673480K932091L194411L602269L991008
5186E1629346M440205M828693N248827N178331M805547L949642K497490J170243
5178H3748324K98123J00387K8434L25704J11257l65319j366680k905890m176308
$$ plain form
5241 3101842 2899549 3127850 3312855 3468285 3694506 3762442 3741616 3946002 4019964 4105430
5231 4105430 4249492 4374844 4546145 4721983 4929100 5171454 5244661 5545809 5823231 6058401
5221 6058401 6348205 6652755 6943162 7374611 7678406 8149523 8639647 8993691 9454476 10118490
5211 10118490 10769464 11491425 12208295 13055438 13863932 14575613 15574811 16649332 17707150
5202 17707150 18787123 19920975 21229517 22626690 23903558 25563085 27192923 28948104
5194 28948104 30870356 33042466 35236087 37909567 40841658 44036069 47638338 51629346
5186 51629346 56069551 60898244 66147071 71325402 76130949 80080591 82578081 83748324
5178 83748324 84046447 84146834 84175268 84500972 84612229 84246910 82880230 79974340 75798032
5169G5798032n221538n837792n658640n358814m806229m429447m093136l465260
5161C6927176l163774k897126k436624k006145j810870j584215j458575j442372
5153B0127475j228088j229923j011790q78781r32308p10818p87998n58793n81357
5144A2207619o65422n00134l82365n54555m22588m68467m97642k64794m48133
5135H003519k22356l52138l02489l12900j35982k82710l69082j18256p2669k58363
5125E576574k98129K8915j63676j27711l34034n3426p6532m1566j55404j49830
5115D205181m2686k00606J2030j76500O4177q4723j49783j32292q2246j14598
5105C297954j31675L622K7046j4131r0255k3611r2224N725O4368j72749K0639
$$ plain form
5169 75798032 70576494 64738702 59080062 53721248 48915019 44485572 40392436 36927176
5161 36927176 33763402 30866276 28429652 26423507 24612637 23028422 21569847 20127475
5153 20127475 18899387 17669464 16657674 15778893 14846585 14135767 13347769 12788976 12207619
5144 12207619 11542197 11042063 10659698 10105143 9682555 9214088 8716446 8451652 8003519
5135 8003519 7781163 7429025 7126536 6813636 6677654 6394944 6025862 5907606 5834937 5576574
5125 5576574 5278445 5307360 5143684 5015973 4681939 4628513 4551981 4510415 4355011 4205181
5115 4205181 4162495 3961889 3973919 3797419 3861596 3776873 3627090 3494798 3412552 3297954
5105 3297954 3166279 3169901 3196947 3182816 3092561 3068950 2976726 2982451 3046819 2874070 2894709
5094B894709J1662j13708j70985Q993L0669j26049n8232R2514J3073j01918k07734
5083B272994n7491M7137J44554l8336l4827m5264R2825Q5572j80814o9819N963
5072B222494j18465M4332J02349q4820j11489R0017M7448j13212M6755l2423O3500
5061B156486p9064O4215J37889K6317o1710r5441j73244K81166j30528j7646p270
5050B101170l2370o0148P1751p7648J42715j0442M461J11800q0051J04495q4814
5039B190919L2018Q1981J4303o7693l1541J15190N574J6814L448K3963k00349
5028B184627L9039L27J3182J51196J3891l0671J9163P9730j7438n5276m5191J96304
5016B548883K658l7946J3944M3917J50116m1822k6827R0539j28712M9851J62281
$$ plain form
5094 2894709 2906371 2792663 2621678 2630671 2661340 2535291 2477059 2569573 2582646 2480728 2272994
5083 2272994 2215503 2262640 2407194 2368858 2334031 2288767 2381592 2467164 2286350 2216531 2222494
5072 2222494 2104029 2148361 2250710 2165890 2054401 2144418 2191866 2078654 2125409 2092986 2156486
5061 2156486 2077422 2141637 2279526 2305843 2244133 2148692 1975448 2256614 2126086 2108440 2101170
5050 2101170 2068800 2008652 2080403 2002755 2145470 2135028 2139489 2251289 2171238 2275733 2190919
5039 2190919 2222937 2304918 2319221 2251528 2219987 2335177 2340751 2357565 2361013 2384976 2184627
5028 2184627 2223666 2223993 2237175 2388371 2402262 2371591 2390754 2470484 2453046 2397770 2352579 2548883
5016 2548883 2551541 2513595 2527539 2571456 2721572 2679750 2652923 2743462 2614750 2664601 2826882
5005B826882J21913K58563K8005J26214R580j73535K94245J64033o1591K56410
4995C850719J48039J88363R8152j30066M45945J00343J88486K38866L26079L02435
4985E757361K73350L08139L17695L08166K85880M90645M18033O92173M99282M13943
4975I764667M87242Q07652Q01540N90054P48733N99091R29915J167770J190862
4966A7087526J178456J311964J529215J915004K223384K557735K781378K802868
4958C3387530K659803K185275K013294J873351K170369K499226K569837K796772
4950E2155457K192650P12716j005106k294894k954346k913458k331250k196703
4942D1365066j920125k042269k287497k306979k423145k279939k053522j717353
$$ plain form
5005 2826882 2948795 3207358 3235363 3361577 3371157 3197622 3491867 3655900 3594309 3850719
4995 3850719 3998758 4187121 4285273 4155207 4601152 4701495 4889981 5128847 5454926 5757361
4985 5757361 6030711 6338850 6656545 6964711 7250591 7741236 8159269 8851442 9350724 9764667
4975 9764667 10251909 11059561 11861101 12451155 13199888 13798979 14728894 15896664 17087526
4966 17087526 18265982 19577946 21107161 23022165 25245549 27803284 30584662 33387530
4958 33387530 36047333 38232608 40245902 42119253 44289622 46788848 49358685 52155457
4950 52155457 54348107 55060823 54055717 51760823 48806477 45893019 43561769 41365066
4942 41365066 39444941 37402672 35115175 32808196 30385051 28105112 26051590 24334237
4934B4334237j612251j205283r20122o35682q09556m84117k12931l02600j54206
4925A7997489q2429k6411Q7620O9795p6115J3384L3717n1575J65482L6586O0224
4914A8227767o409j59575j4184k0242j59460j16924j30300j99417j67041m40111
4904A6814104n35496k95551m77395n16120l39862m40941m13751l47578m64613
4895A2982797l82454n01477n52831m21199l81025k34004l56401m20565m31416
4886I301425j76962m70927k20618j77618m38619j94776k20928j76891q8448l26673
4876F808965j89918j60824j59955k65946j25474o4080j71350j64656o8998j88119
4866E249645k08912l6958j68757j19454j54473q5496P676j40736L944j50966r8429
$$ plain form
4934 24334237 22721986 21516703 20596581 19960899 19151343 18667226 18454295 18151695 17997489
4925 17997489 17915060 17888649 17976269 18046064 17969949 17983333 18017050 17965475 18130957 18167543 18227767
4914 18227767 18221358 18061783 18047599 18027357 17867897 17750973 17620673 17421256 17254215 16814104
4904 16814104 16278608 15983057 15505662 14989542 14649680 14208739 13794988 13447410 12982797
4895 12982797 12600343 12098866 11546035 11124836 10743811 10509807 10153406 9732841 9301425
4886 9301425 9124463 8653536 8432918 8255300 7816681 7621905 7400977 7224086 7135638 6808965
4876 6808965 6619047 6458223 6298268 6032322 5906848 5842768 5671418 5506762 5437764 5249645
4866 5249645 5040733 5003775 4835018 4715564 4561091 4475595 4483271 4342535 4346479 4195513 4097084
4855D097084j57304k52657p1010r6058P582r5644N476k08548j0748r5340L9931
4844C162764j27690k9191j354k11519N9067j35762j04178o029j9356o2748p1717
4833B452287q7252k2284L2285l2475o634j2279J2212m883n2718n9245J4547L3092
4821B266653q6762q4265j06344J6206R786j13412M167l1046O5058O4378J35845
4810B140264n7604j34382Q3595l7174O7579M1996k28660m7309p4611j7827J25797
4799A861664M6478N6556l8262K846J4429r315n4555k0827k8148J1821L5271P9450
4787A957408p8422P3962p0672K9853o327K1890n0876q0519j0058O3408N4938p786
4775A896799l9820J75073n9912Q1379l2186l4234R7418m6532L5929J8507J43286
$$ plain form
4855 4097084 3939780 3687123 3616113 3520055 3527637 3431993 3437469 3228921 3218173 3122833 3162764
4844 3162764 3035074 3005883 3004529 2793010 2852077 2716315 2612137 2606108 2586752 2524004 2452287
4833 2452287 2365035 2342751 2375036 2342561 2335927 2323648 2335860 2330977 2278259 2219014 2233561 2266653
4821 2266653 2179891 2095626 1989282 2005488 2015274 1901862 1906029 1874983 1940041 2004419 2140264
4810 2140264 2082660 1948278 2031873 1994699 2062278 2104274 1875614 1828305 1753694 1735867 1861664
4799 1861664 1908142 1964698 1926436 1929282 1943711 1934396 1879841 1859014 1830866 1842687 1877958 1957408
4787 1957408 1878986 1952948 1882276 1912129 1905802 1927692 1876816 1796297 1786239 1849647 1904585 1896799
4775 1896799 1856979 2032052 1972140 2053519 2021333 1987099 2084517 2037985 2073914 2092421 2235707
4764B235707j45155k9277Q5731J28545j01994L347K2689J17043J0918L0363O7197
4753B425114p1706J7148N9033m7921J55154L9012r0970J48615J01686l7999M9385
4742B746551Q3992j0002Q2718P0560N1020r0643J72984n312o1979Q3109J21748
4731C244746K3664R9424N5107M782P0512L2284k3741P8120J65414J03797P234
4720C861343r6908n9847K6477J41559Q0951Q1168j7148O3913J67223Q7055J44339
4709D480125n963J35987J77247p7524O8194J99483J73928K9187R4646K32532J40231
4698E648073J06896R0863k2722K61420L30095q7294J73402M25253K94111J50288
4688G370385N3731L21347J83239J66482J40342J61800J14848J93178Q2271O620
$$ plain form
4764 2235707 2090552 2061275 2147006 2275551 2173557 2176904 2199593 2316636 2327554 2357917 2425114
4753 2425114 2353408 2370556 2429589 2381668 2536822 2575834 2484864 2633479 2735165 2697166 2746551
4742 2746551 2830543 2820541 2903259 2973819 3024839 2934196 3107180 3101868 3039889 3122998 3244746
4731 3244746 3268410 3367834 3422941 3427723 3498235 3530519 3506778 3584898 3750312 3854109 3861343
4720 3861343 3764435 3704588 3731065 3872624 3953575 4034743 4017595 4081508 4248731 4335786 4480125
4709 4480125 4474162 4610149 4787396 4709872 4778066 4977549 5151477 5180664 5275310 5507842 5648073
4698 5648073 5754969 5845832 5823110 6084530 6414625 6327331 6500733 6925986 7220097 7370385
4688 7370385 7424116 7745463 7928702 8095184 8235526 8397326 8512174 8705352 8787623 8794243
4678H794243P1400J9187R5502K09277j43499O0276Q1081j19938r8635p4709o3944
4667H830241K0820j30021j42600k3023j55724k59375l41352l15601k31095j23448
4657G128822k21710j53394k43616j37832j37641L9926m6798k35065k9399o9008
4647E894285J9875j72245j16087j6647q5399k2028k12749j61664j47527n5237
4637D924577Q8666j8535K7888p5199M9010o2811R7807n375K9893R2982o011l0537
4625E112355J19914K9887j02642m541L0396p7216j84528P3240m9055j05546j19805
4614D722459N4752K1696o2972j88186R9092j31924q3694J78305j31897o5021Q7318
4603D499928J35825J6563j01545P4719J45439k6879j48310r895m0816l7136L9717
$$ plain form
4678 8794243 8865643 8884830 8980332 9189609 9046110 9106386 9187467 9067529 8968894 8894185 8830241
4667 8830241 8851061 8721040 8578440 8555417 8399693 8140318 7798966 7483365 7252270 7128822
4657 7128822 6907112 6753718 6510102 6372270 6234629 6274555 6227757 5992692 5963293 5894285
4647 5894285 5914160 5741915 5625828 5609181 5523782 5501754 5289005 5127341 4979814 4924577
4637 4924577 5013243 4994708 5022596 4947397 4996407 4933596 5031403 5026028 5055921 5148903 5142892 5112355
4625 5112355 5232269 5262156 5159514 5154973 5185369 5108153 4923625 4996865 4947810 4842264 4722459
4614 4722459 4777211 4798907 4735935 4547749 4646841 4514917 4431223 4609528 4477631 4412610 4499928
4603 4499928 4635753 4652316 4550771 4625490 4770929 4744050 4595740 4585845 4545029 4507893 4547610
4592D547610J15956M9958P1751J02738J22023r258k2974P4205l6132Q6110J95220
4581E297207p9341n452O6567O2566J32570P1253l3139J04274J12420L3103J65459
4570E927487J09649L9773K4339J05651J06179J12269Q0513O7697N0741j1800O8023
4559F680521J40593M5367K949N168N0394J25871R1045J01033J5555K5515J50933
4548G434944M9129N0367J07800J78621K45015O4417j05567N1460K5766R0480J19024
4537H311456J72438K21023P7244K73313J61882J43350J47385p3964K04098J35698
4527I773923K13627L43874O3361J25096K06962L31704J51300L67747J90711J20598
4517A1888903K85123L08145K19278J57182L43052K79018J09671L18566L11218
$$ plain form
4592 4547610 4663566 4713524 4785275 4888013 5010036 5000778 4977804 5052009 5015877 5101987 5297207
4581 5297207 5217866 5212414 5278981 5341547 5474117 5545370 5512231 5616505 5728925 5762028 5927487
4570 5927487 6037136 6076909 6101248 6206899 6313078 6425347 6505860 6573557 6624298 6612498 6680521
4559 6680521 6821114 6866481 6869430 6874598 6924992 7050863 7141908 7242941 7258496 7284011 7434944
4548 7434944 7484073 7534440 7642240 7820861 8065876 8130293 8024726 8076186 8101952 8192432 8311456
4537 8311456 8483894 8704917 8782161 9055474 9217356 9360706 9508091 9434127 9638225 9773923
4527 9773923 9987550 10331424 10394785 10519881 10726843 11058547 11209847 11577594 11768305 11888903
4517 11888903 12174026 12482171 12701449 12858631 13201683 13480701 13590372 13908938 14220156
4508A4220156K56754L05236L17592L28331L35587L47060L50125N55756L77462
4499A7394059M59186M16538M04568N18540N50106N61184O21751N07665P49589
4490B2183186P08551O10111P96967Q78143O63747R80801Q98749R96661Q92640
4481B9609556J077727J158252J300673J413041J378863J540183J445959J835208
4473D0759462J857929J777070K192585K336655K424126K620268K895693K991885
4465E9855673L172960L646235L896467M275638M299476M827468M934137N191137
4457I4099191N725666O292530O335429O599997O910907P371535P738848P861057
4449A48935160Q499682R057542R866927J0538416J1365904J2683695J3660125
$$ plain form
4508 14220156 14476910 14782146 15099738 15428069 15763656 16110716 16460841 17016597 17394059
4499 17394059 17853245 18269783 18674351 19192891 19742997 20304181 20925932 21433597 22183186
4490 22183186 22891737 23501848 24298815 25176958 25840705 26821506 27720255 28716916 29609556
4481 29609556 30687283 31845535 33146208 34559249 35938112 37478295 38924254 40759462
4473 40759462 42617391 44394461 46587046 48923701 51347827 53968095 56863788 59855673
4465 59855673 63028633 66674868 70571335 74846973 79146449 83973917 88908054 94099191
4457 94099191 99824857 106117387 112452816 119052813 125963720 133335255 141074103 148935160
4449 148935160 157434842 166492384 176359311 186897727 198263631 210947326 224607451
4442B24607451J4940019J6309009J7963376J9695665K1343062K3121804K4967946
4435C62948332K6640323K7238512K6620417K4583150K0598638J4016894N559314
4428E08205580l804678j2791426k0335568k5716440k8462471k9680419k9379953
4421C58034625k8335860k6384446k4289721k2355531k0307602j8326150j6486424
4414B01548891j4780799j3366758j2045450j0765106r753732q833033q172677
4407A23831336p520396o802798o131905n537939n306717m899830m545613m118804
4399G8967334l697510l619246l405397l344138l022784k831458k625993k589331
4391E3831477k362213k014954j923473j947757j765023j646289j729668j572636
$$ plain form
4442 224607451 239547470 255856479 273819855 293515520 314858582 337980386 362948332
4435 362948332 389588655 416827167 443447584 468030734 488629372 502646266 508205580
4428 508205580 504400902 491609476 471273908 445557468 417094997 387414578 358034625
4421 358034625 329698765 303314319 279024598 256669067 236361465 218035315 201548891
4414 201548891 186768092 173401334 161355884 150590778 140837046 132004013 123831336
4407 123831336 116310940 109508142 103376237 97838298 92531581 87631751 83086138 78967334
4399 78967334 75269824 71650578 68245181 64901043 61878259 59046801 56420808 53831477
4391 53831477 51469264 49454310 47530837 45583080 43818057 42171768 40442100 38869464
4383C8869464j360688j427247j373703j081709r86641j105967j186833j074502
4375B9272174r51886q48602q55351q40432q45435q85584o84669n79449p06708
4366B2074058q03810n90326o83269m18117o32853n32284l01191n26727m86535
4357A7098946m97411m33073l29385l23475m44669n85223l40146k72509k93829
4348A3579226n20273j88886j60510m29326m68102k57562k32311k2356j71874k77264
4338A0850762k81059j66371l08546j50915j56775k69243k79364j21343q7570j66646
4328H862930k27968o6379k47025l24774j27229j15503j74082j02829L7784k33733
4318G281192m1403j34378k22184k10662K2148j15350r3812j44998l16294j79748
$$ plain form
4383 38869464 37508776 36081529 34707826 33626117 32639476 31533509 30346676 29272174
4375 29272174 28320288 27471686 26616335 25775903 24930468 24044884 23360215 22780766 22074058
4366 22074058 21270248 20679922 19996653 19578536 18945683 18413399 18112208 17585481 17098946
4357 17098946 16601535 16168462 15839077 15515602 15070933 14485710 14145564 13873055 13579226
4348 13579226 13058953 12870067 12709557 12280231 11812129 11554567 11322256 11299900 11128026 10850762
4338 10850762 10569703 10403332 10094786 9943871 9787096 9517853 9238489 9117146 9029576 8862930
4328 8862930 8634962 8568583 8321558 7996784 7869555 7754052 7579970 7477141 7514925 7281192
4318 7281192 7239789 7105411 6883227 6672565 6694713 6579363 6485551 6340553 6024259 5844511
4308E844511M3130o6597j20034k48573m8774j87950q7761p5002j20364j55278
4298D777308j70344R4803q1563l21512J41883j38332o631j9533n2424j28231K0261
4287D115685p3996k3499j19195O2321p3461j74400p4471K3216M8421j96637J2162
4276C526146j9571N2183p4165j17412p9590R7613l9621J2142r7212j43851P03
4265C117365N0143j208j05414R057l5889N901r4321M5642p0312j62807N2694L1036
4253B841887L4227j8090M298n0868L2314n4557k15359P2552r1819n4301j12539
4242B387745N2464J25039j13016k8160M6989r1861j05005q042k4164J26603q9329
4231B279263j50860M5783M9088q2586k25013m2068K07814J3073N5584o8191j5331
$$ plain form
4308 5844511 5887641 5821044 5701010 5452437 5403663 5215713 5127952 5052950 4932586 4777308
4298 4777308 4606964 4701767 4620204 4298692 4440575 4302243 4295612 4276079 4223655 4095424 4115685
4287 4115685 4041689 4018190 3898995 3961316 3887855 3713455 3638984 3662200 3710621 3513984 3526146
4276 3526146 3506575 3558758 3484593 3367181 3287591 3385204 3345583 3357725 3260513 3116662 3117365
4265 3117365 3167508 3166300 3060886 3069943 3034054 3039955 2945634 2991276 2920964 2758157 2810851 2841887
4253 2841887 2876114 2858024 2862322 2811454 2843768 2789211 2573852 2646404 2554585 2500284 2387745
4242 2387745 2440209 2565248 2452232 2424072 2471061 2379200 2274195 2266153 2241989 2368592 2279263
4231 2279263 2128403 2174186 2223274 2140688 1915675 1873607 2081421 2094494 2150078 2081887 2066556
4220B066556o8823o7441k6580L1248O7714J7301n5721k9766P0802q5708p3396
4209A846186m4525o799J3162p3772l3063k1591k8291l7303q1525J7897J50447
4198A700823j26900j30881J10431O6328O1344r2438j44239O8568l6400j5781J37510
4187A598365j04592j0570j07601K9004R7328O654n3633j01217Q3558m0870Q881
4176A405307n663M4078j86771O7744l3778J4335O138L4666O3985M0728N1203q4914
4164A417058q028k3530M3832n3615j5113p4481n2960N5375j45104Q3484K0697
4153A247615l6347K4270j26289O7798J58055p5702K4674K6178M5732j38641Q8768
4142A306111n3925j9705m9558L5680j37287l779J99179Q9520o0026j68509K0708
$$ plain form
4220 2066556 1997733 1930292 1903712 1934960 2002674 2019975 1964254 1934488 2005290 1919582 1846186
4209 1846186 1801661 1794862 1808024 1734252 1701189 1679598 1651307 1614004 1532479 1550376 1700823
4198 1700823 1573923 1443042 1553473 1619801 1681145 1588707 1444468 1513036 1476636 1460855 1598365
4187 1598365 1493773 1483203 1375602 1404606 1501934 1508588 1454955 1353738 1437296 1396426 1405307
4176 1405307 1399644 1443722 1256951 1324695 1290917 1305252 1311390 1346056 1410041 1450769 1501972 1417058
4164 1417058 1409030 1385500 1429332 1375717 1360604 1286123 1233163 1288538 1143434 1226918 1247615
4153 1247615 1211268 1235538 1109249 1177047 1335102 1259400 1284074 1310252 1355984 1217343 1306111
4142 1306111 1252186 1232481 1182923 1218603 1081316 1077537 1276716 1366236 1306210 1137701 1158409
4131A158409O3856j08042N9309J3441j26038J20146j24579K720J30711J44663
4121A334596j40260o1026q4620M0205n2129n88j01048O008J48897J47598J7087
4110A254720j98508P172M8943j262J00386j39843J14601J9216j44619M9895n6352
4099A054349j7932j7885m1879j2863J78806L0737j25325M3j20532j08023K17775
4088A037271P4878m6793j71135o0134J89815o0051j923j43931K856J28853N3144
4077A002850p5497Q0341J65904k17619q6557l6424l6220P4583J16229l5562j48123
4066H03905R8710N6498m7548j45203l7551L2261J6786J61367l7294j18852J48383
4055I31462p0842M9935N4073k0340J13207q8030j53752J6696Q131O6698N0988
$$ plain form
4131 1158409 1222265 1114223 1173532 1186973 1060935 1181081 1056502 1059222 1189933 1334596
4121 1334596 1194336 1133310 1048690 1088895 1036766 1036178 935130 941138 1090035 1237633 1254720
4110 1254720 1056212 1063384 1112327 1111065 1211451 1071608 1186209 1205425 1060806 1110701 1054349
4099 1054349 1036417 1018532 976653 963790 1142596 1173333 1048008 1048051 927519 819496 1037271
4088 1037271 1112149 1065356 894221 834087 1023902 963851 961928 817997 820853 949706 1002850
4077 1002850 927353 1007694 1173598 955979 869422 832998 796778 871361 987590 952028 803905
4066 803905 902615 959113 911565 766362 728811 761072 777858 939225 901931 783079 931462
4055 931462 860620 910555 964628 944288 1057495 969465 815713 832409 840540 907238 958226
4044I58226q2395l9887Q0319j9741l8434J00633J24675j8363l1297m1033l3954
4033I58749k573K9050J23860N9638n3629P2936K003k4092r7636j16396J57895
4022A109805j42497J12122R2479N11J06540j20496p5112l7039n2011k5224L0245
4011I99323m0695J6590J05965m2811K3723J9611j92118N8349j84885K5513J24201
4000I12766J7526j14092m1933L3394J16135R8087j44719k9644m8160J16731J0063
3989I26154p3199K6126q6437J62502m9647n3234o0934O0475J12784N3961o5248
3978I53303j49794n2304j36317K13472O8551j9825j49686J16865j8691n6350J92839
3967I62063M9131j56941M9641m0365J7669k6419m6445O5153j5936q621J928l004
$$ plain form
4044 958226 875831 835944 916263 896522 858088 958721 1083396 1065033 1033736 992703 958749
4033 958749 956176 985226 1109086 1168724 1115095 1188031 1190034 1165942 1068306 951910 1109805
4022 1109805 967308 1079430 1171909 1172420 1278960 1158464 1083352 1046313 994302 969078 999323
4011 999323 958628 975218 1081183 1038372 1062095 1081706 889588 947937 763052 788565 912766
4000 912766 930292 816200 774267 807661 923796 1021883 877164 847520 799360 916091 926154
3989 926154 852955 879081 792644 955146 905499 852265 791331 851806 964590 1018551 953303
3978 953303 803509 751205 614888 828360 896911 877086 727400 844265 825574 769224 962063
3967 962063 1011194 854253 903894 863529 881198 854779 808334 873487 857551 848930 850858 847854
3955H47854k1067M6791Q9873k8815J52443l8629m6562j25959J32067j7069J5134
3944A006061K16397j69532j90900M3280Q1162R2181m253o6901J36934l3880j43801
3933I66748k193M1913M576M1738J89796j34653J9173j2256j3941J8736m2529P354
3921A084462j33826j7546J34194j08832J91509J28988j32112j41258O8845N1627
3911A126051k6626l5531j41256O4769j1040L028J07019O7980L9663J25132j70010
3900A149179L4518j8997n5616N9781N2029P1400J30025j32227j7179l3773l4202
3889A204938J33126J8867J3853J42397k9949O1917j14440J0824O0042o6454j67235
3878A267886J53579J71786l688p5769J5090M5804k4598J02902k1762O0699Q5812
$$ plain form
3955 847854 826787 873578 963451 934636 1087079 1048450 1001888 875929 1007996 990927 1006061
3944 1006061 1222458 1052926 862026 905306 986468 1078649 1074396 1007495 1144429 1110549 966748
3933 966748 964555 1006468 1011044 1052782 1242578 1107925 1127098 1114842 1100901 1119637 1077108 1084462
3921 1084462 950636 933090 1067284 958452 1149961 1278949 1146837 1005579 1074424 1126051
3911 1126051 1099425 1063894 922638 987407 976367 979395 1086414 1154394 1194057 1319189 1149179
3900 1149179 1183697 1164700 1109084 1168865 1220894 1292294 1422319 1290092 1272913 1239140 1204938
3889 1204938 1338064 1356931 1370784 1513181 1483232 1545149 1430709 1441533 1501575 1435121 1267886
3878 1267886 1421465 1593251 1589563 1513794 1528884 1574688 1550090 1652992 1631230 1691929 1777741
3867A777741K6614R502P1274J20609j14690j55859Q2147n5614K57651K65M0046
3856B059686Q8103o4911K18698l7328j1783O2894j5433j9349J76570P4526r5164
3845B436509K77694N2384j10185J70423J49066J31530J30816k363J4938L02177
3835C552989K49583J14108J82755J61956J75884L49997J81516K89758M58529L01446
3825F018521L19950M32798L45487O75432N30470O67694N37212O28933O20561O76455
3815A1453513Q16857P34199Q41495R31525J169876J106188J339432J433541J717274
3806B1543900J941575K220642K622214K958545K815448K623758K313690K439884
3798D1479656K983230L265435L453394K696066J628830Q99535J230272J874981
$$ plain form
3867 1777741 1804355 1813857 1885131 2005740 1891050 1735191 1817338 1761724 2019375 2019640 2059686
3856 2059686 2147789 2082878 2301576 2264248 2252465 2315359 2299926 2280577 2457147 2531673 2436509
3845 2436509 2714203 2766587 2656402 2826825 2975891 3107421 3238237 3235874 3250812 3552989
3835 3552989 3802572 3916680 4099435 4261391 4437275 4787272 4968788 5258546 5717075 6018521
3825 6018521 6338471 6771269 7116756 7792188 8322658 8990352 9527564 10156497 10777058 11453513
3815 11453513 12270370 13004569 13846064 14777589 15947465 17053653 18393085 19826626 21543900
3806 21543900 23485475 25706117 28328331 31286876 34102324 36726082 39039772 41479656
3798 41479656 44462886 47728321 51181715 53877781 55506611 56406146 57636418 59511399
3790E9511399K016003J333742o96638k298790k455198j933614j312987j590686
3782E2573231k612965l501304l811618l273096k852944k528926k711368k958311
3774B8322699k993330k779506k465551k043277j592864j521441j340097j015534
3766A2571099q02922q60730p41112n77579o17718m76044m72347l61888m73374
3757G187385l60446k30552l77935j30076j88405j63666j99807k66541j29325k08036
3747D932596j46355k42571L4217m1741k54751j54659q857k3143L2002j45890j33621
3736C847227j29996l6089n4785j24608J26375l7494K228j28575p4244m9841l3706
3725C306492j98343L2318Q1890K8224N5751j41251n0509K6205n6551j63826J03029
$$ plain form
3790 59511399 61527402 62861144 62164506 59865716 57410518 55476904 54163917 52573231
3782 52573231 49960266 46458962 42647344 39374248 36521304 33992378 31281010 28322699
3774 28322699 25329369 22549863 20084312 18041035 16448171 14926730 13586633 12571099
3766 12571099 11768177 10907447 10166335 9588756 8971038 8494994 8022647 7660759 7187385
3757 7187385 6826939 6596387 6218452 6088376 5899971 5736305 5536498 5269957 5140632 4932596
3747 4932596 4786241 4543670 4577887 4536146 4281395 4126736 4117879 4094736 4126738 3980848 3847227
3736 3847227 3717231 3681142 3626357 3501749 3628124 3590630 3592858 3464283 3390039 3340198 3306492
3725 3306492 3108149 3140467 3222357 3250581 3306332 3165081 3114572 3140777 3084226 2920400 3023429
3714C023429M8427M8784j75171N8115m3179n90n9813j74430n145j4735O0523J0278
3702B776493j03431q817j3257r9725R0670j0592j93192J12674o6475k1923j6625
3691B445800j26631K408J59421P0979j2456L2019j44915j39738M3465J18970N4216
3680B503538j63718J05756J00340j03134J18657j06879m2596K8279N1908l9514
3670B452637R774N8421J3946o5851O1738N223Q3649n4438K6937L3567K9332N2324
3658B707259M7869R6846j49973J2865J55092j00415M4446p4844n3630j5017P2204
3647B742702J55527P5285j37609R5512K6923l2630K273j32196J17064J39641Q343
3636C060835o7993n5825l1700k0236J28220J25438p4709m5236J59380M7160O5191
$$ plain form
3714 3023429 3071856 3120640 2945469 3003584 2960405 2959815 2900002 2725572 2720427 2705692 2766215 2776493
3702 2776493 2673062 2664245 2650988 2551263 2641933 2631341 2438149 2550823 2484348 2462425 2445800
3691 2445800 2319169 2321577 2480998 2551977 2539521 2571540 2426625 2286887 2330352 2449322 2503538
3680 2503538 2339820 2445576 2545916 2442782 2561439 2454560 2411964 2440243 2492151 2452637
3670 2452637 2462411 2520832 2534778 2468927 2530665 2535888 2619537 2565099 2592036 2625603 2654935 2707259
3658 2707259 2755128 2851974 2702001 2714866 2869958 2769543 2813989 2739145 2685515 2670498 2742702
3647 2742702 2898229 2973514 2835905 2931417 2958340 2925710 2927983 2795787 2912851 3052492 3060835
3636 3060835 2992842 2937017 2905317 2885081 3013301 3138739 3064030 3018794 3178174 3225334 3290525
3625C290525r6136j139J28911m349j61464Q8174K03509J01174P4055l2635j61513
3614C429112j3579J32441J00048n173m9737o4129J49204M8103M4202J4549R8394
3603C883435O1674r422P0262M8720O7788J30548J26664k3294J15747J38139m81
3592D609780M4889K57631o0294J36510J38348J93768m6002K59321J77525J15202
3582E826678Q2373K01943L23750J16797R8264K44259N1097K41392L39566J49659
3572G675778L15524L84251L48513L57981K03025M52269N28927K96331L88184M71295
3562A1422078N58390N55589N50526P73092O63480M40302P10520N77216O43663
3553A6894856O69751O65645P70770O47176P80403Q83757P80787Q31695P98301
$$ plain form
3625 3290525 3194389 3193250 3322161 3317812 3156348 3244522 3448031 3549205 3623260 3590625 3429112
3614 3429112 3415533 3547974 3648022 3642849 3593112 3528983 3678187 3726290 3770492 3785041 3883435
3603 3883435 3945109 3935687 4005949 4054669 4122457 4253005 4379669 4356375 4472122 4610261 4609780
3592 4609780 4654669 4912300 4852006 4988516 5126864 5320632 5274630 5533951 5711476 5826678
3582 5826678 5909051 6110994 6434744 6551541 6649805 6894064 6945161 7186553 7526119 7675778
3572 7675778 7991302 8375553 8724066 9082047 9285072 9737341 10266268 10562599 10950783 11422078
3562 11422078 11980468 12536057 13086583 13859675 14523155 14963457 15673977 16251193 16894856
3553 16894856 17564607 18230252 19001022 19648198 20428601 21312358 22093145 22924840 23723141
3544B3723141J011709Q37674Q83586Q18790Q46946Q48741P82233R30613R03925
3535C1587358R48920R85899J149400J062780J188626J243198J105745J301792
3527D0573718J445418J456837J650611J730185J803546J816528K206327K262650
3519E4945820K345882K634836K653784K654687K974242K950263L075015L175307
3511G7409836L402895L422760L379231L311001L454086L269073L338200L182977
3503A04170059L014373K780375K396658K514682J966351J870585J649003J397277
3495A21759363J094652P65848J52540l18104q82018j349316j438170j723386k120103
3486A15941306k281603k607218k861229l083395l329958l492563l503987l950103
$$ plain form
3544 23723141 24734850 25572524 26456110 27274900 28121846 28970587 29752820 30683433 31587358
3535 31587358 32536278 33522177 34671577 35734357 36922983 38166181 39271926 40573718
3527 40573718 42019136 43475973 45126584 46856769 48660315 50476843 52683170 54945820
3519 54945820 57291702 59926538 62580322 65235009 68209251 71159514 74234529 77409836
3511 77409836 80812731 84235491 87614722 90925723 94379809 97648882 100987082 104170059
3503 104170059 107184432 109964807 112361465 114876147 116842498 118713083 120362086 121759363
3495 121759363 122854015 123619863 123772403 123454299 122572281 121222965 119784795 118061409 115941306
3486 115941306 113659703 111052485 108191256 105107861 101777903 98285340 94781353 90831250
3478I0831250l784671l754962l678216l700631l430451l523849l387393l183981
3470F2387096l055833k868222k708524k513028k400164j954775k056528j636013
3462D3194009j524051j379906j039917o75602q05865n09550m82894j52570J15496
3453C6739150J43270M25074M97518O90640P21922P64996J054721J245775J035636
3444D3318702Q54971N68548O34686K86368r2562M5549j68498n25231o52780q58278
3434D3411475q10573r40529j112478j301676j434360j527804j644692j815269
3426C2824094j700074j567399j504265j562068j426657j220232j363385r79717
3418B1500297r17995p18978q77546p87402n97392o07611n25069m50076l06563
$$ plain form
3478 90831250 87046579 83291617 79613401 75912770 72482319 68958470 65571077 62387096
3470 62387096 59331263 56463041 53754517 51241489 48841325 46886550 44830022 43194009
3462 43194009 41669958 40290052 39250135 38574533 37768668 37259118 36776224 36623654 36739150
3453 36739150 36882420 37307494 37805012 38495652 39217574 39982570 41037291 42283066 43318702
3444 43318702 44173673 44742221 45376907 45663275 45570713 45616262 45447764 44922533 44269753 43411475
3434 43411475 42600902 41660373 40547895 39246219 37811859 36284055 34639363 32824094
3426 32824094 31124020 29556621 28052356 26490288 25063631 23843399 22480014 21500297
3418 21500297 20582302 19863324 18985778 18198376 17600984 16993373 16468304 16018228 15711665
3409A5711665l49392k77930l18340l60125k60074j87015j06360l32547k42990
3400A3276892o3754k73783r8638p3212j15418r5718K9389o0638j75374l9821o794
3389A2303131j91964R904k1013p2136N1687P4155M0505M1832L8172J11461K0482
3378A2406216l2908J40916N2304m190N6492J37071L13177J40495J76964J44239
3368A3530776K03116K57537J28193K11734L02141L57505K83003K25132J75686
3359A5674823L59189M67521L72716L05817O74273M97573M90386N02137N94854
3350A9939289O69033N32017R22663Q57577R42391J010209J067796J126485J276722
3341B8344182J221596J400469J358046J536823J698113J615546K022509K004422
$$ plain form
3409 15711665 15362273 15084343 14766003 14405878 14145804 13958789 13852429 13519882 13276892
3400 13276892 13213138 12939355 12840717 12767505 12652087 12556369 12585758 12525120 12349746 12309925 12303131
3389 12303131 12111167 12121071 12100058 12027922 12079609 12153764 12194269 12236101 12274273 12385734 12406216
3378 12406216 12373308 12514224 12566528 12562338 12618830 12755901 13069078 13209573 13386537 13530776
3368 13530776 13733892 13991429 14119622 14331356 14633497 14991002 15274005 15499137 15674823
3359 15674823 16034012 16501533 16874249 17180066 17854339 18351912 18842298 19344435 19939289
3350 19939289 20608322 21140339 22063002 22920579 23862970 24873179 25940975 27067460 28344182
3341 28344182 29565778 30966247 32324293 33861116 35559229 37174775 39197284 41201706
3333D1201706K148945K276421K604790K619142K842807L018649L062582L259730
3325F3034772L562110L647875L776778M381081M806026N048929N604371O417719
3317A00279661O734267P630752Q304961R205556J0376917J1667577J3148823J4784542
3309A82133056J6510005J7791945J8769103J8992176J8261787J5839055J2701738
3302C00998865Q897851N076951K208658j38382j505956k103622k905326l970822
3294C06558217n767339q073201j0916629j3936672j6619763j8529762j9279809
3287B13435042j8916573j7809272j6387334j5025872j3030862j1555892j0330014
3280A10379223q771422p711602o932888o027691n256069m494680m200052l442891
$$ plain form
3333 41201706 43350651 45627072 48231862 50851004 53693811 56712460 59775042 63034772
3325 63034772 66596882 70244757 74021535 78402616 83208642 88257571 93861942 100279661
3317 100279661 107013928 114644680 122949641 132155197 142532114 154199691 167348514 182133056
3309 182133056 198643061 216435006 235204109 254196285 272458072 288297127 300998865
3302 300998865 309896716 314973667 317182325 317043943 315537987 313434365 310529039 306558217
3294 306558217 300790878 292717677 281801048 267864376 251244613 232714851 213435042
3287 213435042 194518469 176709197 160321863 145295991 132265129 120709237 110379223
3280 110379223 101607801 93896199 86963311 80935620 75679551 71184871 66984819 63541928
3272F3541928l141436k868262k524294k241474k155102j893735j604562j522681
3264D5590382j456533j305633j076584j046315p95191q34065q75038o48571m78792
3255C7073660m36977k81703l63034r6783k3449p3616K56628K77486M06718L22312
3245C7061242O84412Q77312Q93250R37538R37590J266771J078269J027538J091954
3236D5855876J169343R08775J018452R98325Q23288R25637R04910P31769O28420
3227E3964795L82057J43654j24026k6081k41685j54290K0498N5321O2646J00528
3217E4183417J25658K47164J91411L33331N58979Q42561J000614J378659J606059
3208F0467853K174197K260880K587148L135965L554587L851517M314694M745073
$$ plain form
3272 63541928 60400492 57532230 55007936 52766462 50611360 48717625 47113063 45590382
3264 45590382 44133849 42828216 41751632 40705317 39910126 39076061 38201023 37552452 37073660
3255 37073660 36636683 36354980 35991946 35895163 35871714 35798098 36054726 36332212 36738930 37061242
3245 37061242 37745654 38622966 39516216 40453754 41391344 42658115 43736384 44763922 45855876
3236 45855876 47025219 47933994 48952446 49950771 50774059 51699696 52604606 53336375 53964795
3227 53964795 54346852 54490506 54366480 54340399 54098714 53944424 53964922 54020243 54082889 54183417
3217 54183417 54309075 54556239 54747650 55080981 55639960 56482521 57483135 58861794 60467853
3208 60467853 62642050 64902930 67490078 70626043 74180630 78032147 82346841 87091914
3200H7091914M949557N539746N614761N573101N666970N651151N522807N368985
3192A30978992N294130N326469N029978M893962M509784M087819L433800L090477
3184A66645411K484526J593539Q13689N31093N5578J03891M5954P4431J71766
3175A72519878j04355K39456N5575k04177j72244m33118m96631n74865o30627
3166A70198892q02690q35463p25984p25680o86363j072019j173113j714108k113459
3157A60350013k895853l457662l991328m794835n190063n170300n372536n491610
3149A23985826n568049n609357n376647n392151n636394n349342n329098n080951
3141H0643837m874910m720235m172923l649707l187523k945084k615276j932805
$$ plain form
3200 87091914 92041471 97581217 103195978 108769079 114436049 120087200 125610007 130978992
3192 130978992 136273122 141599591 146629569 151523531 156033315 160121134 163554934 166645411
3184 166645411 169129937 170723476 171537165 172068258 172123836 172227727 172273681 172348112 172519878
3175 172519878 172415523 172654979 172710554 172506377 172334133 171901015 171404384 170829519 170198892
3166 170198892 169396202 168560739 167834755 167109075 166422712 165350693 164177580 162463472 160350013
3157 160350013 157454160 153996498 150005170 145210335 140020272 134849972 129477436 123985826
3149 123985826 118417777 112808420 107431773 102039622 96403228 91053886 85724788 80643837
3141 80643837 75768927 71048692 66875769 63226062 60038539 57093455 54478179 52545374
3133E2545374j627230j208658q88609n81696k97231l94675k90007j09272j26900
3124D7021096k62146r7116l9735j64017L9539j20898k8569k77713m84150n85806
3114D5000485q91361j133875j252411j180970j453839j273900j353293j605206
3106C4855630j564757j456219j401214j402079j613026j562786j469515j191912
3098B3194122j518606j337125j108299r90408j106442q63732o98642o04254n85439
3089A4381175o59338n02678m10512m34910l01953l65142k23090m16002j86688
3080A0880862m87122k98259l17990j66603j61770k56325k61437k79479l23800
3071H328077k51439k42631k80924j90436k41911k85133l49339m1933k45924k28397
$$ plain form
3133 52545374 50918144 49709486 48820877 48239181 47941950 47547275 47257268 47147996 47021096
3124 47021096 46758950 46661834 46622099 46458082 46497621 46376723 46348154 46070441 45586291 45000485
3114 45000485 44109124 42975249 41722838 40541868 39088029 37814129 36460836 34855630
3106 34855630 33290873 31834654 30433440 29031361 27418335 25855549 24386034 23194122
3098 23194122 21675516 20338391 19230092 18239684 17133242 16269510 15570868 14966614 14381175
3089 14381175 13721837 13219159 12808647 12373737 12071784 11706642 11483552 11067550 10880862
3080 10880862 10393740 10095481 9777491 9610888 9449118 9192793 8931356 8651877 8328077
3071 8328077 8076638 7834007 7553083 7362647 7120736 6835603 6486264 6444331 6198407 5970010
3061E970010j32460k07362q9041k25723k02814p8225k07902k24485j40911k134
3051D458953J6170j72089j91657j48503J0214k73521O6840R8235k60586m7413
3041C556643j23993m9091J15935m1476m08498j65416J9234m12o2695J07388j59435
3030B788184N4008j29394n8066n66K4134r3496k11221J55697j52731R3130p6807
3019B392872m3280J40595j01486n7641J26p869j03762P5382J04199l428j52726
3008B242982n7657j47583P7203N148j8520j07006j6349o811K4392j29676r9899
2997A766224R3216M3685m2070l3029p823J83983r0615j80849k3329q0326O5103
2986A694170J08203j87723J55867N9542j33899p4365L8195Q9943J23998M68L8309
$$ plain form
3061 5970010 5837550 5630188 5541147 5315424 5112610 5034385 4826483 4601998 4461087 4458953
3051 4458953 4475123 4303034 4111377 3962874 3973088 3699567 3766407 3864642 3604056 3556643
3041 3556643 3432650 3383559 3499494 3458018 3049520 2884104 2903338 2902926 2840231 2947619 2788184
3030 2788184 2842192 2712798 2654732 2654166 2678300 2584804 2373583 2529280 2376549 2469679 2392872
3019 2392872 2349592 2490187 2388701 2331060 2331186 2323317 2219555 2294937 2399136 2395708 2242982
3008 2242982 2185325 2037742 2114945 2120093 2101573 1994567 1978218 1971407 1995799 1866123 1766224
2997 1766224 1859440 1903125 1861055 1828026 1820203 2004186 1913571 1732722 1709393 1629067 1694170
2986 1694170 1802373 1614650 1770517 1830059 1696160 1621795 1659990 1749933 1873931 1874399 1912708
2975A912708J367K7886j47357O9403J09254r47j59712Q5299J17442m0768K2438
2964A997013N5231M8500j42796O880j4044N725p683L7970j44787m0687p4458J33615
2952A860479N4010n7917j10977R0967j13808j27482R4478J66532K3578j00218
2942A779642j13962k0853N0685q8638m4908M8388j1026k7875j56862m3964n5512
2931A315115J03562n9943j06906J10666j61875O5731J3688q3879P8350j465m7993
2920A225051j34950O1052q1447M1304q0061O5017R3477L1664m1195q9732j19072
2909I71108o7914P4807O6143J2924p4236J5232j06504L8234K3867j61330L519
2898G95850K4675j27373J17529j9211P6295r9585j22336l2106J76512L2365j24186
$$ plain form
2975 1912708 1914075 1941961 1794604 1864007 1973261 1972314 1812602 1897901 2015343 1974575 1997013
2964 1997013 2052244 2100744 1957948 1964828 1950784 1956509 1948826 1986796 1842009 1801322 1726864 1860479
2952 1860479 1914489 1856572 1745595 1836562 1722754 1595272 1689750 1856282 1879860 1779642
2942 1779642 1665680 1644827 1695512 1606874 1561966 1610354 1599328 1571453 1414591 1370627 1315115
2931 1315115 1418677 1358734 1251828 1362494 1200619 1266350 1280038 1196159 1274509 1273044 1225051
2920 1225051 1090101 1151153 1069706 1111010 1030949 1095966 1189443 1221107 1179912 1090180 971108
2909 971108 903194 978001 1044144 1057068 982832 998064 891560 929794 953661 792331 795850
2898 795850 820525 693152 810681 791470 867765 768180 645844 613738 790250 822615 698429
2887F98429N4854r1726M379j59003O8510j69619j5202J71529J5685j5544r3422
2876D68870q4918n0985J27581Q919M780L2150N41R0039N7349r8235j13497m9241
2864C93353K49940j41127K2367J81182k971m013m737o8850L9919J71838j05283
2853G31618r3895l2842m2814o9322R0949k846j07400J02269r4748J59772j2470
2842F28271n0530q2533n1324L6526j27682J680J14530N6296j00300Q0545j41888
2831C63591J16469M656P0450n1689P7422O7910j61421J7587J15567L6381l0626
2820F26297p0709n3580M9070P283R1641K8587l0828K2852J3090J69029j1514J3885
2808H55103j3577Q0692K56103J5825K465L7316K79794J74970q7304J94365K56601
$$ plain form
2887 698429 753283 661557 665936 506933 575443 405824 390622 562151 577836 562292 468870
2876 468870 383952 332967 460548 469467 474247 506397 506938 596977 654326 556091 442594 393353
2864 393353 643293 502166 524533 705715 702744 698731 693994 625144 665063 836901 731618
2853 731618 637723 604881 562067 492745 583694 580848 473448 575717 480969 640741 628271
2842 628271 577741 495208 443884 480410 352728 354408 468938 525234 424934 505479 363591
2831 363591 480060 484716 555166 503477 580899 648809 487388 504975 620542 656923 626297
2820 626297 555588 502008 551078 558361 650002 678589 647761 670613 683703 852732 841218 855103
2808 855103 841526 922218 1178321 1194146 1196611 1233927 1513721 1688691 1601387 1795752 2052353
2797B052353J97729K12331K95612N00843O11672O26154M71429k76635m64419p05389
2787C521680n21058k47495k76528o4922k37133k96j18377o8950K36075n2066M1012
2776B211942J85719K12657L26369L13708M79274O39570L84917m44445n25282o17592
2766C166837m78457l07657l67976k58758k07771n9978j81279j30758r6938j55077
2756I22188J7875j21604p4606m5501o4376J1814M5918j56963m6101J9813J57874
2745F66331k9412j01998k07633J03108P1544k22708Q6333j08277R532J23848k3808
2734C66860r3899r1432K5716k6919M5248N2540P474p2262M3934j00933K9405k7368
2722A58364k1208K58123j22570q4186q3537K477J14111p0552k7263k9880o3532
$$ plain form
2797 2052353 2250082 2462413 2758025 3258868 3870540 4496694 4968123 4691488 4227069 3521680
2787 3521680 3000622 2753127 2476599 2411677 2174544 2174248 2055871 1986921 2222996 2170930 2211942
2776 2211942 2397661 2610318 2936687 3250395 3729669 4369239 4754156 4309711 3784429 3166837
2766 3166837 2688380 2380723 2012747 1753989 1546218 1486240 1304961 1174203 1077265 922188
2756 922188 940063 818459 743853 698352 633976 645790 691708 534745 488644 508457 666331
2745 666331 636919 534921 327288 430396 501940 279232 365565 257288 266820 390668 366860
2734 366860 272961 181529 207245 180326 225574 278114 285588 213326 257260 156327 185732 158364
2722 158364 137156 395279 272709 188523 104986 107463 221574 151022 123759 93879 30347
2711C0347J04552l3193M3889j94975O9741M2208N4132l3423K9768j05807J46084
2700A53323J1266J9118R5377j99740K4858O207Q0081r7543j33967k8309L1585
2689c7744J15539j7839r145N0597k7399J09122r7397R08L6304j80523k1813R2655
2677A3265K1970N0469l4003j03074n2989J41273J742P3865p3285J26474p9725
2666H5982m3727m7023o3874n806K14719m0216q9918P4011Q0399k4488L1232n0704
2654A20587n9318j99552J10857M5214K8809J24488K5659p6205l2028O0933j98246
2643d8802J38729l0846k8615Q5317o1104q9982J02906j07152N278J26505j0335
2632H1899j47189L4091N0329M9423j66285M2419m408r636P2804j26144N045N5073
$$ plain form
2711 30347 134899 101706 145595 -49380 20361 62569 116701 83278 113046 7239 153323
2700 153323 164589 183707 279084 79344 104202 110409 190490 92947 -41020 -69329 -37744
2689 -37744 77795 59956 50811 101408 74009 183131 85734 86642 122946 -57577 -79390 13265
2677 13265 35235 85704 51701 -51373 -104362 36911 38653 112518 39233 165707 85982
2666 85982 42255 -4768 -68642 -74448 140271 100055 10137 84148 164547 140059 171291 120587
2654 120587 61269 -138283 -27426 17788 46597 171085 196744 120539 88511 149444 -48802
2643 -48802 89927 59081 30466 115783 54679 -35303 67603 -39549 -34271 92234 81899
2632 81899 -65290 -31199 19130 68553 -97732 -55313 -59721 -69357 3447 -122697 -117652 -62579
2620f2579J08621M2827l8823p2102k0692j4491K51081m78m4054l6258j4344l4128
2608F4580j67136J31115M7486P3243K6295j64824j26886N3977j31443P6885j21695
2597b38403J11920R8784J733N934N1832j12436j08474O7142P2729Q6686m5265
2586g818m877K908K5604R4749j59695Q2657j9983j5329j57536K2810M9628N6829
2574c0053q591m547L0111J07023o0246j03992J939q975N3845M0307m0443p802
2562c1424N5348j2120k8486l750J45231j34319m935j11930O99J88925N6702r0990
2550B8951P487L988k09765Q3829J09663o3459j49905P0930J26078j00730J39985
2539D7052Q669P1244r4137p2966l8039J07735j49455P275j16552J19873J71528
$$ plain form
2620 -62579 46042 88869 50046 -22056 -42748 -57239 193842 193364 149310 113052 98708 64580
2608 64580 -102556 28559 76045 149288 175583 10759 -116127 -62150 -193593 -116708 -238403
2597 -238403 -126483 -27699 -25966 -20032 31800 -80636 -189110 -121968 -49239 37447 -7818
2586 -7818 -12695 -9787 15817 110566 -49129 33528 13545 -1784 -159320 -136510 -86882 -30053
2574 -30053 -38644 -43191 -13080 93943 33697 -70295 -68356 -77331 -23486 16821 -23622 -31424
2562 -31424 23924 11804 -16682 -20432 124799 -9520 -14455 -126385 -125686 63239 119941 28951
2550 28951 36438 40426 -169339 -85510 24153 -39306 -189211 -118281 7797 -92933 47052
2539 47052 55721 126965 32828 -40138 -78177 29558 -119897 -112622 -229174 -109301 62227
2528F2227R1436k65781K9725J76741j25198n9629J6245J4084J2994L8562j29463
2517a38057n090n1183Q5967L0515R807L5061n1767J06577L2860j6800m0621j60197
2505a62928J2469J0108R2276J9340r7456q3861K07476k5908n1744O6305Q8817
2494G4894k2034k07972N9220O2854K3394o3121l9N8586m4484J12055j62507J77876
2482F8722r1474l048L323j8226o9211k2150j772l1772J16992m9223j8104m9138
2470a65081Q6743R6886m1553j47576J32945j26080p1202J74206J28289k2101r6751
2459e1275k3142Q1381n8322P8174N9991r2993j03452l1329M1175J42059j29379
2448h7112q3316O7807R7705J9673R4799j59110l9146l7821L1740l6688O9137n5458
$$ plain form
2528 62227 153663 -112118 -82393 94348 -30850 -90479 -74234 -60150 -47156 -8594 -138057
2517 -138057 -143147 -194330 -108363 -77848 -68041 -32980 -84747 21830 54690 37890 -2731 -162928
2505 -162928 -150459 -140351 -48075 -28735 -126191 -210052 -2576 -28484 -80228 -13923 74894
2494 74894 52860 -155112 -95892 -33038 -9644 -72765 -72804 -14218 -58702 53353 -109154 68722
2482 68722 -22752 -25800 -22477 -40703 -109914 -132064 -133836 -165608 -48616 -97839 -115943 -165081
2470 -165081 -78338 18548 -23005 -170581 -37636 -163716 -234918 -60712 67577 45476 -51275
2459 -51275 -74417 6964 -51358 26816 86807 -6186 -109638 -140967 -99792 42267 -87112
2448 -87112 -170428 -102621 -4916 14757 109556 -49554 -88700 -126521 -94781 -131469 -62332 -117790
2436a17790o622J5296n4065J55999o4663R3394K3467j75213l4671P3599P759L2181
2424e1329R5368j56172j16490K9561K0105J16365J8153p2719R7967N4390K9019
2413F4218l7877j11141P0192o1768J11013r3747j04081L193p9381M6202l2132
2402b25309J54467m4549J16013l7557l0014L6614n8552j2300P570K7739K5330
2391d0548O408r1112P0291p6713J16523r415L9843j08470L888J744r1598N2209
2379a26950j023O0176J41223j41434N225N2890j53599j05204J17114R2044o6860
2368a26398J7758J37823L0871j68691K967J14737q1326R8409j20396j4164L7725
2357g0685M3070N4619j09255j2158J15362L1746n7522j10250R9935N0375j33733
$$ plain form
2436 -117790 -124412 -109116 -163181 -7182 -71845 21549 45016 -130197 -164868 -91269 -83510 -51329
2424 -51329 44039 -112133 -228623 -199062 -178957 -62592 -44439 -117158 -19191 35199 64218
2413 64218 26341 -84800 -14608 -76376 34637 -59110 -163191 -159998 -239379 -193177 -225309
2402 -225309 -70842 -115391 622 -36935 -66949 -30335 -88887 -101187 -93617 -65878 -40548
2391 -40548 -34140 -125252 -54961 -131674 -15151 -24566 15277 -93193 -89305 -87561 -179159 -126950
2379 -126950 -127973 -67797 73426 -68008 -62783 -9893 -163492 -268696 -151582 -59538 -126398
2368 -126398 -108640 29183 60054 -108637 -105670 9067 -72259 26150 -94246 -108410 -70685
2357 -70685 -27615 27004 -82251 -94409 20953 52699 -4823 -115073 -15138 35237 -98496
2346i8496N4811P955J56302j78485l1932J11190l5593p6335j68412J91947m752
2335g1800q8336q154J03622q8712P354P1430j86951O6042J3328j80417M0908J61072
2323a60614K90002R3575o4446j64614l5598N3423j33120o3166P0654j12281K2556
2312b03629O1311O8052j1782k0716R7298P1186j96908r2451K5424J33754n4505
2301a22966j36133L6706J52801R0486j00303p3788J35637r0108r1702n7502N7687
2290a99185M0297O9480j6659K4338Q6635l2028L0323k52828O5712k7997J16976
2279i4936q5173P5452P8215N9595p4338Q8207k18332K9580L5167J2395J04161
2268I993l5836K2670J21093j83567J6952L1668K0364J1960j30015j8613j4439
$$ plain form
2346 -98496 -43685 -35730 120572 -57913 -89845 21345 -14248 -90583 -258995 -67048 -71800
2335 -71800 -160136 -168290 -64668 -153380 -146026 -74596 -261547 -195505 -182177 -362594 -321686 -160614
2323 -160614 129388 222963 158517 -6097 -41695 11728 -121392 -184558 -113904 -226185 -203629
2312 -203629 -142318 -74266 -86048 -106764 -9466 61720 -135188 -227639 -202215 -68461 -122966
2301 -122966 -259099 -222393 -69592 20894 -79409 -153197 -17560 -107668 -199370 -256872 -199185
2290 -199185 -158888 -89408 -106067 -81729 4906 -27122 3201 -249627 -183915 -211912 -94936
2279 -94936 -180109 -104657 -26442 33153 -41185 47022 -171310 -141730 -106563 -94168 9993
2268 9993 -25843 -3173 117920 -65647 -48695 -17027 3337 15297 -114718 -133331 -147770
2257a47770N8977R975R960m2493R1397k9109P4942j4163j1906Q2652q2736Q623
2245H349m222k0521j0903l8599L5646o7334r3411J08002J47288k9256q5355j03524
2233a53840N5125J91945l8745p2822l0703J50455k5027k57978K1073J21151O6223
2222B6857j28208O2375n0316j20251R0706O4848p201j4457L8203k8647J00947
2211C4856K1798j64429N609M7047O5992R372o6808l4905O8028r0850L3398J02610
2199C1718P7555k17859j96055J29819R6115R7945j37878L4522l4685j8974J45152
2188G375J3455m9805J9154j0150r750J4953M8740N934K5118r6410K03128j98499
2176b6757R136o7268l1587N3561n2063P1812p6879j3285J10869j16259L1280J34934
$$ plain form
2257 -147770 -88793 -78818 -68858 -111351 -19954 -49063 25879 11716 -190 82462 -274 8349
2245 8349 4127 -16394 -27297 -65896 -30250 -97584 -190995 -82993 64295 35039 -50316 -153840
2233 -153840 -98715 93230 54485 -18337 -49040 101415 76388 -181590 -160517 -39366 26857
2222 26857 -101351 -38976 -89292 -209543 -118837 -53989 -61190 -75647 -37444 -66091 34856
2211 34856 56654 -107775 -102166 -55119 10873 20245 -46563 -81468 -13440 -104290 -70892 31718
2199 31718 109273 -108586 -304641 -174822 -78707 19238 -118640 -84118 -118803 -137777 7375
2188 7375 20830 -28975 -9821 -19971 -29721 -14768 33972 39906 65024 -31386 171742 -26757
2176 -26757 -17621 -84889 -116476 -62915 -114978 -43166 -120045 -133330 -22461 -138720 -107440 27494
2164B7494k8856l3004J52472J01413j75041j69205m2999L3754j5579J75004j34465
2153a09012j32190J59220J6192j18009Q1934L2915n290Q2729p6427r8059J69168
2142C171j49951r3692J60911K0600o6083J72477j15400O5648k7240r3049J7873
2131a04735n5997J41149J4442m1573L1943K0866M4520r849j05155o3226K9523
2120i8092L2932o348j8982J48703l4059m8442l1322l4580m8007P0955M4271j10832
2108a33803j9555J08719j29719R073M1297K03131R800M9171k443o5626k989J48112
2096B15168l5460j11160L7759L6652r7821P4370J05024j02934Q3450O4180k06451
2085F2777J85199n0535j11872J96669k214J01404N2534N4701R970K26261K38007
$$ plain form
2164 27494 -1362 -34366 118106 219519 44478 -124727 -167726 -133972 -149551 25453 -109012
2153 -109012 -241202 -81982 -65790 -183799 -101865 -68950 -74240 8489 -67938 -165997 3171
2142 3171 -146780 -240472 -79561 -58961 -125044 47433 -67967 -2319 -29559 -122608 -104735
2131 -104735 -160732 -19583 -5141 -46714 -14771 6095 50615 40766 -64389 -127615 -98092
2120 -98092 -65160 -71508 -90490 58213 24154 -24288 -55610 -90190 -138197 -67242 -22971 -133803
2108 -133803 -153358 -44639 -174358 -165285 -123988 79143 88943 138114 135671 70045 67056 215168
2096 215168 179708 68548 106307 142959 45138 119508 224532 121598 205048 269228 62777
2085 62777 247976 197441 85569 282238 280024 381428 433962 488663 498633 724894 962901
2074I62901K56862K13004M6502l53817j84678k43207o4476j47732m5778j8326
2064D21255k4783L4209o209l4557M6625l4763m9034k01851j41355J72590j7620
2053A64507l5914K2947L762J5209L0750j63413r609j1700Q3282j15965N5298q1301
2041d2147l2755m8570O3558P3167p7372J26456j23467K400M1768q2496j8635K13325
2029I5232p177K2267n3280j24002K8725R8011K8969n7052j25069J22929R2201
2018A21754o6526m2925j7096j6197O1631j19990R1661K9717j58246j34965K89317
2007C8135q3239j08500J66690j86823K9354j8124J99523M3253n3198j43579R7342
1996a9166r7878j24237J26092R3243N4050r2527J03990j43337j68818J47477j11148
$$ plain form
2074 962901 1219763 1432767 1479269 1125452 940774 697567 633091 485359 439581 421255
2064 421255 396472 430681 424472 389915 436540 401777 352743 150892 9537 182127 164507
2053 164507 128593 151540 155302 170511 201261 37848 28239 16539 99821 -16144 39154 -42147
2041 -42147 -74902 -123472 -59914 13253 -64119 62337 -61130 -58730 -16962 -99458 -118093 95232
2029 95232 88055 110322 57042 -66960 -38235 59776 88745 31693 -93376 29553 121754
2018 121754 55228 12303 -4793 -20990 40641 -79349 12312 42029 -116217 -251182 38135
2007 38135 -45104 -153604 13086 -173737 -144383 -162507 37016 80269 27071 -116508 -19166
1996 -19166 -117044 -241281 -115189 -21946 32104 -60423 43567 -99770 -268588 -121111 -232259
1985b32259O7656j08635m2645K37329n939O2821m3668K1093q59J32491l5556L2513
1973H4342K6390j98336l871k4625j0688j31717P7777K28287n7906q4108J08159
1962A3704N5920j05834O008j5116M4343j17630J653l9406Q9051J7959Q1093l972
1950B7773j46211J53112M9991j02149N3971j18828L0892j40395R310Q1665K41748
1939A40879R107o0955j74232J46389K4651k17977J70015l4572p0853p3045L0878
1928a09715O3865q1962J06330k2702P7586m8102N493j83o1889j2791o651J13162
1916B2441m4473R5222j63840L783j48840J15012K1791J20812M2692r6232l9857
1905g1489J72812j0668n2038o0698j23586j18329J09786M0135L3677N7327L8012
$$ plain form
1985 -232259 -164603 -273238 -315883 -78554 -84493 -21672 -65340 -44247 -45106 87385 51829 84342
1973 84342 110732 -87604 -91475 -116100 -126788 -258505 -180728 47559 -10347 -94455 13704
1962 13704 69624 -36210 -30202 -45318 -975 -118605 -116952 -156358 -67307 -49348 31745 27773
1950 27773 -118438 34674 84665 -17484 36487 -82341 -51449 -191844 -182534 -100869 140879
1939 140879 149986 89031 -85201 61188 85839 -132138 37877 3305 -67548 -140593 -109715
1928 -109715 -45850 -127812 -21482 -44184 33402 -14700 -9207 -9390 -71279 -84070 -90721 22441
1916 22441 -22032 73190 -90650 -86867 -235707 -120695 -98904 21908 64600 -31632 -71489
1905 -71489 101323 90655 38617 -22081 -145667 -263996 -154210 -114075 -80398 -23071 14941
1894A4941J28119N2106j65529k05553K05126o7886Q8729Q9778j77950O0477j17371
1883i5013L3102K5858l9938k2542R408j38701Q8626O1033J13055k2858j34931
1872a22901k1319J39709j61390N9148J22285l1771P5249K6113j24547j14118k2514
1861a76056J37724L8167J2595J01489O065j84995q9028R5021j28729J27Q0383
1850a07237K9263N9200J08899j34080K12830N5907j73975p1528j48287J26739
1840d2269N6260o9646j1429M6545k12M1268o8076N2742n4146l5281L3497j71449
1828b22196J10011k3625j46931K10768J38614m6738n3107O0160j12555M5126m589
1817d5062j68676Q5869P363L7313N6326Q2017p678N6971n1207m0330r9699Q6058
$$ plain form
1894 14941 143060 195166 29637 -175916 29210 -38676 50053 139831 -38119 22358 -95013
1883 -95013 -61911 -36053 -75991 -98533 -89125 -227826 -139200 -78167 34888 12030 -122901
1872 -122901 -144220 -4511 -165901 -106753 15532 -16239 59010 85123 -39424 -153542 -176056
1861 -176056 -38332 -165 12430 113919 119984 -65011 -154039 -59018 -187747 -187620 -107237
1850 -107237 -77974 -18774 90125 -43955 168875 224782 50807 -20721 -169008 -42269
1840 -42269 13991 -55655 -67084 -20539 -20751 20517 -47559 5183 -48963 -84244 -50747 -222196
1828 -222196 -112185 -135810 -282741 -71973 66641 19903 -33204 26956 -85599 -40473 -45062
1817 -45062 -213738 -127869 -120506 -83193 -26867 55150 47472 104443 53236 12906 -86793 -735
1805g35J65926k5591k8724j21483r7998J34994j12333K6435k0149N069J6648P7765
1793A9824k6240M7841p9927J4914L0065M9124O9981j35256M5066P1971q5005l2093
1781i735l7132P6176j09414j21297M6310J53905Q0883j64305n5980N5953O8504
1770a6132J47781L946j99988P3014j10289L4963J10283m7820l4982J48706k6796
1759H2686p497j12792N3742k42309Q295P2688M4476N1861o1635j6602k1582K00288
1747E1619r3591k27068N0367J32043J7241j393M4655J47895j87634Q2810m2108
1736b5164J05990j82743J7523k9834j32058O7022q571Q1218R1446o9526n3767
1725a38464J15875m5382N2833j4089r1688P4416p578N6113q6649O1184L3684O6769
$$ plain form
1805 -735 165191 139600 110876 -10607 -108605 26389 -85944 -59509 -79658 -74589 -57941 19824
1793 19824 -6416 41425 -38502 -23588 6477 55601 125582 -9674 35392 107363 22358 -9735
1781 -9735 -46867 29309 -80105 -201402 -155092 -1187 79696 -84609 -140589 -84636 -16132
1770 -16132 131649 135595 -64393 8621 -101668 -66705 43578 -4242 -39224 109482 82686
1759 82686 75189 -37603 16139 -226170 -217875 -145187 -100711 -48850 -110485 -127087 -148669 51619
1747 51619 -41972 -269040 -218673 -86630 -69389 -70782 -26127 121768 -65866 16944 -25164
1736 -25164 80826 -101917 -84394 -114228 -246286 -179264 -187835 -106617 -15171 -84697 -138464
1725 -138464 -22589 -67971 -15138 -29227 -120915 -46499 -54077 2036 -84613 -23429 10255 77024
1713G7024q6066J2050n008J3835q9677P6866j00111Q3391J936o20j43233J08506
1701e1107O5237r2486k5573j02115K37523p8664l0175J32745M1454j76438j9959
1690i9558P1491J0203O3852K6413j39593J52662j13438Q9907l8295J38382n8055
1679A03971j47267P9990k809R2662K5614j99595K9411P238o548M0739O943p3711
1667d3362l27M1337O2648p3682L2325L8615n0231k4704O8701n629O0225k04679
1655i8763L6843J42237L3204l3197l9753k8482O7005K2146m3695k3544m7782P5972
1643F2191J2637n2679r3663R177K0246o1199o6524j039J01694L3129R3791o0242
1631b481j5301q1328m7906J05666q6760J13536L2611j27965J0029J34301k1689
$$ plain form
1713 77024 -9042 3008 -2000 11835 -77842 -976 -101087 -17696 -15760 -16380 -159613 -51107
1701 -51107 14130 -78356 -103929 -206044 31479 -47185 -77360 55385 96839 -79599 -99558
1690 -99558 -28067 -17864 45988 72401 -67192 85470 -27968 61939 23644 162026 103971
1679 103971 -43296 36694 33885 126547 152161 -47434 -18023 -10785 -17333 23406 30349 -43362
1667 -43362 -43689 -2352 60296 -13386 18939 57554 7323 -17381 51320 45691 105916 -98763
1655 -98763 -61920 80317 113521 80324 40571 12089 79094 101240 57545 34001 -13781 62191
1643 62191 74828 22149 -71514 -62337 -42091 -103290 -169814 -170853 -69159 -36030 57761 -2481
1631 -2481 -17782 -99110 -147016 -41350 -128110 -14574 18037 -109928 -99899 34402 12713
1620A2713j00184o460j12270L6319R359K6805k5610K42218r1157j7337l8864K626
1608f1842P5550j1368R1498M8977k6483j42431N8089Q0220K2177o6283k0143K0647
1596F8608k7291m7605L5423l350m6888o5693J25324o1355m4269o9274p0611J32062
1584g4919N0054N1400j533j7901j3787M1606l0029m6636M4658l749o6566L7870
1572b9532n3677P1379n7123o589K22643j56639j74526M9018J65756j29424J04668
1561E954L8712J29692k17479J36629j87658O403K0594k3771R1657K6589j21173
1550i3851J28926k7447p3796n5406J21179j7967K97893r2990j81313j01826J2529
1539h4069N3292M6587o3437r1229K21011o6213j0659j00597k5331N5533m1964
$$ plain form
1620 12713 -87471 -93931 -206201 -169882 -160523 -133718 -159328 82890 -8267 -25604 -64468 -61842
1608 -61842 13708 2340 93838 142815 116332 -26099 31990 112210 134387 68104 47961 68608
1596 68608 41317 -6288 29135 25785 -21103 -86796 38528 -22827 -67096 -136370 -206981 -74919
1584 -74919 -24865 26535 25002 7101 -6686 34920 4891 -41745 2913 -836 -67402 -29532
1572 -29532 -83209 -11830 -68953 -75542 147101 -9538 -184064 -135046 30710 -98714 5954
1561 5954 44666 174358 -43121 93508 -94150 -87747 -67153 -90924 733 27322 -93851
1550 -93851 35075 7628 -66168 -121574 -395 -18362 279531 186541 5228 -96598 -84069
1539 -84069 -30777 15810 -47627 -138856 82155 15942 5283 -95314 -120645 -65112 -107076
1528a07076j2469K5223O3910j39979p3676J53741j09235J32093N0210O3005j46223
1517a00476P2055L1254O1492p1935J4814P6281l4108J20411l3273j37676L2642
1506C1481k12043P4460K41796j66157j5520M2184j67034R9724Q2357r650Q9485
1495I1083M40k9337n47k7187K7330j81582m2747J75796R5120r8175r781O9804
1483G0217L9611K8879q8470o6595J71588J7371j68288r8315R5932o9115O7333
1472A48p8771j59439J97983L7147p430Q4733k6866O3621j12255l3905J3518o1728
1460h3244J19631q3644j07936k934M3547o2270m6622J48078q672J81823M0028
1449A37785j22027j18232k0197O6639J45362j71624K6707o0215J4423J01070P7442
$$ plain form
1528 -107076 -119545 -94322 -30412 -170391 -244067 -90326 -199561 -67468 -17258 45747 -100476
1517 -100476 -28421 2833 64325 -7610 7204 83485 49377 169788 136515 -1161 31481
1506 31481 -180562 -106102 135694 -30463 -45983 -3799 -170833 -71109 11248 1598 91083
1495 91083 91523 62186 61639 34452 61782 -119800 -162547 13249 108369 10194 413 70217
1483 70217 109828 138707 50237 -16358 155230 172601 4313 -94002 1930 -67185 148
1472 148 -78623 -238062 -40079 -2932 -10362 74371 47505 111126 -1129 -35034 -21516 -83244
1460 -83244 36387 -47257 -155193 -158127 -114580 -176850 -223472 -75394 -84066 97757 137785
1449 137785 15758 -102474 -122671 -56032 89330 -82294 -55587 -115802 -101379 -309 77133
1438G7133k13999L3109Q2666R4799P8010p1755L4553N798P3070j73701o9275k3736
1426g3328L62j8201Q9649q5954J28459n2378J11496o4339j26033J21148j67104
1415a36223r847J17670M7228P6865Q7131l1695j12979o4856k5725o5113M5216
1404g2328J92134p6630M3184K5937P142l2446m1676j03390O1638j27545J19896
1393d084J23863K2733o3433k2723l3257q0922n3696l8293K4234J1786J60321q5976
$$ plain form
1438 77133 -136866 -103757 -21091 73708 151718 79963 114516 120314 193384 19683 -49592 -73328
1426 -73328 -72966 -91167 -1518 -87472 40987 -11391 100105 35766 -90267 30881 -136223
1415 -136223 -146070 -28400 18828 95693 182824 151129 38150 -26706 -52431 -117544 -72328
1404 -72328 119806 43176 86360 112297 119439 86993 45317 -58073 3565 -123980 -4084
1393 -4084 119779 142512 79079 56356 23099 -57823 -111519 -149812 -125578 -113792 46529 -39447
$$ [...]
##END NTUPLES=NMR SPECTRUM
##END=
