##TITLE=1H_CA-9275
 CDcl3
 8 sc, 
 7.6.2024
##JCAMPDX= 6.0         $$ Bruker NMR JCAMP-DX V2.0
##DATA TYPE= NMR SPECTRUM
##DATA CLASS= NTUPLES
##ORIGIN= UXNMR, Bruker Analytische Messtechnik GmbH
##OWNER= root
$$ XWIN-NMR		Version 3.5
$$ Fri Jun  7 13:37:29 2024 Russian Standard Time (UT+4h)  she@DPX200
##.OBSERVE FREQUENCY= 200.1309
##.OBSERVE NUCLEUS= ^1H
##.ACQUISITION MODE= SIMULTANEOUS
##.ACQUISITION SCHEME= undefined
##.AVERAGES= 8
##.DIGITISER RES= 18
##SPECTROMETER/DATA SYSTEM= spect
##.PULSE SEQUENCE= zg30
##.SOLVENT NAME= CDCl3
##.SHIFT REFERENCE= (INTERNAL, CDCl3, 0, 16.1215)
##AUDIT TRAIL= $$ (NUMBER, WHEN, WHO, WHERE, WHAT)
$$ ##TITLE= Audit trail, XWIN-NMR		Version 3.5
$$ ##JCAMPDX= 5.01
$$ ##ORIGIN= Bruker BioSpin GmbH
$$ ##OWNER= she
$$ F:/spectra/data/she/nmr/H-F/1/pdata/1/auditp.txt
$$ ##AUDIT TRAIL=  $$ (NUMBER, WHEN, WHO, WHERE, WHAT)
(   1,<2024-06-07 13:36:20.23 +0400>,<she>,<DPX200>,
      <created by zg, POWCHK disabled, PULCHK disabled
       configuration hash MD5:
       00 E9 B6 7A A2 85 ED C7 34 08 36 98 17 FE 4E 26
       data hash MD5: 16K
       87 3C EA 91 10 E2 2A 4B 84 E2 E1 24 37 FE 9D 84>)
(   2,<2024-06-07 13:36:23.15 +0400>,<she>,<DPX200>,
      <Start of raw data processing
       efp BC_mod = 2 LB = 0.24 FT_mod = 6 PKNL = 1 PHC0 = -25318.97 PHC1 = 10.38748 SI = 16K 
       data hash MD5: 16K
       8D A1 4B 0F EA 34 59 A7 AB 45 A0 6B 07 CE 29 86>)
(   3,<2024-06-07 13:36:43.34 +0400>,<she>,<DPX200>,
      <pk PHC0 = 2.833418 PHC1 = 1.2 
       data hash MD5: 16K
       7E 3B 05 92 10 9B 10 69 DD 41 3A EC 34 7F BF 6E>)
(   4,<2024-06-07 13:36:48.56 +0400>,<she>,<DPX200>,
      <abs ABSG = 5 
       data hash MD5: 16K
       E3 C5 B6 93 2D 44 8A A2 0E 7F 61 E2 D6 03 75 6B>)
$$ ##END=
$$ 
$$ hash MD5
$$ 49 1C FD D5 C0 94 B2 3D 9B 97 22 BF 4A 42 CC 52
##$RELAX= 
##$RELAX= 
##$RELAX= 
##$RELAX= 
##$RELAX= 
##$RELAX= 
$$ Bruker specific parameters
$$ --------------------------
##$DU= <F:/spectra>
##$EXPNO= 1
##$NAME= <H-F>
##$PROCNO= 1
##$TYPE= <nmr>
##$USER= <she>
##$AMP= (0..31)
100 100 100 100 100 100 100 100 100 100 100 100 100 100 100 100 100 100 
100 100 100 100 100 100 100 100 100 100 100 100 100 100 
##$AQSEQ= 0
##$AQ_mod= 1
##$AUNM= <au_zg>
##$AUTOPOS= <>
##$BF1= 200.13
##$BF2= 200.13
##$BF3= 200.13
##$BF4= 200.13
##$BF5= 200.13
##$BF6= 200.13
##$BF7= 200.13
##$BF8= 200.13
##$BYTORDA= 1
##$CFDGTYP= 0
##$CFRGTYP= 5
##$CHEMSTR= <none>
##$CNST= (0..31)
1 1 145 1 1 1 1 1 1 1 1 1 1 1 1 1 1 1 1 1 1 1 1 1 1 1 1 1 1 1 1 1 
##$CPDPRG= <>
##$CPDPRG1= <>
##$CPDPRG2= <>
##$CPDPRG3= <>
##$CPDPRG4= <mlev>
##$CPDPRG5= <mlev>
##$CPDPRG6= <mlev>
##$CPDPRG7= <mlev>
##$CPDPRG8= <mlev>
##$CPDPRGB= <>
##$CPDPRGT= <>
##$D= (0..31)
0 1.2 0 0 0 0 0 0 0 0.06 0 0.03 0 0 0 0 0.0002 0 0 0 0 0 0 0 0 0 0 0 0 
0 0 0 
##$DATE= 1717752979
##$DBL= (0..7)
120 120 120 120 120 120 120 120 
##$DBP= (0..7)
150 150 150 150 150 150 150 150 
##$DBP07= 0
##$DBPNAM0= <>
##$DBPNAM1= <>
##$DBPNAM2= <>
##$DBPNAM3= <>
##$DBPNAM4= <>
##$DBPNAM5= <>
$$ [...]
##$SUBNAM3= <"">
##$SUBNAM4= <"">
##$SUBNAM5= <"">
##$SUBNAM6= <"">
##$SUBNAM7= <"">
##$SUBNAM8= <"">
##$SUBNAM9= <"">
##$SW= 18.0517689322627
##$SWIBOX= (0..15)
0 0 2 0 0 0 0 0 0 0 0 0 0 0 0 0 
##$SW_h= 3612.71676300578
##$TD= 16384
##$TD0= 1
##$TE= 0
##$TE2= 300
##$TE3= 300
##$TEG= 300
##$TL= (0..7)
0 120 120 120 120 120 120 120 
##$TP= (0..7)
150 150 150 150 150 150 150 150 
##$TP07= 0
##$TPNAME0= <>
##$TPNAME1= <>
##$TPNAME2= <>
##$TPNAME3= <>
##$TPNAME4= <>
##$TPNAME5= <>
##$TPNAME6= <>
##$TPNAME7= <>
##$TPOAL= (0..7)
0.5 0.5 0.5 0.5 0.5 0.5 0.5 0.5 
##$TPOFFS= (0..7)
0 0 0 0 0 0 0 0 
##$TUNHIN= 0
##$TUNHOUT= 0
##$TUNXOUT= 0
##$USERA1= <user>
##$USERA2= <user>
##$USERA3= <user>
##$USERA4= <user>
##$USERA5= <user>
##$V9= 5
##$VALIST= <valist>
##$VCLIST= <CCCCCCCCCCCCCCC>
##$VD= 0
##$VDLIST= <DDDDDDDDDDDDDDD>
##$VPLIST= <PPPPPPPPPPPPPPP>
##$VTLIST= <TTTTTTTTTTTTTTT>
##$WBST= 1024
##$WBSW= 4
##$XGAIN= (0..3)
0 0 0 0 
##$XL= 0
##$YL= 0
##$YMAX_a= 78470
##$YMIN_a= -122481
##$ZGOPTNS= <>
##$ZL1= 120
##$ZL2= 120
##$ZL3= 120
##$ZL4= 120
##$ABSF1= 16.00805
##$ABSF2= -2.043844
##$ABSG= 5
##$ABSL= 3
##$ALPHA= 0
##$AQORDER= 0
##$ASSFAC= 0
##$ASSFACI= 0
##$ASSFACX= 0
##$ASSWID= 0
##$AUNMP= <proc_1d>
##$AZFE= 0.1
##$AZFW= 0.1
##$BCFW= 0
##$BC_mod= 2
##$BYTORDP= 0
##$COROFFS= 0
##$CY= -3
##$DATMOD= 1
##$DC= 0
##$DFILT= <>
##$DTYPP= 0
##$F1P= 0
##$F2P= 0
##$FCOR= 1
##$FTSIZE= 16384
##$FT_mod= 6
##$GAMMA= 0
##$GB= 0
##$INTBC= 1
##$INTSCL= 3.70164e-10
##$ISEN= 128
##$LB= 0.24
##$LEV0= 0
##$LPBIN= 0
##$MAXI= 10000
##$MC2= 0
##$MEAN= 0
##$ME_mod= 0
##$MI= 1.114404
##$NCOEF= 0
##$NC_proc= -9
##$NLEV= 6
##$NOISF1= 3.799351
##$NOISF2= 2.8
##$NSP= 0
##$NTH_PI= 0
##$NZP= 0
##$OFFSET= 16.12154
##$PC= 1
##$PHC0= -25316.14
##$PHC1= 11.58748
##$PH_mod= 1
##$PKNL= yes
##$PPARMOD= 0
##$PSCAL= 0
##$PSIGN= 0
##$REVERSE= no
##$SF= 200.129479961638
##$SI= 16384
##$SIGF1= 3
##$SIGF2= 2
##$SINO= 5.538805
##$SIOLD= 16384
##$SREGLST= <1H.CDCl3>
##$SSB= 0
##$STSI= 16384
##$STSR= 0
##$SW_p= 3612.71676300577
##$SYMM= 0
##$S_DEV= 0
##$TDeff= 16384
##$TDoff= 0
##$TI= <>
##$TILT= no
##$TM1= 0
##$TM2= 0
##$TOPLEV= 0
##$USERP1= <user>
##$USERP2= <user>
##$USERP3= <user>
##$USERP4= <user>
##$USERP5= <user>
##$WDW= 1
##$XDIM= 16384
##$YMAX_p= 438305227
##$YMIN_p= -8067630
$$ End of Bruker specific parameters
$$ ---------------------------------
##NTUPLES= NMR SPECTRUM
##VAR_NAME=  FREQUENCY,     SPECTRUM/REAL,   SPECTRUM/IMAG
##SYMBOL=    X,             R,               I
##VAR_TYPE=  INDEPENDENT,   DEPENDENT,       DEPENDENT
##VAR_FORM=  AFFN,          ASDF,            ASDF
##VAR_DIM=   16384,         16384,           16384
##UNITS=     HZ,            ARBITRARY UNITS, ARBITRARY UNITS
##FACTOR=    0.220516191357247, 1,           1
##FIRST=     3226.39543030577, 0,            0
##LAST=      -386.3213327,  0,               0
##MIN=       -386.3213327,  -8067630,        0
##MAX=       3226.39543030577, 438305227,    0
$$ Real data points
##PAGE= N=1
##DATA TABLE= (X++(R..R)), XYDATA
$$ [...]
6217I11963k95130q93047m25176j37707J33517P06961Q16478N45273j48941n26737
6207F87454R24829n13549l15380K4456o1465k4354J84007J3620l73902j50685
6197C95031o0374K35956R9722P55551L18431n40963J8126q29512r5724K81143
6187E77387R67827L72096k14146J23292n13633k95425l60470p1914j153911J223178
6177F54281o03029O47733J96877j65288j87608K02177O4887j14406j348026k12831
6167h65233P14931P26095M63571m3745m95726k78589L59274p9671P79106n21900
6157G58113j65522P2623j74189l32259r2584O60184K24416m80149K94996L54986
6147A120615o38647N93860L12756l96558k10557N31818M69076n87666k65077M00379
$$ y = [911963, 616833, -276214, -701390, -839097, -705580, 1381, 817859, 1363132, 1214191, 687454, 1612283, 1098734, 783354, 807810, 746345, 721991, 905998, 919618, 545716, 395031, 334657, 570613, 670335, 1425886, 1744317, 1203354, 1221480, 391968, 296244, 577387, 1545214, 1917310, 1703164, 1826456, 1312823, 1017398, 656928, 585014, -568897, 654281, 51252, 698985, 895862, 730574, 542966, 745143, 810030, 695624, -652402, -865233, -150302, 575793, 1039364, 995619, 499893, 221304, 580578, 500907, 1280013, 758113, 592591, 665214, 491025, 158766, 66182, 726366, 950782, 470633, 765629, 1120615, 481968, 1075828, 1388584, 992026, 781469, 1313287, 1782363, 1194697, 929620, 1329999]
6137A329999L62212j150890k7168j46016K75682N19816o89357l73868j84186P22095
6127F38319j33393N05819O05002k89264j31413Q7721o21192N5674l91727m9097
6117B76449L31611m50280Q8582M89885m02318Q69741M91184J33100M99177k53176
6107B073955q42296n01463J47732O53309L08743n9595n16292j100303l41687J015647
6097H37750m38700m15255O54370M53439J20060k02613j24880l51079J635924k53755
6087A915261p67694K96556l55355j75088J09328K27123M13472K62674J75291r24066
6077A177502q07714K34942J76461K63023q04552L98634J070050o22452m78747
6068F07147K55878l00468n48528J321405o14696m35006K86023O76930Q23971m72709
$$ y = [1329999, 1692211, 541321, 514153, 368137, 643819, 1163635, 474278, 100410, -83776, 638319, 504926, 1010745, 1615747, 1326483, 1195070, 1282791, 661599, 717273, 325546, 276449, 608060, 157780, 246362, 736247, 333929, 1203670, 1694854, 1827954, 2327131, 2073955, 1231659, 730196, 877928, 1531237, 1839980, 1780385, 1264093, 163790, -177897, 837750, 399050, -16205, 638165, 1091604, 1211664, 1009051, 884171, 533092, 2169016, 1915261, 1147567, 1444123, 1088768, 913680, 1023008, 1250131, 1663603, 1926277, 2101568, 1177502, 369788, 604730, 781191, 1044214, 239662, 638296, 1708346, 1085894, 607147, 863025, 562557, 14029, 1335434, 720738, 285732, 571755, 1248685, 2072656, 1599947]
6058A599947r77256n4691n7293N52629J11059j90715J15636N7727j83600O84521
6048A657964p6841j42561P3535q53242M83350M51175M0875k49404j15648l38454
6038I30749o60963M26310P47698m23676l4456k16519K10291J20649j123185l06304
6028c29406N9015M66514L45809N62389n29415L97838K01710N05937P62215J37588
6018B580194m96555l72423r86186l74310J37523L7152n95221O02791N15077K57717
6008A305759J121214j95176j471114n02635J105677q1896K02715j51801m35882
5999H96861N52765j95961l54761M8858n92062O32510M85156l91992n60302L26610
5989H47682J120586k44466r46788q7866N45736N64197k83321m75855m05533J158756
$$ y = [1599947, 622691, 568000, 510707, 1063336, 1174395, 983680, 1099316, 1157043, 973443, 1657964, 1581123, 1438562, 1512097, 658855, 1142205, 1593380, 1634255, 1384851, 1269203, 930749, 269786, 696096, 1443794, 1020118, 985662, 769143, 979434, 1100083, -23102, -329406, -270391, 196123, 541932, 1104321, 574906, 972744, 1174454, 1680391, 2442606, 2580194, 2083639, 1711216, 725030, 350720, 488243, 525395, -69826, 532965, 1048042, 1305759, 2426973, 2231797, 760683, 258048, 1363725, 1281829, 1484544, 1332743, 896861, 1449626, 1253665, 898904, 947762, 355700, 988210, 1473366, 1081374, 521072, 847682, 1968268, 1723802, 777014, 689148, 1234884, 1799081, 1515760, 1039905, 634372, 1793128]
5979A793128L19253J59028j276710m44863O16271j64036O43141O25572m48220
5970A822564M51093J91353K52585O7425j048549m53842P23528K51723k62897K32455
5960B227438K4011r5761j96776Q72J62724R73117n18659p60217m35826O61409
5950B042332j81382o2825L56747k83559r25667r0881Q00924O19420l77395m51855
5940A445859J424530k23191J47316o05510J71009N5110L27158p57186o30739K43837
5930A598193L39786M31241K47042K85944K91844m46525l59900J80660p17839p6212
5920A774234J10060K63842O20555K48393J20479r9929j81923j65112N93855J0624
5910C295078l63464K32099k07003M046M45765l9236o3485M89604L65433j70101
$$ y = [1793128, 2112381, 2271409, 994699, 549836, 1166107, 1002071, 1645212, 2270784, 1822564, 2273657, 2465010, 2717595, 2785020, 1736471, 1282629, 2006157, 2257880, 1994983, 2227438, 2251449, 2155688, 1958912, 1959784, 2122508, 3095625, 2576966, 1816749, 1380923, 2042332, 1860950, 1798125, 2154872, 1871313, 945646, 854765, 1655689, 2275109, 1897714, 1445859, 2870389, 2647198, 2794514, 2189004, 2360013, 2415123, 2742281, 1985095, 1354356, 1598193, 1937979, 2369220, 2616262, 2902206, 3194050, 2747525, 2387625, 2568285, 1850446, 1774234, 1884294, 2148136, 2768691, 3017084, 3137563, 3037634, 2855711, 2690599, 3284454, 3295078, 2931614, 3163713, 2956710, 2960756, 3406521, 3367285, 3303800, 3793404, 4158837, 3988736]
5900C988736p57629O6858r7040J48396K80200O47810r3711k59385L87356R38485
5890E250076K19323l89926o16441l97158k6198M25327R49546j58500N59044l86322
5880E428771j1617k9839N8489N071N93313K35863p67626r1765O02319p3810K04424
5869F153593O88901k53763K25638j19899p68195Q51516O26507K5396L85070N88296
5859H403060j08544Q2587N46041R1461O99950m37973l4646L42352P24144o27990
5849I680442L65079J105039N12744k09200o5726k90988j00186R22625J080919
5840A3000748l0050L25733O75521M56181k77801J60484J210548k28017K13248
5831A5506595J383801L16006N69511R81422Q25966L75590M82224r9752N18820
$$ y = [3988736, 3231107, 3297965, 3200925, 3349321, 3629521, 4277331, 4183620, 3924235, 4311591, 5250076, 5469399, 5079473, 4463032, 4065874, 4039676, 4465003, 5414549, 5256049, 5815093, 5428771, 5417154, 5387315, 5445804, 5450875, 6044188, 6280051, 5512425, 5420660, 6022979, 5949169, 6153593, 6842494, 6588731, 6814369, 6694470, 5926275, 6777791, 7404298, 7429694, 7814764, 8403060, 8294516, 8377103, 8923144, 9014605, 9714555, 9276582, 9241936, 9584288, 10308432, 9680442, 10045521, 11150560, 11663304, 11454104, 11388378, 11097390, 10997204, 11919829, 13000748, 12970698, 13296431, 13971952, 14428133, 14150332, 14310816, 15521364, 15293347, 15506595, 16890396, 17206402, 17775913, 18757335, 19583301, 19958891, 20441115, 20341363, 20860183]
5822B0860183N45964J000833O06675K67946J071036Q22891P23729J073069J821330
5813B8793656Q62325N11999J121211R93965R86888J312564J574915J860864K677375
5804D0695762J873736K009243K432882K754651L189568K719216K497955K267149
5796F0440162K186689K904380L784939L835767J413677J286371K812020R87743
5788G9651748J59646O10043N3031n86532K7251Q13298J09603J477657K019245
5779H4334990J109682J241147K012017K716287L952205M344475L034226L542306
5771A06287335M741236M464263K947221L487685K854077J351144j05263j882818
5763A24144880k248670l180652l977420m734016n254665l685089m631149l246999
$$ y = [20860183, 21406147, 22406980, 23013655, 23281601, 24352637, 25175528, 25899257, 26972326, 28793656, 29655981, 30167980, 31289191, 32283156, 33270044, 34582608, 36157523, 38018387, 40695762, 42569498, 44578741, 47011623, 49766274, 52955842, 55675058, 58173013, 60440162, 62626851, 65531231, 69316170, 73151937, 74565614, 75851985, 78664005, 79651748, 79811394, 80421437, 80474468, 79887936, 79915187, 80728485, 80838088, 82315745, 84334990, 85444672, 86685819, 88697836, 91414123, 95366328, 99710803, 102745029, 106287335, 111028571, 115492834, 118440055, 121927740, 124781817, 126132961, 126027698, 124144880, 121896210, 118715558, 114738138, 110004122, 104749457, 101064368, 96433219, 93186220]
5755I3186220l162471k683077k529812k448599o99849j26325j316860r1833N08571
5746H0635965j001460R4824R8049p02801Q9690j604937q37313j818021k926012
5737G2027984l044271l311977l793534l828664l673315l719017l379090k256142
5729D5021974k567146k467210k557304k864137k654693j412358j907906j435252
5721B7155968j265864j236926q42382j275244j004152n24790q13841j284488o87081
5712A8221200l30555o51013r36946k94631l33972n14951r19488n29049j72485
5703A3538110l94310l2042j27304j502123n00204k88479J27533j05670P6599j299723
5693I492387K04830j23441K21028n34725j04940l27156r05052m36603L23111o47609
$$ y = [93186220, 90023749, 87340672, 84810860, 82362261, 81662412, 81536087, 80219227, 80127394, 80635965, 79634505, 79729329, 79827378, 79124577, 79214267, 77609330, 76772017, 74953996, 72027984, 68983713, 65671736, 61878202, 58049538, 54376223, 50657206, 47278116, 45021974, 42454828, 39987618, 37430314, 34566177, 31911484, 30499126, 28591220, 27155968, 25890104, 24653178, 23810796, 22535552, 21531400, 21006610, 20192769, 18908281, 18221200, 17890645, 17239632, 16302686, 16008055, 15674083, 15159132, 14239644, 13710595, 13538110, 13143800, 13111758, 12984454, 11482331, 10982127, 10693648, 10821181, 10715511, 10792110, 9492387, 9697217, 9573776, 9794804, 9260079, 9155139, 8827983, 7922931, 7486328, 7809439, 7161830]
5683G161830n61331l83846L45438Q69005n09405n07463K13906K94021q26868Q500
5673F103787L81944n81233n01669M03126o30690J070086L75417j713901j20236
5664D786631N62357q87888L60363K69953q10532k10479R3855J28533k53321k23257
5654C816215K4770Q26637K01295o0701j596978J2924J61989k12436Q54043P85176
5644D812934o29303j342630L25514l9051j6410Q1907L30001M61431o33241J0874
5634C362026o2803l06959N10903m7713m9609M00174o17409l44384L28144r87111
5624B185259l34498R9012O61883N38925M52001l88410J1714k01704K66282k51525
5614C038939M01924L62462n88463l99908l14988O328j51835K74314J440974m80960
$$ y = [7161830, 6600499, 6216653, 6562091, 7431096, 6921691, 6414228, 6628134, 6922155, 6095287, 6103787, 6485731, 5904498, 5402829, 5805955, 5175265, 6245351, 6620768, 4906867, 4786631, 5348988, 4461100, 4821463, 5091416, 4280884, 4070405, 4164260, 4292793, 4039472, 3816215, 3840985, 4667622, 4868917, 4808216, 3211238, 3224162, 3386151, 3173715, 4027758, 4812934, 4183631, 2841001, 3166515, 3127464, 3111054, 3192961, 3522962, 3984393, 3351152, 3362026, 3299223, 2992264, 3503167, 3455454, 3405845, 3806019, 3188610, 2844226, 3172370, 2185259, 1850761, 1949773, 2611656, 3150581, 3602582, 3214172, 3225886, 3024182, 3290464, 3038939, 3440863, 3803325, 3214862, 2814954, 2499966, 2506294, 2354459, 2628773, 4069747, 3588787]
5604C588787J84124l882j02581j94172p28737N05839l20157k04450j168536P61867
5594B318102l64661L8720O35284j31152J77976J81735q28129J66624k78895k0278
5584A895326q7934k34926j09992q04198l14454P87391J090995N79823l74648l37019
5574B090364P03997n6748m85811p97508p38771O98209L95600l5238O00028j93689
5564B180433K70832J84042l4537n4722J91797R3339M1468j032670R5425j055201
5554H80206Q72204O90321q19689p88465O91904L06505N07060j1333j11628J252048
5544C469133o73175j396559P16409K2241o49208P625k23781j1973N66396J76252
5534B003360k20602L41534R7788j11256P25796q0308n41264P4425l82287L73359
$$ y = [3588787, 3772911, 3769029, 3666448, 3472276, 2743539, 3249378, 2929221, 2724771, 1556235, 2318102, 1953441, 1992161, 2627445, 2496293, 2674269, 2856004, 2027875, 2194499, 1915604, 1895326, 1807392, 1572466, 1462474, 658276, 343822, 1131213, 2222208, 2802031, 2427383, 2090364, 2794361, 2737613, 2251802, 1454294, 715523, 1413732, 1809332, 1774094, 2374122, 2180433, 2451265, 2635307, 2600770, 2546048, 2737845, 2831184, 2872652, 1839982, 1935407, 880206, 1752410, 2442731, 1623042, 834577, 1526481, 1832986, 2340046, 2328713, 2217085, 3469133, 2795958, 1399399, 2115808, 2138049, 1488841, 1496466, 1272685, 1260712, 1827108, 2003360, 1782758, 2124292, 2222080, 2110824, 2836620, 2756312, 2215048, 2289473, 1907186, 2280545]
5524B280545k32064r870o6851m4454n19607R46541m00007o24653M18464L76556
5514B124600n1219M18741k19463M49427p5975l86166M36513K68370l07258j186275
5504A471295m56891R84378j7593l11649r2796N79421l56760J67948m20036p2908
5494A474409P56261J29996j56316j2278k98032K15138P64299J10869l05091n32824
5484B146431M08528m84378l85322M42293M23283Q1750l91967L36069J352370n01639
5474C427418l80238J10842O38153o51951O04474j18123j18423L49913j016320
5465B845745q09329O84733l94896k21215N45021n71220J539694P31410k96823
5456D053120j003792l96878K06996J11125J73031M28880M22411k03806M4920k04672
$$ y = [2280545, 2048481, 2038611, 1971760, 1927306, 1407699, 2354240, 1954233, 1329580, 1748044, 2124600, 2073381, 2492122, 2272659, 2722086, 2646111, 2259945, 2696458, 2964828, 2657570, 1471295, 1014404, 1998782, 1981189, 1669540, 1576744, 2156165, 1799405, 1967353, 1547317, 1474409, 2230670, 2360666, 2204350, 2192072, 1894040, 2109178, 2873477, 2984346, 2679255, 2146431, 2554959, 2070581, 1685259, 2127552, 2550835, 2632585, 2240618, 2576687, 3929057, 3427418, 3047180, 3158022, 3796175, 3144224, 3748698, 3630575, 3512152, 3862065, 2845745, 2036416, 2721149, 2326253, 2105038, 2650059, 2078839, 3618533, 4349943, 4053120, 3049328, 2652450, 2859446, 2970571, 3143602, 3572482, 3994893, 3791087, 3836007, 3631335]
5446C631335l33845L04418j31455O11057R6807l37259p3918j198826O8966J374875
5436D012155j4640J0561p82359K11162L86170k9427j19334K22711J545377m92229
5426D950147o70704M12070j23070l35936k36328M81177O20486j244384j71620
5417C681838k26707N2511O57529L25831M28062j98456l76916j80219p06315L17061
5407C774219O33395M21228r56844n96053l91497Q46576N90493j5563m6920O08487
5397D867521o98735m51664O79136j75477J51056J77953L22742k50929m54181o40269
5387C527153P70743N35880l61834j29518l88782j27539O07364m3596j90751o6134
5377D132986o82345q8993N80294Q63645l67957K33193K81181n11543M59659K00949
$$ y = [3631335, 3297490, 3601908, 3470453, 4081510, 4178317, 3841058, 3767140, 2568314, 2637280, 4012155, 3997515, 4008076, 3225717, 3436879, 3823049, 3793622, 3674288, 3896999, 5442376, 4950147, 4279443, 4691513, 4568443, 4232507, 3996179, 4477356, 5097842, 3853458, 3681838, 3455131, 3507642, 4165171, 4491002, 4919064, 4720608, 4343692, 4163473, 3457158, 3774219, 4407614, 4828842, 3871998, 3275945, 2884448, 3731024, 4321517, 4305954, 4259034, 4867521, 4168786, 3717122, 4396258, 4220781, 4371837, 4549790, 4872532, 4621603, 4167422, 3527153, 4297896, 4833776, 4471942, 4342424, 3953642, 3826103, 4433467, 4389871, 4199120, 4132986, 3450641, 3361648, 3941942, 4805587, 4437630, 4670823, 4952004, 4440461, 4900120, 5101069]
5367E101069j33649J31505K65757J53331N28693k25909m26662N41152J41756P9590
5357F156633k49010R23247p22725k93781N43098n95405M68357K81621K50424j27975
5347F634484N02450J01664n7459O42517L08017l06534O12743r43604N20934J92028
5337H207240O68334L54218l12632M48987l50400N8950J042122M70692J7317n02512
5327A0102316P61233L65683j67503j53483L70126R59183r5005n89100j52983M86541
5317A1887008J072809m46383R56384Q67019N24204N0831J99788L33446N86557
5308A6031663L99721K65857L02319Q55916J104624N94633N45466K14585N09600
5299B0824384O83666J214548j84969j0635j70638J208444Q52584L80735N1734
$$ y = [5101069, 4967420, 5098925, 5364682, 5518013, 6046706, 5820797, 5394135, 5935287, 6077043, 6156633, 5907623, 6830870, 6108145, 5814364, 6357462, 5762057, 6230414, 6512035, 6762459, 6634484, 7136934, 7238598, 7181139, 7823656, 8131673, 7825139, 8437882, 7494278, 8015212, 8207240, 8875574, 9229792, 8917160, 9366147, 9015747, 9074697, 10116819, 10587511, 10604828, 10102316, 10863549, 11229232, 11061729, 10908246, 11278372, 12237555, 12142550, 11553450, 11400467, 11887008, 12959817, 12513434, 13469818, 14336837, 14861041, 14911872, 15111660, 15445106, 16031663, 16431384, 16697241, 16999560, 17855476, 18960100, 19554733, 20100199, 20314784, 20824384, 21508050, 22722598, 22537629, 22526994, 22356356, 23564800, 24417384, 24798119, 24849853]
5290B4849853J948237P25180N20425J510851P79898K58446R49045R83720K286638
5281C4812293K036850J617946J28449R62415J358547K909462K877467J438403
5273D8141832J974937K420623L590769L462135L123162L458987L530022L042809
5265G2745276L333724L779286L692842L653993L280214J014846J171487R9442
5257I2771110R2305O4062j284944p24356j46880P82977Q96200k28311Q32079J712379
5247I4766621K591843K398052K708841K978326L660419M856101M342838M317804
5239A22620845M092691M181728L084485J513940m0745j225176j769916m000211
5231A28457641n856692m944225m993901n527297n015757m057059k901382l110919
$$ y = [24849853, 26798090, 27523270, 28043695, 29554546, 30334444, 30592890, 31541935, 32525655, 34812293, 36849143, 38467089, 38595538, 39557953, 40916500, 43825962, 46703429, 48141832, 50116769, 52537392, 56128161, 59590296, 62713458, 66172445, 69702467, 72745276, 76079000, 79858286, 83551128, 87205121, 90485335, 91500181, 92671668, 92771110, 92863415, 92927477, 91642533, 90918177, 90771297, 91554274, 92450474, 92222163, 93054242, 94766621, 97358464, 99756516, 102465357, 105443683, 109104102, 113960203, 118303041, 122620845, 126713536, 130895264, 133979749, 135493689, 135452944, 134227768, 132457852, 128457641, 122600949, 117656724, 112662823, 107135526, 102119769, 98062710, 95161328, 92050409]
5223I2050409l658531k661878k023773k193583o63698p86553N33367N2425j38783
5214H0509402M1209N8426M12411j494181j824758k350729j844434k220398k288908
5205F8998040m350180l658210k973187l145590l029960k199239k747189k419380
5197D4475105j329592k160310j634368j328692j351111j713078o58291r17399
5189C3382264p23769n01578j144895j650243k14770o32778p7918m9638L18132
5180B8704807o46440j562866J11350j43428o95312J227524k38060M4467J48869
5171B6950911m969r1763n93345O49950L08445j04365j32712O97923j50094k46243
5161B7283738l8348R24614J447986K73875q58478J17191l45032P08590K66545
$$ y = [92050409, 88391878, 85730000, 83706227, 81512644, 80848946, 80062393, 80595760, 80648185, 80509402, 80550611, 80609037, 81021448, 79527267, 77702509, 75351780, 73507346, 71286948, 68998040, 64647860, 60989650, 58016463, 54870873, 51840913, 49641674, 46894485, 44475105, 43145513, 40985203, 39350835, 38022143, 36671032, 34957954, 34299663, 33382264, 32658495, 32156917, 31012022, 29361779, 29147009, 28514231, 28436313, 28386675, 28704807, 28058367, 26495501, 26606851, 26463423, 25768111, 26995635, 26757575, 26802042, 26950911, 26945942, 26854179, 26260834, 26910784, 27219229, 27114864, 26982152, 27680075, 27529981, 27283738, 27245390, 28170004, 29617990, 29891865, 29033387, 29150578, 28805546, 29514136, 29780681]
5152B9780681R09649J607062l3645J61012Q10130R09483J36624L75968J180864
5143C5837828J544959J681423L96252J247641J229222P60108J605568K038206
5135D6341207K150403J356941J524641K496095K446774J600173K055563K440104
5127F2411901K168870K942347L218409K458863J903101J472747K030307K091842
5119H0698387Q24013J107491R64809l34331Q20349K18913J008242J234006J259058
5110H7800937J068982M88638o1299J338393K376134K683341L165940L120590L466240
5101A05447896K508741L055074L758766J618688J989467K637847J964444l45465
5093A22635458j384814p26722r10161k234511m081719k934138k991417l232025
$$ y = [29780681, 30690330, 32297392, 32263747, 32424759, 33234889, 34144372, 34280996, 34656964, 35837828, 37382787, 39064210, 39460462, 40708103, 41937325, 42697433, 44303001, 46341207, 48491610, 49848551, 51373192, 53869287, 56316061, 57916234, 59971797, 62411901, 64580771, 67523118, 70741527, 73200390, 75103491, 76576238, 78606545, 80698387, 81522400, 82629891, 83594700, 83260369, 84080718, 84299631, 85307873, 86541879, 87800937, 88869919, 89358557, 89297258, 90635651, 93011785, 95695126, 98861066, 101981656, 105447896, 107956637, 111011711, 114770477, 116389165, 118378632, 121016479, 122980923, 122635458, 121250644, 120523922, 119613761, 117379250, 113297531, 110363393, 107371976, 104139951]
5085A04139951l555804l599973k958852j717462k317207o35479j839500j551625
5077H5964049m01663r74776q19726l38824p65370q26796q79401j183308l86328
5068G9387857j902247r93017k708036k443404k653930k306036k658742l225695
5060F0496750k333911k617660l486672k755545k195179k519339j611622m75734
5052D2501088j689667k197592j775825r60790j252015j528640j003497k60497
5044C1832565j608746j676785o59575n54912n67567j305938K55822m46329l78905
5035B4889630J83549l49806k53652q60807j461114L08243n13542R47397j115630
5026B1774268n55174l37134m33512k9358O32077j65537P586J62881p3025p84894
$$ y = [104139951, 100584147, 96984174, 94025322, 92307860, 89990653, 89355174, 87515674, 85964049, 85562386, 84587610, 83767884, 83429060, 82663690, 81836894, 80957493, 79774185, 79387857, 77485610, 76492593, 73784557, 71341153, 68687223, 66381187, 63722445, 60496750, 58162839, 55545179, 52058507, 49302962, 47107783, 44588444, 42976822, 42501088, 40811421, 38613829, 36838004, 35877214, 34625199, 33096559, 32093062, 31832565, 30223819, 28547034, 27887459, 27332547, 26764980, 25459042, 25714864, 25268535, 24889630, 25073179, 24723373, 24469721, 23608914, 22147800, 22456043, 21942501, 22889898, 21774268, 21219094, 20881960, 20448448, 20419090, 21051167, 20885630, 20893216, 21056097, 20983072, 20198178]
5016B0198178K69037K56902P6092k21329r27765Q61556m0106P2761j31686M33756
5006B0847396J13321R45501R95959j95042j209290N54319M13310J15906Q16201
4997B3397581k05203R66174P53140r92874N9978J300680J313157P07771K23667
4988B7524071n6493P53522P33243L38193j34335Q39025M15126J157710J361343
4979C2931405N03354P98302l37505Q01091L85383Q71875M35294P68457K163338
4970C9320994R94766J210551N90902J220092P89202J036549M59622R60907O57174
4961D7240759J551951L03862J090673K481484J974344K712515K184581Q63711
4953F0403880N78177J885252K891968K655406J780732K638760J818226K133613
$$ y = [20198178, 20467215, 20724117, 20800209, 20578880, 19651115, 20512671, 20472565, 20545326, 20413640, 20847396, 20960717, 21906218, 22902177, 22707135, 21497845, 22052164, 22465474, 22581380, 23397581, 23192378, 24158552, 24911692, 23918818, 23978796, 25279476, 26592633, 27300404, 27524071, 27467578, 28221100, 28954343, 29292536, 29158201, 29997226, 30412352, 31570062, 32931405, 33434759, 34233061, 33895556, 34696647, 35082030, 35953905, 36389199, 37157656, 39320994, 40315760, 41526311, 42117213, 43337305, 44126507, 45163056, 45622678, 46583585, 47240759, 48792710, 49096572, 50187245, 52668729, 54643073, 57355588, 59540169, 60403880, 60982057, 62867309, 65759277, 68414683, 70195415, 72834175, 74652401, 76786014]
4945G6786014L166996L483539J992764L370823K581872L093180L149385L792197
4937A01416770M244856L990788M771508M521779N301765O554087N929024O649540
4929A43380117Q087775Q109635Q426971R960946J2042900J2922572J3204188J4584644
4921B30719748J6024588J7636714J9207563K0074263K0611010K0693271J9859506
4914C64826663J7591176J5372898J1685112M865748j364720q147519j5191058
4907C89638300j9382654k2315154k4159279k3618928k3708009k2250559j9487620
4900B34716097j8374040j6995945j5356513j2625055j2012227j0037138j0066017
4893A39249162q261460p374607o752636o736460n317257o320224m821346n095856
$$ y = [76786014, 79953010, 83436549, 85429313, 88800136, 91382008, 94475188, 97624573, 101416770, 105661626, 109652414, 114423922, 118945701, 124247466, 130801553, 136730577, 143380117, 151467892, 159577527, 168004498, 177965444, 190008344, 202930916, 216135104, 230719748, 246744336, 264381050, 283588613, 303662876, 324273886, 344967157, 364826663, 382417839, 397790737, 409475849, 414341597, 412976877, 404829358, 389638300, 370255646, 347940492, 323781213, 300162285, 276454276, 254203717, 234716097, 216342057, 199346112, 183989599, 171364544, 159352317, 149315179, 139249162, 130987702, 123613095, 116860459, 110123999, 104806742, 98486518, 93665172, 88569316]
4885H8569316m863878l365940m182312k769850l343194l212966l044186k184522
4877F1602468k612619k695349j795140j969484j484968k898803j173275r15820
4869D6057010k010064k441803j535664j289743j214182n14393j628604n34445
4861C4888112r78494o94948j432695n95896q67271j546390l93131j211045j363937
4852B5804305q86013m85050M18014r23670o43510l94242j317908k14427R5066
4843B1452565n95243p13525j348515k30730p05599p46191M97741m3435l96164
4834A7170904j287660j085751N18312M0846m55717l1008m97873o82460k61170
4825A3428423O993o57134j080818N28239p58418J86881o96065Q8218Q2978o15711
$$ y = [88569316, 83705438, 80339498, 76157186, 73387336, 70044142, 66831176, 63786990, 61602468, 58989849, 56294500, 54499360, 52529876, 51044908, 48146105, 46972830, 46057010, 44046946, 41605143, 40069479, 38779736, 37565554, 37051161, 35422557, 34888112, 33909618, 33214670, 31781975, 31186079, 30318808, 28772418, 28379287, 27168242, 25804305, 24918292, 24433242, 24851256, 23927586, 23284076, 22889834, 21571926, 21357499, 21452565, 20857322, 20143797, 18795282, 18564552, 17858953, 17112762, 17610503, 17567068, 17170904, 15883244, 14797493, 15315805, 15356651, 14900934, 14869926, 14372053, 13689593, 13428423, 13435416, 12778282, 11697464, 12225703, 11467285, 11654166, 10958101, 11046319, 11129297, 10513586]
4815A0513586p49377l33564Q37361k47166R203Q05122n41319k89134K19329R1609
4805A0315650l92623l79788n09710r300j84256j56323p9929m25269m80152P9707
4795G778007K27362K24634k2036m26407j10724P11819l54839j257709R18824M41408
4785H130339o36221L2845N20474l85734o17803n77493k62877R7132j27939n35438
4775E637285N41800R2778q0142k61823M48841O0339o0753m03250k90366m66728
4765E217981k70633j83035k03413P02197J7369n38463L300L25467M18247j11890
4755E377127J85879j97608k84017k48911j8540K97709P83291J015074r10129n09354
4745E490521l75783q12711m85973l60611J255469r3055L14888n03027n66485R23021
$$ y = [10513586, 9764209, 9430645, 10268006, 10020840, 10030043, 10835165, 10293846, 10004712, 10224041, 10315650, 9923027, 9543239, 9033529, 9024229, 8839973, 8683650, 8603721, 8178452, 7698300, 7778007, 8005369, 8230003, 8207967, 7781560, 7670836, 8382655, 8027816, 6770107, 7688931, 8130339, 7494118, 7526963, 8047437, 7661703, 7043900, 6466407, 6203530, 6300662, 6172723, 5637285, 6179085, 6271863, 6191721, 5929898, 6378739, 6439078, 6378325, 5975075, 5684709, 5217981, 4947348, 4764313, 4560900, 5263097, 5280466, 4742003, 4745303, 5070770, 5489017, 5377127, 5563006, 5365398, 5081381, 4832470, 4813930, 5111639, 5894930, 6910004, 5999875, 5490521, 5114738, 4302027, 3816054, 3455443, 4710912, 4617857, 4932745, 4429718, 3863233, 4786254]
4735D786254p7378j281354M56169L62727l71388L13337N45115l25800p97604L49662
4725C959740L55917p08718j24100r28624Q41895M28307L69432k10109k49912K38617
4715C972445j426896N83233N09953n04777O91359m12916O75967R7491o86914P361
4705C506306o94551k96799J46317K147p07378k82392Q68718P39669o82183j43379
4695B456475j273089J113768Q29056j44898n15379N55209P70863P3332l39952
4686C525385K98754R34l38871J88064n57434j88983l40845m28993P70682K18370
4676C147063k66716k87436N82633q37800m45154N85309K15916o79691j73586N32274
4666B372812O7642Q82671K06899O7043J2328k71759k63728k94387J86036R30386
$$ y = [4786254, 4708876, 3427522, 3883691, 4246418, 3875030, 4188367, 4733482, 4407682, 3610078, 3959740, 4315657, 3606939, 3482839, 2554215, 3396110, 3824417, 4193849, 3983740, 3733828, 3972445, 2545549, 3128782, 3638735, 3133958, 3825317, 3412401, 4088368, 4185859, 3498945, 3506306, 2811755, 2514956, 2661273, 2663420, 1956042, 1673650, 2542368, 3282037, 2599854, 2456475, 1183386, 2297154, 3126210, 2981312, 2465933, 3021142, 3792005, 3865337, 3525385, 3824139, 3825073, 3486202, 3674266, 3116832, 2927849, 2587004, 2158011, 2928693, 3147063, 2880347, 2592911, 3175544, 2337744, 1892590, 2477899, 2693815, 2014124, 1840538, 2372812, 2440454, 3323125, 3530024, 3597067, 3609395, 3337636, 3073908, 2779521, 2965557, 3895943]
4656C895943M60909r32599m98185J94099k25066O6872M72863l76698l80068j55777
4646B522293j90008l20679M17537p46565k09739M02419O73435N48178K79127l65324
4636C010674k02688O33059k26167j104126O12489K38977M4874m2202M24208M3311
4626C432409j061997l19958M19084L44538M33083o24837K25638N71950L74090
4617C794000m68145r38412M59395L09514N52982J82081J35779N41604l76728j109825
4607C082245L86785M50191M12990o53739J83436r26001L94351J06882K40881J95162
4597C873183k5419j08671Q91394l63101q51544l07943J61719n11181k34393K56030
4587B780074n44045J295488N73168j015431L05371J020600q35803j048486O71683
$$ y = [3895943, 4356852, 3424253, 2926068, 3120167, 2895101, 2961973, 3434836, 3058138, 2678070, 2522293, 2332285, 2011606, 2429143, 1682578, 1472839, 1875258, 2548693, 3096871, 3375998, 3010674, 2807986, 3441045, 3214878, 2110752, 2723241, 2962218, 3007092, 2964890, 3389098, 3432409, 2370412, 2050454, 2469538, 2814076, 3247159, 2622322, 2847960, 3419910, 3794000, 3325855, 2387443, 2846838, 3156352, 3709334, 3891415, 4027194, 4568798, 4192070, 3082245, 3469030, 3919221, 4332211, 3678472, 3861908, 2935907, 3330258, 3437140, 3678021, 3873183, 3847764, 3739093, 4630487, 4267386, 3415842, 3107899, 3269618, 2758437, 2524044, 2780074, 2236029, 3531517, 4104685, 3089254, 3394625, 4415225, 3579422, 2530936, 3202619]
4578C202619j14518Q24014j21609j28012R1300m40741k12382R1169K60078l40551
4568C111367j30182l07751M90628K3567K6147k68554j04355R9315j7257L03024
4558C225949m42306j81564p92110O73616Q31927K14012m77029j06265L21299m44398
4548B823131m11769M16713P11973N1202q47210J95L90783l48648K24142J07915
4538C118427k04733J65593o36375m86448P34027O15273N48283l77100J81111k03227
4528C454831j57759J21628L39515p1489l49962k92326k13329o74474m3641L89465
4518B502459P81331N36582l11734K73933O4094r0479j109806m61452N60398k30620
4508B514706P41696m794l9158O1161J328626j090616m31196N14728M47694q74580
$$ y = [3202619, 3088101, 3912115, 3790506, 3662494, 3753794, 3313053, 3100671, 3191840, 3451918, 3111367, 2981185, 2673434, 3164062, 3187629, 3213776, 2945222, 2840867, 2940182, 2922925, 3225949, 2783643, 2602079, 1809969, 2483585, 3315512, 3529524, 3052495, 2946230, 3267529, 2823131, 2411362, 2828075, 3540048, 3591250, 2744040, 2744235, 3135018, 2786370, 3010512, 3118427, 2913694, 3079287, 2442912, 1956464, 2690491, 3305764, 3854047, 3476947, 3658058, 3454831, 3297072, 3418700, 3758215, 3686726, 3336764, 3044438, 2831109, 2156635, 2112994, 2502459, 3283790, 3820372, 3508638, 3782571, 3846665, 3756186, 2646380, 2184928, 2745326, 2514706, 3256402, 3251608, 3212450, 3273611, 4602237, 3511621, 3080425, 3595153, 4042847, 3168267]
4498C168267j37104O63172M61210j269918J1119J03435K98473k8074l0402J219457
4488D459635Q0312L37382n92488P51073M26645l37444o77122Q3669k49241J11274
4478D393695L18808J11858M94875j02399K16633J42412Q1800J19370k97124m93571
4468D986357M33242L50580k51912K26554m97536k90776N1593J485557m76835k94194
4458E722630K28159O02889m0395K17915J47513J89520O23452O9780k97689K13304
4448G677078K65691J29743R34129L91843p23111l38470J452694m88977Q690M66524
4438I775834j125262J32636K71146N65469Q08541R965K25616l84361L22445K17884
4428A0819913J119902J57426p50371L81141R29270J048793L79192K71982K17655
$$ y = [3168267, 3031163, 3694335, 4155545, 2885627, 2896746, 3000181, 3298654, 3270580, 3240178, 4459635, 4539947, 4877329, 4284841, 5035914, 5462559, 5125115, 4447993, 4531662, 4282421, 4393695, 4712503, 4824361, 5319236, 5216837, 5433470, 5575882, 5657682, 5777052, 5479928, 4986357, 5419599, 5770179, 5518267, 5744821, 5247285, 4956509, 5008102, 6493659, 6016824, 5722630, 5950789, 6553678, 6513283, 6731198, 6878711, 7068231, 7691683, 7761463, 7463774, 7677078, 7942769, 8072512, 9006641, 9398484, 8675373, 8336903, 9789597, 9300620, 9309310, 9775834, 8650572, 8783208, 9054354, 9619823, 10428364, 10438329, 10663945, 10279584, 10602029, 10819913, 11939815, 12097241, 11346870, 11728011, 12657281, 13706074, 14085266, 14357248, 14574903]
4419A4574903J008284j18575N12594J044598L88952n27315j94477Q10508J682228
4410A9181700P0320N24903J410597P73225M43251M10880P09515J479047Q96984
4401B5900422Q28151J583708J07036J35134J028117J860560J366188J217732R78219
4392C5005267J142918J084798M22643R67728J264196Q59680J392040J60851O77430
4383D2977551J311134O51055R05936K147603J675362J870478P76277J304705J261725
4374E4881826J247367J623934J340626J169689J546856J656880Q66641P52468
4366F5086287J030774R90213K51777P64435J907152J486067J384124J171523M66428
4357G4538780N15822J67613O68621N83236J553939N10706l27174k88358Q9362
$$ y = [14574903, 15583187, 15464612, 15977206, 17021804, 17410756, 16883441, 16688964, 17499472, 19181700, 19252020, 19776923, 21187520, 21960745, 22403996, 22814876, 23524391, 25003438, 25900422, 26728573, 28312281, 28419317, 28554451, 29582568, 31443128, 32809316, 34027048, 35005267, 36148185, 37232983, 37655626, 38623354, 39887550, 40747230, 42139270, 42300121, 42977551, 44288685, 44939740, 45845676, 47993279, 49668641, 51539119, 52315396, 53620101, 54881826, 56129193, 57753127, 59093753, 60263442, 61810298, 63467178, 64333819, 65086287, 66117061, 67107274, 67359051, 68123486, 70030638, 71516705, 72900829, 74072352, 74538780, 75054602, 75222215, 75890836, 76474072, 78028011, 78538717, 78211543, 77923185, 78012547]
4348G8012547N3263N61148J277085R29117L10981L73405l40145k85312j017051
4339G9875038n09866p8296N32432N25010n83896J79878K42777k08307r00083q35778
4329G8238909j362360p91149l02492j407724q17107p04004o53925j161933j248816
4320F9789399o83363o53832j228412j106209n00772q69399j930844l17804j463775
4311F1034989j913132L94331q50339k157889j757369p21437j579244j576796j863833
4302D9009281j869285q22069j069954p48169p02291j911733j454463p53939r91712
4293C8685666j453817j144317r25798j068728o34418j840795p93262l55999j003926
4284B9464606j952114r51848o22648j148246j439737j34975k96169n39599j581048
$$ y = [78012547, 78065810, 78626958, 79904043, 80833160, 81144141, 81517546, 81177401, 80892089, 79875038, 79365172, 79286876, 79819308, 80344318, 79760422, 79940300, 80183077, 79974770, 79074687, 78238909, 76876549, 76085400, 75782908, 74375184, 73558077, 72854073, 72200148, 71038215, 69789399, 69106036, 68452204, 67223792, 66117583, 65616811, 64747412, 62816568, 62498764, 61034989, 59121857, 59516188, 58665849, 56507960, 54750591, 54029154, 52449910, 50873114, 49009281, 47139996, 46317927, 45247973, 44499804, 43797513, 41885780, 40431317, 39677378, 38685666, 37231849, 36087532, 35161734, 34093006, 33458588, 31617793, 30824531, 30468532, 29464606, 27512492, 26560644, 25937996, 24789750, 23350013, 23215038, 22918869, 22379270, 20798222]
4275B0798222j524440J87919o61575j311332m83288k86807l98871o07929j233037
4266A4478862l39271j28967M68287j016206m18717J9288O3789j000122j82256
4257A1944687o23547j62331o06514N5701p6433j388844N6777K30623L3108q17481
4247H645746m93155N32132j13421q6750K7817Q13475j62742j57918j286173N51520
4237H270531m01608R19273p0992j771k00694n15860j26024j017377K64610J74057
4227G294145K01460q88808q95384K4896k92412J15515M28276n14797l06787j020984
4217D145120j00299Q13033K61561p09457o31543K62076l9319l02581m73986K93641
4207C518246O21441R71522j18343j16479l12638l28017j53706j32567K35660r32924
$$ y = [20798222, 19273782, 19461701, 18800126, 17488794, 17005506, 16718699, 16319828, 15711899, 14478862, 14139591, 14010624, 14478911, 13462705, 13043988, 13063276, 13127065, 12126943, 11944687, 11321140, 11158809, 10552295, 10607996, 10531563, 9142719, 9199496, 9430119, 9463227, 8645746, 8152591, 8684723, 8571302, 8484552, 8512369, 9325844, 9163102, 9005184, 7719011, 8270531, 7868923, 8788196, 8717204, 8715433, 8514739, 7998879, 7872855, 6855478, 7120088, 7294145, 7495605, 6606797, 5711413, 5736309, 5443897, 5559412, 5987688, 5472891, 5166104, 4145120, 4044821, 4857854, 5119415, 4409958, 3778415, 4040491, 4001172, 3698591, 3224605, 3518246, 4139687, 5111209, 4992866, 4876387, 4563749, 4235732, 4082026, 3949459, 4185119, 3252195]
4197C252195q55392j75171J593082L1394m38264j042857J90862N35166j31609
4188B959406m78115N77998q20310L80260L40301J398623l64548O77695o52484
4179D018826m9411J78577j82320n0706o09501o28620q1296Q38174R9456q09996
4169B723183N4882K45481l27777j17529J61935J12243Q95883N046j55939j181607
4159B415801m70503J190384M21938n71505j52900N69420m28818Q42576M97471
4150D313864r67463j12688J7466K34932J302044m52906o8281M37031O17449L58008
4140E679456p18880k14670J254649o8309N45999L56792l56902M62338R20742R4942
4130G956157L54677O83083j162161p97370j57670o69635p38151j9501o33027n94027
$$ y = [3252195, 2396803, 2221632, 3814714, 3846108, 3407844, 2364987, 2555849, 3091015, 2959406, 2481291, 3059289, 2238979, 2619239, 2959540, 4358163, 3993615, 4671310, 4018826, 3969415, 4147992, 3965672, 3914966, 3305465, 2676845, 2595549, 3433723, 3533179, 2723183, 2778065, 3023546, 2695769, 2578240, 2740175, 2852418, 3748301, 3753347, 3597408, 2415801, 1945298, 3135682, 3557620, 2986115, 2833215, 3402635, 2973817, 3816393, 4313864, 3346401, 3233713, 3251179, 3486111, 4788155, 4335249, 4266968, 4703999, 5321448, 5679456, 4960576, 4745906, 6000555, 5932246, 6478245, 6835037, 6478135, 6940473, 7861215, 7956157, 8310834, 8993917, 7831756, 7034386, 6876716, 6207081, 5468930, 5449429, 4816402, 4222375]
4120D222375N48658M29347K01276j587891k64718l53911L31615j274067P86280
4111C038964J88776R34295r05914k92579r24137O35768K39887n82845L92542n05638
4101B219119l3900m4943Q7882O2196l87212L2463K79878J1913L23201r9828k64595
4090B186174p68622l85253N10927N03032O16807M58714q07757L88076k46477j6947
4080B438674P85020K23403n5076l25743j517269Q57075J6974k79782Q60525p12171
4070B291630j89576K18510r3279m97629N18871L78631J67438J36594k88704P49421
4060C391907l19232J27543j544525O94646J59214k9081n2773j68039L65953j58076
4050B467537m65838j28267N7859J5018J019586K94273m60057l70077m82284N0365
$$ y = [4222375, 4771033, 5200380, 5401656, 3813765, 3549047, 3195136, 3526751, 2252684, 3038964, 3227740, 4162035, 3256121, 2963542, 2039405, 2675173, 2915060, 2332215, 2724757, 2219119, 2185219, 2140276, 2228158, 2290354, 1903142, 1935605, 2215483, 2227396, 2550597, 2450769, 2186174, 1417552, 1032299, 1543226, 2046258, 2663065, 3121779, 2314022, 2702098, 2455621, 2438674, 3223694, 3447097, 3392021, 3066278, 1549009, 2406084, 2423058, 2143276, 3003801, 2291630, 2102054, 2320564, 2227285, 1729656, 2248527, 2627158, 2794596, 2931190, 2642486, 3391907, 3072675, 3200218, 1655693, 2350339, 2509553, 2480472, 2427699, 2259660, 2625613, 2467537, 2001699, 1873432, 1931291, 1946309, 2965895, 3260168, 2800111, 2430034, 1947750, 1998115]
4040A998115J116042k37175q1638L84665n85712K52580M41239n95918J26112P07270
4030C525580n27507K71748Q22023r5532J15255l18806o97883P82826q42031n72542
4020B463131N81988l08535P0076J046122k67932J47107K34442m01061n67483R0510
4010C088365P75044n41892P5193n05080n1160J30033L13733o40501j024789J443136
4000C062082N99967L47859Q6313m33049Q3989j63916l44391K94708O23770j18471
3990D038861q5566K80759Q66391k08457L78518n15153R6501m27416m65778o42322
3980C316338N52082j30855J080043o2716n24609J7510r62233k50810l26106R19891
3970C628535M57784L74957l58731J103808m41459k14990j88430r51280L40699
$$ y = [1998115, 3114157, 2876982, 2795344, 3180009, 2594297, 2846877, 3288116, 2692198, 2818310, 3525580, 2998073, 3269821, 4091844, 3996312, 4111567, 3792761, 3094878, 3877704, 3035673, 2463131, 3045119, 2736584, 2806660, 3852782, 3584850, 3731957, 3966399, 3565338, 2997855, 3088365, 3863409, 3321517, 3396710, 2891630, 2840470, 2970503, 3284236, 2643735, 1618946, 3062082, 3662049, 4009908, 4096221, 3663172, 3747161, 3583245, 3238854, 3533562, 4157332, 4038861, 3953295, 4234054, 5100445, 4891988, 5270506, 4755353, 4851854, 4424438, 3958660, 3316338, 3868420, 3737565, 4817608, 4754892, 4230283, 4247793, 3285560, 3034750, 2708644, 3628535, 4086319, 4461276, 4102545, 5206353, 4764894, 4549904, 4361474, 3410194, 3750893]
3961C750893J383319l18526L6999r54201j71051P22099p58182M67644L72731p4325
3951D457400L5746J11664l15902n89984j55898k6882k45181O86678L05184K57642
3941D520467l73803n22741R0580q54585j53587N04987R76797q18889l31844N47487
3931C584869N3784l68169P09996O86827K67612J05096L7413M08813L8224j8915
3921E505550p81239l67645m89454K42799o11529M49256j20658J58141M8645N9634
3911D093500k12649O30958l19698K68357n39184m8652Q15234K14037j38057n33918
3901D229928l529K50322m92944K2894P87037o1653P28041L04729r9492L5957J41515
3890E842805k91046M45554J81611l19764o08020j05375J47529m79679J0087J212830
$$ y = [3750893, 5134212, 4815686, 4852685, 3898484, 3727433, 4449532, 3691350, 4158994, 4531725, 4457400, 4493146, 4604810, 4288908, 3698924, 3543026, 3516144, 3270963, 3957641, 4262825, 4520467, 4146664, 3623923, 3714503, 2859918, 2706331, 3211318, 4188115, 3369226, 3037382, 3584869, 3638653, 3270484, 3980480, 4667307, 4934919, 5040015, 5077428, 5486241, 5524465, 5505550, 4724311, 4356666, 3867212, 4110011, 3498482, 3947738, 3827080, 3985221, 4033866, 4093500, 3880851, 4511809, 4192111, 4460468, 3921284, 3872632, 4687866, 4901903, 4763846, 4229928, 4226399, 4476721, 3983777, 4006671, 4793708, 4732055, 5460096, 5764825, 5665333, 5701290, 5842805, 5551759, 5997313, 6178924, 5859160, 5251140, 5145765, 5293294, 4813615, 4823702, 6036532]
3880F036532L49270n60714L8194J63893K05062P19572k32229o79058N10345N90928
3870G141795o44003j16583K62478K67421J033093j88618r5508L2401j052994J77757
3860F817239K18607M31644J49507K1558k45688m27943J97013P99406k48607J01937
3850G814673M40044q7027j20316K36381p7672o5240Q60720m62830P78149K70465
3840I587347q846l97390l39337J140285o2154p8523o63400K09434j57558J058895
3830A0288753O00138r5313o10148L74591L63780L08498J430048m87702l38600
3821A1834045J93116J63687j66733Q8360R00228o83303J003880M64613k20360
3812A3577533K95803m37421J066225O04751L84372J9555O79179R45156j06877
$$ y = [6036532, 6385802, 5825088, 5863282, 6027175, 6232237, 6951809, 6719580, 6040522, 6550867, 7141795, 6497792, 6381209, 6643687, 6911108, 7944201, 7755583, 7660075, 7692476, 6639482, 6817239, 7035846, 7467490, 7616997, 7638555, 7392867, 6964924, 7161937, 7961343, 7712736, 7814673, 8254717, 8167690, 8047374, 8283755, 8206083, 8140843, 9001563, 8538733, 9316882, 9587347, 9578501, 9181111, 8841774, 9982059, 9919905, 9841382, 9177982, 9387416, 9229858, 10288753, 10888891, 10793578, 10183430, 10558021, 10921801, 11230299, 12660347, 12172645, 11834045, 12027161, 12190848, 12024115, 12112475, 13012703, 12329400, 13333280, 13797893, 13577533, 13873336, 13435915, 14502140, 15106891, 15491263, 15510818, 16189997, 17135153, 17028276]
3803A7028276L16791N40711K60275k25565r7131O37118Q0153J033294M89479Q62923
3793B0926324J074356J78734L61945o07974M18228J419358j10293M21210Q38694
3784B4920582J238291N24679L83282k3954L83746O82538P10196O61244J091916
3775C0572520L27911Q64125J435010M14199O83031m30689Q87763R58366K96364
3766C6008600J487210Q50557J599460Q96645K02849Q02501J788449J837274J047142
3757D6520687J019302K222361J665100J137871J597085K384097K103278J734194
3749F0383975J220654K058868L534142K070542K157893K058400K418594K153008
3741G8056076K788386K449872L226033K759342L297795L731919K793366K364740
$$ y = [17028276, 17345067, 17885778, 18146053, 17920488, 17823357, 18460475, 18540628, 19573922, 20063401, 20926324, 22000680, 22179414, 22541359, 21933385, 22351613, 23770971, 23660678, 24081888, 24920582, 26158873, 26683552, 27066834, 27042880, 27426626, 28109164, 28819360, 29480604, 30572520, 30900431, 31764556, 33199566, 33613765, 34296796, 33866107, 34753870, 35712236, 36008600, 37495810, 38346367, 39945827, 40842472, 41045321, 41847822, 43636271, 45473545, 46520687, 47539989, 49762350, 51427450, 52565321, 54162406, 56546503, 58649781, 60383975, 61604629, 63663497, 67197639, 69268181, 71426074, 73484474, 75903068, 78056076, 80844462, 83294334, 86520367, 89279709, 92577504, 96309423, 99102789, 101467529]
3733A01467529L868735M575258J875755K940011L931907L067113L361053K804679
3725A27892040J249600R64136J625536K313342L726796J635415L29767K175689
3717A41912321K384537J862390J583720K508623L160828K156864K689113L558416
3709A61816812K300969K703421K683879K903081L151743K401745K103053K332724
3701A82397427K245140L004412K756271K071456K245819J784052J806608J532512
3693A99843697J042554l83958L91132M09086p61114j201260o79675l57638j779092
3684A96523732k696421j573058k751592l189564k020017l346739l818470l574659
3676A73553212l086039l925925m686916m340769l709261m766623n064692m328674
$$ y = [101467529, 105336264, 109911522, 111787277, 114727288, 118659195, 121726308, 125087361, 127892040, 129141640, 130105776, 131731312, 134044654, 137771450, 139406865, 139736632, 141912321, 144296858, 146159248, 147742968, 150251591, 153412419, 155569283, 158258396, 161816812, 164117781, 166821202, 169505081, 172408162, 175559905, 177961650, 180064703, 182397427, 184642567, 187646979, 190403250, 192474706, 194720525, 196504577, 198311185, 199843697, 200886251, 200502293, 200893425, 201302511, 200541397, 199340137, 198660462, 198302824, 196523732, 193827311, 192254253, 189502661, 186313097, 184293080, 180946341, 177127871, 173553212, 170467173, 166541248, 161854332, 157513563, 153804302, 149037679, 143972987, 139644313]
3668A39644313m582397m182584m109714m377824n718571l681453l481772m395630
3660A05114368l262886m361044l791681l991371l744545k949566l143101l481593
3652G6388581k900409l229404l195370k334762k542999k495159k048116k425993
3644E5216369j450834j535513k095484j352133j344435j207223j479065j165388
3636D3586294j082553q68886q67491j527951m72450j285407p57581K58009r27930
3627C6054054n40478p54007j02787l69190p54042n47958J27635L08306j7342j104071
3617C2300120n58239R97643m22180o11777J370363p88693j225597Q12146n2236
3608C1821550L19886n19536n85019l49266P11720Q34833o23879J5947N09625O26943
$$ y = [139644313, 135061916, 130879332, 126769618, 122391794, 116673223, 112991770, 109509998, 105114368, 101851482, 97490438, 93698757, 89707386, 85962841, 83013275, 79870174, 76388581, 73488172, 70258768, 67063398, 64728636, 62185637, 59690478, 57642362, 55216369, 53765535, 52230022, 50134538, 48782405, 47437970, 46230747, 44751682, 43586294, 42503741, 41634855, 40767364, 39239413, 38766963, 37481556, 36723975, 36981984, 36054054, 35513576, 34759569, 34656782, 34287592, 33533550, 32985592, 33113227, 33421533, 33404191, 32300120, 31741881, 32739524, 32317344, 31705567, 33075930, 32287237, 31061640, 31873786, 31821550, 32141436, 31621900, 31036881, 30687615, 31399335, 32234168, 31610289, 31626236, 32135861, 32762804]
3598C2762804R79589l04974n64140O52088O16239K8291O64150J068443R85890
3589C6888380k97549K1589R84293N93827K38364J251401O51083J22191J485968
3580D1939547J83526J117408K066974P35715L82472J607623O45015L73914J241208
3571E0293402J599197P63882J241084J462419K047332Q50726P91823J717057N60347
3562F1327269Q48597J916457J902330J947197J582177J333426J426436K887065
3554G5170954K624520R31130K109725J659988J548355K023742K451819K983492
3546I1503725J732587L293111K302664L395551L028743L183532L912090L024497
3538A15376500L741542L488575M635822N103218N699118M778690M803851N391645
$$ y = [32762804, 33742393, 33437419, 32873279, 33525367, 34141606, 34169897, 34834047, 35902490, 36888380, 36590831, 36612420, 37596713, 38190540, 38428904, 39680305, 40331388, 40453579, 41939547, 42123073, 43240481, 45307455, 46043170, 46425642, 48033265, 48678280, 49052194, 50293402, 51892599, 52656481, 53897565, 55359984, 57407316, 58258042, 59049865, 60766922, 61327269, 62175866, 64092323, 65994653, 67941850, 69524027, 70857453, 72283889, 75170954, 77795474, 78726604, 80836329, 82496317, 84044672, 86068414, 88520233, 91503725, 93236312, 96529423, 98832087, 102227638, 105256381, 108439913, 112352003, 115376500, 119118042, 122606617, 127242439, 132345657, 138044775, 142823465, 147627316, 153018961]
3530A53018961O179735O210735P942043Q066629Q770628Q969146J0002179J0846180
3522B20006236J1291524J1846740J2597006J2678335J4652689J4811335J5827668
3515C13711533J5840104J5483955J5327169J4221033J3448426J3088778J0365804
3508D11486802Q129071P242213M990932L859188J984140O12881j330250k102575
3500D34872402l358727n297217n338614p431994q387293r115663j1819824j2405407
3492C71717663j3104198j4923781j4542655j5485143j6718023j6115404j5293069
3485B65535390j4666044j3831143j3655456j3226635j1824886j1507946r538583
3478A77284697r936355r181788p859581p660272p141265o232831n599664o438511
$$ y = [153018961, 159198696, 165409431, 173351474, 181418103, 190188731, 199157877, 209160056, 220006236, 231297760, 243144500, 255741506, 268419841, 283072530, 297883865, 313711533, 329551637, 345035592, 360362761, 374583794, 388032220, 401120998, 411486802, 419615873, 426858086, 431849018, 435708206, 437692346, 438305227, 436974977, 434872402, 431513675, 426216458, 420877844, 413445850, 405058557, 395942894, 384123070, 371717663, 358613465, 343689684, 329147029, 313661886, 296943863, 280828459, 265535390, 250869346, 237038203, 223382747, 210156112, 198331226, 186823280, 177284697, 167348342, 158166554, 150306973, 142646701, 135505436, 129272605, 123672941, 117234430]
3470A17234430o139252l874860l770829m332296m855415l411861l423462k779638
3462H4646817l282725l081730k364668k980607k307282j694753k787622k154766
3454F3992664k528343j18512r64718k595602j018499j199105j241413j525514
3446E2800958j553750p08484p28281p45011j301222j537161m83599j249044m60662
3437D4033744n53643j487466j291269k13305K62734k68285j403195j026359k67573
3428C7785383l99567j198196m89085j304144m01348J2475m34249r02693k89779
3419C2378797n92449n84044n29915J43714j84762m57988q07537j049489l71795
3410B7944532j65415P4342j214652q232R38127p29634l91619n70699J93431J51402
$$ y = [117234430, 111095178, 107220318, 103449489, 99117193, 94261778, 90849917, 87426455, 84646817, 81364092, 78282362, 75917694, 72937087, 70629805, 68935052, 66147430, 63992664, 61464321, 61345809, 60381091, 57785489, 56766990, 55567885, 54326472, 52800958, 51247208, 50538724, 49810443, 49065432, 47764210, 46227049, 45743450, 44494406, 44033744, 43480101, 41992635, 40701366, 40488061, 40750795, 40482510, 39079315, 38052956, 37785383, 37385816, 36187620, 35698535, 34394391, 33993043, 34005518, 33571269, 32668576, 32378797, 31786348, 31202304, 30672389, 30816103, 30631341, 30173353, 29365816, 28316327, 27944532, 27779117, 27853459, 26638807, 26630575, 27568702, 26839068, 26447449, 25876750, 26070181, 26221583]
3400B6221583j10830P24489L07625m25460m31282K54052n69132m80779r88577
3391B4501689n61411N94484m3206l87107P98664K12918P37223J88184m06097L12541
3381B5947882o64473P6279P67987l14354O85135l11978L08647l49968K92026R66103
3371B7403286J3957j86951q6946k54798O11694N89889J7064O70114k93881J108983
3361B9592411J391704M31819L76048P02449K17310j61886N56029J385420R51309
3352C5442613K35594J471175O58900M59937J057699Q19579K35015Q30348J284367
3343D2495227J370356R01344J263746J699144J011309J514733K096445J167501
3335E3519805N10561K218411J401719J905023R46967J309867Q15087Q81939J865578
$$ y = [26221583, 26110753, 26835242, 27142867, 26717407, 26286125, 26540177, 25971045, 25490266, 24501689, 23940278, 24534762, 24491556, 24104449, 24903113, 25116031, 25853254, 26041438, 25635341, 25947882, 25283409, 25359688, 26127675, 25813321, 26498456, 26186478, 26495125, 26145157, 26437183, 27403286, 27417243, 27230292, 27143346, 26888548, 27500242, 28090131, 28107195, 28777309, 28483428, 29592411, 30984115, 31415934, 31791982, 32494431, 32711741, 32549855, 33105884, 34491304, 35442613, 35678207, 37149382, 37808282, 38268219, 39325918, 40145497, 40380512, 41210860, 42495227, 43865583, 44766927, 46030673, 47729817, 48741126, 50255859, 52352304, 53519805, 54030366, 56248777, 57650496, 59555519, 60502486, 61812353, 62627440, 63509379, 65374957]
3326F5374957J389378J055639Q40183J318443Q98304P3039J757106J307548J013648
3317G5028245P65008M078J379674J483562K52592J283629J278026J065856J976602
3308H4517272R77170J874583K845899J932551J961963J660127K567687K852710
3300A01189962K697385L738299L947487L774443L937737M314153N003341N367600
3292A33970407N222235O303549O510504N821088Q144181Q424477P047102Q024595
3284A89468138R652783R802159R254921Q798093R203227J0752751J0875569J0479505
3276B68287146R354083J0242628R432103R222369R103270P932407Q130059P859094
3268C39563159O129369N667567M261931M284381K920041K720166J473465l0716
$$ y = [65374957, 66764335, 67819974, 68660157, 69978600, 70876904, 70949943, 72707049, 74014597, 75028245, 75793253, 75797331, 77177005, 78660567, 78913159, 80196788, 81474814, 82540670, 84517272, 85494442, 87369025, 90214924, 92147475, 94109438, 95769565, 98337252, 101189962, 103887347, 107625646, 111573133, 115347576, 119285313, 123599466, 128602807, 133970407, 139192642, 145496191, 152006695, 157827783, 165971964, 174396441, 181443543, 189468138, 199120921, 208923080, 218178001, 226976094, 236179321, 246932072, 257807641, 268287146, 277641229, 287883857, 297315960, 306538329, 315641599, 323574006, 331704065, 339563159, 345692528, 351360095, 355622026, 359906407, 362826448, 365546614, 367020079, 366989363]
3260C66989363K39565j682642l096954l682843m300343l208621n808106o874162
3252C38575257p167638p367810q103644r212643j0188021r508428r417166j0261279
3244B67348628r963382j0695945r231261j0464251r935860j0201722r160307q920410
3236A88775490q595806r265173o960057q509185q923192p520894o848888o044589
3228A26107706o277669n188438m338344n531990n318377l022020k229550l785247
3220I0416071l167527l124537l009727k360305k154351j268983k167781j138353
3212G2024507j874644j814483j610869o61144j049133j651440n14734q98629k31302
3203F1718129m34550j032666r50023j172312j589993j502096q38366k31221k64291
$$ y = [366989363, 367228928, 365546286, 362449332, 358766489, 354466146, 351257525, 345449419, 338575257, 331407619, 324039809, 315936165, 306723522, 296535501, 287027073, 277609907, 267348628, 257385246, 246689301, 237458040, 226993789, 217057929, 206856207, 197695900, 188775490, 180179684, 170914511, 163954454, 155445269, 146522077, 139001183, 132152295, 126107706, 119830037, 114641599, 110303255, 104771265, 99452888, 96430868, 94201318, 90416071, 87248544, 84124007, 81114280, 78753975, 76599624, 75330641, 73162860, 72024507, 70149863, 68335380, 66724511, 66063367, 65014234, 63362794, 62848060, 61949431, 61718129, 61283579, 60250913, 59300890, 58128578, 56538585, 55036489, 54198123, 53966902, 53702611]
3194E3702611j814123j480386j574075j010178j666124o14774j280122n22279
3186D3740550j776195j157048q70627j266969j344402j774366p09121k675l34026
3177C4505121j246426p59992j850692j304721j518758q31074o73498j381490j386014
3168B3552456j36215l55726r76054k97341n47858j03918q60571j005262o41392
3159A8628119L13264r70309l10123k20727M2826K12993o57306q02828j348782
3150A4887127r88301N08328P4651j0468j148416o90759K34421m6619n3218L19697
3140A3086443l07803j82196p20330m33713L47745k53724j81327j498184R20781
3131A0777692k8031q9449r41153K64209k49387m49896k66265O18624o76231N77720
$$ y = [53702611, 51888488, 50408102, 48834027, 47823849, 46157725, 45542951, 44262829, 43740550, 41964355, 40807307, 39936680, 38669711, 37325309, 35550943, 34841822, 34839147, 34505121, 33258695, 32498703, 30648011, 29343290, 27824532, 26993458, 26319960, 24938470, 23552456, 23416241, 23060515, 22084461, 21787120, 21239262, 21135344, 20274773, 19269511, 18628119, 18941383, 17971074, 17660951, 17440224, 17483050, 17696043, 17038737, 16235909, 14887127, 13898826, 14407154, 14481805, 14471337, 13322921, 12632162, 12866583, 12819964, 12766746, 13086443, 12778640, 12596444, 11876114, 11442401, 11790146, 11536422, 11355095, 9856911, 10777692, 10749661, 10660212, 9719059, 9983268, 9733881, 9283985, 9017720, 9636344, 8960113, 9537833]
3121I537833k58400k95177j64975l23235o4512o55095K39649J82273k91206j85732
3111G721423l44648l11739R31533o02929m33991L25213r17808k34313j76914J203096
3101G158923M49816n92401n4322J86013k53865r35739P52765J12957j80572l09299
3091F334276j45607n78998K42900L12687q4261r4404K9128n13256q49209J28920
3081D782176N69385J62450o91772k99521J50463J57475N34104R5073r82303n46333
3071C931197l99720O93176l35044N71200P47220o00310m87478k60058p6776J653544
3061E436951L93091j199318j99716J85154K93363l76154m2909N0162L95561m09838
3051D526347J60870j124n59445m44616N52385l66520j58095l208M70720J64417
$$ y = [9537833, 9279433, 8984256, 8819281, 8496046, 8431534, 7776439, 8016088, 8198361, 7907155, 7721423, 7376775, 7065036, 7996569, 7393640, 6959649, 7284862, 6367054, 6132741, 5955827, 7158923, 7608739, 7016338, 6962016, 7148029, 6894164, 5958425, 6711190, 6824147, 6643575, 6334276, 6188669, 5609671, 5852571, 6165258, 6080997, 5986593, 6015721, 5502465, 4653256, 4782176, 5351561, 5514011, 4822239, 4522718, 4673181, 4830656, 5364760, 5459833, 4477530, 3931197, 3531477, 4224653, 3889609, 4460809, 5208029, 4607719, 4120241, 3860183, 3783407, 5436951, 5830042, 4630724, 4431008, 4616162, 4909525, 4533371, 4490462, 4540624, 4936185, 4526347, 4687217, 4686093, 4126648, 3682032, 4234417, 3867897, 3709802, 3706594, 4177314, 4341731]
3041D341731p46741m75694O79415m11442O30640M0318L08474O21578j00727n60183
3031D327369m17854K17452n08902J24422K43889p09971J513K94487M53361o71098
3021C354668o79535J04461Q71736O40813L71384o8462m44350l97984k1110J74389
3011C906010l17049N0216P00650l9439o20647Q0424M79295p82252l09977Q33349
3001C980580J8702j65575m20278j82449M28108L51110l03110J49483m58649m04134
2991B993788k4346Q7820m53265L22434J90920O57697J16299k18595j78702L35658
2981C829708K63388o61847R51231N59957j162154p67164K43864K90639J496823
2972E044445L92825j013245j39869O4542K49830l96482r5508N05346l74244n63018
$$ y = [4341731, 3594990, 3119296, 3798711, 3387269, 4017909, 4058227, 4366701, 4988279, 4887552, 4327369, 3909515, 4126967, 3618065, 3742487, 3986376, 3276405, 3277918, 3572405, 4025766, 3354668, 2675133, 2779594, 3651330, 4292143, 4663527, 4595065, 4150715, 3752731, 3731621, 3906010, 3588961, 3639177, 4339827, 4300388, 3679741, 3760165, 4239460, 3457208, 3147231, 3980580, 3999282, 3833707, 3413429, 3230980, 3659088, 4010198, 3707088, 3856571, 3397922, 2993788, 2969442, 3057262, 2603997, 2926431, 3117351, 3775048, 3891347, 3672752, 3494050, 3829708, 4093096, 3431249, 4382480, 4942437, 3780283, 3013119, 3256983, 3547622, 5044445, 5437270, 4424025, 4284156, 4348698, 4598528, 4202046, 4106538, 4611884, 4237640, 3674622]
2962C674622O21939q0408J45646J62031k1912L64459m27686L59071k79350q10077
2952C708335P11624l84455K86144K88248J9651O698q61209Q66460j14002r02367
2942C625127N18746O26421m66085l01720J95378K4771K48643L18351Q04957n68401
2932E026188p63581k1370R22736j61911n14244L6272M07009L00949Q5367l09080
2922E008335N75969o15030J34473l46510K19901N77171k46599m92719J83185R74260
2912E972436j75472k93279j46162j29768L81816L71721P51698P60568l22613K18218
2902G389163K8643l11757k4465N38921R77842j4400K10076R82540n285Q61452
2892A0632730M83981K27333K46533L40116N03655M49184j58407K24941M96189
$$ y = [3674622, 4296561, 4216153, 4361799, 4523830, 4501918, 4866377, 4438691, 4797762, 4518412, 3708335, 4419959, 4035504, 4321648, 4609896, 4629547, 4636245, 3775036, 4641496, 4527494, 3625127, 4143873, 4770294, 4304209, 4002489, 4197867, 4222638, 4471281, 4789632, 5594589, 5026188, 4262607, 4241237, 5163973, 5002062, 4487818, 4524090, 4931099, 5232048, 5317415, 5008335, 5584304, 4969274, 5103747, 4757237, 4977138, 5554309, 5307710, 4814991, 4998176, 5972436, 5796964, 5503685, 5357523, 5227755, 5609571, 5981292, 6732990, 7493558, 7170945, 7389163, 7417806, 7106049, 7081584, 7620505, 8598347, 8583947, 8794023, 9776563, 9771278, 10632730, 11116711, 11344044, 11590577, 11930693, 12434348, 12883532, 12725125, 12950066, 13446255]
2883A3446255q05739m54153m95562r57250q17801j137073o91646J21858K15616
2874H424505q81239p98414k18423P06681l39324n88864n14475L87272L07882p86912
2864E698689j247351l14967L55294J4044l36760L90216j0167q47909m31090M10830
2854C680829O27478K97595j01245p41455p12411K68143N61046k36999M3657r5708
2844C590930m85612n47632N55632K94347p07839N8339j28364j42882p79108l66917
2834A340894K43848O03834p73889M66720L53086j71213m39307j49262j82514M11220
2824A703417P70582M15289j065417j80286Q1764k55298K8654K75779l22143k89693
2814A162648J331045m26373o35702l13084R7201J7450N89183Q2796M86228j73241
$$ y = [13446255, 12640516, 12186363, 11690801, 10733551, 9915750, 8778677, 8087031, 8208889, 8424505, 7543266, 6744852, 6526429, 7233110, 6893786, 6304922, 5790447, 6177719, 6485601, 5698689, 4451338, 4136371, 4491665, 4505709, 4168949, 4559165, 4548998, 3701089, 3269999, 3680829, 4308307, 4605902, 4504657, 3763202, 3050791, 3318934, 3879980, 3642981, 3686638, 3590930, 3105318, 2557686, 3113318, 3407665, 2699826, 2758165, 2629801, 2486919, 1707811, 1340894, 1584742, 2188576, 1414687, 1881407, 2234493, 2063280, 1623973, 1474711, 1292197, 1703417, 2473999, 2889288, 1823871, 1643585, 1725349, 1470051, 1498705, 1774484, 1452341, 1162648, 2493693, 2067320, 1431618, 1118534, 1215735, 1233185, 1822368, 1905164, 2391392, 2218151]
2804B218151n14497m57151l94822O3809k79755k99766K91305N21387J90139l54735
2794I84065n49371K02403M53625M88020p9216n83031J48206l43998O36263m32828
2784I24138j40808j64888J59258J18236j54662q8924J58489q02961n2124M23516
2774C79270m42064P54354R80138K3720l2896p57900o75529o3327M10387L35535
2764I11688n07854p73986K36476o43198N22095J469641j0650q73282N26299J250664
2754B107893j517652m10191L78556K52158Q50496P3761n79749p75225m56666m3476
2744a20095K72014n93756j73438J345389M46963L2080q05229j60480N44228M99695
2734A287371n06820l54045l67151M29033L92432m41374K97324J74893k35782K30575
$$ y = [2218151, 1703654, 1246503, 851681, 915490, 635735, 335969, 627274, 1148661, 1338800, 984065, 434694, 637097, 1090722, 1578742, 1499526, 916495, 1064701, 720703, 1356966, 924138, 783330, 618442, 777700, 895936, 741274, 652350, 810839, 7878, -44246, 379270, -62794, 691560, 1671698, 1695418, 1662522, 904622, 229093, 165766, 576153, 911688, 403834, -370152, -133676, -776874, -254779, 1214862, 1204212, 330930, 857229, 2107893, 590241, 180050, 558606, 810764, 1661260, 1735021, 1155272, 380047, -76619, -120095, 151919, -441837, -615275, 730114, 1177077, 1209157, 403928, 243448, 787676, 1287371, 780551, 426506, 59355, 488388, 880820, 439446, 736770, 911663, 675881, 906456]
2724I06456o27399k42284k99461M70313r97281L37535O22896j27693j16528m13919
2714d87365J226736l9831j28087L73656M05510p26769k47425k50824L07594j52111
2704B81084K78073o56086J99283m3905L02642J2294p63312J312171Q01112k76922
2694A446434l63090o98160k56341l95542l95425Q68914P14782k65218J54971J49479
2684I60804l5715J78863l80274p4922L23016k85988n83999N18907P065j94744
2674D33013m13662P12948K67951k58214m30343o35357K94513P4330K35665P5363
2664C56207o71415P18901M24860j415983J004469M41256r6712L94360o74172r7398
2654C84373L16836N81548K11800j15956o41647K03501j23995K37974P02701o65728
$$ y = [906456, 279057, 36773, -262688, 207625, -789656, -452121, 170775, 43082, -73446, -487365, 739371, 699540, 571453, 945109, 1350619, 623850, 376425, 125601, 433195, 281084, 559157, -96929, 102354, 58449, 361091, 373385, -389927, 922244, 1723356, 1446434, 1083344, 385184, 128843, -266699, -662124, 206790, 921572, 656354, 811325, 960804, 925089, 1103952, 723678, 648756, 971772, 685784, 101785, 620692, 627757, 433013, 19351, 732299, 1000250, 742036, 311693, -323664, -29151, 45179, 280844, 356207, -315208, 403693, 828553, -587430, 417039, 858295, 761583, 1155943, 481771, 384373, 701209, 1282757, 1494557, 1378601, 736954, 940455, 816460, 1054434, 1757135, 1091407]
2644A091407l24340R2852o9153L48719l0001k16608k95444r8678M11254r88766
2634g8758r18515R8325Q57710L66663l96099j1021k5851N71098K47791M02341
2624A113684j75056l99372Q0751K82431j066105L00300N9490j83755M27689m97579
2614e7522K88174k48907J45588O04707J7666J79015k17170m46626J08270j31777
2604B41418j38470M46062q71547L34730J172515k49629k95451j109821K16418
2595b53775O98887j67527m47931n6977N31356J081739N11503j08205l8130K07805
2585A958745m15810Q7996n2051l33008l88737Q1358J50467J52701m20080m82078
2575C39503K82792P21776K28958j15075k26371K00917K8682j349810O84265k09664
$$ y = [1091407, 767067, 859919, 790766, 1139485, 1109484, 892876, 597432, 498754, 910008, -78758, -997273, -898948, -41238, 325425, -70674, -81695, -107546, 463552, 711343, 1113684, 938628, 539256, 620007, 902438, -163667, 136633, 196123, 12368, 440057, -57522, 230652, -18255, 127333, 732040, 749706, 928721, 711551, 264925, 373195, 241418, 102948, 549010, -322537, 12193, 1184708, 935079, 639628, -470193, -253775, 445112, 277585, -170346, -227323, 304033, 1385772, 1897275, 1789070, 1750940, 1958745, 1542935, 1630931, 1578880, 1245872, 857135, 938493, 1088960, 1241661, 821581, 339503, 622295, 1344071, 1573029, 1457954, 1231583, 1432500, 1461182, 111372, 795637, 585973]
2565E85973M55451M53026N56661o2025j100618n12421J467846K12846r12499J54047
2555A298287O27280L19618q6940j59924o71067P3374P63575o51696p61430K01407
2545I52484M52699j2306K22612m47381l29175K4966O47599L14265o70350Q07662
2535A963075l59684n51388J84239k17238L1636k02732l50314L97292N41379K90570
2525A726835p3180K94288n94640M08360k18488k96028J60144m56285M84871R499
2515A445376p11192j62814L20683O92296P3877j088427l31437J117855K44324
2506A600541q15881r53354O79493m20061l4742l09295M91530l00460Q47980N28978
2496A314729k47901n20822M6124r38037L64213Q08847m50971M03261J36316l44027
$$ y = [585973, 1041424, 1494450, 2051111, 1989086, 888468, 376047, 1843893, 2056739, 1144240, 1298287, 1925567, 2245185, 2158245, 1998321, 1327254, 1400628, 2164203, 1512507, 751077, 952484, 1405183, 1392877, 1615489, 1168108, 838933, 863899, 1511498, 1825763, 1155413, 1963075, 1603391, 1052003, 1236242, 1019004, 1050640, 847908, 497594, 894886, 1436265, 1726835, 1653655, 1947943, 1353303, 1761663, 1543175, 1247147, 1407291, 951006, 1435877, 1445376, 734184, 571370, 892053, 1584349, 1658226, 569799, 238362, 1356217, 1600541, 784660, -168694, 510799, 90738, 55996, -253299, 238231, -62229, 785751, 1314729, 1066828, 546006, 592130, -345907, 18306, 827153, 376182, 779443, 915759, 571732]
2486E71732O95219r6585m56394N34210j33871o56306L75462K98882l16121q55479
2476c9251K3479J070427Q8038p86355K3482M02531o17491k76257J31936J2773
2466C3312N11954M59924n52459j06898N9620j8733q50773m62935N02614L62790
2456f1584n47972J04951K0329Q82360m85159l63188m59470K37968J72230N55592
2446E6057r322J21288k37352J61856m4722N22700L65692k9568n55077j77376K91490
2435D65666O82j58338R15369j206060l06683l93599n84119O34502k03534J039739
2425B03625n12099O02592K98047r8145m96212j85601l48884J02583Q59258k50192
2415A74972J02859m9635P06895o55095J40450N07993j10615m14902j02932l43487
$$ y = [571732, 1266951, 1170366, 713972, 1248182, 1114311, 458005, 833467, 1132349, 816228, -39251, -15772, 1054655, 1142693, 356338, 379820, 782351, 164860, -111397, 20539, 33312, 545266, 1005190, 452731, 345833, 405453, 386720, -464053, -926988, -424374, -61584, -609556, -504605, -484276, 398084, -87075, -450263, -909733, -671765, -499535, 56057, 46735, 168023, -69329, 92527, 47805, 570505, 936197, 906629, 351552, 174176, 465666, 466348, 308010, 1223379, 17319, -289364, -682963, -1267082, -632580, -836114, 203625, -308474, 294118, 592165, 494020, -2192, -187793, -536677, -434094, 425164, 174972, 277831, 228196, 935091, 279996, 420446, 928439, 817824, 402922, 299990, -43497]
2405d3497J09934K456L079q793o07479p0759J68263J333543P34502r41643m26439
2394B53167k3973J16772J97066j083991j2660R36304P5106o27814o1466M79118
2384B47629j00414j53696k9782n28179P25506M94475o94471p9868n40256n5672
2374g14728L69257l88122j16486N88993P55135l32438K72426J9442k01468P10463
2364I62474p45962J022668R5516j534233j71603q08419r3186J036388L64144k91604
2354a63817O45471K04589j42023n50315p92556m78178R43424J10261k74041O25973
2344A28788o38526L14385l59953L46254O05621k99809L36573j88876o16822N65775
2334A93410M05094o69763J75515n55757J17892M1947j7455P2564M6869m93278
$$ y = [-43497, 66437, 68893, 71972, 63179, -544300, -615059, -446796, 886747, 1621249, 679606, 253167, 229194, 345966, 543032, -540959, -553619, 382685, 457791, -170023, -231489, 247629, 147215, -6481, -36263, -564442, 161064, 655539, -38932, -118800, -659056, -714728, -345471, -733593, -850079, -261086, 494049, 161611, 434037, 453479, 252011, 962474, 216512, 1239180, 1334696, -199537, -371140, -1179559, -1272745, -236357, 127787, -163817, 481654, 686243, 544220, -6095, -798651, -1276829, -333405, -223144, -497185, 128788, -509738, -195353, -555306, -209052, 396569, 96760, 433333, 244457, -372365, 193410, 598504, -71259, 104256, -451501, -333609, -291662, -309117, -236553, -189684, -682962]
2324f82962j06139m63061J219450k26457k11695n67311Q73973m8600J64398K5583
2314b2821j98879l35893J34478o48050O02245P68619l16271P7934l10396k82529
2304e31563L24784K29089M63659P79245j096196k84801k14444n3706l00744N49842
2294a34835K99387M75907m23232K73368P3568p78886j66848M56260m19487m40983
2284g85781N91240O94789J00423j98175L25649k33029l60474J02554p69919J78714
2274c54009j02444J276616O68781j283437j79378K09135K78881J8747L00462K95983
2264A129337n49993K24255m02625n08298o87346m88403L10730k87610J492793
2255B32840j201k64929l934j63301J63419q16067n56198J038261J138774K0412
$$ y = [-682962, -789101, -1252162, -32712, -259169, -470864, -1038175, -164202, -212802, -48404, -22821, -221700, -557593, -423115, -1071165, -468920, 299699, -16572, 61362, -249034, -531563, -206779, 22310, 485969, 1265214, 169018, -115783, -330227, -383933, -684677, -134835, 164552, 640459, 217227, 490595, 564163, -214723, -381571, 74689, -344798, -785781, -194541, 500248, 600671, 402496, 728145, 495116, 134642, 237196, -532723, -354009, -456453, 820163, 1488944, 205507, 26129, 235264, 514145, 532892, 833354, 1129337, 579344, 803599, 400974, -107324, -794670, -1283073, -972343, -1259953, 232840, 231639, -33290, -37224, -200525, -37106, -853173, -1409371, -371110, 767664, 788076]
2245G88076n24138j445788n94208J625174R2709j19098J65779j376950J31915
2236a256529L37452P25097L81950m28382k7802P802j54240L98208J55476O26255
2226G65287j94055j01063r69740N90667Q3895l14630O66115j26056l37815l16386
2216b53781N48344N79633n24232l46550J59284K7686l13180k57455q60336K88017
2206i52570L02351r0125N20977Q4749n34895R01006J68181r95897l19407q8225
2196a003855O39263J17194j20801O8556n9703J6148j75007j44535o1337l48679
2186a072756J09209M49251M00887J81184p92166K47288j87107O78967p4534j21127
2176a80904Q64857l51986j198267J014716P69495n63623j87066n73872k1951n42339
$$ y = [788076, 263938, -1181850, -1776058, -150884, -58175, -177273, -11494, -1388444, -1256529, -919077, -193980, 187970, -240412, -268214, -260412, -414652, -16444, 139032, 765287, 571232, 470169, -499571, 91096, 174991, -139639, 526476, 400420, 62605, -253781, 294563, 874196, 349964, 3414, 162698, 190384, -122796, -380251, -1240587, -952570, -650219, -740344, -219367, -134618, -669513, 231493, 399674, -596223, -915630, -1003855, -364592, -247398, -368199, -299643, -359346, -343198, -518205, -662740, -724077, -1072756, -963547, -514296, -113409, 67775, -724391, -477103, -664210, 14757, -59777, -180904, 683953, 331967, -866300, 148416, 917911, 354288, 167222, -406650, -428601, -970940]
2166i70940J391589l78801M9234N1532J6782K69164K29046k97464q95557m85971
2156a021386J09408J166410N4237k32762N2125J94810l75484q45816j52371J346898
2146B96069M27930p35210J77416j99639m76318L45206O40705n5823j85102m26191
2136a90957r7789n1463j12098M43880J16450K80l5950n58920O17784j43522P02144
2125F89839j469896r705L98170K04791j39573K74763j07711n37510K02509Q5547
2115d08776k13199M07496L98142l07753j54788k9576N93960n29292j7903P81010
2105E19321M08027m21218p94454m45624L03185J20596l24282j177238K56410J10752
2095a444525Q82694Q42400l78526k70906N71663L17759k90307l92072l54556N29898
$$ y = [-970940, 420649, 41848, 91082, 142614, 159396, 428560, 657606, 360142, -535415, -1021386, -911978, 254432, 308669, 75907, 128032, 322842, -52642, -898458, -1050829, 296069, 723999, -11211, 166205, -33434, -509752, -164546, 476159, 420336, 235234, -190957, -288746, -340209, -452307, -8427, 108023, 108303, 72353, -486567, 131217, -12305, 689839, -780057, -789762, -391592, -186801, -326374, -51611, -159322, -696832, -494323, -408776, -621975, -214479, 183663, -124090, -278878, -308454, 285506, -243786, -261689, 519321, 927348, 506130, -288324, -733948, -430763, -310167, -634449, -1811687, -1555277, -1444525, -561831, 280569, -97957, -368863, 202800, 520559, 230252, -161820, -516376, 13522]
2085A3522m79477l37600l2225M04925J7018O19957k92991N16061N88783q15432
2075B02541o43477m38552N24779J79554J78751l21558p31885L81773J56653j16830
2065f28251P9403L42176J88242k32654K91794j84239N19032j26390k70404R6799
2055G5508O16426j68893j131708j02139M1351j076159J254413J273411O19625
2046A401835o1397j278447L10277m80140j025941M97334M60668K48480P73213
2037H45882r92340o48422N71822j78043k10122K63983P17567P89157m80001k28962
2027D50521K48125J17490O3243j16996L90648n65245k27428M52228Q80377m1940
2017A651023Q29579n20688j011775K28047k24333N429M45961O23370o09117j008948
$$ y = [13522, -465955, -803555, -835780, -430855, -413837, 206120, -86871, 429190, 1017973, 202541, -440936, -879488, -354709, -175155, 3596, -317962, -1049847, -668074, -511421, -628251, -548848, -206672, -18430, -251084, 40710, -143529, 375503, 249113, -21291, 75508, 691934, 523041, -608667, -710806, -669455, -1745614, -491201, 782210, 1401835, 1340438, 61991, 372268, -107872, -1133813, -636479, -175811, 72669, 845882, -146458, -794880, -223058, -401101, -611223, -347240, 370327, 1159484, 679483, 450521, 698646, 816136, 879379, 762383, 1153031, 587786, 360358, 812586, 1692963, 1651023, 2480602, 1959914, 948139, 1176186, 951853, 957282, 1403243, 2026613, 1417496, 408548]
2007D08548N28978M66057o66311J71098j101203J09176Q20339O17417O65549j376231
1997F43417n77747N53563j16925j85155m60440P32130j37979j1953N55222k91530
1987G02603L73193r2546m40060k22782m89948n86978K5606K57178J093556n52976
1977F6846j70661l96461J350013Q29088m04260p17289m68374o13588l88298O34089
1967b78895K77663L16721K75126m5378J31630L57344J47645n86247L13172K49558
1957A158339o79099l18632N89034M95730J86863j67778K08783n41937k3386P48506
1947A656423q05104l94620K15463k65148l00576L85568K2357O46537k06633O50584
1937A604851k16304l35061k9594M6223K31008n4168K30002j326289M35308M04192
$$ y = [408548, 937526, 1403583, 737272, 908370, -192833, -83657, 736682, 1354099, 2019648, 643417, 65670, 619233, 502308, 317153, -143287, 588843, 450864, 438911, 994133, 702603, 1075796, 983250, 543190, 320408, -169540, -756518, -730912, -473734, 619822, 66846, -103815, -500276, 849737, 1678825, 1274565, 557276, 88902, -524686, -912984, -278895, -1232, 315489, 590615, 545237, 676867, 1034211, 1181856, 595609, 908781, 1158339, 479240, 160608, 749642, 1245372, 1432235, 1264457, 1473240, 931303, 907917, 1656423, 851319, 456699, 672162, 407014, 106438, 492006, 514363, 1160900, 954267, 1604851, 1388547, 1053486, 1023892, 1070115, 1301123, 1246955, 1476957, 150668, 585976, 990168]
1927I90168k52353K22484N762k24189M33954l25630k50760J94476J6676J85040
1917I95628k59248M35956N07050q7958r45073J48659L47775P29052l50942q8603
1907A432296L17155l9198m89871L5527M35738j227290J09655P85973n60267j57485
1897F42233j07145k90842O13469K77587R2646M20242m13955J43547o36355L21117
1887A062544L2530J441765J18515N3359j449921o64412J22887P28654k00391j34385
1877A111145N10511N38840m62980n87547P34795Q7500J150784n76483o30890p84461
1867A091214K14088N45320L50908Q24744k43755r57040L15781M64776N1327r07629
1857A749734O86107P22399j539473J161353M67872l37974l36192M29507j61509
$$ y = [990168, 737815, 960299, 966061, 741872, 1175826, 850196, 599436, 793912, 810588, 995628, 736380, 1172336, 1679386, 1591428, 646355, 795014, 1142789, 1871841, 1520899, 1432296, 1749451, 1710253, 1220382, 1255909, 1691647, 464357, 574012, 1359985, 799718, 642233, 535088, 244246, 857715, 1135302, 1227948, 1648190, 1234235, 1377782, 741427, 1062544, 1095074, 2536839, 2655354, 2708713, 1258792, 594380, 717267, 1445921, 1245530, 1111145, 1621656, 2160496, 1697516, 1109969, 1844764, 1932264, 3083048, 2506565, 1875675, 1091214, 1305302, 1850622, 2201530, 3026274, 2782519, 1825479, 2141260, 2606036, 2657363, 1749734, 2435841, 3158240, 1618767, 2780120, 3247992, 2910018, 2573826, 3003333, 2841824]
1848B841824k59534L67552l19451n3055L56993J406281n48600N01369N87975j107415
1838C773939P58931m89533o36273J214071M84997J83175K51324m92507J174359
1829F222483M68507J45855Q13955n20301l71756j37600J403547n1028R65502N27321
1819I466485J08438L48723k54759K48579N43391q4739m77890o38004O42931J018036
1809A0921191J18474K54599P83170P33730j58665L42158L95507M85280J31649
1800A4007093j94199P10093j9127K42811O42804J116919J085397M02570J532361
1791A9526722M51413j83586P45990O98041K02353J94745K156330J634181J562905
1782B6989094n981R72657Q58827O89179J982004J797282M18308J456271J268853
$$ y = [2841824, 2582290, 2949842, 2630391, 2577336, 2934329, 4340610, 3792010, 4293379, 4881354, 3773939, 4532870, 4043337, 3407064, 4621135, 5106132, 5289307, 5540631, 5048124, 6222483, 6690990, 6836845, 7650800, 7130499, 6758743, 6621143, 8024690, 7973662, 8939164, 9466485, 9574923, 9923646, 9668887, 9917466, 10460857, 10376118, 9898228, 9260224, 9903155, 10921191, 11039665, 11294264, 12077434, 12811164, 12652499, 12994657, 13390164, 13875444, 14007093, 13812894, 14522987, 14503860, 14746671, 15389475, 16506394, 17591791, 17994361, 19526722, 19978135, 19794549, 20540539, 21238580, 21440933, 21635678, 23792008, 25426189, 26989094, 26983113, 27955770, 28814597, 29503776, 31485780, 33283062, 33701370, 35157641, 36426494]
1773C6426494K190888K970627K777213K408232L248861L409056M680139M981616
1765F3093126N256011N630496O647829O882437P361459R442431J1034033J3454007
1757A28801829J4606208J5842234J7731540J9360378J8140627J1491785M374942
1750B30349543m505567j3777346j9481026k1963286k0889419j9232907j5540626
1743A14959366j3927573j2260359q760053p648086o185639n133094m607468m365156
1735E2071938l271716l532962l524817k336017k284682j646689k333491k388878
1727C0752686k773072j931811p87393j335905j100550r15590j258891p57148k423433
1718A7468893j56829j087693q54083O9462J31531j264575p82786n13759r0556
$$ y = [36426494, 38617382, 41588009, 44365222, 46773454, 50022315, 53431371, 58111510, 63093126, 68349137, 73979633, 80627462, 87509899, 94871358, 104313789, 115347822, 128801829, 143408037, 159250271, 176981811, 196342189, 214482816, 225974601, 230349543, 225843976, 212066630, 192585604, 170622318, 149732899, 130499992, 114959366, 101031793, 88771434, 80011381, 72363295, 66177656, 61044562, 56437094, 52071938, 48800222, 45267260, 41742443, 39406426, 37121744, 35475055, 33141564, 30752686, 27979614, 26047803, 25260410, 23924505, 22823955, 21908365, 20649474, 19892326, 17468893, 17312064, 16224371, 15370288, 15439750, 15571281, 14306706, 13523920, 13010161, 12919605]
1709A2919605j924065j94440m89222j7955j9294o33996o0382m24669j060393M30313
1699H525502n0119q97153j38862O12339J47855j363967j25329K47385J32406k50271
1689F839786K21689k71204l39782m28645j20885m72879J080299m71861k34569
1680E801949m92639p41909R3723l75789N18567K8587j24485n60346K57291O123
1670D411072n79647o03337q83235R8050Q82252l01677l11760M26879L02168p5948
1660C364817k31252J82442m70121r0197J30323L24002k71019l96678p85600O44574
1650B401291p34918j7683j94724l16960P42571j77529o2871p85935Q51770J038512
1640B743524k68558p23595N9531q49077P79574O5787J64507L04843J014819k18014
$$ y = [12919605, 10995540, 10801100, 10311878, 10293923, 10274629, 9640633, 9580251, 9155582, 8095189, 8525502, 8475383, 7578230, 7439368, 8051707, 8199562, 6835595, 6710266, 6957651, 7090057, 6839786, 7061475, 6790271, 6450489, 6021844, 5900959, 5428080, 6508379, 6036518, 5801949, 5309310, 4567401, 4661124, 4285335, 4803902, 4832489, 4708004, 4147658, 4404949, 4411072, 3831425, 3228088, 2344853, 2442903, 3325155, 3023478, 2711718, 3138597, 3440765, 3364817, 3133565, 3316007, 2845886, 2755689, 2886012, 3210014, 2938995, 2542317, 1756717, 2401291, 1666373, 1648690, 1453966, 1137006, 1879577, 1702048, 1639177, 853242, 1705012, 2743524, 2474966, 1751371, 1810902, 961825, 1741399, 1807186, 1971693, 2276536, 3291355, 3073341]
1630C073341j396339K86597m67592j54533J92323L63932k07942k66145r3089p49520
1620E81033J0045R94076O01473p05930J38860j19781l78598k68534r775O68279
1610A511148J1045n80293j03521Q9829q4880q74090n04609J184263K62962l4260
1600H77594j26502L37656q96822K48775N76025o30817n62311N44094L45099m02017
1590C10774J3263Q92923N30553j72285L19858r06621N3634L64105k29968o368
1580A169868l66623P84948r06271K7823j34451P8678l62925k05761l13931j33869
1570c62514k01702J198962j08308n05256j89007J54744Q69857m1807j27941p6800
1560F10228j089568P48620M3818l61327P84778L0459j42499j073622J582968m26976
$$ y = [3073341, 1677002, 1963599, 1496007, 1341474, 1533797, 1897729, 1689787, 1423642, 1330553, 581033, 591078, 1585154, 2186627, 1480697, 1619557, 1499776, 1121178, 852644, 842869, 1511148, 1522193, 941900, 838379, 928208, 843328, -30762, -535371, 648892, 911854, 877594, 751092, 1088748, 191926, 440701, 1016726, 385909, -176402, 367692, 712791, 310774, 324037, 1216960, 1747513, 1575228, 1895086, 988465, 1042099, 1406204, 1176236, 1169868, 803245, 1588193, 681922, 709745, 575294, 653972, 291047, 85286, -228645, -362514, -564216, 634746, 526438, 21182, -167825, -13081, 856776, 814969, 687028, 610228, -479340, 269280, 313098, -48229, 736549, 767008, 624509, -449113, 1133855, 706879]
1550G06879n6702j10075k27295L47507r85236L14848N6376k67056L39648L46260
1540D65154L48431P15773j026045p68105N48254P05471p38223p45678J082552
1531E87584N37376m39494p12160R90499O6517r41404J0236J98113J54143l80947
1521G0463m17651j040334J21187R92217M71698O53727k53539L45162O10639j028040
1511E25529k08515K08497L41937K29583j235257j85832M43431N1774l28960J65160
1501G347o89425L14424O13682k76013Q49493O6502m74727L52850k42077N82518
1491A104574p59142L26497L77514Q536m71250j83480R11754m40883O61253O06895
1481B142268j093534o17558R10132K28730P5644n01758k8268L39721n1584j637357
$$ y = [706879, 650177, 540102, 312807, 660314, -324922, -10074, 46302, -220754, 118894, 465154, 813585, 1529358, 503313, -264792, 283462, 988933, 250710, -494968, 587584, 1124960, 685466, -26694, 963805, 1030322, 88918, 99154, 297267, 451410, 70463, -347188, -1387522, -1266335, -274118, 197580, 851307, 597768, 942930, 1553569, 525529, 317014, 525511, 867448, 1097031, -138226, -324058, 119373, 171147, -157813, 7347, -682078, -367654, 246028, -29985, 819508, 886010, 411283, 764133, 522056, 1104574, 345432, 671929, 1049443, 1057979, 586729, 403249, 1315003, 874120, 1535373, 2142268, 1048734, 431176, 1341308, 1570038, 1645682, 1143924, 1115656, 1455377, 1403793, -233564]
1471b33564n0155O19618q75088O02916J030261L07710o03586k16679r66563L39402
1461d5728J4897p9655q31989Q03203k22576M21269M7608o81611M48272M7583o31546
1450g10273l57766M86362O48868J79296l2191m7159R80468j137541m97957O38491
1440A50598L81183r9870n17433N77957n15622m32928M22907n6940k0046l53404
1430d63598K65714K99189m54967Q0476q1767K14446p50319P60225M507M97304
1420C71210o25310R6058k21996m59769J087245j26556k76273J41666O91574j40298
1410E37551r03564m7855J55486M29202O65781o37198o82802J09261l89987R06390
1400A42265M37557J47419o64754m82926N0837o70749R26574N50240j464067J9526
$$ y = [-233564, -283719, 335899, -539189, 63727, 1093988, 1401698, 798112, 581433, -385130, -45728, -30831, -110486, -942475, -139272, -361848, 59421, 107029, -574582, -126310, -78727, -710273, -1068039, -581677, 67191, 246487, 214296, 167137, 1147605, 10064, -487893, 150598, 531781, 431911, -85522, 492435, -23187, -456115, -33208, -90148, -110194, -463598, -197884, 101305, -353662, -273186, -354953, -140507, -890826, -130601, -126094, 371210, -254100, -158042, -380038, -839807, 247438, 120882, -155391, -13725, 677849, 537551, -366013, -413868, -258382, 170820, 836601, 199403, -483399, -374138, -764125, 142265, 579822, 727241, 62487, -420439, -369602, -1040351, -113777, 436463, -1027604, -1008078]
1390a008078M14341Q64866l12379k05467l3497j62065J75950p9756p52287m09564
1380a507936P91830J082392k89211L14630k28712N58845j069918m56802K17880
1371e87002q81912Q25430L49728J21048J08441O50996l29006n87764o8367n10091
1361i08499K24256N10397l48660J660490p38661p50164j49390j51019M56640l61623
1351e56233o75651N78112L69341p23824N5734J132133m92447P880J392662j166902
1341g9195K70929P4599l14641L33491n7133j402143N09122k04455K03324M60086
1331b06016o0658m73632o82769K88789N06731K78793r93989k63252J275857J036109
1321G05963j46109L83123l05260o80102q28803N47106k28097Q3257J68026Q19979
$$ y = [-1008078, -593737, 271129, -41250, -246717, -280214, -442279, -266329, -346085, -1098372, -1507936, -716106, 366286, 77075, 391705, 162993, 721838, -348080, -804882, -587002, -1468914, -643484, -293756, -172708, -64267, 586729, 257723, -330041, -398408, -908499, -684243, -173846, -522506, 1137984, 399323, -350841, -500231, -651250, -194610, -556233, -1231884, -653772, -284431, -1008255, -952521, 179612, -312835, -304955, 1087707, -79195, 191734, 266333, -48308, 285183, 228050, -1174093, -664971, -869426, -666102, -206016, -266674, -740306, -1423075, -1134286, -627555, -348762, -1342751, -1606003, -330146, 705963, 559854, 942977, 637717, -42385, -871188, -324082, -552179, -468922, -300896, 519083]
1311E19083k31320k02151N36142n3310m10897l28203j9709R43215p2395l77174
1301C03281j20914P09040j75657o91733M94577J7703r99885l68977J076478m56435
1291b12522o9595O34893l99905q29294j1329J106523K86883j351670R7847m01750
1281a149919j94454O58876J38139M98998M50534o50786O9295L19716K96020j3572
1271D22847o80958Q070J41288o0638j99457k2624j255956M22438Q82165p13455
1261a056280N49911L2533Q69119j29317m3616N93825j32640j29558n53993J12829
1251A12813k20771r055L49098j14432j33566o42938j63692O60112k28759j31916
1241e23106J60417P79910m36884k54089k71107O61757k25921o10872M04295m88676
$$ y = [519083, 287763, 85612, 621754, 568444, 157547, -170656, -190365, 752850, 680455, 303281, 182367, 891407, 715750, 24017, 518594, 536297, -463588, -832565, 243913, -212522, -282117, 352776, -47129, -876423, -887752, 218771, 505654, -846016, -748169, -1149919, -1344373, -685497, -547358, -48360, 402174, -248612, -179317, 140399, 436419, 422847, -258111, -250041, -108753, -169391, -368848, -391472, -1647428, -1224990, -342825, -1056280, -506369, -473836, 395283, 265966, 222350, 816175, 683535, 553977, -16, 112813, -107958, -117013, 232085, 117653, -15913, -658851, -822543, -162431, -391190, -523106, -362689, 417221, -19663, -273752, -544859, 116898, -109023, -719895, -315600, -804276]
1231h04276N85991L77856o27433k83698O19015j81561o6409J29481j68368j72550
1221e91952j2505J168776o19277l14982r4092l4002J09208L53802M6743p90213
1211g78494l91282O00356O00970m84345k37698n58063R85245k54240m54275o22097
1201a593923K99913L72423M85921P28848m6903Q34522p18534q48917R8916k24283
1191f12017J20185J31889L07213l75099k1548j19392L317K19248m18951O02000
1181a63155l33969j103302j34239R46335m13958J90951J20623J015127m27486
1172c03073N05752j00677m1482p1142m36927N41887K85187p40880j19760N21202
1162D0087j60691j79898o94857K42991K30145J373824K81140k43010j405624K53409
$$ y = [-804276, -218285, 159571, -467862, -751560, -132545, -314106, -380515, -251034, -419402, -591952, -604457, 564319, -54958, -369940, -464032, -498034, -388826, -35024, 11719, -778494, -1169776, -569420, 31550, -452795, -690493, -1248556, -263311, -517551, -971826, -1593923, -1294010, -921587, -435666, 293182, 246279, 1080801, 362267, -486650, -387734, -612017, -491832, -359943, -52730, -427829, -449377, -568769, -565452, -346204, -765155, -163155, -497124, -1600426, -1734665, -788330, -1202288, -1011337, -890714, 124413, -303073, 202679, 102002, 60520, -10622, -447549, 94338, 379525, -361355, -481115, 40087, -120604, -300502, -995359, -752368, -522223, 851601, 1132741, 889731, -515893, -262484]
1152b62484M52494K56970M32499o04158p18821p74780J2814J337397k53265j71002
1142b92336m7827L07864j84940p46676n55916J79022M90833Q01238q2910j242845
1132a374493O96379R09338L7542N6782L65837j93324n99355m8933N10738j00856
1122B59655n84373k86081l76874k53455O79965M44616n7939O3556j53927J95796
1112f9061n75632K36884j69554n75861M23121L9313J73751P91041n40780o23175
1102h89953j4738L9373K46298O49435O08023j6910j65328L9025j156842j46254
1092h07871Q76543n23001K56494j73007J46093J84385L73794r79968K27157K8768
1082c90613j062759N45499J076734r7173M533j2289N83370m80431J17446N8792
$$ y = [-262484, 190010, 446980, 879479, 275321, -443500, -1218280, -1205466, 131931, -121334, -292336, -340163, -32299, -217239, -963915, -1519831, -1340809, -849976, -48738, -131648, -1374493, -678114, 231224, 268766, 325548, 691385, 498061, -101294, -150227, 360511, 259655, -324718, -610799, -987673, -1241128, -561163, -116547, -174486, -110930, -264857, -69061, -644693, -407809, -577363, -1153224, -730103, -690790, -517039, 274002, -266778, -889953, -904691, -865318, -619020, 30415, 638438, 621528, 456200, 495225, -661617, -807871, 68672, -454329, -197835, -370842, -224749, -40364, 333430, -646538, -419381, -390613, -1453372, -907873, 168861, 71688, 76221, 63932, 647302, 166871, 284317, 343109]
1072C43109o31654j04798m71875j2377O58295K75890p42743L78531m39629l76936
1062a124187N66315L67684p32401P39631J27670J12991j1381N88031o36108n86613
1052e88368m43449q2540N14260k41923N23121k96332N16468m59338K89702J35586
1042a32813k30394J15166k30539L43612l40302m5534k9730L62907J196798K39816
1032A248987o17503l42737n82007o76214K26153R55990M18214o72686j81592M93629
1022B70234l5831k32054R03937l31394q11230K2889K5812n45780j3457J11021
1012f35853l84070P86875Q44501n55678l18055m54275N9443J57605J017423J72186
1002F90102k01097M82983k52102J40325L74115p34651j21303n65612j51426K18515
$$ y = [343109, -288545, -393343, -865218, -877595, -219300, 56590, -686153, -307622, -747251, -1124187, -557872, -190188, -922589, -182958, -55288, 57703, 46322, 634353, -1755, -588368, -1031817, -1114357, -600097, -842020, -318899, -615231, -98763, -558101, -268399, -132813, -363207, -248041, -478580, -134968, -475270, -520804, -550534, -187627, 1009171, 1248987, 631484, 288747, -293260, -969474, -743321, 212669, 630883, -41803, -223395, 270234, 234403, 2349, 906286, 574892, -236338, -213449, -187637, -733417, -746874, -635853, -1019923, -233048, 611453, 55775, -262280, -716555, -657112, -499507, 517916, 690102, 489005, 971988, 719886, 860211, 1234326, 499675, 378372, -187240, -338666, -120151]
992a20151l90480k51104K38111N64294J83541J29454n23347p78625L91264J33464
982d23579P68191L0481n78955m03011N04940Q88275m38260l70529J2886j53423
972a62984m98486J96666j77788Q56O4771P82782P41894M15378j090803O31614
962I03900n38968L56113o36159j0342M23727k34645Q17928n94950l76725l02826
952a92947k4328l63404j97436N71263M37788l76112L75711J25655K15597n98825
942b7038j039540l35599L77950L82093N44119j70736l28364M02230j31051m26040
932g51976L39904k19792k45656O04344K50579K28674K10359k468k38299j023282
922h47613R68960P2085j136248J073666Q8579J13211O72768j177408L54431j57881
$$ y = [-120151, -510631, -761735, -523624, 40670, 224211, 353665, -169682, -948307, -557043, -423579, 344612, 375093, -203862, -606873, -101933, 786342, 348082, -22447, -9561, -162984, -661470, -464804, -642592, -641736, -576965, 205817, 947711, 1363089, 272286, 903900, 364932, 721045, 84886, 74544, 498271, 263626, 1081554, 486604, 109879, -192947, -217275, -580679, -778115, -206852, 230936, -145176, 230535, 356190, 571787, -27038, -1066578, -1402177, -1024227, -642134, -98015, -268751, -597115, -194885, -325936, -751976, -412072, -631864, -877520, -273176, -22597, 206077, 416436, 413968, 175669, -847613, 121347, 193432, -942816, 130850, 219429, 332640, 1005408, -172000, 182431, 24550]
912B4550K89156P18834q65942j90227o1756M56688N77841n90743k68545J92900
902B82756n63897j67618n04590N21695N29634o31422N6562N00125L33681K34149
892E91075k18035P92608l59403j235985n26777j95040P13612R04017r36283N64179
882I3968p9507k50600P62897n49902p23928j19942L68509L30450k6701O07142
872D12386L97818J45972M76609l94614l00550o22923O11045L02149j414696L80783
862f021N90566j66671m16567N75848m21580l95168L52151J57593r5666M96208
852F70693K27686n63818L9616m86459O81870Q53419n76062l69876o67128m39886
842f29945O1078J44464L21216k4590M02153o10666j70270q3993J11690J6432r2680
$$ y = [24550, 313706, 1032540, 166598, -23629, -85385, 371303, 949144, 358401, 89856, 282756, -281141, -448759, -953349, -431654, 97980, -533442, -476880, 23245, 356926, 591075, 373040, 1165648, 806245, -429740, -956517, -1151557, -437945, 466072, -470211, 93968, 14461, -236139, 526758, -23144, -747072, -867014, -498505, -168055, -194756, 412386, 810204, 956176, 1432785, 1038171, 737621, 114698, 725743, 1027892, -386804, -6021, 584545, 417874, 1307, 577155, 155575, -239593, 112558, 270151, 174485, 670693, 898379, 334561, 374177, -112282, 569588, 1423007, 846945, 477069, -190059, -629945, -568867, -424403, -103187, -127777, 274376, -336290, -506560, -590553, -478863, -462431, -555111]
831e55111J068460l97015l92881L55167l11277m25824M96339o82191J000645J83385
821C39697r15624j74413L88258K79887j37224m59466l46211J81193P36788J82221
811G5106m607K83259l58245K06725j48746M93414n08001L82955j22748o0224j62768
800G6120L97221n48319m09328J78954J174174K61336q92167L1194o3937p3153
790A32095q75734J74766K22426K77421P80153M56746p48782p66397j30039m56726
780i34071J717354K5125l49448N56506j91316r85933q95352J0105O32876l72743
770g86897J124374n06420j37713K07435K96910O40524Q03419o57750q61360o1498
760F1024K17288m81763J49133R9706L35806K30228m90267l2925l2140l77098M59209
$$ y = [-555111, 513349, 116334, -276547, 78620, -232657, -658481, -162142, -844333, 156312, 339697, -575927, -750340, -362082, -82195, -219419, -678885, -1025096, -843903, -107115, 75106, 70499, 353758, -4487, 202238, 53492, 546906, 38905, 421860, 299112, 238888, 76120, 473341, -74978, -484306, -305352, 868822, 1130158, 237991, 269185, 205248, 132095, -743639, -568873, -346447, -69026, 711127, 1167873, 419091, -347306, -477345, -934071, 783283, 808408, 458960, 1015466, 824150, -161783, -1057135, -1047030, -414154, -786897, 337477, -168943, -306656, -99221, 197689, 838213, 1641632, 983882, 122522, 61024, 278312, -203451, -54318, 45388, 381194, 611422, 121155, 88230, 56090, -321008, 138201]
749A38201L66873j075590L26292l25053K55749j38634J72570J73520J38050j9244
739A2734j05841j68595R5677k51522J99705m14397K47303P99394K28474r12603
729b69671n13340M34648L40842j43178R91834m04346L6372q12197J56862L3765
719a48409k1914k61410k09819N3440L9213L56468r1220n28430N15049J06992o60076
708h50116P01715Q10169p71707m68002O7783J25806N2457l99230J26866p70j46426
697g51455k48032M05583K1620k75921N95219M82545L69955N68647J99091q47771
687E19481j48959N09821j035704J74911K61813j12673m3722k91357L9089J22117
677e183l78481J162429o4131j055709o63960M91640N43112P10707k44085O4656
$$ y = [138201, 505074, -570516, -244224, -569277, -313528, -452162, -279592, -106072, 31978, 12734, -93107, -261702, -166025, -417547, -217842, -632239, -384936, 414458, 642932, -269671, -783011, -348363, -7521, -150699, 841135, 436789, 473161, -339036, -182174, -148409, -170323, -431733, -641552, -588112, -548899, -192431, -283651, -812081, -297032, -190040, -850116, -148401, 661768, -109939, -577941, -510158, -384352, -331895, -731125, -604259, -605029, -751455, -999487, -593904, -572284, -848205, -252986, 229559, 599514, 1168161, 1367252, 519481, 370522, 880343, -155361, 19550, 281363, 168690, 124968, -166389, -127300, -5183, -383664, 778765, 714634, -341075, -1005035, -513395, 29717, 740424, 496339, 560995]
667E60995p15348N7156O04165J20859k37495m6384l04786J29519O3994m44825
657b12150K80797Q99097j50701q12014L79242k64029o44771l79688O41243o8449
$$ y = [560995, -154353, -97197, 506968, 627827, 390332, 343948, 39162, 168681, 232675, -212150, 68647, 967744, 817043, 5029, 384271, 120242, -524529, -904217, -262974, -331423]
$$ [...]
##END NTUPLES=NMR SPECTRUM
##END=
