##TITLE=1H_CA-9274-2
 CDCl3
 8 sc, 
 4.6.2024
##JCAMPDX= 6.0         $$ Bruker NMR JCAMP-DX V2.0
##DATA TYPE= NMR SPECTRUM
##DATA CLASS= NTUPLES
##ORIGIN= UXNMR, Bruker Analytische Messtechnik GmbH
##OWNER= root
$$ XWIN-NMR		Version 3.5
$$ Tue Jun  4 14:25:19 2024 Russian Standard Time (UT+4h)  she@DPX200
##.OBSERVE FREQUENCY= 200.1309
##.OBSERVE NUCLEUS= ^1H
##.ACQUISITION MODE= SIMULTANEOUS
##.ACQUISITION SCHEME= undefined
##.AVERAGES= 8
##.DIGITISER RES= 18
##SPECTROMETER/DATA SYSTEM= spect
##.PULSE SEQUENCE= zg30
##.SOLVENT NAME= CDCl3
##.SHIFT REFERENCE= (INTERNAL, CDCl3, 0, 16.0047)
##AUDIT TRAIL= $$ (NUMBER, WHEN, WHO, WHERE, WHAT)
$$ ##TITLE= Audit trail, XWIN-NMR		Version 3.5
$$ ##JCAMPDX= 5.01
$$ ##ORIGIN= Bruker BioSpin GmbH
$$ ##OWNER= she
$$ F:/spectra/data/she/nmr/H-F/1/pdata/1/auditp.txt
$$ ##AUDIT TRAIL=  $$ (NUMBER, WHEN, WHO, WHERE, WHAT)
(   1,<2024-06-04 14:23:12.79 +0400>,<she>,<DPX200>,
      <created by zg, POWCHK disabled, PULCHK disabled
       configuration hash MD5:
       00 E9 B6 7A A2 85 ED C7 34 08 36 98 17 FE 4E 26
       data hash MD5: 16K
       C7 7E 6F 70 3E 67 FC EB 8E FB E6 B1 64 45 EA 94>)
(   2,<2024-06-04 14:24:05.93 +0400>,<she>,<DPX200>,
      <Start of raw data processing
       efp BC_mod = 2 LB = 0.24 FT_mod = 6 PKNL = 1 PHC0 = -25473.16 PHC1 = 13.38748 SI = 16K 
       data hash MD5: 16K
       57 AC B1 25 B9 00 1A E4 BA 39 C1 E2 9A 05 CA 98>)
(   3,<2024-06-04 14:24:22.82 +0400>,<she>,<DPX200>,
      <pk PHC0 = -1.073664 PHC1 = 0 
       data hash MD5: 16K
       97 BE 89 95 64 AF 2B 65 20 2B BA FC 7C 96 90 24>)
(   4,<2024-06-04 14:24:25.93 +0400>,<she>,<DPX200>,
      <abs ABSG = 5 
       data hash MD5: 16K
       E0 C9 F2 95 3E BB 8E 0E 48 BB 56 6F DC CF D1 61>)
$$ ##END=
$$ 
$$ hash MD5
$$ 91 CF 0C 2D 0F C9 F9 B9 54 7C 92 B2 3F F9 FE 1B
##$RELAX= 
##$RELAX= 
##$RELAX= 
##$RELAX= 
##$RELAX= 
##$RELAX= 
$$ Bruker specific parameters
$$ --------------------------
##$DU= <F:/spectra>
##$EXPNO= 1
##$NAME= <H-F>
##$PROCNO= 1
##$TYPE= <nmr>
##$USER= <she>
##$AMP= (0..31)
100 100 100 100 100 100 100 100 100 100 100 100 100 100 100 100 100 100 
100 100 100 100 100 100 100 100 100 100 100 100 100 100 
##$AQSEQ= 0
##$AQ_mod= 1
##$AUNM= <au_zg>
##$AUTOPOS= <>
##$BF1= 200.13
##$BF2= 200.13
##$BF3= 200.13
##$BF4= 200.13
##$BF5= 200.13
##$BF6= 200.13
##$BF7= 200.13
##$BF8= 200.13
##$BYTORDA= 1
##$CFDGTYP= 0
##$CFRGTYP= 5
##$CHEMSTR= <none>
##$CNST= (0..31)
1 1 145 1 1 1 1 1 1 1 1 1 1 1 1 1 1 1 1 1 1 1 1 1 1 1 1 1 1 1 1 1 
##$CPDPRG= <>
##$CPDPRG1= <>
##$CPDPRG2= <>
##$CPDPRG3= <>
##$CPDPRG4= <mlev>
##$CPDPRG5= <mlev>
##$CPDPRG6= <mlev>
##$CPDPRG7= <mlev>
##$CPDPRG8= <mlev>
##$CPDPRGB= <>
##$CPDPRGT= <>
##$D= (0..31)
0 1.2 0 0 0 0 0 0 0 0.06 0 0.03 0 0 0 0 0.0002 0 0 0 0 0 0 0 0 0 0 0 0 
0 0 0 
##$DATE= 1717496592
##$DBL= (0..7)
120 120 120 120 120 120 120 120 
##$DBP= (0..7)
150 150 150 150 150 150 150 150 
##$DBP07= 0
##$DBPNAM0= <>
##$DBPNAM1= <>
##$DBPNAM2= <>
##$DBPNAM3= <>
##$DBPNAM4= <>
##$DBPNAM5= <>
$$ [...]
##$SUBNAM3= <"">
##$SUBNAM4= <"">
##$SUBNAM5= <"">
##$SUBNAM6= <"">
##$SUBNAM7= <"">
##$SUBNAM8= <"">
##$SUBNAM9= <"">
##$SW= 18.0517689322627
##$SWIBOX= (0..15)
0 0 2 0 0 0 0 0 0 0 0 0 0 0 0 0 
##$SW_h= 3612.71676300578
##$TD= 16384
##$TD0= 1
##$TE= 0
##$TE2= 300
##$TE3= 300
##$TEG= 300
##$TL= (0..7)
0 120 120 120 120 120 120 120 
##$TP= (0..7)
150 150 150 150 150 150 150 150 
##$TP07= 0
##$TPNAME0= <>
##$TPNAME1= <>
##$TPNAME2= <>
##$TPNAME3= <>
##$TPNAME4= <>
##$TPNAME5= <>
##$TPNAME6= <>
##$TPNAME7= <>
##$TPOAL= (0..7)
0.5 0.5 0.5 0.5 0.5 0.5 0.5 0.5 
##$TPOFFS= (0..7)
0 0 0 0 0 0 0 0 
##$TUNHIN= 0
##$TUNHOUT= 0
##$TUNXOUT= 0
##$USERA1= <user>
##$USERA2= <user>
##$USERA3= <user>
##$USERA4= <user>
##$USERA5= <user>
##$V9= 5
##$VALIST= <valist>
##$VCLIST= <CCCCCCCCCCCCCCC>
##$VD= 0
##$VDLIST= <DDDDDDDDDDDDDDD>
##$VPLIST= <PPPPPPPPPPPPPPP>
##$VTLIST= <TTTTTTTTTTTTTTT>
##$WBST= 1024
##$WBSW= 4
##$XGAIN= (0..3)
0 0 0 0 
##$XL= 0
##$YL= 0
##$YMAX_a= 156494
##$YMIN_a= -128738
##$ZGOPTNS= <>
##$ZL1= 120
##$ZL2= 120
##$ZL3= 120
##$ZL4= 120
##$ABSF1= 15.99924
##$ABSF2= -2.052655
##$ABSG= 5
##$ABSL= 3
##$ALPHA= 0
##$AQORDER= 0
##$ASSFAC= 0
##$ASSFACI= 0
##$ASSFACX= 0
##$ASSWID= 0
##$AUNMP= <proc_1d>
##$AZFE= 0.1
##$AZFW= 0.1
##$BCFW= 0
##$BC_mod= 2
##$BYTORDP= 0
##$COROFFS= 0
##$CY= -3
##$DATMOD= 1
##$DC= 0
##$DFILT= <>
##$DTYPP= 0
##$F1P= 0
##$F2P= 0
##$FCOR= 1
##$FTSIZE= 16384
##$FT_mod= 6
##$GAMMA= 0
##$GB= 0
##$INTBC= 1
##$INTSCL= 3.70164e-10
##$ISEN= 128
##$LB= 0.24
##$LEV0= 0
##$LPBIN= 0
##$MAXI= 10000
##$MC2= 0
##$MEAN= 0
##$ME_mod= 0
##$MI= 1.114404
##$NCOEF= 0
##$NC_proc= -7
##$NLEV= 6
##$NOISF1= 3.799351
##$NOISF2= 2.8
##$NSP= 0
##$NTH_PI= 0
##$NZP= 0
##$OFFSET= 16.00475
##$PC= 1
##$PHC0= -25474.23
##$PHC1= 13.38748
##$PH_mod= 1
##$PKNL= yes
##$PPARMOD= 0
##$PSCAL= 0
##$PSIGN= 0
##$REVERSE= no
##$SF= 200.129503335354
##$SI= 16384
##$SIGF1= 3
##$SIGF2= 2
##$SINO= 5.538805
##$SIOLD= 16384
##$SREGLST= <1H.CDCl3>
##$SSB= 0
##$STSI= 16384
##$STSR= 0
##$SW_p= 3612.71676300577
##$SYMM= 0
##$S_DEV= 0
##$TDeff= 16384
##$TDoff= 0
##$TI= <>
##$TILT= no
##$TM1= 0
##$TM2= 0
##$TOPLEV= 0
##$USERP1= <user>
##$USERP2= <user>
##$USERP3= <user>
##$USERP4= <user>
##$USERP5= <user>
##$WDW= 1
##$XDIM= 16384
##$YMAX_p= 286135610
##$YMIN_p= -297023
$$ End of Bruker specific parameters
$$ ---------------------------------
##NTUPLES= NMR SPECTRUM
##VAR_NAME=  FREQUENCY,     SPECTRUM/REAL,   SPECTRUM/IMAG
##SYMBOL=    X,             R,               I
##VAR_TYPE=  INDEPENDENT,   DEPENDENT,       DEPENDENT
##VAR_FORM=  AFFN,          ASDF,            ASDF
##VAR_DIM=   16384,         16384,           16384
##UNITS=     HZ,            ARBITRARY UNITS, ARBITRARY UNITS
##FACTOR=    0.220516191357247, 1,           1
##FIRST=     3203.02252803475, 0,            0
##LAST=      -409.694234971022, 0,           0
##MIN=       -409.694234971022, -297023,     0
##MAX=       3203.02252803475, 286135610,    0
$$ Real data points
##PAGE= N=1
##DATA TABLE= (X++(R..R)), XYDATA
$$ [...]
6999d9043l5335n1900L6406L6560N2988n6676l4177N4610J4921N5791J406m2630
6987a7079J6173k4089l747j5635O7821l0079q72l3051L7802N1139n0858K6925
6975B4450q0559L035j6877J8397J7616M4246K0183m3662J4860l4850J7565M9120
6963C3524l79p2614l0104J00357k658P723L5126m162q3919M506K3366j4637j1284
6950a5155m0159M9424K9101l3834J5917M3579M543k7530K5867L9826o0871o3312
6938c2604K6995j9514j1448m5528L5519P5611J5642k6865J1337J0917J9038k7841
6926C1259n0676k1947N3116m4331q3143J08846K3976O231K7441r6241j100R5003
6914D8434l171m1212k5082k0833n2136R494K666j327P0003j8648j4276n0527N1917
$$ y = [-49043, -84378, -136278, -99872, -63312, -10324, -67000, -101177, -46567, -31646, 24145, 25551, -17079, -906, -24995, -28742, -44377, 23444, -6635, -7507, -40558, -2756, 48383, -2475, 24450, -56109, -53074, -69951, -51554, -33938, 10308, 30491, -13171, 1689, -33161, -15596, 33524, 33145, -39469, -69573, 30784, 28126, 35849, 70975, 66813, -17106, -12600, 10766, -3871, -15155, -55314, -5890, 23211, -10623, 5294, 48873, 53416, 25886, 51753, 91579, 30708, -32604, -5609, -25123, -36571, -82099, -46580, 29031, 44673, 17808, 29145, 40062, 59100, 31259, -19417, -41364, 11752, -32579, -115722, -6876, 17100, 23331, 50772, -45469, -46569, 48434, 45263, 4051, -21031, -41864, -94000, -84506, -81840, -83167, -13164, -31812, -46088, -96615, -44698]
6901d4698k1629j1833O7383r643o9198L2097J4435k4381j4115N2449P415K0244
6889a474r5264l9848P1758J5011L6636m6860j3451L9369j1367J070J0795n8992
6877i2617P1069M9307m8504n768P889Q057o4785L4919O1890M7774l9986j1311
6865A7934k3527K744l5162k7580J7323N4849k33p1766J07160k2436J6233P231
6853D2770K3423n9539O44K7025M3160k2437L0292p5679r2061N5400j9882j1310
6841e8194M8976p0468O9618p2319L8387P6380K7708l4683j7646n2204P0594N8826
6829H4975l7210j16726q391N3586l1262M4971L246L1111M9552j5079j6259q7387
6817d4873l0623J25313l6824p2102l9798q106N1316K5256K3351m1175j6002K1924
$$ y = [-44698, -66327, -78160, -10777, -20420, -89618, -57521, -43086, -67467, -81582, -29133, -21718, -1474, -96738, -136586, -64828, -49817, -13181, -60041, -73492, -34123, -45490, -44420, -33625, -92617, -21548, 27759, -20745, -26513, -18624, -10567, -75352, -40433, 21457, 69231, 29245, 17934, -5593, -2849, -38011, -65591, -48268, 6581, 6348, -65418, 41742, 19306, 35539, 42770, 66193, 6654, 7298, 34323, 77483, 55046, 85338, 9659, -82402, -27002, -46884, -58194, -9218, -79686, -10068, -82387, -44000, 32380, 60088, 25405, 7759, -44445, 26149, 84975, 47765, -68961, -77352, -23766, -55028, -10057, -6811, 24300, 73852, 58773, 42514, -44873, -75496, 49817, 12993, -59109, -98907, -107013, -55697, -30441, -7090, -48265, -64267, -42343]
6805d2343P418J4954p3839M7653L1435j6051j5785N1652K3922K3720L2605q5977
6793f36j6034N0677L742o6517M8149j1386l2420N6381n7555L3197k154j3160q842
6780a6558j9234P5576K4081r3778J3200m5627N4818K4703J3960J1932n3790r663
6768b0380K2754k3815P279k3282J078P3696l3309J0953O5453q030k0383Q14m0494
6755A2334q1749J18685P3207j8031j9459M389J2724o6299K867N5567K722J2100
6743A09057Q7812l704q8121R315m816M794l2119Q2748k4152n9432L7114q28K516
6730A20184q316R34J7927j7165r096n4216K7129L6332O870n4886k0719K5057j01570
6717c1535l9465L5379L7742m3124J8822m3220O9314q9738Q7326L6450j1946k4454
$$ y = [-42343, -34925, -19971, -93810, -46157, -14722, -30773, -46558, 5094, 29016, 52736, 85341, -636, -16670, 34007, 37749, -28768, 19381, 7995, -24425, 31956, -25599, 7598, 5444, -7716, -16558, -35792, 39784, 63865, -29913, -16713, -62340, -7522, 17181, 31141, 43073, -10717, -20380, 2374, -21441, -14162, -37444, -36366, 37330, 4021, 14974, 80427, 72397, 52014, 52828, 12334, -69415, 49270, 122477, 104446, 84987, 89376, 102100, 35801, 38668, 94235, 96957, 109057, 196869, 193165, 105044, 114359, 109543, 114337, 82218, 164966, 140814, 81382, 118496, 117668, 120184, 111868, 112802, 130729, 113564, 104468, 50252, 77381, 113713, 120583, 65697, 44978, 70035, -31535, -71000, -35621, 2121, -41003, -22181, -65401, 3913, -85825, 1501, 37951, 26005, 1551]
6705A551m3020Q7331J22048j20626q0062M5741N1804L2771l7858k8987r3951K7239
6693c6019L7285j6677n6880L1193J4415m391p2775M1872N2441J4842k4399N5386
6681C6293p2156k2945K2189J2979R0563m9042q7905q117J02049r6248j3718L9384
6669d6674J0656Q3483K0222k3092Q679o9092o3103P9607j4097j2600k308q64n1833
6656h1016J2139K0850O1807j4551n2031l6186P257L5970Q116O5732l836o6220
6644d1969l2471M4406j9612k0595J3858k2022J5683L8084q46P0522j3680r0532
6632e9174j0228j2043L013J13404l5608n3341L7435j1824p7848L2345m682L4042
6620d4509J9529k8025n0419L4614J9074l2166m8440M609J06243m118n8637N3863
$$ y = [1551, -41469, 45862, 167910, 47284, -32778, 12963, 64767, 97538, 59680, 30693, -63258, -36019, 1266, -15411, -72291, -41098, -26683, -31074, -103849, -61977, -9536, 5306, -19093, 36293, -35863, -58808, -36619, -23640, 66923, 17881, -70024, -78141, 23908, -72340, -86058, -46674, -36018, 47465, 67687, 44595, 53274, -15818, -78921, 686, -13411, -26011, -28319, -29183, -81016, -68877, -48027, 13780, -771, -52802, -88988, -81731, -45761, -37645, 28087, 24251, -41969, -74440, -30034, -49646, -70241, -56383, -78405, -62722, -24638, -25484, 45038, 31358, -59174, -69402, -81445, -78432, 34972, -636, -53977, -16542, -28366, -106214, -73869, -78551, -44509, -24980, -53005, -103424, -68810, -49736, -81902, -130342, -125733, -19490, -23608, -82245, -28382]
6608b8382M4602j02231K970O3834L5469p0082r203J02088L6774J5079m0468j1326
6596C9124K0540P747L3366j6567o5296K7416L9146k6280j2829K0407p309m2837
6584A6628m9722o3086j7107O5699Q1327o7563J3570n28J4443O3918L7172q8354
6572F397o3855Q2074q2507k892O1996l155k6137J6760k8913m3703R230M7529j8301
6559d5477k1027Q168M4808L2426k5736r23m9654j0915J8970P8090Q054K5310n5069
6546G025O307K784L4057Q2349j31350p1169M5522P7196p9878l4569K4844K743
6534c4139l1602j1261L4453k1518k3207P9829K0744n6726M6493j9099P828M7955
6522C9750k123m6482l2357k9063O4681j6716q3303M5455P9353p5004L2376O750
$$ y = [-28382, 16220, -86011, -83041, -19207, 16262, -53820, -63023, 39065, 75839, 90918, 50450, 39124, 59664, 67411, 100777, 84210, 18914, 46330, 85476, 59196, 46367, 66774, 59465, 16628, -33094, -96180, -113287, -47588, 33739, -33824, -20254, -20782, -6339, 57579, 94751, 6397, -57458, 24616, -57891, -60783, 1213, -1942, -28079, -11319, -40232, -83935, -74705, -27176, -45477, -66504, -58336, -13528, 18898, -6838, -7761, -57415, -68330, -49360, 28730, 36784, 62094, 7025, 13332, 16116, 50173, 132522, 1172, -69997, -24475, 52721, -27157, -61726, -36882, -34139, -65741, -77002, -42549, -64067, -87274, -7445, 13299, -43427, 3066, -16033, -8205, 39750, 37627, -8855, -41212, -70275, -5594, -22310, -105613, -60158, 19195, -55809, -23433, -16683]
6510a6683k3084n269j4592K2980J721M6400M5117k205k3833j024n7066j9867M125
6497d3280J6419l0437k1095O0817J13L2667l6186l0393j6806n5226J1917M5012
6485f6478M4017j6166K3119n1189n5089O8968l5980r9936N4333L5985j964K0521
6473g9859R1740m1336m6732q591M9333M1797k5838K9408m4279j1785N914l85P1570
6460C0957M9863p0980k1468L5915l8647n6798K1784L3127K6247m5765k8842k6335
6448i0942m949Q1114m4495m1960L1218M828K0788J8134l6075m9172P2183K5q9982
6435a29285p66l960R249K5201P9611n2744m9880l0467K6388O2620K1603N738O5563
6422B8871N3174n9899o4393P751j6865j1381k5240j8518M0279j164k6707n7423
$$ y = [-16683, -39767, -45036, -59628, -36648, -34927, 11473, 56590, 54385, 30552, 29528, -27538, -47405, -43280, -26861, -57298, -78393, -17576, -17463, 15204, -20982, -51375, -68181, -123407, -111490, -66478, -22461, -38627, -15508, -66697, -121786, -52818, -88798, -188734, -134401, -98416, -100380, -79859, 11881, -29455, -76187, -84778, -35445, 6352, -19486, 9922, -34357, -46142, -40228, -40613, 30957, 80820, 9840, -11628, 24287, -14360, -71158, -49374, -16247, 10000, -35765, -64607, -90942, -95891, -14777, -59272, -101232, -70014, -65186, -44398, -26264, -62339, -111511, -39328, -39303, -129285, -130051, -134011, -124762, -99561, -19950, -72694, -122574, -153041, -126653, -64033, -42430, -36692, 28871, 82045, 22146, -42247, -34496, -51361, -62742, -87982, -106500, -66221, -67385, -94092, -151515]
6410a51515n947Q0055M8523o1375N2799J1281J827r494J2921N198J6127j8795
6398a8395n3j5573L9588N5702l6023o7221l5333J8422n1872M2974O5002n6612
6386e9394L1603J7886o4254K7669J8367L6777k1014l4716n3490j7584R1738N1093
6374B4681o181K552k6812m4821l1761K7172P685j2619K4703R123r285m0484j9000
6361i5047L4421J3161L7279L5217j8061k1539l6721K3000j0646K8675n0937j673
6349f2871K1675m0768j0288j179M9433K7023j8611l0892m510N4231J9893K4406
6337B7542l857j4299m0529n8417P2817M902m0920R891N0328M753j851k6348M5075
6324B9087r9485m4581k0679M3944J12226l2965M604O4788k8774J2637L7517o1109
$$ y = [-151515, -157462, -77407, -28884, -90259, -37460, -26179, -24352, -33846, -20925, -15727, 400, -18395, -18448, -34021, 5567, 61269, 25246, -41975, -77308, -58886, -110758, -67784, -2782, -59394, -27791, -9905, -74159, -46490, -28123, 8654, -12360, -47076, -100566, -118150, -26412, 24681, 18500, 21052, -5760, -50581, -82342, -55170, -47485, -60104, -35401, -26278, -35563, -76047, -95047, -60626, -47465, -10186, 25031, 6970, -14569, -51290, -28290, -38936, -10261, -61198, -62871, -41196, -81964, -92252, -93431, -43998, -16975, -35586, -66478, -70988, -16757, 3136, 27542, 23685, 9386, -31143, -89560, -16743, -11841, -52761, -42870, 7458, 12211, 10360, -15988, 29087, -70398, -114979, -135658, -91714, 20512, -12453, -7849, 56939, 28165, 40802, 78319, 17210]
6312A7210l6340J3348j4810Q7859o7434l6167j69Q066o5859k1303R8518k1831
6300c8912k6329j6111N1071J7133k2503m6664M1543M6284k604M0765n0554j09311
6288a16192Q5342Q9428l7674j05915L8229O792p2487K3304K6792J02363m3962
6277c980r1763N9545N000N1969o8734J5998L6671j2069K3328J6469m5150j4278
6265b6994n4541R512N4456j923O7925k4040p8577j6087M6819k5169M8488K0194
6253B0063n0654K5849k458l969N799M1209l5080m5602K7776r359n4599Q0443k4692
6240b5274k1293L0124N9689k6707j3628m614m7807o2711k4201Q3498k5316m2390
6228a20630P8680L4598K761p0459J4742K0776j1738L3355n8064M0186m9885R125
$$ y = [17210, -19130, -5782, -20592, 67267, -167, -36334, -36503, -28437, -94296, -115599, -17081, -38912, -65241, -81352, -30281, -13148, -35651, -82315, -40772, 5512, 2908, 43673, -6881, -116192, -30850, 58578, 20904, -85011, -46782, -39990, -112477, -89173, -62381, 39982, -3980, -95743, -36198, -31198, 20771, -47963, -31965, 4706, -7363, 15965, 32434, -12716, -26994, -81535, -72023, -17567, -19490, 48435, 24395, -54182, -70269, -23450, -48619, -131, 20063, -30591, -4742, -7200, -11169, -5370, 35839, 759, -44843, -17067, -26426, -81025, -582, -25274, -46567, -16443, 43246, 16539, 2911, -1703, -49510, -112221, -136422, -52924, -78240, -120630, -41950, -7352, -4591, -75050, -60308, -39532, -51270, -17915, -75979, -35793, -85678, -76553]
6216g6553N1677M5818p7896j6421J0657l0213J6943l1406n266n887O4787N6183
6204B423n0652k4071L3304L593K1115L809p57j2043p8687j9579M0159j1973O9207
6191b4152N0401r6663N0708m441l9251O403M5963K0909N986o1795n4959L058j162
6178i8995J8871K526M0314k9437M4612M47N1643l0806l9035L0550K123M0544o5716
6165c2359O2978k9831k6080J2262J6701m2113j7341N2462k7836k0781L5394K1271
6153D727j1005p1745M4366n276l4054M912j9850R6801N4830k1754J104l8891Q952
6140A3117J4844K9929n4182j5937K2556J5291m917q9829L0030N7588N3476m5241
6128B6725m6238k1991k2672l80O7053J161J1764k5098o5266Q109p891M9888l221
$$ y = [-76553, -24876, 20942, -56954, -73375, -62718, -92931, -75988, -107394, -112660, -118547, -53760, 2423, -48229, -72300, -38996, -35403, -14288, -10479, -11236, -23279, -101966, -121545, -81386, -93359, -24152, 26249, -70414, -19706, -24147, -63398, -56995, -11032, 9877, 15863, -45932, -100891, -97833, -98995, -80124, -77598, -37284, -66721, -22109, -21662, 29981, -825, -39860, -9310, -7187, 33357, -32359, 30619, 788, -25292, -13030, 3671, -38442, -55783, -3321, -31157, -51938, -16544, 4727, -6278, -78023, -33657, -38933, -72987, -68075, -87925, 8876, 63706, 41952, 43056, 4165, 13117, 27961, 57890, 3708, -12229, 10327, 25618, 20701, -69128, -39098, 18490, 71966, 26725, -19513, -41504, -64176, -64556, 2497, 3658, 15422, -9676, -74942, -66833, -74724, -24836, -28057]
6115b8057r445R85M596l3938k6799O0701L5626Q774o9432k122k0869J0890k3672
6102i2762M6206J231J2534M227K0035J9142n6775m4454J1847n86p854R233j480
6089g9456K4519J9556l544l1730K154K3724j1494j8159o7977K1586J07032j4123
6077b7912K2668K898k7852j7L3640N3745m2160o8675J0025L2474K0058k1709l1157
6064d3974j0030O6223m3118j9897K647J4006Q616j6225j7570j3448P554O1727
6052c489l1794j2447K8190l4172K1487Q3665l7534p3941j2316O6756L117l7116
6040c9594L066l7200N7485L765m012O0160k229o0124l1238O4694p8133j5892O3198
6027a6054m1661K2801J8373O3973K0513j0847r9644K0662L0443m9745p1528Q8379
$$ y = [-28057, -37502, -36517, -31921, -65859, -92658, -31957, 3669, 12443, -56989, -59111, -79980, -69090, -92762, -46556, -45325, -32791, -28564, -8529, 10613, -46162, -90616, -78769, -79355, -87209, -77976, -79456, -54937, -35381, -38925, -70655, -68501, -44777, -56271, -74430, -142407, -120821, -13789, -27912, -5244, -2346, -30198, -30215, 3425, 57170, 15010, -53665, -43640, -11166, 8892, -12817, -43974, -54004, 12219, -30899, -50796, -48149, -34143, -25527, -41752, -59322, -72770, -65216, -3489, -35283, -47730, -19540, -53712, -32225, 51440, 13906, -60035, -72351, -5595, -2478, -39594, -36528, -73728, -16243, -12478, -16490, 43670, 41441, -18683, -49921, 14773, -63360, -79252, -16054, -57715, -34914, -16541, 47432, 67945, 57098, -42546, -21884, 8559, -41186, -112714, -24335]
6015b4335J0251q3576L4661N1367J2707J3133K1024J5824n7416J7746N0253n8810
6003B829J6478m8815J1340O3880r799j1500p5136L5491J2095j7018p3176n174
5991i8505R7701m5184R964N2943K8447k3235j2260L3719j481l3144j8645j5868
5979b5548k4183O5316l378m5314j596j4668K862J6551k3132m701j0450L8369j3328
5966d3200N448O9441n7987M2982q0629k0202j8922o970K5611P2627R5340k2211
5954F1328l1997m5528m8788J1591J7606N7392P3118n9565j14146O0581Q851l8856
5942d8413l385O123J8361O131O82m884j3268O490O168M2417n8271R236L7675k643
5928B419n278L9997l943N850J4978o5716o8630k2859Q2959J2303n9488L4028Q8915
$$ y = [-24335, -14084, -97660, -62999, -11632, 1075, 14208, 35232, 51056, -6360, 11386, 61639, 2829, 19307, -29508, -18168, 45712, 35913, 24413, -50723, -15232, -3137, -20155, -93331, -98505, -804, -45988, -36024, 16919, 45366, 22131, 9871, 43590, 42109, 8965, -9680, -25548, -49731, 15585, 12207, -33107, -34703, -49371, -46509, -29958, -53090, -57791, -68241, -29872, -43200, -37752, 31689, -26298, 16684, -63945, -84147, -103069, -110039, -84428, -11801, 83539, 61328, 29331, -16197, -64985, -53394, -35788, 21604, 94722, 35157, -78989, -18408, -9557, -48413, -51798, -45675, -27314, -21183, -20501, -25385, -38653, -32163, -25995, 16422, -41849, -32613, 5062, 2419, -2859, 37138, 33195, 39045, 54023, -11693, -80323, -103182, -20223, -7920, -67408, -33380, 55535]
5915E5535p8292m030L8088K3839m8487K1067n5863N1283o8896M6024n13p090P0500
5902D3165l1098j7020j3480J9743Q197r015j6407O61l0193k0298J7186L8883l096
5889a2772J4335N692L1221l3800L0943J9009j4769o548L1085l0299J4377o2702
5877a4228J1455N246l5596p0307K6626L2699n367M5274K5004m328q1187N4744
5865i965K5317j3303k0594J890j3585p2137K4721O7637P1608O732q4307K3583
5853G597L4823n3702J312K5291L1717J5690m976l1083K1099K8224m6715R964q0476
5840d1235O3052m190n330m9592l5731J9487J5399P3366O3744p7435l7956m6558
5828f2979O9834L8013L3153l9968m1952L1455k7879P1835q6492j038J4322k3531
$$ y = [55535, -22757, -26787, 11301, 35140, -13347, 7720, -48143, 3140, -65756, -19732, -20245, -27335, 43165, 12067, -4953, -18433, 1310, 9507, 492, -15915, -15254, -45447, -65745, -48559, -9676, -12772, 1563, 7255, 38476, 4676, 35619, 54628, 39859, 33311, 64396, 34097, 48474, -14228, -2773, 2473, -33123, -103430, -76804, -44105, -49472, -4198, 20806, 16478, -64709, -9965, 15352, 2049, -18545, -16655, -30240, -102377, -77656, -10019, 61589, 68321, -15986, 7597, 42420, -11282, -9970, 15321, 47038, 62728, 57752, 26669, 47768, 75992, 29277, 39241, -41235, 21817, 17627, 12297, -37295, -73026, -53539, -38140, 35226, 98970, 21535, -16421, -62979, 6855, 44868, 78021, 38053, -3899, 27556, -323, 71512, -14980, -16018, -1696, -25227]
5816b5227k1894O1679P0690J3351m9187l5582J9607N4137j3431m8677K967R9029
5804A27462j05609n6644L2290L165N6301J8718q22p9473j662j6646q740O5127
5792C3467m0666L1223J8645K6403k1115q398n3413o559N0222J8699l0382n0429
5780c2303M9301j946l7842o443N4338o570O8843j3495P820l0179l3142L7246m3601
5767A2027k908K3297j0083Q530L8131l4837L1790K6712k9254r1806k2396P9353
5755B8556N5594L5094O901m6774m0727J1179l685j7346M9972M049k61K9513k1319
5742I0746l8089k1046o787j9988N2736q113K0148O7456M038J220q5834p2734J297
5729a4950J37415J7748j00172N4030l7205J2323r812L6207l1700n8877k0353O2470
$$ y = [-25227, -47121, 14558, 85248, 98599, 49412, 13830, 33437, 87574, 74143, 25466, 28433, 127462, 21853, -34791, -2501, 664, 56965, 75683, 74861, -4612, -6274, -22920, -31660, 33467, -7199, 24024, 42669, 69072, 47957, 39559, -13854, -20413, 29809, 48508, 18126, -32303, 16998, 15052, -22790, -29233, 25105, 18535, 87378, 73883, 81703, 51524, 18382, 55628, 12027, 9119, 32416, 22333, 30863, 68994, 34157, 65947, 92659, 63405, -28401, -50797, 28556, 84150, 119244, 126145, 79371, 38644, 49823, 46138, 28792, 78764, 82813, 82552, 112065, 90746, 52657, 31611, 24824, 4836, 57572, 49459, 69607, 137063, 141101, 142321, 56487, -16247, -14950, 122465, 140213, 40041, 94071, 56866, 69189, 59377, 95584, 63884, 5007, -15346, 47124]
5717D7124L4467n3869k7979J217r942P7251q6533n6562N6703K0500L7686J5650
5705E5713r987j1166o0849o6278k608M3291J2667j3869J09514J7540j1068l4480
5693B8420p7j2529N8867m6325j76m528N213K3192L9620l3713l9125R2778j07245
5680D372j4502m990N1404J06787m6466n1840o9323J2902j8367L0934L5444k1768
5668A4587M3640o2774k7881M5379p432k7762O7294J7016m821k4786L7751j9139
5656E1072n582K6501J2615m0113n3246N013j0746Q1398k1291Q165j1855K9438
5644G1369k6124j8127l7727L7423m5760k7233N5264k0403j7446l9209n690Q7213
5632A3550J15386j08186J4448M9055l3814K4798k06k726o0930O3743q400l6681
$$ y = [47124, 81591, 27722, -257, 960, -8982, 68269, -18264, -74826, -18123, 2377, 40063, 55713, 45726, 34560, -26289, -92567, -95175, -51884, -39217, -53086, 56428, 73968, 62900, 28420, 28343, 15814, 74681, 28356, 28180, 23652, 28865, 52057, 91677, 57964, 18839, 111617, 4372, -10130, -15120, 36284, 143071, 96605, 44765, -24558, -11656, -30023, 911, 36355, 14587, 58227, -4547, -32428, 12951, 5519, -22243, 45051, 62067, 57246, 32460, 70211, 51072, 45490, 71991, 84606, 44493, -8753, -3740, -14486, 66912, 45621, 53786, 41931, 71369, 45245, 27118, -10609, 26814, -18946, -46179, 9085, -11318, -28764, -67973, -73663, 13550, 128936, 20750, 35198, 84253, 50439, 75237, 75031, 72305, 11375, 75118, 66718, 30037]
5620C0037k180J9061K9063r329n0091J7382k1085l8436P4651K9340k883l1856
5608D3674j6098K672m1671K2927J04767o1695K4452J6715q021N7608O580j16641
5596C5269j0485j8843j7274j2436M6731K5410j7217P4144q6961o5744Q9676M3380
5584H5650p0810k5276m1818p791R0846J9060M234j6717p0641L059N5458j6002
5572I252K7063M0929k7535k2648m8629K8885R9060m2487m5111r971o32Q040j5245
5559I71Q558J9716P978K7240K9178L3923q665l0007q057m2136J1488Q433L585
5546F2205N3307n226q9147N2891O1716K4198k5650n0149p497o955M854p053L998
5533G1492J3317l47j8241P400J2418m8138r584L9549J45106p2942r9441R9361
$$ y = [30037, 27857, 46918, 75981, 66652, 16561, 33943, 12858, -25578, 49073, 78413, 75530, 43674, 27576, 30248, -11423, 11504, 116271, 54576, 79028, 95743, 87722, 145330, 151910, 35269, 24784, 5941, -11333, -23769, 22962, 48372, 31155, 105299, 18338, -47406, 42270, 85650, 14840, -10436, -52254, -60045, 30801, 49861, 54095, 37378, -33263, -30204, 25254, 9252, 36315, 77244, 49709, 27061, -21568, 7317, 106377, 63890, 18779, 8808, 8176, 16216, 971, 9529, 29245, 37223, 64463, 93641, 127564, 118899, 88892, 80835, 38699, 50187, 58620, 62205, 115512, 110286, 21139, 74030, 135746, 159944, 134294, 84145, 76648, 69693, 74547, 67494, 71492, 84809, 84462, 66221, 73621, 86039, 37901, 28317, 67866, 212972, 140030, 40589, 139950]
5521A39950q328p9095M605K894K496N1947M5757O7312o1798k5487M4515K1044
5509B05812M6829j2506k3285q7314j1633k2629L30P8597l4811o8340l70L1171
5497A01851L2389N2254o9218j108N0334L5678l7148j3072M5266Q8714o8252j8318
5485A99370P6359m7100N231L9217l9000j99k6952n2664j6137L9227P366p477k0755
5472A56486K3833N050Q544r6947J0518K81l3798k7022J416K3183Q124O9178j8136
5459A30710l8191m2306N1403O8498k0548N0721N2365r869m2651j7767j23731j3052
5447D5582O1239m1515N8789L418L8773l730J6907m8782n4089O6083l0980n1497
5435F0198j5J4306l0328M4176J16192K3131N1230r8973K240l2308K4231j1586
$$ y = [139950, 131622, 52527, 57132, 60026, 62522, 114469, 160226, 227538, 165740, 140253, 184768, 205812, 252641, 240135, 216850, 129536, 117903, 95274, 95604, 174201, 139390, 71050, 70680, 101851, 134240, 186494, 117276, 116168, 166502, 202180, 165032, 151960, 197226, 285940, 217688, 199370, 275729, 228629, 233860, 273077, 234077, 233878, 206926, 154262, 138125, 177352, 184718, 177241, 156486, 180319, 185369, 193913, 96966, 107484, 107765, 73967, 46945, 48361, 71544, 79668, 148846, 130710, 92519, 50213, 101616, 170114, 149566, 200287, 252652, 242783, 200132, 182365, 58634, 45582, 106821, 65306, 124095, 127513, 166286, 162556, 179463, 130681, 76592, 142675, 111695, 60198, 60183, 74489, 44161, 88337, 204529, 227660, 278890, 179917, 182157, 149849, 174080, 162494]
5423A62494j2963j3327p302p3651K8617K1181K3014m0703k7310Q26K1600j8191
5411F4285j953k8732O0712k0410K0242R179l4262K7749q4325P6415M402o2978
5399C0324R2329J7974p9980M2458L0835J4925M1269m6607l1381J384m7616K5556
5387I1470O1669n6262J2416k3049l3587M4522r891J4307k0085O533m410J600j5416
5374F9817M0815l628Q8162k6690p360r8510K2415K2920K8164p7031M6050m5205
5362E9919m0758j5372M9662J00982m2475l4659K2373j04777J1576N2216j7865
5351D0822O6897J3661l4796l0463M5526M1059O1382o8418k0836M3309M7396R910
5339B15449p5874l095k054O99n7200K5216O5646j9620L6154q4677L4543l8264
$$ y = [162494, 149531, 136204, 128902, 55251, 83868, 105049, 128063, 87360, 60050, 60876, 82476, 64285, 62332, 33600, 94312, 73902, 94144, 103323, 69061, 96810, 12485, 88900, 93302, 30324, 122653, 140627, 60647, 103105, 133940, 148865, 190134, 143527, 112146, 113530, 65914, 91470, 153139, 96877, 109293, 86244, 52657, 97179, 87288, 101595, 81510, 88043, 83633, 85233, 69817, 110632, 107004, 195166, 168476, 161116, 62606, 85021, 107941, 136105, 59074, 105124, 59919, 19161, 3789, 53451, 154433, 111958, 77299, 99672, -5105, 6471, 58687, 40822, 107719, 121380, 86584, 56121, 101647, 142706, 204088, 135670, 114834, 158143, 205539, 215449, 139575, 136480, 134426, 135125, 77925, 103141, 168787, 149167, 185321, 100644, 135187, 96923]
5327I6923M2410n7000j6507j6989n1849r93P0956P8718p0114K2429K0697O3778
5315A82459J5127l3217m6753l4264J8180l0190k3969l1615P100N1447N2414m0684
5303H6035j4949m8101L6537Q3949j6200k0039o214k8798n96K5693L8585r937J6963
5290A42928J1261k4161M0917l2911p2765m7696N6974O2869N2220m813o3537L5930
5278A57216K2152J0021m9479K7659R088J9460M4616l4646q340J2146l935n2427
5266A53531N7631O8368r4256q144P2555k1132p556j3237O3625n8058J7096K8321
5254B58744p5102l39O703L6682k4390K040K3487J9695J844k1663L5861M9572j7778
5241B95356O94n282O4583N5584l5187L4776q3067l6153K8478N5442n5124N7584
$$ y = [96923, 139333, 82333, 65826, 48837, -3012, -4005, 66951, 145669, 75555, 97984, 118681, 182459, 197586, 164369, 117616, 83352, 101532, 71342, 47373, 15758, 22858, 74305, 126719, 86035, 71086, 22985, 59522, 143471, 127271, 107232, 101018, 72220, 71624, 97317, 135902, 125965, 142928, 154189, 130028, 170945, 138034, 65269, 17573, 74547, 137416, 189636, 184823, 121286, 157216, 179368, 189389, 139910, 167569, 176657, 196117, 240733, 206087, 197747, 209893, 205958, 153531, 211162, 279530, 185274, 177130, 249685, 228553, 220997, 207760, 271385, 213327, 230423, 258744, 183642, 183303, 190006, 226688, 202298, 204338, 227825, 247520, 249364, 227701, 263562, 313134, 295356, 296050, 290768, 355351, 410935, 375748, 410524, 327457, 291304, 319782, 375224, 320100, 377684]
5229C77684L8713L6617j7819n698J2351M2513p770M292K7383l2097O8265P9485
5217F23919j8242J2337J17938O5225J9597j5619J9376O9423Q6992m322j2769J20214
5205A084069Q8450P3719R6097O9366J25944J43377J63272K00639K41853J65428
5195B452214K45028K27625J39772J43624P6457j23852o1934j2287l0795P751R7609
5184C161212R0559o0171m369o2040k59006k25948k96990k07945j10879j93180
5174A831243j41851j62356j31624j22353j26467j03740j31471l0961l571o314
5164H70535j4120r96j77111L0103L4694n6896j16535j2573m7312m2194O923N5177
5152E29695n1834j3796o1066l2808j6657m4493O2373j2147N363Q0412L4000q6758
$$ y = [377684, 416397, 453014, 435195, 429497, 441848, 484361, 476591, 480883, 508266, 476169, 544434, 623919, 605677, 618014, 735952, 801177, 820774, 805155, 824531, 893954, 980946, 976624, 963855, 1084069, 1172519, 1246238, 1342335, 1411701, 1537645, 1681022, 1844294, 2044933, 2286786, 2452214, 2697242, 2924867, 3064639, 3208263, 3284720, 3160868, 3098934, 3086647, 3055852, 3063603, 3161212, 3251771, 3191600, 3187231, 3125191, 2866185, 2640237, 2343247, 2135302, 2024423, 1831243, 1689392, 1527036, 1395412, 1273059, 1146592, 1042852, 911381, 880420, 876849, 870535, 856415, 855419, 678308, 708411, 743105, 686209, 569674, 557101, 509789, 467595, 474518, 529695, 477861, 464065, 402999, 370191, 353534, 309041, 371414, 359267, 364630, 445042, 479042, 392284]
5140C92284p2182k6975K9853l705L0211n0027O2592m5890j2759K2763K0854o4505
5128B82514o0071K5858j3297m4896O4785k6724o426O4358j3296P5789j3511o3950
5116B71133n0275o0755O4978M923K2976N9293l8268o2426j7510J0914M1615p3194
5104A73404M9009j4364k6964Q683O8697P995l3433J6498m0552j4469k2549J2128
5092A84083j181K0998M4182J721L447o7372O332M368K8567l9685N7096J7107J4676
5079B74339J5638K0972m2510p1947N5518J4801k5286m6035P908Q965O2496o7222
5067B07637M4146O3092n4343l1645J6800p973j2659M9037L6018l4633m1307L519
5055B37689J00619q3103k9563o1638k789Q2622l5440J5694K9321k5356M315L8115
$$ y = [392284, 320102, 293127, 322980, 319275, 349486, 299459, 362051, 316161, 303402, 326165, 347019, 282514, 222443, 248301, 235004, 190108, 254893, 228169, 221743, 286101, 272805, 348594, 335083, 271133, 220858, 160103, 225081, 230004, 252980, 312273, 274005, 211579, 194069, 204983, 246598, 173404, 222413, 208049, 181085, 189768, 258465, 266460, 233027, 249525, 208973, 194504, 171955, 184083, 182902, 203900, 248082, 249803, 253250, 185878, 192210, 196578, 225145, 185460, 242556, 259663, 274339, 289977, 310949, 268439, 196492, 252010, 266811, 241525, 195490, 203398, 212363, 274859, 207637, 251783, 314875, 260532, 228887, 245687, 237714, 225055, 274092, 310110, 275477, 234170, 237689, 338308, 255205, 225642, 164004, 161215, 243837, 208397, 224091, 253412, 228056, 232371, 270486]
5043B70486j7879L373l4010M234L7375K922m9689k9001M9666j4199j3505k1713
5031A88060P7443k2584j0268k9889J9732M9521J2126l8182L284K1957o7692q548
5019A94960L8213J2845P794M7047L3453J65k4807M3913J789M6653p9200L3208
5007C56033K4338q951k108Q925l5908K8667M2015r4415N2957n0481k4454K6015
4995C22633J9634M7197J2730L5652M8354j2153j3604J8780P2064l0742P767K3655
4983E51967M7837Q0945j2204k2026O6775R3877J1880L9651Q8416M9013J5198P6314
4971A087643J07963J23449J65890J06482J00136K00263K28074K03156J89102m1774
4961B470384j29859j08369j05971j8153j7134M2458J21097O3076J23312K7556
$$ y = [270486, 252607, 255980, 221970, 226204, 263579, 266501, 216812, 187811, 237477, 223278, 209773, 188060, 265503, 242919, 232651, 202762, 222494, 272015, 284141, 245959, 249243, 271200, 203508, 194960, 233173, 246018, 253812, 300859, 334312, 334477, 309670, 353583, 355372, 402025, 322825, 356033, 380371, 371420, 369312, 378237, 342329, 370996, 413011, 318596, 371553, 321072, 296618, 322633, 342267, 389464, 402194, 437846, 486200, 474047, 460443, 479223, 551287, 520545, 528312, 551967, 599804, 680749, 668545, 646519, 713294, 807171, 819051, 858702, 947118, 996131, 1011329, 1087643, 1195606, 1319055, 1484945, 1591427, 1691563, 1891826, 2119900, 2323056, 2512158, 2470384, 2340525, 2232156, 2126185, 2108032, 2090898, 2133356, 2254453, 2317529, 2440841, 2468397]
4951B468397q5898j75151k32547k33504k19001r9018q2876j44316j19416M1525
4941A118195j27816j28003m1852k9090m2548r8224q596K2702l5302J5616o4082
4930E81000o4702j9212L618j8168m490j9774J2788j1117L1050n6687J3783r8514
4918C49575j925J6884p306K0206n4320R244l3618j4810k7934K477k721O6296J3263
4905C35311m173M2273j31242J4347J1226r2935M3040k0793M631J1695K2102l8942
4893A96540P9203k4560j4194j9092l0218K8770K8388m2489l2274k8234O9362k1801
4881A89401Q0462J0583K4154J4606k2322J881p9920k9798K0159k1916r54q239
4869A78097J9299M3836m2705n4293K9535N4559N708J1436j3821O2626o3442n1357
$$ y = [2468397, 2382499, 2207348, 1974801, 1741297, 1522296, 1423278, 1340402, 1196086, 1076670, 1118195, 990379, 862376, 820524, 791434, 748886, 650662, 642066, 664768, 629466, 645082, 581000, 516298, 497086, 500704, 482536, 478046, 458272, 471060, 459943, 490993, 434306, 448089, 349575, 347650, 364534, 357228, 377434, 323114, 332358, 298740, 283930, 255996, 258473, 255752, 322048, 335311, 331138, 373411, 242169, 256516, 267742, 174807, 217847, 197054, 201685, 213380, 235482, 196540, 275743, 251183, 236989, 217897, 187679, 216449, 244837, 202348, 170074, 141840, 211202, 189401, 269863, 280446, 304600, 319206, 296884, 298765, 218845, 189047, 209206, 187290, 186336, 178097, 197396, 241232, 198527, 144234, 173769, 228328, 234036, 245472, 231651, 294277, 230835, 179478]
4857A79478j6140P0524L1715o5714L4949l2896k6788k0028K858L8306m4615M0417
4845A92066M89J0199m4737j6949j4920M1805l0772J48o4362k3210R9754N6179
4833B05690P183j7119m1046j1100L3690M0624M3328o6363M2030J9819L366M0259
4821C00361q8931l8450k8808P1344m4509k2600j2665K6171n151m3489l6191o896
4809G0186L3658K7048K7513K13k9124m2866Q885K9995L7407l5411l7553J5224
4797A05175j7933j129L394M3082O3786M039j3979l5665L2767Q1870p860p165R953
4784B60335l1698K741l3751J9204L5533r5347M9312N5205J3263J240j14933L5036
4772A96140k4054l5805L1890l915K0171O2479R970J3008k5981J8965q8302M2418
$$ y = [179478, 163338, 233862, 265577, 199863, 234812, 201916, 175128, 155100, 157958, 196264, 151649, 192066, 192555, 202754, 158017, 141068, 126148, 167953, 137181, 137329, 72967, 49757, 149511, 205690, 212873, 195754, 154708, 143608, 177298, 217922, 261250, 194887, 236917, 256736, 260102, 300361, 211430, 172980, 144172, 215516, 171007, 148407, 135742, 161913, 156762, 113273, 77082, 70186, 103844, 130892, 158405, 158618, 129494, 86628, 95513, 125508, 162915, 127504, 89951, 105175, 87242, 86113, 89507, 132589, 196375, 200414, 186435, 150770, 183537, 265407, 257547, 250382, 260335, 228637, 231378, 197627, 216831, 252364, 157017, 206329, 261534, 274797, 276037, 161104, 196140, 172086, 136281, 168171, 164256, 184427, 246906, 256876, 269884, 243903, 262868, 174566, 216984]
4760B16984j027k3323j4504J6489N0608l3912k7802L0826k2738j1637j4715P990
4748A73239J2559M3895l0977L1086K6666j3921k8431P5595j7422l4748m9216l3059
4736A55266L7162P0256L3250r2351l7588K2894O048l0824j2014j9798J13623N4944
4724C00868j7952r4657K8865n7675k2806J24623O6560L212l9024M7365p3556m6110
4712B19713P0176j1938q166k2566k8590q5366M0881O6417k4381k7936J20524k9826
4700B78942n4519J2148k7326j8527k7614L9441J0125J6189K3293P949N7840l4990
4688B82951j0525l3024p9424O2214K3129N1682M5303j2046k5836m4747P0171k2343
4676C07505o9462M806L0398k3494K4447M4771K8175J1828l9684m053m1871n5923
$$ y = [216984, 215957, 192634, 178130, 194619, 245227, 211315, 183513, 214339, 191601, 179964, 165249, 173239, 185798, 229693, 198716, 229802, 256468, 242547, 214116, 289711, 272289, 237541, 188325, 155266, 192428, 262684, 295934, 203583, 165995, 188889, 194937, 164113, 152099, 132301, 245924, 300868, 282916, 188259, 217124, 159449, 136643, 261266, 327826, 331038, 292014, 339379, 265823, 219713, 289889, 277951, 269785, 247219, 218629, 133263, 174144, 240561, 216180, 188244, 308768, 278942, 224423, 236571, 209245, 190718, 163104, 202545, 212670, 228859, 252152, 260101, 317941, 282951, 272426, 239402, 159978, 222192, 245321, 297003, 342306, 330260, 304424, 259677, 329848, 307505, 238043, 242849, 273247, 249753, 274200, 318971, 347146, 358974, 319290, 315237, 273366, 217443]
4664B17443R880O3785K376L4386j5811l4799J188J0916M3643N411q2863O412R620
4651B71587l8114j7949M7422O4065j8160k7729l0789M3692M5836L6154r1434m3568
4639B41013O4508O4994P193m5456k1472O805M6580r3070m002P8619l9396p956
4627B98360r8125j8782O0308J08209o8808P5085N562n6584m9951k6437N8196M6029
4615C33062J9056r7191N741O272O99N8912M6328o9005J9268o0142k020L2960m4992
4602B48948J2776N4900N649m8989N9000N7154R207k498o6108n338l3603j3306
4590B77792l2115J0860J4674P829k3468j8255J7713j8650k9497M5017R4445j24083
4578B22262k996q856L693k0478J8754L6083M7323N4836m2570j10227J303N9792
$$ y = [217443, 227323, 291108, 293484, 327870, 312059, 277260, 278448, 289364, 333007, 338418, 255555, 261967, 271587, 233473, 215524, 262946, 327011, 308851, 281122, 250333, 294025, 339861, 376015, 284581, 241013, 305521, 370515, 377708, 332252, 310780, 317585, 364165, 271095, 267093, 345712, 306316, 298360, 200235, 181453, 241761, 349970, 281162, 356247, 361809, 305225, 255274, 228837, 287033, 333062, 352118, 254927, 260668, 266940, 267639, 326551, 372879, 303874, 323142, 263000, 260980, 293940, 248948, 261724, 316624, 322273, 273284, 332284, 389438, 398645, 396147, 330039, 324701, 291098, 277792, 245677, 256537, 271211, 279040, 255572, 237317, 255030, 236380, 206883, 251900, 346345, 222262, 219266, 210410, 214103, 193625, 212379, 248462, 295785, 350621, 308051, 197824, 199127, 258919]
4566B58919l0744K8723J1322N3453o4906q8998L2767O1678j9293O3379o1572m594
4554B40134Q20r2300L0474O4481l0690M3789O8943n7882o3197K4490m1993J5825
4542B02894P2110P8429n6591m7379l1309J21081j5968q0189M0755j1533o334n3902
4530B12064K1650j3240k5259K485J2170m5760J5418J4289O3337r123j1720N0518
4518B86829l1018N8890n536n5304K0193l4672J0782j2560O957K7522p011M1785
4506C06857j96o0337P157K9879j0513k679K0406J0686j8410J1258l6563L9051
4494B96596R432m9454M374p513l8986J9134L3458M3181N286j1669J5152m740k1359
4481B92892j9162k7843k0030K3062k8740K3421L8543j7146R0315L40n0072l598
$$ y = [258919, 228175, 256898, 268220, 321673, 256767, 167769, 200536, 262214, 242921, 306300, 244728, 240134, 240954, 148654, 179128, 243609, 212919, 256708, 325651, 267769, 204572, 229062, 187069, 202894, 275004, 353433, 296842, 249463, 218154, 339235, 323267, 243078, 283833, 272300, 265966, 212064, 233714, 220474, 195215, 197700, 209870, 164110, 179528, 193817, 257154, 248031, 236311, 286829, 255811, 314701, 309165, 253861, 274054, 239382, 250164, 237604, 244561, 272083, 265072, 306857, 306661, 246324, 253481, 283360, 272847, 270168, 290574, 301260, 282850, 294108, 257545, 296596, 306028, 256574, 260948, 253435, 214449, 233583, 267041, 310222, 315508, 303839, 318991, 314251, 292892, 273730, 245887, 225857, 248919, 220179, 243600, 282143, 264997, 355312, 355652, 305580, 301982]
4469C01982L2093L0195q2458J8299l4000j8018K8647k8852r4624R7500k2054J5099
4457B43809K2129J7448o1766k5671J11923M0835J6327l6345l6924l4102Q112L733
4445B69508j3077j7139P287j4556l4720M4287O5510j587R273J9513J7457K4437
4433C76193K3339k1072o191K0961o1971K1685r376o6979M5808p189o869K2495
4421C30834K7623J6216o6623p3982j0634M3242J1097o321J6005P7422p2476M9649
4409C42052O7315P867n8751j0669j7183j2094M4833J4556J8901m7728M9616o091
4397C92624l9514n4230j004L3163q626j2746M9017J3331k0483M873k9611m624
4385C22170J9675j96J2125m2284K6485N3209j7538j477P878L13j494J5812N3523
$$ y = [301982, 334075, 364270, 281812, 300111, 266111, 248093, 276740, 247888, 153264, 250764, 228710, 243809, 265938, 283386, 221620, 195949, 307872, 348707, 365034, 328689, 291765, 257663, 265775, 269508, 256431, 239292, 246579, 232023, 197303, 241590, 307100, 305513, 314786, 334299, 351756, 376193, 399532, 378460, 372269, 393230, 331259, 352944, 343568, 276589, 322397, 315208, 308339, 330834, 358457, 374673, 308050, 234068, 223434, 266676, 277773, 271452, 287457, 364879, 292403, 342052, 409367, 417234, 358483, 347814, 330631, 318537, 363370, 377926, 396827, 349099, 398715, 392624, 353110, 298880, 297876, 331039, 322413, 309667, 358684, 372015, 351532, 356405, 326794, 322170, 341845, 341649, 353774, 311490, 337975, 391184, 373646, 372169, 380047, 380360, 378866, 394678, 448201]
4372D48201k1457k0461q6357n3233M9220o107O0789Q1888l2083k0286l6452L0712
4360C94374j2107k7802l3595j9407N5049j6284l5382O5806M8313O1073L1080k6274
4348D84844n9882L5087K8441Q9611K4134l6487k9292m8942k8642P0781O8794K3365
4336F21812L0782J6265m2350o6174L7582K909j10133K0808J8366K0655L8659J7408
4324F06589k4677m3197R18l8455O4491J4068M2595K25o6128L8106J8275L2605
4312F45415j3080k0494j1180q846J1561K628N8708J2733j7416N136L1251L4780
4300G31196L0381n5045k367p1293l4602K8852O0318K2561O664J2332L5384o7554
4288F96827L6469M1326J5998P9610N8895M1341M6568J03918L6628Q847L9638M5521
$$ y = [448201, 426744, 406283, 319926, 266693, 315913, 309806, 370595, 452483, 420400, 400114, 363662, 394374, 382267, 354465, 320870, 301463, 356512, 340228, 304846, 370652, 418965, 480038, 511118, 484844, 424962, 460049, 488490, 578101, 602235, 565748, 536456, 487514, 458872, 529653, 598447, 621812, 652594, 668859, 626509, 560335, 597917, 600826, 490693, 511501, 529867, 550522, 589181, 606589, 581912, 538715, 539633, 501178, 565669, 579737, 622332, 622557, 556429, 594535, 612810, 645415, 632335, 611841, 600661, 591815, 603376, 606004, 664712, 677445, 660029, 665165, 696416, 731196, 761577, 706532, 704165, 632872, 598270, 627122, 687440, 710001, 716665, 728997, 764381, 696827, 733296, 774622, 790620, 870230, 929125, 970466, 1017034, 1120952, 1157580, 1166427, 1206065, 1251586]
4276A251586J1941J47219J03754N2591J03553J04330J36652Q0732P2728O2601
4266B127687J09145J22458O2157J20461Q5617J13303O5836o1121P7590P1955O9903
4255B964991J29221L7950r284l9751o8058j12011m8970n8451o6203P973o2565
4244B674842p8086p5973r6741k08476j22777j59886k0749Q345l8626j72652j46985
4233A562236j25424n6732n1090p4977K1650j04956r4612m6338m5492n7623J9376
4222I46018o5079N99N1948p9591q504m8025l6239J1717j1228k3814j3637K5415
4210G49580l1437l9836m0928O0620L2846j6870J7060q0121J1578N8212L5956l4654
4198G22006l7769j1425m8891M2541l8682M766J1883J1134Q8982L5825j15385M3455
$$ y = [1251586, 1263527, 1410746, 1514500, 1567091, 1670644, 1774974, 1911626, 1992358, 2065086, 2127687, 2236832, 2359290, 2421447, 2541908, 2627525, 2740828, 2806664, 2745543, 2823133, 2895088, 2964991, 3094212, 3132162, 3122878, 3083127, 3015069, 2903058, 2854088, 2795637, 2729434, 2737407, 2674842, 2596756, 2520783, 2424042, 2215566, 2092789, 1932903, 1912154, 1920499, 1881873, 1709221, 1562236, 1436812, 1380080, 1328990, 1254013, 1275663, 1170707, 1076095, 1029757, 984265, 926642, 946018, 880939, 881538, 933486, 853895, 845391, 797366, 761127, 772844, 761616, 737802, 724165, 749580, 718143, 678307, 637379, 697999, 730845, 713975, 731035, 650914, 662492, 720704, 756660, 722006, 684237, 672812, 623921, 666462, 627780, 632546, 644429, 655563, 744545, 780370, 664985, 708440]
4186G08440m8218j1686L0696J0417m9314L1786l7370K8375m1656q037n7046k3264
4174E33123L9972O5500K0110P4788j8606j20361j9677l292L7908R4912N598p3812
4162F36163K9499k3460L2295Q333M0959r3798j1599O9822N6534n4874n9406K8881
4150F59349L9408m0314K1074j746O549O3881k8655J0149j1156l8452K11k0428
4138F59870J9577M6459K2579k6718N5049J4563P993k2165l2850k3707J24752j0346
4126H35056n617M6102N1306n744N1953N3561n7334m3596j6427K6723j55j7424
4114I18404M3384L5912N7542L2385m3205l082L3006K9444j2217P1915N7888P1488
4102A292864j4781l8840J2593M8153m5363J3465P8042O4176q7709L854O9682M7551
$$ y = [708440, 660222, 648536, 679232, 689649, 640335, 672121, 634751, 663126, 621470, 613433, 556387, 533123, 573095, 638595, 658705, 733493, 714887, 594526, 574849, 571557, 609465, 704377, 709975, 636163, 665662, 642202, 674497, 682830, 723789, 629991, 618392, 688214, 744748, 689874, 630468, 659349, 698757, 658443, 679517, 677771, 684320, 748201, 719546, 729695, 718539, 680087, 680298, 659870, 679447, 725906, 748485, 721767, 776816, 791379, 799372, 777207, 744357, 720650, 845402, 835056, 829439, 875541, 926847, 921103, 973056, 1026617, 969283, 925687, 909260, 935983, 935828, 918404, 961788, 997700, 1055242, 1087627, 1044422, 1041340, 1074346, 1103790, 1091573, 1163488, 1221376, 1292864, 1278083, 1239243, 1251836, 1299989, 1254626, 1268091, 1346133, 1410309, 1322600, 1326454, 1396136, 1443687]
4090A443687Q931k9353L7103j3083M4004L6725n7130N0069L6516R552o1567J1544
4078A516998l4974L0743O5962j09930m422L8625l5656m1025m0505q793N0497r8182
4066A329338J00910K0856L0644J1160p2716o7835L0897q08k6156j1126R107j5723
4054A338548j8595K0677N0803j0189k0018L7190k1589l2401j074R7133M0492j688
4042A479289M1844n6381J6239N8113l4204J2553j1625j7795j0767L1455K6708
4031A535429J06121j9238J7714o9098j3091P0095j704L5330K1171N862M9312L6211
4019A774114P3406R103k8258M5389N7627o2584K1283M6431J9574M6289K0185N727
4007B028286N7180Q0777L8911K4482q102P0853K4766l2187J00704K3678o338R4832
$$ y = [1443687, 1452618, 1423265, 1460368, 1447285, 1491289, 1528014, 1470884, 1520953, 1557469, 1567021, 1505454, 1516998, 1482024, 1512767, 1578729, 1468799, 1464377, 1503002, 1467346, 1426321, 1385816, 1377023, 1427520, 1329338, 1430248, 1451104, 1481748, 1492908, 1420192, 1352357, 1383254, 1382446, 1356290, 1345164, 1354271, 1338548, 1319953, 1340630, 1391433, 1381244, 1361226, 1398416, 1376827, 1344426, 1343352, 1440485, 1480977, 1479289, 1521133, 1464752, 1480991, 1539104, 1504900, 1517453, 1505828, 1488033, 1477266, 1508721, 1535429, 1641550, 1622312, 1640026, 1570928, 1557837, 1627932, 1626228, 1661558, 1682729, 1688591, 1737903, 1774114, 1847520, 1856623, 1828365, 1873754, 1931381, 1868797, 1890080, 1936511, 1956085, 2002374, 2022559, 2028286, 2085466, 2166243, 2205154, 2229636, 2221534, 2292387, 2317153, 2284966, 2385670, 2409348, 2403010, 2497842]
3995B497842L3553j4931q0685o874l3847J1174Q0274M1566o4790o990M710k4695
3983B436307K4974J6948j8366P5798L6262k4748L8261J5824j5197M8595k5097
3972B609561R6859Q1634j3357M1693M6036O1992J383R7377o55j272R8575J15927
3960C235753O3601M3534R8575L7246J8468R4772N9139O8563O5782L9498J25679
3949C950610K2089k2045M4575K4671L7329J0602P1419P3626L2347j8190l7608
3938D189425m5539J16624N7108J2481m3033j774j1081J37946L4425K2091M1987
3927D510660n197O5195M82J37810J30361o401m985R4573M2028J30757L9961J63959
3915E299203J77540J51639J22032J49270J62510J62181J49211K03576J91545K45090
$$ y = [2497842, 2531395, 2516464, 2435779, 2428905, 2395058, 2406232, 2486506, 2528072, 2463282, 2456292, 2461002, 2436307, 2461281, 2478229, 2459863, 2535661, 2571923, 2547175, 2585436, 2601260, 2586063, 2634658, 2609561, 2706420, 2788054, 2774697, 2816390, 2862426, 2924418, 2925801, 3023178, 3022523, 3021251, 3119826, 3235753, 3299354, 3342888, 3441463, 3478709, 3497177, 3591949, 3651088, 3719651, 3785433, 3824931, 3950610, 3972699, 3950654, 3995229, 4019900, 4057229, 4067831, 4139250, 4212876, 4245223, 4227033, 4189425, 4143886, 4260510, 4317618, 4330099, 4287066, 4285292, 4274211, 4412157, 4446582, 4468673, 4510660, 4505463, 4570658, 4571140, 4708950, 4839311, 4832910, 4827925, 4922498, 4964526, 5095283, 5135244, 5299203, 5476743, 5628382, 5750414, 5899684, 6062194, 6224375, 6373586, 6577162, 6768707, 7013797]
3905G013797J47872J00340J64449J32051L7049R2373O8082J65955J37403J6274
3895H075645J26606N3968L0005J350k5514n3331j23795j08546p6050k4637k5875
3884G849826l2377m8539P638p1579j1510K1129k8578J8165J4009M8438Q0054Q9203
3872G935879P8705J09335J32526J28180J15497R5965J86993K63816J13834K33839
3862I394569K32111K39078L18981L06069K08121K34239K52373K98273K75069L41297
3852A2100180L63940L31552L38708M19366L57786M36079M84385M15590N09025
3843A5756611M98130N55997N15266O42583O75202O17220P69049O87292O42834
3834B1360184Q00759R05130R80531R48316J112475J172963J123657J196330J281974
$$ y = [7013797, 7161669, 7262009, 7426458, 7558509, 7595558, 7687931, 7756013, 7921968, 8059371, 8075645, 8202251, 8256219, 8286224, 8287574, 8262060, 8208729, 8084934, 7976388, 7900338, 7875701, 7849826, 7817449, 7768910, 7776548, 7704969, 7693459, 7714588, 7686010, 7704175, 7718184, 7766622, 7846676, 7935879, 8014584, 8123919, 8256445, 8384625, 8500122, 8596087, 8783080, 9046896, 9160730, 9394569, 9626680, 9865758, 10184739, 10490808, 10698929, 10933168, 11185541, 11483814, 11758883, 12100180, 12464120, 12795672, 13134380, 13553746, 13911532, 14347611, 14831996, 15247586, 15756611, 16254741, 16810738, 17326004, 17968587, 18643789, 19261009, 20030058, 20717350, 21360184, 22160943, 23066073, 24046604, 24994920, 26107395, 27280358, 28404015, 29600345, 30882319]
3825C0882319J347449J400427J541061J653975J698741J767636J868369J941376
3817D4101353K050735K048790K175521K255187K213796K247711K460305K391830
3809F1945228K499362K607994K601244K528647K606041K644810K628457K582980
3801H2644763K479376K445698K342351K241836K085874J952545J873959J795923
3793I9862325J672301J489545J384029J227903J088176R52537P22211M26289J75063
3784A09000379q1965k61527m30933p59406q73919j014519j087242j255686j390491
3775A01844691j553604j645454j870693j988708k090745k258635k318735k439113
3767H5679004k446387k375389k628928k555221k489455k466127k343832k375760
$$ y = [30882319, 32229768, 33630195, 35171256, 36825231, 38523972, 40291608, 42159977, 44101353, 46152088, 48200878, 50376399, 52631586, 54845382, 57093093, 59553398, 61945228, 64444590, 67052584, 69653828, 72182475, 74788516, 77433326, 80061783, 82644763, 85124139, 87569837, 89912188, 92154024, 94239898, 96192443, 98066402, 99862325, 101534626, 103024171, 104408200, 105636103, 106724279, 107676816, 108399027, 108825316, 109000379, 108918414, 108656887, 108225954, 107466548, 106592629, 105578110, 104490868, 103235182, 101844691, 100291087, 98645633, 96774940, 94786232, 92695487, 90436852, 88118117, 85679004, 83232617, 80857228, 78228300, 75673079, 73183624, 70717497, 68373665, 65997905]
3759F5997905k371560k259850k321034k270041k210080k137036k042201k039170
3751D8346933j913034j805969j803037j667234j637665j470409j469884j419898
3743C5159803j291979j217907j151318j096112j009928j024736q63972r07057
3735B6596794q26171q40567p08593o59432o54560o24264o49118n07367m57800
3726B0668922n35570l74176l35447l93219l65294l29699l77194k46051k35621
3717A7476651k64242k65657k47199j62818j06047j65088j39437q0469j12269L124
3707A5936549m2586j01225l1928N1762L1756N3816L6349J00152J05628J56736
3697A6297009J31328J12552J70729K11374K69186K51019K42790K79677L26647
$$ y = [65997905, 63626345, 61366495, 59045461, 56775420, 54565340, 52428304, 50386103, 48346933, 46433899, 44627930, 42824893, 41157659, 39519994, 38049585, 36579701, 35159803, 33867824, 32649917, 31498599, 30402487, 29392559, 28367823, 27503851, 26596794, 25770623, 24930056, 24221463, 23562031, 22907471, 22283207, 21634089, 21126722, 20668922, 20133352, 19759176, 19423729, 19030510, 18665216, 18335517, 17958323, 17712272, 17476651, 17212409, 16946752, 16699553, 16536735, 16430688, 16265600, 16126163, 16045694, 15933425, 15936549, 15893963, 15792738, 15760810, 15812572, 15844328, 15898144, 15934493, 16034645, 16140273, 16297009, 16428337, 16540889, 16711618, 16922992, 17192178, 17443197, 17685987, 17965664, 18292311]
3688A8292311L73010M26227L55152L57899M32582L94204M05915N57660N77482
3679B2172442N23877N77395N33416N28844O04543N39134N30768O17038O57610
3670B7285067O83547O61124O37869P30430P27082Q03144P62041Q81680Q87033
3661C4059017Q25261R45319R39657J054451J150486J108925J110608J236050J220279
3652D3650053J317220J424220J450215J503568J689049J700480J863816K096194
3644E6694815K151081K199307K393036K645110K998562L210803L360907L756481
3636G9410102M256338M503327N005500N654259O109742O853023P628958Q402269
3628A27823518R233973J0193831J0930767J1833578J2642337J3318602J3811484
$$ y = [18292311, 18665321, 19091548, 19446700, 19804599, 20237181, 20631385, 21037300, 21594960, 22172442, 22696319, 23273714, 23807130, 24335974, 24940517, 25479651, 26010419, 26627457, 27285067, 27968614, 28629738, 29267607, 29998037, 30725119, 31528263, 32290304, 33171984, 34059017, 34884278, 35829597, 36769254, 37823705, 38974191, 40083116, 41193724, 42429774, 43650053, 44967273, 46391493, 47841708, 49345276, 51034325, 52734805, 54598621, 56694815, 58845896, 61045203, 63438239, 66083349, 69081911, 72292714, 75653621, 79410102, 83666440, 88169767, 93175267, 98829526, 104939268, 111792291, 119421249, 127823518, 137057491, 147251322, 158182089, 170015667, 182658004, 195976606, 209788090]
3621B09788090J4089079J3656113J2696098J1174695R182270P002573M682470
3614B82271388K697692J136936K9594o74866j176683j573672k089217k549589
3606B78071583l186305l952269n141734o608165q141120r787460j1240054j2510952
3598B17503524j3182556j3270698j3064449j2539461j1744859j0961655j0196579
3591A32543267r457727q540351p801261p141229o398534n734850n178632m660078
3583G7630605m211845l828168l562208l234613k913404k749696k587024k315390
3575E2228257k199078j991964j887857j798782j645158j412340j471515j397212
3567C8424351j250909j139335j140550j068656j061288r65529r09385q58216p32753
$$ y = [209788090, 223877169, 237533282, 250229380, 261404075, 270586345, 277588918, 282271388, 284969080, 286106016, 286135610, 285460744, 284284061, 282710389, 280621172, 278071583, 274885278, 270933009, 265791275, 259183110, 251041990, 241254530, 230014476, 217503524, 204320968, 191050270, 177985821, 165446360, 153701501, 142739846, 132543267, 123085540, 114545189, 106743928, 99602699, 93204165, 87469315, 82290683, 77630605, 73418760, 69590592, 66028384, 62793771, 59880367, 57130671, 54543647, 52228257, 50029179, 48037215, 46149358, 44350576, 42705418, 41293078, 39821563, 38424351, 37173442, 36034107, 34893557, 33824901, 32763613, 31798084, 30888699, 30030483, 29297730]
3558B9297730q17671p83470o15514n96954o70207n90161n82398o22742m63243
3549B3555370m56377n16807m66868m29613m39145m97479l82010l51725k92497
3540A9722849l25939k28987l23689l68722l01005k23822k10281j71925j17560
3531A7450919J1520j73733j71628R771L9434N6306M5629N3276J78376J70233J01739
3520A7771842M1229R4246J25860r1999k2513j14471j03389J0850l8014m3490j17972
3509A7512179p6676j25310j5459r1985j39836o4403q8087j49829k16639k24184
3499A6319771k09554k64748l28498k23910j66084r6206j73883j51989r0516o6184
3489A4548199p8626m9962m5043J4698K3574j11559N3295O9868P8754N7641j3028
$$ y = [29297730, 28480059, 27696589, 27081075, 26484121, 25813914, 25223753, 24641355, 24018613, 23555370, 23098993, 22582186, 22115318, 21685705, 21246560, 20749081, 20367071, 20015346, 19722849, 19396910, 19167923, 18844234, 18475512, 18174507, 17950685, 17740404, 17568479, 17450919, 17462439, 17288706, 17117078, 17126849, 17166283, 17222589, 17268218, 17321494, 17499870, 17670103, 17771842, 17813071, 17907317, 18033177, 17941178, 17918665, 17804194, 17700805, 17711655, 17673641, 17630151, 17512179, 17435503, 17310193, 17294734, 17202749, 17062913, 16998510, 16910423, 16760594, 16543955, 16319771, 16110217, 15845469, 15516971, 15293061, 15126977, 15030771, 14856888, 14704899, 14614383, 14548199, 14469573, 14419611, 14374568, 14389266, 14412840, 14301281, 14354576, 14424444, 14503198, 14560839, 14547811]
3478A4547811L5054J33297J73616R4573J12143J48200J42704K61732K01702J31001
3468A5981833K25764J94202J98282K53972L25317L09139M04550L95681L63347
3459A8652087M46256M79302N51854N53812M03910N34089O01817N60058N60975
3450B3344160O16525N81978O26364P07292O42684N69168O36163O73890P05715
3441B9103939P32501P26844Q02223P97266P48771O57715P08710O48550O27302
3432C5553821O71641O51324P40450O86873P33204P87350R32669Q99245R19090
3423D2575667R59191J007496J132088J023927J190716J258849J312854J527984
3415E1988772J570438J678751J869416K033835K194937K374870K593711K855264
$$ y = [14547811, 14582865, 14716162, 14889778, 14984351, 15096494, 15244694, 15387398, 15649130, 15850832, 15981833, 16207597, 16401799, 16600081, 16854053, 17179370, 17488509, 17893059, 18288740, 18652087, 19098343, 19577645, 20129499, 20683311, 21087221, 21621310, 22223127, 22783185, 23344160, 23960685, 24542663, 25169027, 25876319, 26519003, 27088171, 27724334, 28398224, 29103939, 29836440, 30563284, 31365507, 32162773, 32911544, 33569259, 34277969, 34926519, 35553821, 36225462, 36876786, 37617236, 38304109, 39037313, 39824663, 40757332, 41656577, 42575667, 43534858, 44542354, 45674442, 46698369, 47889085, 49147934, 50460788, 51988772, 53559210, 55237961, 57107377, 59141212, 61336149, 63711019, 66304730, 69159994]
3407F9159994L150420L453983L756849M161259M537523M906808N409881N940552
3399A04477269O461521O894153P457187Q003312Q321837Q591859Q855196Q864831
3391A67927165Q706518Q243917P723849P164696O515227O197533N892969N673800
3383B24045674N623351N619206N484803N186737M640596L820189K659627J472663
3375B58552846O1484j297141k485608l567186m454933n094724n597829n995138
3367B30121771o251236o508110o701462o847957o968912p089312p396642p578057
3359A74780083p657056p886969p928672p914548p877378p683900p202170o938573
3351A13690817o461931o008129n623080n334654m786919m499155m113830l724144
$$ y = [69159994, 72310414, 75764397, 79521246, 83682505, 88220028, 93126836, 98536717, 104477269, 110938790, 117832943, 125290130, 133293442, 141615279, 150207138, 159062334, 167927165, 176633683, 184877600, 192601449, 199766145, 206281372, 212478905, 218371874, 224045674, 229669025, 235288231, 240773034, 245959771, 250600367, 254420556, 257080183, 258552846, 258614330, 257317189, 254831581, 251264395, 246809462, 241714738, 236116909, 230121771, 223870535, 217362425, 210660963, 203813006, 196844094, 189754782, 182358140, 174780083, 167123027, 159236058, 151307386, 143392838, 135515460, 127831560, 120629390, 113690817, 107228886, 101220757, 95597677, 90263023, 85476104, 80976949, 76863119, 73138975]
3343G3138975l379963l078621k789630k578394k366916k134053k015521j804531
3335E2991346j667116j526493j520733j318275j188324j228715j232300j174418
3327D2134972j100898r97771j058153r41985r62234r04081p78447p65852p90165
3318C3835386q45083p97744p62444q05757q09423q44511q22342q12705q17551
3309B6517826q09040p69462p94733p56226p43732o34749o28913o55037n10506
3300B0215428n64368n77371n98703n84760n46656m92564n11310m51035m70856
3291A5417805m02969m04293k92438l54936l51826l66941k29386k63545l40813
3282A2410658k59073j84873k34818k90387j77648j65020k00652k47552j91139
$$ y = [73138975, 69759012, 66680391, 63890761, 61312367, 58945451, 56811398, 54795877, 52991346, 51324230, 49797737, 48277004, 46958729, 45770405, 44541690, 43309390, 42134972, 41034074, 40036303, 38978150, 38036165, 37073931, 36169850, 35391403, 34625551, 33835386, 32990303, 32192559, 31430115, 30624358, 29814935, 28970424, 28148082, 27335377, 26517826, 25708786, 24939324, 24144591, 23388365, 22644633, 22009884, 21380971, 20725934, 20215428, 19651060, 19073689, 18474986, 17890226, 17343570, 16851006, 16339696, 15888661, 15417805, 15014836, 14610543, 14318105, 13963169, 13611343, 13244402, 13015016, 12751471, 12410658, 12151585, 11966712, 11731894, 11441507, 11263859, 11098839, 10898187, 10650635, 10459496]
3273A0459496k30620k51625k70314q4589j93798j89207k14736k57880j57924k05354
3263H403449q5882j60955j46091j69935j97909j67105k77771j65251q3992j03539
3253F845019j42558r7047j67843j83565j52379r718p265o6600j52994j80910j02103
3242E582037j06112j15525n2674j18377n0166k2420m8019j12789p3915r4031q2214
3231D705795j135l8101j37536p1963j12013n2870p2176p2554p8577o9132k7110
3220C972628k9476p1806j29252p1979M133m3278r2444k5064n2003k1136Q5515
3209C525838j02365j16803M5331n185n6946q4798m8618o3267J01650n8993j70998
3198B964846m0920M2823j46600k9038o1616l4074j335p8213m0999p0702j03132
$$ y = [10459496, 10228876, 9977251, 9706937, 9622348, 9428550, 9239343, 9024607, 8766727, 8608803, 8403449, 8317567, 8156612, 8010521, 7840586, 7642677, 7475572, 7197801, 7032550, 6948558, 6845019, 6702461, 6605414, 6437571, 6254006, 6101627, 6091909, 6084644, 6018044, 5865050, 5684140, 5582037, 5475925, 5360400, 5307726, 5189349, 5139183, 5116763, 5068744, 4955955, 4882040, 4788009, 4705795, 4704660, 4666559, 4529023, 4457060, 4345047, 4292177, 4220001, 4147447, 4068870, 3999738, 3972628, 3943152, 3871346, 3742094, 3670115, 3674248, 3630970, 3538526, 3513462, 3461459, 3440323, 3525838, 3423473, 3306670, 3352001, 3346816, 3289870, 3205072, 3156454, 3093187, 3194837, 3135844, 2964846, 2923926, 2966749, 2820149, 2791111, 2729495, 2695421, 2694086, 2615873, 2574874, 2504172, 2401040]
3187B401040l5237p2311n7992m0167L834K6066K5364k4367p2051l4531k1210m8605
3175B049833j0859Q32k9017j0907p2215m6793R108o741M5676l8895o6302m1794
3163A781926q675L7176o2657L0217K3005o232m4253K9634j4730j4527N3777l3685
3151A770976o200r0075k4O0197K1609J2804r3063K9523J6383M5194k7139m6595
3139A693590p3898l9532K0351o641L951k2068L7096l1057j4873J545l1155n4716
3127A482593n391L0993n2157L8528P6035k5016m1546o7229J08755N3793j7331
3116A582027N956l2898Q039M7881k3053K4402P3909n7773n2112M1104J22391P7385
3104A817258k5562J3362M1914P8377Q3643M263R0835l8842J9014N8952j7523Q8137
$$ y = [2401040, 2365803, 2293492, 2235500, 2195333, 2199167, 2225233, 2250597, 2226230, 2154179, 2119648, 2098438, 2049833, 2038974, 2039806, 2010789, 1999882, 1927667, 1880874, 1889982, 1883241, 1928917, 1890022, 1823720, 1781926, 1773251, 1810427, 1747770, 1777987, 1800992, 1794760, 1750507, 1780141, 1765411, 1750884, 1804661, 1770976, 1764776, 1674701, 1674677, 1734874, 1756483, 1769287, 1676224, 1705747, 1722130, 1767324, 1740185, 1693590, 1619692, 1580160, 1600511, 1593870, 1597821, 1575753, 1612849, 1581792, 1566919, 1568464, 1537309, 1482593, 1477202, 1508195, 1456038, 1494566, 1570601, 1545585, 1504039, 1436810, 1545565, 1599358, 1582027, 1587983, 1555085, 1563124, 1611005, 1587952, 1612354, 1686263, 1628490, 1576378, 1617482, 1739873, 1817258, 1791696, 1805058, 1846972, 1925349, 2008992, 2013255, 2104090, 2065248, 2084262, 2143214, 2125691, 2213828]
3092B213828o6439l1352M5403O2651P7754l7596m0268l2816l3853J4363l7702
3081B133973k1981j10896K4276j1206n2853l7756q1320J3692k3619J7976m6535
3070A803751o3010M7633o9647p4818l8756m1116J713j06543n3294k8722P569m0229
3058A344531k1291l4331n19m2078L4256k5333o1165L4254o5030m2587l2797o3217
3046A024693K3380m932R7417p5221l6903L8328N291p215m8393j5144M2028M0484
3034A083813o8851k3419L1736N9211N391n4135J709L6838m3234O7969l5591n0414
3022A011023M2116p0383J2818P3891j1464L6405J381l1650p090K8504P5378K0901
3010A181830m7527P7295l8272k4554L4028K2587K0942M5662K5405J23075k5748
$$ y = [2213828, 2147389, 2116037, 2161440, 2224091, 2301845, 2264249, 2223981, 2191165, 2157312, 2171675, 2133973, 2111992, 2001096, 2025372, 2014166, 1961313, 1923557, 1842237, 1855929, 1832310, 1850286, 1803751, 1740741, 1788374, 1718727, 1643909, 1605153, 1564037, 1565750, 1459207, 1405913, 1377191, 1384760, 1344531, 1323240, 1288909, 1288390, 1246312, 1280568, 1255235, 1194070, 1228324, 1163294, 1120707, 1087910, 1024693, 1048073, 1043141, 1140558, 1065337, 1028434, 1066762, 1072053, 1064838, 1016445, 1001301, 1043329, 1083813, 1014962, 991543, 1023279, 1082490, 1087881, 1033746, 1035455, 1072293, 1029059, 1097028, 1061437, 1011023, 1053139, 982756, 995574, 1069465, 1058001, 1094406, 1095787, 1064137, 1057047, 1085551, 1160929, 1181830, 1134303, 1211598, 1173326, 1148772, 1182800, 1205387, 1226329, 1271991, 1297396, 1420471, 1394723]
2999A394723m1589J3918N3671N255N9365K3683o3101r7700J483l3286p1865l4076
2987A210481m1575o0268p3261r16m2436K4483k3311j9860l4287M8406n2883m237
2975I30336k1203O7680n5965o2174J2101R2663O3752m4935M8639K3215p31J03124
2963A156502K3208M0381J49048M1608M8141J22833J02310J47241P4523J87370
2953B093165K37071J38063q8613j82953k12417k53808j76572j00579n9700j5217
2943A378440n0448l0568n6801k2001n7959n6649P4248J0861N201j3792K1600P3365
2931A275497K18559Q2624J01022J58187J14688J80236J09855j9857j18080j95669
2921A907062k49409j59155r5809q0488j63506l1511n6544j30739p2686p1981n3591
$$ y = [1394723, 1353134, 1367052, 1420723, 1425978, 1485343, 1509026, 1445925, 1348225, 1349708, 1316422, 1244557, 1210481, 1168906, 1108638, 1035377, 1034461, 992025, 1016508, 993197, 973337, 939050, 987456, 934573, 930336, 909133, 976813, 920848, 858674, 870775, 963438, 1027190, 982255, 1030894, 1054109, 1053378, 1156502, 1179710, 1220091, 1369139, 1410747, 1458888, 1581721, 1684031, 1831272, 1905795, 2093165, 2330236, 2468299, 2379686, 2196733, 1984316, 1730508, 1553936, 1453357, 1393657, 1378440, 1327992, 1297424, 1240623, 1218622, 1160663, 1104014, 1178262, 1189123, 1194324, 1180532, 1202132, 1275497, 1494056, 1576680, 1677702, 1835889, 1950577, 2130813, 2240668, 2220811, 2102731, 1907062, 1657653, 1498498, 1402689, 1322201, 1158695, 1127184, 1070640, 939901, 867215, 795234, 741643]
2910G41643m5328K3957l4829l9521k4975k3680m6544J1177p7676O7963L4952k6848
2898E60291j7534L8492o1962p1473J2738O6789j5422j9901J2269N66q4941J3712
2886D33624l60j9034q805M6589J7983k6260L3124l7343j1257l0778m5666n2687
2874B99130M2134k8845m7157M0447M5128n9248K2132j4536J756J8718N9112n8202
2862C20569m6761j2157k4617p223L2345j659l1271P126q2947O5600Q8200l5515
2850B71690j13589L3774J4171L7100j5666K6464p9191M2161J9945n7447N2371
2839B31783m0864m4862M0812m718m740J6157O7688k8624m7196J6235o5774K2023
2827A57920o4552N7709J167j8225J8419m5239k9766k0270N6272M9059j4117n809
$$ y = [741643, 696315, 720272, 685443, 645922, 620947, 597267, 550723, 561900, 484224, 552187, 587139, 560291, 542757, 581249, 519287, 447814, 460552, 527341, 511919, 492018, 504287, 504853, 419912, 433624, 433264, 414230, 405425, 452014, 469997, 443737, 476861, 439518, 428261, 397483, 351817, 299130, 341264, 312419, 265262, 305709, 350837, 291589, 313721, 299185, 300941, 319659, 378771, 320569, 273808, 261651, 237034, 229811, 262156, 260497, 229226, 236352, 153405, 219005, 307205, 271690, 158101, 191875, 206046, 243146, 227480, 253944, 174753, 216914, 236859, 179412, 231783, 190919, 146057, 186869, 182151, 177411, 193568, 261256, 232632, 185436, 201671, 135897, 157920, 93368, 151077, 152244, 134019, 152438, 107199, 77433, 57163, 113435, 162494, 148377, 142568]
2815A42568k1210M8804j4702N6333n239M4055k5998p7783j5106n4295L360O6352
2803A47139k3572k4497q3892j4793J19969k5385o796Q9683k5233J010m9079J2365
2791A16919n2640r907M9675k1089K871K1645j1014p4471Q0566L4393k6834L7887
2779A48001l8138L173j9088m8463M2741M4524L575m9156L1749K9869l2500o8959
2767D7328j6911N4911J1629k838k2731K1514J9296L9359L038o4757n79k2524m0272
2754B6463r950Q5992K2712K0866J5713p0115K6737l1237L7225N4139L3205q1967
2742A29783n3285O9031k6739r493N95l5671q1433M9153J05639n548k4959k2163
2730I4910j4134J5865L6385K705j923K5668m8742m0888o679N1632n4990N455R8220
$$ y = [142568, 121358, 170162, 155460, 211793, 206554, 250609, 224611, 146828, 131722, 77427, 80787, 147139, 123567, 99070, 15178, 385, 120354, 94969, 88173, 177856, 152623, 153633, 104554, 116919, 64279, 54372, 104047, 82958, 85829, 107474, 96460, 21989, 102555, 136948, 110114, 148001, 109863, 113036, 93948, 45485, 88226, 132750, 136325, 87169, 118918, 148787, 116287, 47328, 30417, 85328, 96957, 94119, 71388, 92902, 112198, 151557, 154595, 89838, 89259, 66735, 26463, 16513, 102505, 125217, 146083, 161796, 91681, 118418, 87181, 124406, 178545, 211750, 129783, 76498, 145529, 118790, 109297, 109892, 74221, -7212, 41941, 147580, 142032, 117073, 94910, 80776, 96641, 133026, 135731, 133808, 159476, 110734, 69846, 63167, 114799, 59809, 65264, 163484]
2717A63484m0167r3563M8449o6197L0829k747M5870N2927n0902k8208L1987m4878
2705D6884R38N9635m812p5845j2790N3965L3785k4864M5236j5509q6012L7448
2693E8059P1570L2359K6110M4943k5961m2716o4829k6570J09785l9152M0701K8318
2681B12617m2303K1077l5425R374l9137M9257m0823l7546N4699m005n297j18M3385
2668A85755N6009n2580j0844L3223k5870k9059M2665O5457M484K4885p9030J8096
2656B33191M9228r2862k373r4741P5260k1802p4867J5954P0373K904l260l3273
2644A23732J9135O4572P65n6172k3717l0363O6745l3751n107N3155o8760P1218
2632A81452L5911m3862r3760L0600K4750j4753k6311K6087K6394L4582N888n3281
$$ y = [163484, 123317, 29754, 78203, 12006, 42835, 40088, 85958, 138885, 87983, 59775, 91762, 46884, 47822, 107457, 102645, 26800, 14010, 67975, 101760, 76896, 122132, 106623, 20611, 58059, 129629, 161988, 188098, 233041, 207080, 164364, 99535, 72965, 182750, 143598, 184299, 212617, 170314, 191391, 155966, 165340, 126203, 175460, 134637, 97091, 151790, 147785, 142488, 142370, 185755, 241764, 189184, 178340, 211563, 185693, 156634, 199299, 264756, 269240, 294125, 215095, 233191, 282419, 189557, 187184, 92443, 167703, 145901, 71034, 86988, 157361, 160265, 157005, 123732, 142867, 207439, 208204, 152032, 128315, 97952, 164697, 130946, 125839, 178994, 110234, 181452, 217363, 173501, 79741, 110341, 135091, 120338, 94027, 120114, 146508, 181090, 186978, 133697]
2620A33697O2508J6683k7123J3576q0744l6624q611N8064N7786q7227n6477m2166
2608C342P7334M1997l7702m8919l0569J3678j5171L4499M1782K695j452m2254
2596C9260n5915q0724j220J05939O2760l8242m3339L9487O8643n936p1443r116
2584A0154L0601k8816J6526j6348m0205J7960j4096L242L2832M0549r5095l629
2572d6325P4327K6593N4039L8049l9530J8562l9276o347o0164K4279K9925m3597
2560C0535J4006l3459M6371Q312o0823p7350P4596K5212n5608k1045J6761L8102
2548E610Q0346M5471M1130n8693q8434k7420n2849K3828N0003J1581k2994P364
2536A4943J038N816J2743k4873K4096p8402K5377J7914j2961J8410J24066n7788
$$ y = [133697, 196205, 212888, 185765, 199341, 118597, 81973, 73362, 131426, 189212, 101985, 45508, 3342, 80676, 122673, 84971, 36052, 5483, 19161, 3990, 38489, 80271, 82966, 81514, 39260, -16655, -97379, -98599, 7340, 70100, 31858, -11481, 28006, 96649, 90713, 19270, 10154, 40755, 11939, 28465, 12117, -28088, -10128, -24224, -20982, 11850, 52399, -42696, -46325, 28002, 54595, 108634, 146683, 107153, 125715, 86439, 80092, 19928, 44207, 74132, 30535, 44541, 11082, 57453, 65765, 4942, -72408, 2188, 27400, -28208, -49253, -32492, 5610, 85956, 131427, 172557, 113864, 25430, -1990, -54839, -31011, 18992, 30573, 7579, 14943, 15981, 21797, 34540, 9667, 33763, -44639, -19262, -1348, -14309, 4101, 128167, 70379]
2524G0379r7601k8424m8105L9963j3741O6455l8257P3326O2800o4346m9088Q1977
2512E5338R890o9562m2572R780P3183M5739o8362o601q787p436k9462N178K668
2499c1006J3809J722o2486N0227L3001r019j9476j4372L0680M0904O3887m2167
2487E5704n7030Q568m6463J0139l1054P1672j3380r555J5068J2483J6368J4940
2475D7460J2325j0318R719k9537r3421l4265J10037K523M0336o7892n9818O5654
2463g197L2588l7597L0429K0650K7981K2108p4396o5773J4547J768K3496j8960
2451c0356k1011m755j3067l1958M447R3402M4563j5310j8240m9863k5317m9662
2439a17127M4625K6064k7935J12023r536J1153L1087j3145n1k5426j6712m2612
$$ y = [70379, -27222, -55646, -103751, -63788, -77529, -11074, -49331, 23995, 86795, 22449, -26639, 55338, 65228, -4334, -46906, -37126, 36057, 81796, 13434, 6833, -1954, -9390, -38852, -33674, -31006, -17197, -15475, -77961, -27734, 5267, -3752, -23228, -37600, -6920, 33984, 97871, 55704, -1326, 7242, -39221, -29082, -60136, 11536, -1844, -11399, 3669, 16152, 32520, 47460, 59785, 49467, 59186, 29649, -63772, -98037, 12000, 14523, 54859, -13033, -72851, -7197, 25391, -12206, 18223, 38873, 66854, 88962, 14566, -51207, -36660, -34892, -11396, -30356, -51367, -56122, -69189, -101147, -96700, -3298, 41265, 25955, 7715, -42148, -67465, -117127, -72502, -46438, -74373, 37650, 28114, 39267, 70354, 57209, 57158, 31732, 15020, -27592]
2427b7592p9750J11964L0330l1169p5390l286L5446j2289Q2795l1954m2051N3353
2415A0407j5789L4732n199l9555n3851O4271L694L9486L5395r5217M7136M0150
2403F5660n3344l2579M0829k3673L624p711j9948l410L1655J4803l6325J1129
2391i290J8260k6538o3194JJ4387R8907L5549m5969j2279n5310O7343n250n5470
2378c8853k6097K7900K9852O1589k8471l8267p3765p855L5358J7861L3800k1380
2366b8328m090L409n930n545O384k9043J6597L7834J0467o6624J0423k5547R766
2353g0227j3686j6497O125O8100j542R784L855l2415N5870J9516M0995m5157n3767
2340b9046O208j1792K9336J4181m9351K8207M9362m0025o8091L580J910L2479
$$ y = [-27592, -107342, 4622, 34952, 3783, -71607, -74893, -39447, -51736, 31059, -895, -42946, 10407, -5382, 29350, 24151, -15404, -69255, -4984, -1290, 38196, 73591, -21626, 25510, 65660, 12316, -20263, 20566, -3107, 517, -7194, -27142, -30552, 1103, 15906, -20419, -9290, 8970, -17568, -80762, -80761, -66374, 32533, 68082, 22113, 9834, -45476, 21867, 16617, -38853, -64950, -37050, -7198, 54391, 25920, -12347, -86112, -93967, -58609, -40748, -6948, -28328, -32418, -29009, -34939, -40484, -34100, -63143, -46546, -8712, 1755, -64869, -54446, -79993, -70227, -83913, -100410, -94285, -26185, -27727, -17943, -14088, -46503, 9367, 28883, 69878, 24721, -29046, -22838, -34630, -5294, 8887, -40464, -12257, 37105, -2920, -71011, -67431, -65521, -33042]
2328c3042J4937K7744N1581n4646n8482K1412J05046k0833m2237J7910L3364K628
2316F5382j00496m5505M0681K0351J346k2078k7627J14094j215q6315p6157N006
2304a12533Q3170k4378J3840N6046k97k1981k6291l0068L4255r774o682K1488
2292b3205p1308N598N0300k9810P760J7925L8118P1877J2982m1894o7462j6119
2280d5238K0320k4352k2137l4240n102P1035N5902P30o9135O809K48j6343j7988
2267g9491j17k8841M6832n5936M7546O1608K6476j0810J201M2088o9614l4229
2255e3287l6453k32m9678O0160M2296k4632k0949M3660N5351J4476l4401o5676
2243f9365l158R2335J9384J3929n6308J3387l4935J9935o380k3318M6292p295
$$ y = [-33042, -18105, 9639, 61220, 6574, -51908, -30496, 74550, 53717, 11480, 29390, 62754, 65382, -35114, -80619, -39938, -19587, -18241, -40319, -67946, 46148, 44933, -41382, -117539, -112533, -29363, -53741, -39901, 16145, 15848, -6133, -32424, -62492, -28237, -38011, -44693, -23205, -94513, -88915, -38615, -68425, -60665, -42740, -4622, 67255, 80237, 38343, -29119, -45238, -24918, -49270, -71407, -105647, -110749, -39714, 16188, 16918, -52217, -45408, -45160, -61503, -79491, -79608, -108449, -61617, -117553, -70007, -8399, 18077, 7267, 8468, 50556, -19058, -53287, -89740, -89972, -139650, -79490, -37194, -61826, -82775, -39115, 16236, 30712, -3689, -69365, -72523, 19812, 39196, 53125, -3183, 10204, -24731, -4796, -11176, -34494, 11798, 4503]
2231D503p399M2447R91o6222J1891j6468Q1227j7958n634l5361O3198n115p2766
2218b2666j1037N8368k3201r3782Q8863l1647l4962j0349l8210M0432k1914O7397
2206c2708M6208j9431K8484k6168o587M010J02810n0481l7020L6853j06834L1796
2194b9068M9440l3208K3591m0124j5280O9343k2133l6389Q179L4386J5107n0424
2182b6580m7494K2429R3021m300m6118n7193k0480J8610m779J1475n302j7085
2170h3796k4541P2732R2092j288l8260o7960l6605L2469k9015O6679K0711J1605
2158A4823K3023q82R724K1720k8902l0755j7692K4015k8709m3765N2904p2031
2146g6527K5241O1728n198L2473K8674n2092L8881n7876k7939L0825j39J4460
$$ y = [4503, -2896, 39551, 40542, -25680, -13789, -30257, 50970, 33012, 27378, -7983, 55215, 50100, -22666, -33703, 24665, 1464, -92318, -3455, -35102, -70064, -80413, -118623, -78191, -100105, -32708, 13500, -5931, 22553, -3615, -10202, -6192, 96618, 46137, 9117, 45970, -60864, -29068, 20372, -12836, 10755, -29369, -44649, 24694, 2561, -33828, -25649, 8737, 23844, -26580, -74074, -51645, 41376, 37076, -9042, -66235, -86715, -68105, -72884, -61409, -66711, -83796, -108337, -35605, 56487, 55199, 16939, -51021, -87626, -55157, -84172, -17493, 3218, 14823, 37846, 36964, 46688, 68408, 39506, 8751, -8941, 15074, -13635, -57400, -4496, -76527, -51286, 10442, 5244, 37717, 66391, 14299, 53180, -4696, -32635, -1810, -1949, 12511]
2134A2511n9413L4399N1892n4004L5117N6084n5586l1181l1554j2942L1119J7320
2122f238Q0819J9084N90n3678o2958L356K5689K9142j312K6644K9602m417o1672
2109B4651J7683M0406p7011m0174j6683J3578k3699J4434K5518L2623n737l3769
2097b8180J9038P2177q9k6596q808J8127k5004k6309n297P405O2662R752L1087
2084I9965l0104m3727P169P381L7371N2008k0595j5556m3073K5519k514l5240
2072C8604r775N215j3430L1640j7270k6693m0124N1237R885j7152j5357K7284
2060B4064L7429m8168o601J1951l8237n191j7331L14O5215P7071K2575l4731o5254
2047B3106m3311M154j8845L3033N7578M0340n753l0075K0701m6233K8962P3448
$$ y = [12511, -46902, -12503, 39389, -14615, 20502, 76586, 21000, -10181, -41735, -54677, -23558, -6238, 74581, 93665, 94255, 40577, -22381, -19025, 6664, 35806, 34494, 61138, 90740, 86323, 24651, 42334, 82740, 5729, -34445, -51128, -37550, -61249, -46815, -21297, 11326, 5589, -28180, -9142, 63035, 62946, 36350, 27542, 45669, 20665, -5644, -10941, -3536, 59126, 68878, 99965, 69861, 26134, 33303, 40684, 78055, 130063, 109468, 93912, 50839, 76358, 73844, 38604, 28829, 34044, 20614, 52254, 34984, 8291, -31833, 19404, 29289, 12137, -3220, 24064, 61493, 13325, 6724, 18675, -19562, -24753, -42084, -41770, 23445, 100516, 123091, 88360, 23106, -20205, -16051, -34896, -1863, 55715, 96055, 90302, 60227, 80928, 34695, 63657, 137105]
2035A37105m3944o610l784l4913J3240M6319j03864m1625j4698O8760j9852J3763
2023I897K361p801O3856j5874n6754k5541M2393o649K3993M799l4481R6074L6825
2010A33098j06257o0296k427M6885L8261K4592o7507K457O734n769O037N9876
1998G5684n563k9861k0268J3124K98l5964J03824K8563N1758J6904j7178j4988
1986A66333P330J66p4386l1596N1200L1982n3084r0862L1645j8610O1989k293
1974G9814L1860L1585n1269O597R530K4387l0334J9511O4155o568n1851J2546
1962A39963L0914K5042Q716M9787k8453n2422o6513N1626p655l0987m937N9594
1950A74675P2200j4519o5786M9191L241m9211L6768N6387k1175j2270L4035R7437
$$ y = [137105, 93161, 86551, 82767, 47854, 61094, 107413, 3549, -38076, -52774, 15986, -3866, 9897, 12258, 4457, 68313, 52439, -4315, -29856, 12537, 5888, 29881, 34680, 199, 96273, 133098, 26841, -33455, -35882, 11003, 49264, 73856, 6349, 8806, 15540, 9771, 15808, 75684, 70121, 40260, 19992, 33116, 33414, -2550, 101274, 129837, 181595, 198499, 181321, 166333, 173663, 173829, 99443, 67847, 119047, 151029, 97945, 7083, 38728, 20118, 82107, 79814, 111674, 143259, 91990, 98587, 108117, 132504, 102170, 121681, 185836, 179268, 127417, 139963, 170877, 195919, 204635, 254422, 225969, 173547, 107034, 158660, 151005, 120018, 115081, 174675, 246875, 232356, 166570, 215761, 219002, 169791, 206559, 262946, 241771, 229501, 263536, 360973]
1938C60973j0200J4471Q1525r9743L7188L3053k3806j8340l6206J14535N6615
1927E10065l8744N9186m782j5239M071P9094N6977J028N193m164M4377j449n891
1914F89722m3569J0705Q5510l888J13034K8259n8928R5714Q6921l0944M6041L1469
1902A050046O992N5228N2613N9869M4552M6825O5797P2669M3578L7573O3871N7182
1890A656795J59041k2228R7125J76613L1761N9150R5913J39879R7935J02089K37542
1879B831615J14562J68374K87615L05352L60305K79828L40507L70660M38134N48660
1869F045612O29454P83612R29101Q92719J174130J316845J530725J947750K248901
1860A7498849J786432M26903j105803k279262k580333k061759j433991j012203
$$ y = [360973, 350773, 365244, 446769, 347026, 384214, 417267, 393461, 375121, 338915, 453450, 510065, 471321, 530507, 525725, 510486, 514557, 593651, 650628, 651656, 656849, 652685, 697062, 695613, 689722, 646153, 656858, 742368, 738480, 851514, 879773, 820845, 916559, 1003480, 972536, 1018577, 1050046, 1057038, 1112266, 1164879, 1224748, 1269300, 1316125, 1381922, 1454591, 1498169, 1535742, 1599613, 1656795, 1815836, 1793608, 1890733, 2067346, 2099107, 2158257, 2254170, 2394049, 2491984, 2594073, 2831615, 2946177, 3114551, 3402166, 3707518, 4067823, 4347651, 4688158, 5058818, 5496952, 6045612, 6675066, 7458678, 8387779, 9280498, 10454628, 11771473, 13302198, 15249948, 17498849, 19285281, 19712184, 18606381, 16327119, 13746786, 11685027, 10251036, 9238833]
1852I238833p31409o93026p80450q31083p98512n55830m49171l76502j78524k63222
1842C581104k80684k29731j96087k04801j29982r7729p0667j77793j84951j44198
1832A864481m0491l5686j77269n4501j6021m4438r9549j16639j7265n1187j86391
1821A025044o400M7399o2715j19923m3678k2030K6329O298k5851J750k4575o5536
1809G36112k2079j6721k8052M0231j18531n332m0764P687L0743o0497L4335l7584
1797E19548k0438O9978j5284o4457J0610m8590n2603l4574J9134j806P637J6048
1785D05203p702l5046l8562L209j3027l7401J5115l7083P708N2871N742m3210
1773B77817l4248o7178j9273P6534R910k9248O906K2141J424J5486N7766m7120
$$ y = [9238833, 8507424, 7814398, 7033948, 6202865, 5404353, 4848523, 4399352, 4022850, 3844326, 3581104, 3300420, 3070689, 2874602, 2669801, 2539819, 2442090, 2371423, 2193630, 2008679, 1864481, 1823990, 1788304, 1611035, 1556534, 1540513, 1496075, 1396526, 1279887, 1262622, 1211435, 1025044, 1018644, 1066043, 1003328, 883405, 839727, 817697, 844026, 850324, 824473, 826223, 801648, 736112, 714033, 697312, 669260, 709491, 590960, 585628, 544864, 552551, 583294, 522797, 557132, 519548, 499110, 569088, 553804, 489347, 499957, 451367, 398764, 364190, 383324, 381518, 389155, 405203, 397501, 362455, 323893, 327102, 314075, 276674, 291789, 254706, 262414, 315285, 321027, 277817, 243569, 176391, 157118, 233652, 243562, 214314, 221220, 243361, 244785, 260271, 318037, 270917]
1761B70917n1350N7956r509k6817k1104J4270n0343P658n1345l373N6243k9194
1749A64009L4509n2850l729N2100l4376l6562J2533K0332L7076q0825o42O4487
1737A76062n5547q5867K652J3743N7784N28l7359m9586J0877n8952L5879Q6605
1725I6819j9052K1203o80R240l9807L4593k8540K0726M9679K1093l2098J136j0691
1712A23621l6424j3446K4963j3346j0790L0152n865k4112N8745m5261j6467J4653
1700H6423K4313n813p1969r1501L5726J3860K6392J3634m2720M4396J5980J8285
1688F7006j3064q3536J5027N0656j2879L6905J664j9452r19k2111K3414J7873
1676F0584k888K5904J898L927l5510m9554J7714l5745K2840K980M2582p851k5466
$$ y = [270917, 219567, 277523, 268014, 241197, 220093, 234363, 184020, 191678, 140333, 136960, 193203, 164009, 198518, 145668, 141939, 194039, 159663, 123101, 135634, 155966, 193042, 112217, 111575, 176062, 120515, 34648, 37300, 51043, 108827, 109355, 71996, 22410, 33287, -25665, 10214, 96819, 77767, 98970, 98290, 107530, 67723, 102316, 73776, 94502, 144181, 165274, 133176, 134312, 123621, 87197, 73751, 98714, 85368, 74578, 104730, 98865, 74753, 133498, 88237, 71770, 86423, 110736, 104923, 32954, -58547, -22821, -8961, 17431, 31065, -11655, 32741, 48721, 67006, 53942, -29594, -14567, 36089, 23210, 60115, 61779, 42327, 41408, 19297, 42711, 60584, 57696, 83600, 85498, 89425, 53915, 4361, 22075, -13670, 9170, 12150, 54732, 46881, 21415]
1663B1415o1467M3694J32663n5082n823j3469j6784r6689K1321J5598K9068j2706
1651A739k2323q4405L6251P5206k5245l240Q849K1603j3210N684k8408N3182q63
1638B4820m3294M8517m7507K1766o0486m2169N3005L3457r366N8390M412o0919
1626a9374L8674m9959J8216R890j9991j5064K1724P4201l6712M3156o4327Q333
1614H767N1941k8464j0445J5882l1391j1945M4567J8853l6681M1398J6155o6625
1602A2012L5257L9129N986l5372p397M288K1966j4158N397K3984m1792j1629J43636
1589A81307r1134J2729n1143p0512r468m402K1728Q437K0916o735j0989J2944
1577A3678J3754j1152m712l4820l192q8970Q6952J31756q7705k9804M7714O2750
$$ y = [21415, -40052, 3642, 136305, 81223, 75400, 61931, 45147, -51542, -30221, -14623, 14445, 1739, -20584, -104989, -68738, 6468, -18777, -22017, -13168, 8435, -4775, 909, -27499, 25683, 24820, -18474, 30043, -17464, 4302, -56184, -98353, -45348, -11891, -21257, 37133, 41545, -19374, 19300, -30659, -12443, -2553, -22544, -37608, -15884, 58317, 21605, 64761, 434, 8767, 60708, 32244, 21799, 37681, 6290, -5655, 38912, 57765, 21084, 62482, 78637, 12012, 47269, 86398, 92384, 57012, 49615, 53903, 75869, 61711, 67108, 91092, 49300, 37671, 181307, 90173, 102902, 51759, -18753, -28221, -32623, -10895, -2458, 18458, 11723, 734, 13678, 27432, 16280, 11568, -23252, -26444, -115414, -28462, 103294, 15589, -14215, 33499, 96249]
1565I6249R54q6574l9922P468m9895M3391r194L1056l2175l2802j0993M3330N6692
1552A7585o854n422k0430O8460O360l7107J0729M1727l4593o6360k0284J9119
1540b7070J5140K600j8651K7811k2254J00187k2479j189j6758q028J1615j7690
1528B3234m7778k3306o852M5054j4329L2524j3854j0538J8083n3484K0713n8m560
1515c5151J4697L852j1604O4434n2137n681N7995J390j2909j7362K1718L6297
1503F5539j2785p2481l1772r581N9442j2225j19879O0319P7651Q784j2647k216
1491a851n29P1484K7509p5223K0335K233n7914o5606K5630K8002l9918N0290L8999
1478B3441k3400L102j6451k3893O4268N701N686K3474m1429R573k5121l3029m6469
$$ y = [96249, 97203, 10629, -29293, -21825, -71720, -28329, -37523, -6467, -38642, -71444, -82437, -39107, 17585, 10731, 5309, -15121, 53339, 59699, 22592, 33321, 75048, 40455, -25905, -46189, -27070, -11930, -9330, -27981, -170, -22424, 77763, 55284, 54095, 37337, 29309, 40924, 23234, -24544, -47850, -54702, -9648, -23977, 8547, -5307, -15845, 2238, -51246, -30533, -30591, -35151, -20454, -16602, -28206, 36228, -15909, -21590, 36405, 37795, 24886, 7524, 29242, 65539, 52754, -19727, -51499, -61080, -1638, -13863, -133742, -73423, 4228, 13012, 365, -1851, -2380, 69104, 96613, 21390, 41725, 43958, -13956, -79562, -53932, -25930, -65848, -15558, 23441, 41, 3143, -13308, -37201, 27067, 32768, 38454, 61928, 20499, 30072, 4951, -28078, -74547]
1465g4547m484O5344p9349j0157O7561K1689j1830j3447K9404K5650m8902K0803
1453a2265m6545K4102j9097N0073K407k2086o96p6674Q9386P881K9950L9832p4528
1440h260l894j0945K8866J2033k4690N16j7321k8762M1736J3830R984q9641K5051
1427e1497n359J6773Q4488r715M518n6912q152l0646l9565N4093N2617o1507L0671
1414b0193J8395j3913N7277k4912l9381J0849n021J3718n283m4108l156M2992
1402a2736m3142O8576M4624m780l3589m7680J2213P1192p2659l4505M8143J3092
1390H749K3162n907m8428K1497M8282J5231o3181k9338M744l1731L3720n7215
1378h0415K5386J609k0210J44825J0923K8924q3240q114J4150l2129q446l1683
$$ y = [-74547, -79031, -13687, -93036, -103193, -35632, -13943, -25773, -39220, -9816, 15834, -33068, -12265, -58810, -34708, -53805, -3732, -1325, -23411, -24107, -100781, -11395, -3514, 26436, 66268, -8260, -12154, -23099, 5767, 17800, -6890, -6374, -23695, -52457, -10721, 3109, 13093, -76548, -51497, -56856, -40083, 44405, 34690, 39208, -17704, -25856, -56502, -96067, -41974, 10643, -50864, -20193, -1798, -15711, 41566, 16654, -22727, -11878, -16899, -3181, -8464, -52572, -55728, -12736, -55878, 12698, 57322, 52542, 18953, -28727, -16514, 54678, -17981, -52486, -4343, 8749, 31911, 26004, -22424, -927, 47355, 62586, -595, -29933, -25189, -56920, -23200, -80415, -55029, -53420, -73630, 71195, 82118, 111042, 27802, 19688, 33838, 1709, -6737, -38420]
1366c8420j4727j0371k7260J28729O4383n0860j549n3327M7728n3155p2976J12166
1354C0361k0458k6861p198J4404n276M4744J6774K047J6218n9944m6159N464P3801
1341C7917m267J7945J4169n9803o6464J13083J7112n1798l5692l4849K8429r935
1329c4153M092N6074l4315l3478l1248j9604M495J72866p561n2057n3331L1501
1317C281L55m8011l0829K3055L4721J3710J277m8858K6088l0927N1486j6352L2052
1304A1048n7603l931M2405o7950M1905K6054J3655q0834K5984L6977J2288L5369
1292C5367j4332l3152l0406j8832L0792L8786L7760l997J7155M072n1073n154
1280F986j69144O3746M8306l7447m3265P3617K0957j1367k1894l6449O8515j7049
$$ y = [-38420, -53147, -63518, -90778, 37951, 102334, 51474, 49925, -3402, 44326, -8829, -81805, 30361, 9903, -16958, -24156, -9752, -15028, 29716, 46490, 48537, 64755, 4811, -41348, -35884, 37917, 33650, 51595, 65764, 5961, -60503, 52580, 69692, 17894, -17798, -52647, -24218, -34153, -30061, 26013, -8302, -41780, -73028, -92632, -88137, 84729, 77168, 25111, -28220, 3281, 3636, -44375, -75204, -52149, -17428, -3718, -2441, -51299, -25211, -56138, -4652, -21004, 11048, -46555, -50486, -8081, -76031, -34126, -8072, 5583, -75251, -49267, -12290, -2, 35367, 21035, -12117, -42523, -61355, -30563, 8223, 45983, 41986, 59141, 63213, 12140, 6986, -162158, -98412, -50106, -87553, -130818, -57201, -36244, -47611, -69505, -105954, -37439, -54488]
1268e4488M5501K9673O7953r4493n4334L8457N6970l0122L50j0421j2250o6618
1256h3822n517J2613j4659J582P0509N0688p4655n0254M8717L3805O1724J7209
1244F7940j40980O8511R5596m7500o6545k516L0522j2029l334j2467l7608L7509
1232b2901o4293J8894p5096K8748P2825J4n855j9219r9K5712m9672j829J09735
1219A6964l3397R159K0667p7268k7422L8643K8776N9554o9549r0440P822J4764
1207a01727J344P7377M3440J9247j440l7949l2277J2654L8872m7206N5200O9130
1195I6665n1758k0372p8242l7890O8954M3531K7055r4332l1430k5025P9168J5026
1183h650m6864J2481J6023O7661R215K5459J0704J1887p3047J7851N1803j14098
$$ y = [-54488, -8987, 20686, 88639, -5854, -60188, -21731, 35239, 5117, 5467, -4954, -17204, -83822, -89339, -76726, -91385, -89803, -19294, 31394, -43261, -93515, -44798, -10993, 50731, 67940, -73040, -4529, 91067, 43567, -22978, -25494, 5028, -7001, -10335, -22802, -60410, -22901, -87194, -68300, -143396, -114648, -41823, -41809, -47664, -66883, -66982, -41270, -90942, -92771, 16964, -16433, -7274, 13393, -63875, -91297, -52654, -23878, 35676, -33873, -124313, -116491, -101727, -100383, -23006, 20434, 39681, 38241, 292, -31985, -19331, 19541, -27665, 27535, 96665, 44907, 24535, -53707, -91597, -22643, 20888, 47943, -46389, -77819, -102844, -23676, -8650, -55514, -43033, -27010, 40651, 49866, 75325, 86029, 97916, 24869, 42720, 94523, -19575]
1171a9575N608k1177l8937K772K7533K0581J4031j0297j5389M1701R259J7819
1159C3929l4591n3160O3867p771P5100k3243k0713m6639J29n196J5815L7906j3018
1146B2415k5506k5962N6957p8909k6520k2368L6457R2266K9056o3295r2720L2251
1134f5878R7277j7239j9399n856k8092n597O4739J0186o3588j6454l8155K2993
1122f5063P3031j0004J4922j09548j0503J13785p588o5186N4424Q768k0854J2611
1110a1205j4380j2946O7060J2285O042m5962l490J4342m0225j4178L5355K7221
1098A9919k6221L0050K8946n8740M2587n2128K8696k9597n2350j6037l980L1279
1086e7576K1667J3924L7961l2777j9k5050J8694P8998J609l4504j7360J4132o7159
$$ y = [-19575, -13967, -35144, -74081, -71309, -43776, -23195, -9164, -19461, -34850, 6851, 16110, 33929, -662, -53822, 10045, 2274, 77374, 54131, 33418, -13221, -13092, -18288, -2473, 35433, 22415, -3091, -29053, 27904, -51005, -77525, -99893, -63436, 28830, 57886, -5409, -98129, -65878, 31399, 14160, -5239, -11095, -39187, -44784, 19955, 30141, -33447, -49901, -88056, -65063, 7968, -2036, 12886, -96662, -107165, 6620, -968, -66154, -11730, -2962, -23816, -11205, -25585, -38531, 28529, 40814, 46856, 894, -2596, 11746, -28479, -42657, -7302, 19919, -6302, 23748, 52694, -6046, 36541, -15587, 13109, -16488, -68838, -84875, -88855, -57576, -35909, -21985, 15976, -16801, -16820, -41870, -23176, 55822, 57431, 22927, 5567, 19699, -47460]
1073d7460j9626K3457J13475Q485j2956q5463R598L0381J7484o2009j3259J3018
1061b4875K6706j0780l6387L5247Q4521K122q1300p7093L5385M1358n9593J7894
1049d6795K2335j1204n2305M333P0865l507n0672n0603P0743J28283m95k3920
1037E7058j453l8152o0392O238k5428K043J9542J3144N8819m7236R1456l8540
1025C7099Q455j4081O2825R699K1986j3529N8295o4278r5437N85K4205K6744l9202
1012B3366j9146p9703K8721L4361P786n4565j5162N9496M8852M3066j4313m6476
1000A6283j7880k8524O6527o6171K3485M7845l6415m0012K9641r107J2690l045
988d683L4745j9840J2671k5487o6306q5195Q2263O7571n1202M0896P8083p9455
$$ y = [-47460, -67086, -43629, 69846, 78331, 65375, -20088, -10490, 19891, 37375, -24634, -37893, -24875, 1831, -8949, -45336, -10089, 74432, 76554, -4746, -81839, -46454, -5096, -64689, -46795, -24460, -35664, -87969, -83636, -12771, -16278, -66950, -117553, -46810, 81473, 80978, 57058, 55605, 17453, -42939, -36701, -62129, -60086, -40544, -27400, 31419, -15817, 75639, 37099, 45554, 31473, 94298, 103997, 125983, 112454, 170749, 106471, 11034, 11619, 35824, 62568, 23366, 4220, -75483, -46762, -12401, -4615, -59180, -74342, -14846, 34006, 77072, 62759, 16283, -1597, -30121, 36406, -29765, -6280, 41565, 5150, -34862, -5221, -14328, -1638, -4683, 30062, 10222, 22893, -2594, -68900, -154095, -71832, -4261, -55463, -14567, 63516, -15939]
976a5939R00K4823l4294K1407N6715K0478k9335M0373j0384l7282o762j3231m9541
963c2072m453J8143N3899n4905r907n9068l2627J16785J3752k9967P134P06N9506
950D6926J153k8812p5319j6348N3662n5498k7666M2595J734J9688N548k040K2940
937a1437K7029K2531K861m5643j6632K9823o5567L7565m5149j6609M5481P195
925b8552J5036O573j8081n1484P725M9950j2380J6525P1404o5594O2376Q003j8142
912D3359l2410N556L1128m2834k7925l6579O1413J349j5401L7779k3278L9610
900D1767n4989M0523N770o9092P124J3144P9502j0816m7729k0106L7008L101J0500
887C5707J7786m8706l7348K3226r352J8756J5589K3004l78L1357j9927N019n8259
$$ y = [-15939, -15039, 9784, -24510, -3103, 53612, 74090, 44755, 85128, 74744, 37462, 30700, 17469, -32072, -36525, -18382, 35517, -19388, -29295, -88363, -120990, -4205, 9547, -20420, -13286, -12580, 46926, 48079, 19267, -56052, -72400, -18738, -74236, -101902, -59307, -57573, -37885, -32337, -34377, -11437, 15592, 38123, 40984, -4659, -21291, 8532, -57035, -19470, -64619, -81228, -35747, -28552, -13516, -6943, -25024, -76508, -68783, -18833, -31213, -14688, 56716, -8878, 53498, 61501, 43359, 10949, 16505, 47633, 4799, -23126, -59705, 1708, 3057, -12344, 25435, 2157, 41767, -13222, 27301, 33071, -36021, -28897, -15753, 63749, 52933, 5204, -14902, 22106, 25207, 35707, 53493, 4787, -32561, -9335, -18687, 69, 15658, 38662, 38284, 69641, 49714, 54733, -3526]
874c526q3556j8384P8239l2964K5210L0531J1817O7931p8348J9338O558l677m8726
861b9557k3786O6194k7518o3076j8308L1738P0683j555l7789k6856M3433L841
849a2556j1121j5217L7660J236K9121r5503M2666n735J2079P0127M4135l600o8574
836B4718k4465m434J2439k2210m4987J6617R9824l0902l8268J7725L6089J5203
824E7349l219m8275m4869J1758J18376J7483r670k6368r7592l3856q044K2823
812d4104M4888n2876J4897M9556j8709M1844J3352J6331k5281j5956k4069n877
800f004J18669n4388k4824J5353q218m6340j3840R090P558j5881J8270n6340K0024
787c6871K1897q714J9468n939J1821K4316m1902k7869L7114l1506r0108N0429
$$ y = [-3526, -87082, -105466, -27227, -60191, -34981, -4450, 7367, 75298, -3050, 16288, 22846, 19169, -29557, -53343, 12851, -14667, -77743, -96051, -64313, 6370, 4815, -32974, -59830, -16397, -12556, -23677, -38894, -1234, 2, 29123, -66380, -23714, -29449, -17370, 52757, 96892, 93292, 24718, 253, -4181, 8258, -13952, -58939, -42322, 57502, 26600, -11668, 6057, 42146, 57349, 54130, 5855, -39014, -27256, 91120, 108603, 98933, 72565, -25027, -58883, -66927, -44104, 784, -52092, -37195, 12361, -6348, 35496, 48848, 65179, 39898, 23942, -127, -6004, 112665, 58277, 33453, 48806, 40588, -5752, -19592, -10502, -2944, -18825, -555, -56895, -36871, -14974, -23688, -4220, -10159, 1662, 25978, -15924, -43793, -6679, -38185, -128293, -77864]
775g7864O1310J4427k5731J2028K1259l9490N9482n7017r861R8155J9388n4520
763B1566K3097n6112m0418M7132K2795l5331P0477K1624q0888o571L2544m1792
751b1877P1220M7686n3297j1771k1171l0918K0151J2006k7555K4223O0366R439
739G8502l1587m535k1798l3087Q6642o7746l5498N988j6107k807o232J1181J1631
726b5453p02k9172O3976k5604O026O3239o1227l5120L4939K1680k8080Q789L2769
713B6060m6376k2367J9067K2263k2080K9425k6951l9352K3202N8437P929l0381
701a124J6953L2306J9414n7363p1510j2504O4474O6377l2198j7093L37M7620k7269
688B8420j3668k4786k4618J0507L8455J8446K3708m1333n0939j1584M9365K1457
$$ y = [-77864, -16554, -2127, -27858, -15830, 5429, -34061, 25421, -31596, -41457, 56698, 76086, 21566, 44663, -11449, -51867, -4735, 18060, -17271, 53206, 74830, -6058, -12629, 19915, -21877, 49343, 97029, 43732, 31961, 10790, -20128, 23, 12029, -15526, 8697, 69063, 78502, 46915, 42380, 20582, -12505, 74137, 6391, -29107, -23119, -39226, -42033, -48265, -37084, -25453, -26155, -55327, 8649, -16955, -10929, 52310, -8917, -44037, -9098, 12582, -15498, -6709, 26060, -20316, -42683, -23616, -1353, -23433, 5992, -20959, -60311, -37109, 21328, 29257, -1124, 15829, 48135, 67549, 10186, -61324, -73828, -9354, 57023, 24825, 7732, 8069, 55689, 28420, 14752, -10034, -34652, -24145, 14310, 32756, 56464, 15131, -35808, -47392, 1973, 23430]
676B3430o2115M9138r5637o06N5596l6007M3538K8251k1457M9119O087l9121J8294
663A8510l4614p3737R098K3621N9182r093O8842k649p5452k4626k8531L1227P4762
650C6540Q4210p8685q3517M1186J7664J3863k8436m7531K8584l3726Q743j6144
638e7249M1643K7335o5105j6819J5129M2729K0507m6670m1395j1288L8134O8530
626A5481l2513j0045Q4343M1047k2266j7451k429k1080m8331j9224L8108L4125
614C9765J56N1118k8344m0727j0644n9787o219L4206N9403j773m7075l8136K530
601d5527K1910R196R1158n0235J9697P502r3759M7896l666J3107N0251J9215o0325
588B6420k4655l1635N1005q4499P393K8272R541o973J8739O5336J0857n2666n0300
$$ y = [23430, -38685, 10453, -85184, -85790, -30194, -66201, -22663, 5588, -15869, 33250, 39337, 216, 18510, -16104, -89841, -80743, -57122, 2060, -7033, 61809, 59160, -16292, -40918, -69449, -38222, 36540, 120750, 42065, -41452, -266, 17398, 31261, 2825, -44706, -16122, -49848, -41105, -57249, -15606, 11729, -53376, -70195, -55066, -12337, 8170, -38500, -79895, -91183, -53049, 15481, -17032, -27077, 57266, 98313, 76047, 58596, 56167, 35087, -13244, -32468, 5640, 39765, 39921, 91039, 62695, 21968, 11324, -48463, -54682, -20476, 38927, 37154, -9921, -48057, -45527, -23617, -14421, 76737, 26502, 46199, 53701, -40058, 7838, 4172, 17279, 67530, 86745, 26420, 1765, -29870, 21135, -63364, -55971, -27699, -18158, -25131, -6392, 58944, 69801, 17135, -33165]
575c3165O2278j2899n5721L6733j3746K1389p176J9064L836p8255K8445O3488
563C4271R0074n8363r1766k0297M446L7589L4183L6457m511n3134R9119l7456
551G0612l5565k2181n1188m0227N4627K852L4951j7818j9144J19214K2969p0769
539D8333m0924L2712L6967p2490J7901p300j0144N88k7315n61M7993o951l6303
526a7494M9934N9548p5868n8769J7559O6735l9401n4034R324q649M7786j3473
514a6802R473o1276K0069O759P2134j6464J4965k1517J6414J7033j4448l9622
502a3282o0258Q0926L3370O694o7575k2926k365m073m5319m4024Q5811M3017M690
489e314k526k6403L8461J4703M3029j6466l5979n6703J8984J8531p717J7777p283
$$ y = [-33165, 29113, 16214, -39507, -2774, -16520, 4869, -2307, 16757, 20593, -57662, -29217, 34271, 124345, 65982, -25784, -46081, -41635, -4046, 30137, 66594, 62083, 8949, 108068, 70612, 35047, 12866, -38322, -78549, -23922, -21070, 13881, -3937, -23081, 96133, 119102, 48333, 7409, 40121, 77088, 4598, 22499, 15199, 5055, 5643, -21672, -22233, 25760, 18809, -17494, 32440, 91988, 16120, -42649, -25090, 41645, 2244, -51790, -42466, -51115, -3329, -16802, -7329, -68605, -48536, -41777, 30357, 13893, 28858, 7341, 23755, 40788, 26340, -13282, -73540, 7386, 40756, 47450, -20125, -43051, -45416, -49489, -94808, -138832, -53021, -10004, -5314, -7840, -34243, 4218, 18921, 61950, 45484, 9505, -47198, -28214, -9683, -17400, 377, -6906]
476f906m940m1354M0434N9428p6611l4569l1322J69391m1524r8228O5619k4908
464b5490M4225q7457K9762L2534j0824m534J452n7798J1993K2760J7108O4917
452C8648l0979k0046O9253l8862j5121O3167L517o0237q8205J7461J36035J9599
440I4230q7409k6960N733J4451J42515q9742m8230K9597q403L3027k7617p1824
428d0632M6698L7040j3489m1972K9203k843o6598k4820N0257K4432J7592K3824
416C8692m3299o637j9649J8400J1475l2041M5064J8248m8343O4067K2949m4442
404B4484j0098j4044k6728K9614K7677K6959O2477l356m5428Q7048n770p7887
392G4948o6405K2025P2341J6260M348o3219j25397P3783R5898K5567m2586j2413
$$ y = [-6906, -11846, -53200, -12766, 46662, -29949, -64518, -95840, 73551, 32027, -66201, -582, -25490, 18735, -68722, -38960, -6426, -17250, -21784, -20332, -78130, -66137, -43377, -26269, 38648, 7669, -12377, 56876, 18014, 2893, 66060, 69577, 9340, -78865, -61404, 74631, 94230, 6821, -20139, -14406, 45, 142560, 52818, 4588, 34185, 25782, 58809, 31192, -40632, 6066, 43106, 29617, -12355, 16848, 14005, -52593, -77413, -27156, -2724, 14868, 38692, -4607, -11244, -30893, -12493, -1018, -33059, 12005, 30253, -18090, 45977, 68926, 24484, 14386, 342, -26386, 3228, 30905, 57864, 120341, 116985, 71557, 158605, 152835, 74948, 8543, 30568, 102909, 119169, 123517, 60298, -65099, 8684, 104582, 130149, 87563, 75150]
380G5150k8731J9864r90j9284M5454R960q0822k3730O7278j0041K8611o8837n1456
367c7574N4238O886m7629K4452K7570j00351L3555M4085j2081k4955O3720L3321
355F5237l2376j3164K03j2511l720l7824O0157j2701m9241J38095m7811k5872
343B8472J3691k5890J3276N5862J6786n3910K9365l6677M0458N8399j5607L4715
331A58940l8601k4079l9153k7512Q1603j09237M8743K8900M8338p3849j4586K9980
319F9487m2963O0522J680J1592m174K1466m7258l3055m9881M8179o7170K7205
307d370J02557k3988p2579o2239k940J17917R033Q311J5379j9051Q4884m9661
295A03253m6733J1511n8168o2890j124M9935J5699M706J4647L0027j8611K5426
$$ y = [75150, 46419, 66283, 65293, 46009, 91463, 101423, 20601, -3129, 64149, 54108, 82719, 13882, -37574, 16664, 23550, -24079, 373, 27943, -72408, -38853, 5232, -6849, -31804, 31916, 65237, 32861, 19697, 19900, 7389, 3669, -34155, 26002, 13301, -35940, 102155, 54344, 28472, 42163, 16273, 29549, 85411, 102197, 48287, 77652, 40975, 81433, 139832, 124225, 158940, 120339, 96260, 57107, 29595, 111198, 1961, 50704, 79604, 127942, 54093, 39507, 69487, 26524, 87046, 88726, 100318, 96144, 117610, 70352, 37297, -12584, 35595, -31575, -4370, 98187, 74199, 1620, -60619, -63559, 54358, 63391, 71702, 87081, 68030, 152914, 103253, 56520, 68031, 9863, -53027, -54151, -4216, 11483, 16189, 30836, 60863, 42252, 67678]
283F7678m2913L6460l621L1824k5585o065L218k5796L1882o8444M9263P3784k2636
270I9049l8372j3183J5447n4740l039O6527J2985n7362j0256K7043n712J9920
258E8307n4367k1493O0388k672n4946m1430N7742N3013m7756M510N0021R799m7831
$$ y = [67678, 24765, 61225, 57604, 89428, 63843, 57778, 60996, 35200, 67082, -1362, 47901, 121685, 99049, 60677, 47494, 62941, 8201, 5162, 71689, 84674, 27312, 17056, 44099, 38387, 58307, 3940, -17553, 42835, 40163, -14783, -56213, 1529, 54542, 6786, 11296, 61317, 71116, 23285]
$$ [...]
##END NTUPLES=NMR SPECTRUM
##END=
