##TITLE=1H_CA-9274-1
 CDCl3
 8 sc, 
 4.6.2024
##JCAMPDX= 6.0         $$ Bruker NMR JCAMP-DX V2.0
##DATA TYPE= NMR SPECTRUM
##DATA CLASS= NTUPLES
##ORIGIN= UXNMR, Bruker Analytische Messtechnik GmbH
##OWNER= root
$$ XWIN-NMR		Version 3.5
$$ Tue Jun  4 14:20:11 2024 Russian Standard Time (UT+4h)  she@DPX200
##.OBSERVE FREQUENCY= 200.1309
##.OBSERVE NUCLEUS= ^1H
##.ACQUISITION MODE= SIMULTANEOUS
##.ACQUISITION SCHEME= undefined
##.AVERAGES= 8
##.DIGITISER RES= 18
##SPECTROMETER/DATA SYSTEM= spect
##.PULSE SEQUENCE= zg30
##.SOLVENT NAME= CDCl3
##.SHIFT REFERENCE= (INTERNAL, CDCl3, 0, 15.9992)
##AUDIT TRAIL= $$ (NUMBER, WHEN, WHO, WHERE, WHAT)
$$ ##TITLE= Audit trail, XWIN-NMR		Version 3.5
$$ ##JCAMPDX= 5.01
$$ ##ORIGIN= Bruker BioSpin GmbH
$$ ##OWNER= she
$$ F:/spectra/data/she/nmr/H-F/1/pdata/1/auditp.txt
$$ ##AUDIT TRAIL=  $$ (NUMBER, WHEN, WHO, WHERE, WHAT)
(   1,<2024-06-04 14:18:45.37 +0400>,<she>,<DPX200>,
      <created by zg, POWCHK disabled, PULCHK disabled
       configuration hash MD5:
       00 E9 B6 7A A2 85 ED C7 34 08 36 98 17 FE 4E 26
       data hash MD5: 16K
       B3 1B 3B 35 A8 18 20 28 B8 C2 92 88 FA 6B 1E BA>)
(   2,<2024-06-04 14:19:04.79 +0400>,<she>,<DPX200>,
      <Start of raw data processing
       efp BC_mod = 2 LB = 0.24 FT_mod = 6 PKNL = 1 PHC0 = -25474.87 PHC1 = 14.38748 SI = 16K 
       data hash MD5: 16K
       97 94 95 7B BF 3F 76 E9 E7 2E 75 A7 B3 05 11 7A>)
(   3,<2024-06-04 14:19:22.20 +0400>,<she>,<DPX200>,
      <pk PHC0 = 1.70632 PHC1 = -1 
       data hash MD5: 16K
       88 77 60 77 63 EA 25 A0 E2 D5 04 B7 39 F3 FC EB>)
(   4,<2024-06-04 14:19:25.00 +0400>,<she>,<DPX200>,
      <abs ABSG = 5 
       data hash MD5: 16K
       17 98 8F 00 3E B4 2E 35 86 2B 61 DB 4A DA DC B7>)
$$ ##END=
$$ 
$$ hash MD5
$$ 7C 27 02 EB EA 4C 8E 34 65 18 E4 73 11 BB E3 1F
##$RELAX= 
##$RELAX= 
##$RELAX= 
##$RELAX= 
##$RELAX= 
##$RELAX= 
$$ Bruker specific parameters
$$ --------------------------
##$DU= <F:/spectra>
##$EXPNO= 1
##$NAME= <H-F>
##$PROCNO= 1
##$TYPE= <nmr>
##$USER= <she>
##$AMP= (0..31)
100 100 100 100 100 100 100 100 100 100 100 100 100 100 100 100 100 100 
100 100 100 100 100 100 100 100 100 100 100 100 100 100 
##$AQSEQ= 0
##$AQ_mod= 1
##$AUNM= <au_zg>
##$AUTOPOS= <>
##$BF1= 200.13
##$BF2= 200.13
##$BF3= 200.13
##$BF4= 200.13
##$BF5= 200.13
##$BF6= 200.13
##$BF7= 200.13
##$BF8= 200.13
##$BYTORDA= 1
##$CFDGTYP= 0
##$CFRGTYP= 5
##$CHEMSTR= <none>
##$CNST= (0..31)
1 1 145 1 1 1 1 1 1 1 1 1 1 1 1 1 1 1 1 1 1 1 1 1 1 1 1 1 1 1 1 1 
##$CPDPRG= <>
##$CPDPRG1= <>
##$CPDPRG2= <>
##$CPDPRG3= <>
##$CPDPRG4= <mlev>
##$CPDPRG5= <mlev>
##$CPDPRG6= <mlev>
##$CPDPRG7= <mlev>
##$CPDPRG8= <mlev>
##$CPDPRGB= <>
##$CPDPRGT= <>
##$D= (0..31)
0 1.2 0 0 0 0 0 0 0 0.06 0 0.03 0 0 0 0 0.0002 0 0 0 0 0 0 0 0 0 0 0 0 
0 0 0 
##$DATE= 1717496324
##$DBL= (0..7)
120 120 120 120 120 120 120 120 
##$DBP= (0..7)
150 150 150 150 150 150 150 150 
##$DBP07= 0
##$DBPNAM0= <>
##$DBPNAM1= <>
##$DBPNAM2= <>
##$DBPNAM3= <>
##$DBPNAM4= <>
##$DBPNAM5= <>
$$ [...]
##$SUBNAM3= <"">
##$SUBNAM4= <"">
##$SUBNAM5= <"">
##$SUBNAM6= <"">
##$SUBNAM7= <"">
##$SUBNAM8= <"">
##$SUBNAM9= <"">
##$SW= 18.0517689322627
##$SWIBOX= (0..15)
0 0 2 0 0 0 0 0 0 0 0 0 0 0 0 0 
##$SW_h= 3612.71676300578
##$TD= 16384
##$TD0= 1
##$TE= 0
##$TE2= 300
##$TE3= 300
##$TEG= 300
##$TL= (0..7)
0 120 120 120 120 120 120 120 
##$TP= (0..7)
150 150 150 150 150 150 150 150 
##$TP07= 0
##$TPNAME0= <>
##$TPNAME1= <>
##$TPNAME2= <>
##$TPNAME3= <>
##$TPNAME4= <>
##$TPNAME5= <>
##$TPNAME6= <>
##$TPNAME7= <>
##$TPOAL= (0..7)
0.5 0.5 0.5 0.5 0.5 0.5 0.5 0.5 
##$TPOFFS= (0..7)
0 0 0 0 0 0 0 0 
##$TUNHIN= 0
##$TUNHOUT= 0
##$TUNXOUT= 0
##$USERA1= <user>
##$USERA2= <user>
##$USERA3= <user>
##$USERA4= <user>
##$USERA5= <user>
##$V9= 5
##$VALIST= <valist>
##$VCLIST= <CCCCCCCCCCCCCCC>
##$VD= 0
##$VDLIST= <DDDDDDDDDDDDDDD>
##$VPLIST= <PPPPPPPPPPPPPPP>
##$VTLIST= <TTTTTTTTTTTTTTT>
##$WBST= 1024
##$WBSW= 4
##$XGAIN= (0..3)
0 0 0 0 
##$XL= 0
##$YL= 0
##$YMAX_a= 563551
##$YMIN_a= -576881
##$ZGOPTNS= <>
##$ZL1= 120
##$ZL2= 120
##$ZL3= 120
##$ZL4= 120
##$ABSF1= 15.85931
##$ABSF2= -2.192583
##$ABSG= 5
##$ABSL= 3
##$ALPHA= 0
##$AQORDER= 0
##$ASSFAC= 0
##$ASSFACI= 0
##$ASSFACX= 0
##$ASSWID= 0
##$AUNMP= <proc_1d>
##$AZFE= 0.1
##$AZFW= 0.1
##$BCFW= 0
##$BC_mod= 2
##$BYTORDP= 0
##$COROFFS= 0
##$CY= -3
##$DATMOD= 1
##$DC= 0
##$DFILT= <>
##$DTYPP= 0
##$F1P= 0
##$F2P= 0
##$FCOR= 1
##$FTSIZE= 16384
##$FT_mod= 6
##$GAMMA= 0
##$GB= 0
##$INTBC= 1
##$INTSCL= 3.70164e-10
##$ISEN= 128
##$LB= 0.24
##$LEV0= 0
##$LPBIN= 0
##$MAXI= 10000
##$MC2= 0
##$MEAN= 0
##$ME_mod= 0
##$MI= 1.114404
##$NCOEF= 0
##$NC_proc= -6
##$NLEV= 6
##$NOISF1= 3.799351
##$NOISF2= 2.8
##$NSP= 0
##$NTH_PI= 0
##$NZP= 0
##$OFFSET= 15.99924
##$PC= 1
##$PHC0= -25473.16
##$PHC1= 13.38748
##$PH_mod= 1
##$PKNL= yes
##$PPARMOD= 0
##$PSCAL= 0
##$PSIGN= 0
##$REVERSE= no
##$SF= 200.129504438084
##$SI= 16384
##$SIGF1= 3
##$SIGF2= 2
##$SINO= 5.538805
##$SIOLD= 16384
##$SREGLST= <1H.CDCl3>
##$SSB= 0
##$STSI= 16384
##$STSR= 0
##$SW_p= 3612.71676300577
##$SYMM= 0
##$S_DEV= 0
##$TDeff= 16384
##$TDoff= 0
##$TI= <>
##$TILT= no
##$TM1= 0
##$TM2= 0
##$TOPLEV= 0
##$USERP1= <user>
##$USERP2= <user>
##$USERP3= <user>
##$USERP4= <user>
##$USERP5= <user>
##$WDW= 1
##$XDIM= 16384
##$YMAX_p= 502918183
##$YMIN_p= -1098585
$$ End of Bruker specific parameters
$$ ---------------------------------
##NTUPLES= NMR SPECTRUM
##VAR_NAME=  FREQUENCY,     SPECTRUM/REAL,   SPECTRUM/IMAG
##SYMBOL=    X,             R,               I
##VAR_TYPE=  INDEPENDENT,   DEPENDENT,       DEPENDENT
##VAR_FORM=  AFFN,          ASDF,            ASDF
##VAR_DIM=   16384,         16384,           16384
##UNITS=     HZ,            ARBITRARY UNITS, ARBITRARY UNITS
##FACTOR=    0.220516191357247, 1,           1
##FIRST=     3201.91995688978, 0,            0
##LAST=      -410.796806115991, 0,           0
##MIN=       -410.796806115991, -1098585,    0
##MAX=       3201.91995688978, 502918183,    0
$$ Real data points
##PAGE= N=1
##DATA TABLE= (X++(R..R)), XYDATA
$$ [...]
6549B9391J2403j9204J1010j3673k3128r882M1224O249j49M0849k9157j287M077
$$ 29391 41794 22590 33600 19927 -3201 -13083 28141 34390 34241 75090 45933 44646 48723
6536D8723n0492k8467j308L6393L2635k0020N943P024q668R19n1082J019K5664
$$ 48723 -1769 -30236 -31544 4849 37484 17464 23407 30431 21763 22682 -28400 -27381 -1717
6523a717K8388l0579M18j0261M153k6438M4308J0000j6687j4246k0239r728O0853
$$ -1717 26671 -3908 -3490 -13751 -9598 -36036 8272 18272 1585 -12661 -32900 -42628 18225
6510A8225J2783j7571j6751J0597Q798m911r007n966J6811m0034k7248M254k3130
$$ 18225 31008 13437 -3314 7283 16081 11170 2163 -3803 13008 -27026 -54274 -50020 -73150
6497g3150K0711K7329J3603o539j4361p215L34P66P698J8583J0006p110J137M979
$$ -73150 -52439 -25110 -11507 -18046 -32407 -39622 -39288 -38522 -30824 -12241 -2235 -9345 -8208 -3229
6483c229j6105M3543k6221j4164k6075M2997J5922j8983P334j3513l8571k079
$$ -3229 -19334 24209 -2012 -16176 -42251 746 16668 -2315 5019 -8494 -47065 -49144
6471d9144K4875M027k0349r793j9036K3338Q771L2187K3049k2985n160J5255J5794
$$ -49144 -24269 -20242 -40591 -50384 -69420 -46082 -37311 -5124 17925 -5060 -10220 5035 20829
6458B0829l8716k4113j5714L6012N532L2058r002k7513l3603K2871M393j4078
$$ 20829 -17887 -42000 -57714 -21702 -16170 15888 6886 -20627 -54230 -31359 -26966 -41044
6446d1044L6164L3012j064m3114j1802K0550K7201J802r852J373R198j9982j5255
$$ -41044 -4880 28132 27068 -16046 -27848 -7298 19903 21705 11853 13226 22424 2442 -12813
6433a2813n651J7227q126j9874J3094j7420k7007N234r323J9930L5662r431m3628
$$ -12813 -18464 -1237 -9363 -29237 -16143 -33563 -60570 -55336 -64659 -44729 -9067 -18498 -62126
6420f2126L4764J8481K317M625l6560J938n571j4393L282L9909j0458M129K4244
$$ -62126 -27362 -8881 -6564 -1939 -38499 -36561 -42132 -56525 -53243 -13334 -23792 -19663 4581
6407D581R860l428l1012J5379n407L0302k4773K991l5944m707M3075P302L36O581
$$ 4581 14441 11013 -19999 -4620 -10027 20275 -4498 -1507 -37451 -42158 917 8219 8555 15136
6393A5136m6705R542L0866m573K8344k4640j5455k1210M383L4945O928m2203j4622
$$ 15136 -31569 -22027 8839 4266 32610 7970 -7485 -28695 -24312 10633 17561 -24642 -39264
6380c9264M1533K8867j3968J1810j1789k7860l9835P09L4348p06k9116j639q091
$$ -39264 2269 31136 17168 28978 17189 -10671 -50506 -49797 -15449 -16155 -45271 -46910 -55001
6367e5001L852k3117K2144J7637q343K019O603k7660K8309K2645l318J6968p496
$$ -55001 -51149 -74266 -52122 -34485 -42828 -40809 -34206 -61866 -33557 -10912 -14230 2738 -4758
6354d758P522K4073j705l0180o565n165p945K1698k1775l0091m465J2186K017
$$ -4758 2764 26837 25132 -5048 -11613 -16778 -24723 -3025 -24800 -54891 -59356 -47170 -45153
6341d5153l1491K8972Q675j397J8565j6547J4075M721k8507j5990J4765J636K7057
$$ -45153 -76644 -47672 -38997 -40394 -21829 -38376 -24301 -19580 -48087 -64077 -49312 -47676 -20619
6328b0619L2783j7689M815m3814j8853j6177J3796q049K9457Q580l761J6774o09
$$ -20619 12164 -5525 -710 -44524 -63377 -79554 -65758 -73807 -44350 -35770 -39531 -22757 -23366
6315b3366j9927L4016K8932l3868k9681k5222m726K4732K8062J9426L596L1586
$$ -23366 -43293 -9277 19655 -14213 -43894 -69116 -73842 -49110 -21048 -1622 1974 33560
6303C3560j1369l6999r012J4437L102K68r46k8667r584M3561q945m584J0962j5473
$$ 33560 22191 -14808 -23820 -9383 -6281 -6013 -6959 -35626 -45210 -1649 -10594 -15178 -4216 -19689
6289a9689L146k7985J5677j7204o342M807K1177oJ1766j1242L1128L691N990p410
$$ -19689 -16543 -44528 -28851 -46055 -52397 -47590 -26413 -26419 -14653 -25895 5233 8924 14914 7504
6275G504k4889n36K4346j8384N458O531k6963m336J321J574J3002K87k1214N1367
$$ 7504 -17385 -17921 6425 -11959 -6501 30 -26933 -31269 -29948 -28374 -15372 -15085 -36299 15068
6261A5068k9774j768m941M896j0374O151J3662j6394O215K6427J2780j9966j3365
$$ 15068 -14706 -16474 -21415 -16519 -26893 -20742 -7080 -23474 -17259 9168 21948 1982 -11383
6248a1383K3377j7679J0692k5069k530K9729j0580k1771m026L1546j9419J2340
$$ -11383 11994 -5685 5007 -20062 -22592 7137 -3443 -25214 -29240 2306 -17113 -4773
6236d773Q759l2194j511J6088j5843K3578J8729J512j7746P062q06o017k7653
$$ -4773 3986 -28208 -29719 -13631 -29474 -5896 12833 14345 -3401 3661 2855 -3162 -30815
6223c0815J7571J2243k6691k003O969L3833n319p567J4741n883k5334k1014J9597
$$ -30815 -13244 -1001 -27692 -29695 -22726 11107 5788 -1779 12962 7079 -18255 -39269 -19672
6210a9672N7329M8897l0982n8119R528J1140L311J5622k5306j4108j7148L4003
$$ -19672 37657 86554 55572 -2547 6981 18121 21432 37054 11748 -2360 -19508 14495
6198A4495q52k945j3807q665J1110J6847l7903L1229J6340k7970K627j7176J7374
$$ 14495 13643 10698 -3109 -11774 -664 16183 -21720 9509 25849 -2121 506 -16670 704
6185G04J2492n319j5876M4091m111q175J3254o314j8354n871j5902r286M4493
$$ 704 13196 7877 -7999 36092 31981 23806 37060 30746 12392 6521 -9381 -18667 25826
6172B5826n466k3462M71o3741j917M4012r579o829J6767M383P561M046j7122j71
$$ 25826 20360 -3102 -2631 -66372 -68289 -24277 -33856 -40685 -23918 -19535 -11974 -7928 -25050 -25221
6158b5221r12k0937Q59K4839j8930k1049R991O691j8215j7722M0836J3586j1615
$$ -25221 -26133 -47070 -46211 -21372 -40302 -61351 -51360 -44669 -62884 -80606 -39770 -26184 -37799
6145c7799k0158P451K1901O1133k0833k7966j1535K4674m0205P632K2594K296
$$ -37799 -57957 -50506 -28605 32528 11695 -16271 -27806 -3132 -43337 -35705 -13111 -10815
6133a0815j9730M991L5674J2965n996J7479j0113m8738J823K1654l080O188N913
$$ -10815 -30545 -25554 10120 23085 17089 34568 24455 -24283 -22460 -806 -3886 2302 8215
6120H215j8582J4551j4921N0240K6650J606k9856j9269k1524M799q355K5918j3061
$$ 8215 -10367 4184 -10737 39503 66153 67759 37903 18634 -2890 1909 -6446 19472 6411
6107F411j675M5874j1380j8170j7944J635k7579n820N327m585k0587K611N0766
$$ 6411 4736 50610 39230 21060 3116 4751 -22828 -28648 -23321 -27906 -48493 -45882 4884
6094D884k8480K868R901m424q620K73l147K117L7825J8055j5181o971k0093l6510
$$ 4884 -23596 -20728 -10827 -15251 -23871 -23598 -26745 -24628 13197 31252 16071 9100 -10993 -47503
6080d7503L4813J8468L2776j416m3104r181J1514k5000J2492J960j6128J7490
$$ -47503 -12690 5778 38554 37138 -5966 -15147 -3633 -28633 -16141 -14181 -30309 -12819
6068a2819P196j0601j5404m741j5531L574L4726N673m470p050l2120P465J3970
$$ -12819 -5623 -16224 -31628 -36369 -51900 -48326 -13600 -7927 -12397 -19447 -51567 -44102 -30132
6055c0132J3619j614K2066O961R895k2858J9341l5847k9406j7370o385J4097K42
$$ -30132 -16513 -18127 3939 10900 20795 -2063 17278 -18569 -47975 -65345 -71730 -57633 -57391
6042e7391L3388K3365J1557Q826L7971n0270m8136L6137q152j754q691K2898J5395
$$ -57391 -24003 -638 10919 19745 57716 7446 -40690 -4553 -12705 -14459 -23150 -252 15143
6029A5143K135j3487N508l4318m939j6850n424K986l740M8903j1767k369k3409
$$ 15143 17278 3791 9299 -25019 -29958 -46808 -52232 -49246 -52986 -4083 -15850 -18219 -41628
6016d1628r8J487j0046J9908k1982p577R695N94M5922o463R617j6107l968l375
$$ -41628 -41726 -40239 -50285 -30377 -52359 -59936 -50241 -49647 -3725 -10188 -571 -16678 -20646 -24021
6002b4021K1068k731J54J4429Q396J6416j3932l513k2549n351L4066k0810j3488
$$ -24021 -2953 -5684 -5530 8899 17295 33711 19779 16266 -6283 -11634 22432 1622 -11866
5989a1866o522K6876l5547r963N720j3600K5430J75n949L9452k0570j7006J3064
$$ -11866 -18388 8488 -27059 -37022 -31302 -44902 -19472 -19297 -25246 14206 -6364 -23370 -10306
5976a0306O544J6245P16N6983j6509p0829J9476q888l6001k8381J6328L4632k3272
$$ -10306 -3762 12483 13199 70182 53673 -17156 2320 -6568 -42569 -70950 -54622 -19990 -43262
5963d3262L8888m544j6751J6115l109J060l3022K9101q126K3006P825o478k446
$$ -43262 -4374 -8918 -25669 -9554 -12663 -11603 -44625 -15524 -23650 -644 7181 703 -1743
5950a743o313Q884J970M030l5901Q875p60M550j2743O337Q311l2098o412K2027
$$ -1743 -8056 828 2798 6828 -29073 -20198 -20958 -16408 -29151 -22814 -14503 -46601 -53013 -30986
5936c0986N337K6277k1624J7334j3797K9769J5959k6371K382j2102m792M463q20
$$ -30986 -25649 628 -20996 -3662 -17459 12310 28269 1898 4280 -7822 -12614 -8151 -8971
5923h971M892Q581J2488J531j5306j7188k058L6561l7722j49j336j2542o691J2875
$$ -8971 -4079 4502 16990 18521 3215 -13973 -16031 20530 -17192 -17341 -18677 -31219 -37910 -25035
5909b5035M0773o398l6565j246J9373o766K2204j5322M704K739L50K53n43R845
$$ -25035 15738 9340 -27225 -28471 -9098 -15864 6340 -8982 -4278 -1539 -1189 -936 -1479 8366
5895H366k6349J6395J4811O425M2370O402r529k7941o008m2746K7983L3114j5543
$$ 8366 -17983 -1588 13223 19648 62018 68420 58891 30950 24942 -17804 10179 43293 27750
5882B7750k5556l713l585L2244R339m4581q719N288m9488O399K7600Q40M1218
$$ 27750 2194 -1519 -5104 27140 36479 -8102 -16821 -11533 -61021 -54622 -27022 -26182 15036
5869A5036q457k533n541J460m80l9204J9692L8557j1427J5607j1423O800k2151
$$ 15036 6579 4046 -1495 -35 -515 -39719 -20027 18530 7103 22710 11287 18087 -4064
5856d064L1722j5491J1507n979j6138l367M264j0310j1517q936K3010q661m80
$$ -4064 27658 12167 23674 17695 1557 -1810 2454 -7856 -19373 -28309 -5299 -13960 -14440
5843a4440K2299j2196k9733L078J0186L031K373N962l0695j1243M9461K3036O046
$$ -14440 7859 -4337 -34070 -30992 -20806 -17775 -15402 -9440 -40135 -51378 -1917 21119 27165
5830B7165O186J7217r239Q549k9994j8028J1367J703k6444J9522P636r209L678
$$ 27165 33351 50568 41329 49878 19884 1856 13223 14926 -11518 8004 15640 6431 10109
5817A0109j0516L206K3873J3366K611l060M1417j7204n430m1288R270J4146j4150
$$ 10109 -407 2799 26672 40038 42649 39589 81006 63802 58372 17084 26354 40500 26350
5804B6350O368l0042J1292M0985q303o133m164p99K7746l4188J1436o791l9706
$$ 26350 32718 2676 13968 54953 46650 40517 36353 35554 63300 29112 40548 33757 -5949
5791e949L4666k9135o322M9572m477j6191q772k156J7813K7915j6225j394k3516
$$ -5949 28717 -418 -6740 42832 38355 22164 13392 11236 29049 56964 40739 39345 15829
5778A5829P440L3265j5630p43j0493r075j2329O0731J0794j0683q359K9589l626
$$ 15829 23269 56534 40904 40161 29668 20593 8264 68995 79789 69106 60747 90336 86710
5765H6710P494j8323m257j5256k6793P6977j0556l0379k0697K4748j6619P408
$$ 86710 94204 75881 71624 56368 29575 106552 95996 65617 44920 69668 53049 60457
5753F0457k4572k282K4832m932j3017R100O390J2846J8709J2926j1526K5934q622
$$ 60457 35885 33603 58435 53503 40486 49586 55976 68822 87531 100457 88931 114865 106243
5740A06243O621k2205k3566J1143r558q309q2N353K9438N63N600n932r216n8005
$$ 106243 112864 90659 67093 78236 68678 60369 60287 65640 95078 95641 101241 95309 86093 28088
5726B8088N517K2262k9757p763j0761K8987Q227K4552k4753k4212J0039l3375
$$ 28088 33605 55867 26110 18347 7586 36573 44800 69352 44599 20387 30426 -2949
5714b949Q172K2988j2456K6039K7059l1261N807J4562l6743M0775P966P614Q430
$$ -2949 5223 28211 15755 41794 68853 37592 43399 57961 21218 61993 69959 77573 86003
5701H6003K1665q962m6409l5446L2458J5297m6803M889J8429J0522J6679J2129
$$ 86003 107668 98706 52297 16851 49309 64606 17803 22692 41121 51643 68322 80451
5689H0451k8676k0825K2044J1302K4022m7581q145l55J0896J8321J6496l9531
$$ 80451 51775 30950 52994 64296 88318 40737 32592 32237 43133 61454 77950 38419
5677C8419r741K5176J4110R909J018j8681p455m605j0179K6374k8180k5988N8091
$$ 38419 28678 53854 67964 77873 78891 60210 52755 48150 37971 64345 36165 10177 68268
5664F8268L8390j5498j0260j3259K872j2029J3484j6962K9266j5157Q159P41r663
$$ 68268 106658 91160 80900 67641 70513 58484 71968 55006 84272 69115 77274 78015 68352
5651F8352K9722r404o475M365l581k2461L353K5286L8401r951l6099J8474l8123
$$ 68352 98074 88670 82195 86560 82979 60518 63871 89157 127558 117607 81508 99982 61859
5638F1859q969j7524Q714K7444K6045J9952l6641K573J4896j8528O113L8093l6278
$$ 61859 52890 35366 44080 71524 97569 117521 80880 83453 98349 79821 85934 124027 87749
5625H7749K9188k6328J2350J0441k760J0853n164J8452N286R55l8027L030P761
$$ 87749 116937 90609 102959 113400 110640 121493 116329 134781 140067 141022 102995 106025 113786
5612A13786j9906Q592r318l3341M5454J732Q48J1320l099p965l486j690l1463
$$ 113786 93880 102472 93154 59813 105267 106999 107847 119167 116068 108103 104617 102927 71464
5599G1464L40O902K6465J4445L6483M734k6165M030K4634j7968K0890k144j3644
$$ 71464 71804 78706 105171 119616 156099 160833 134668 138698 163332 145364 166254 164110 150466
5586A50466L7969l1205k1549k2943J2483J2434J0455M006q993J8837N823L913
$$ 150466 188435 157230 135681 112738 125221 137655 148110 152116 143123 161960 167783 171696
5574A71696l4816K1753R073M657L0580j7886r579J2966j6159l876L8779K1409
$$ 171696 136880 158633 167706 172363 202943 185057 175478 188444 172285 168409 207188 228597
5562B28597K8388n2228J8999l3963q659M2724P235j193r960K8749J7122R843j256
$$ 228597 256985 204757 223756 189793 181134 223858 231093 229900 219940 248689 265811 275654 274398
5549B74398j747l598k7954j9154J7169J9640L5162N7558j4607k060O072k8458
$$ 274398 272651 269053 241099 221945 239114 258754 293916 351474 336867 334807 340879 312421
5537C12421J2596M1888R605r52L8607k773k2529o834N0340L7019L0536K7078K9293
$$ 312421 325017 366905 376510 375558 414165 411392 388863 382029 432369 469388 499924 527002 556295
5524E56295M5666L5604M3621N1308M2251M9547Q5978Q4821M8793L5727J5067J5320
$$ 556295 601961 637565 681186 732494 774745 824292 910270 995091 1043884 1079611 1094678 1109998
5512A109998K4469M258l1616k0600Q458O053K3291M575P1K6831r544n7005n5229
$$ 1109998 1134467 1138725 1107109 1086509 1094967 1101020 1124311 1128886 1128957 1155788 1146244 1089239 1034010
5499A034010n1156p9823m7534n4252m0679l2116j5918k1177n155K0392n6146j8817
$$ 1034010 982854 903031 855497 801245 760566 728450 712532 691355 686200 706592 650446 631629
5487F31629l4384l9301M482K2977j7511Q289j2706j737j1020P263l218j3080L4109
$$ 631629 597245 557944 562426 585403 567892 576181 563475 561738 550718 557981 554763 541683 575792
5474E75792J929M374o562L484N654O184r930K0369L4457o709M7078o812M838N689
$$ 575792 577721 582095 575533 579017 584671 590855 580925 601294 635751 629042 676120 669308 674146 679835
5460F79835n269k5476M24k6499l9363K7602l4673K8595O363M0909m2175J9802
$$ 679835 674566 649090 649514 623015 583652 611254 576581 605176 611539 652448 610273 630075
5448F30075N5594J0611r12p645J3710K1037j5501j6877L8159K1563L28O4868M366
$$ 630075 685669 696280 695368 687723 701433 722470 706969 690092 728251 749814 750142 815010 819376
5435H19376J4802L5714l6241r608m4264n8183m243L0744q56j5494P12J6891j2766
$$ 819376 834178 869892 833651 824043 779779 721596 717353 748097 747241 731747 732459 749350 736584
5422G36584L7285m058k2282L8583P038R927K3394k0753j9428M8375L6723k0302
$$ 736584 773869 769811 747529 786112 793150 803077 826471 805718 786290 834665 871388 851086
5410H51086Q1951K3385O398O9027n329l1246j5699k2016O050K1903q098m132n174
$$ 851086 933037 956422 962820 1031847 1026518 995272 979573 957557 963607 985510 977412 973280 968106
5397I68106k4670Q701M6743k5869K8524k1390J113L0342j2249K3757K2843j7719
$$ 968106 943436 952137 998880 973011 1001535 980145 981258 1011600 999351 1023108 1045951 1028232
5385A028232J1177q275K2272M4060L5829l2604J8174j1519J9658K3309q941k7321
$$ 1028232 1039409 1031134 1053406 1097466 1133295 1100691 1118865 1107346 1127004 1150313 1141372 1114051
5373A114051l4235J0823J6493K6959J843j3624j7837K4365K8337J4504M481P3938
$$ 1114051 1079816 1090639 1107132 1134091 1135934 1122310 1104473 1128838 1157175 1171679 1176160 1250098
5361A250098j4687p690J61L4143L3151k39J4644L0280L445K6387k0723j2915K1629
$$ 1250098 1235411 1227721 1227882 1262025 1295176 1294937 1309581 1339861 1343306 1369693 1348970 1336055 1357684
5348A357684J4036o434N5844N0147K1061O0189p144J1547K8303k3094K4970k1004
$$ 1357684 1371720 1365286 1421130 1471277 1492338 1552527 1545383 1556930 1585233 1562139 1587109 1566105
5336A566105k1480K2279K0566K2449L0820J3931L7479M1741J5516K8652M5706
$$ 1566105 1544625 1566904 1587470 1609919 1640739 1654670 1692149 1733890 1749406 1778058 1823764
5325A823764J4065K9799J7496J3936M9717N0286O871O9295o706J7747O2747O2299
$$ 1823764 1837829 1867628 1885124 1899060 1948777 1999063 2005934 2075229 2068523 2086270 2149017 2211316
5313B211316L2492N6287j0703M8080O8481M5765M6695L8893K0478M8329J01136
$$ 2211316 2243808 2300095 2289392 2337472 2405953 2451718 2498413 2537306 2557784 2606113 2707249
5302B707249N0775O9399K8698O6912N6846R1996M7585J01794M3436R1404N1512
$$ 2707249 2758024 2827423 2856121 2923033 2979879 3071875 3119460 3221254 3264690 3356094 3407606
5291C407606O1292J14887L7709Q9752P0150J01866J02695J12661J22841Q6302
$$ 3407606 3468898 3583785 3621494 3711246 3781396 3883262 3985957 4098618 4221459 4307761
5281D307761J34092J12798J64367J15239J37566J60597K28797J63912K10283K43797
$$ 4307761 4441853 4554651 4719018 4834257 4971823 5132420 5361217 5525129 5735412 5979209
5271E979209J81873J44161J61874J78728J92399K41255K77837K35435K65642K81604
$$ 5979209 6161082 6305243 6467117 6645845 6838244 7079499 7357336 7592771 7858413 8140017
5261H140017K58523K52807K20363K29893K12013K50633K79757L03451L19793L24516
$$ 8140017 8398540 8651347 8871710 9101603 9313616 9564249 9844006 10147457 10467250 10791766
5251A0791766L25981K74741L52591L60329M32621M37114M10034M50432M64881
$$ 10791766 11117747 11392488 11745079 12105408 12538029 12975143 13385177 13835609 14300490
5242A4300490N09897N33295N06610M92460N76167N62934N98133N76558O43785
$$ 14300490 14810387 15343682 15850292 16342752 16918919 17481853 18079986 18656544 19300329
5233A9300329O53756O99059P36366P33820Q01715Q27879R15549J005414J008683
$$ 19300329 19954085 20653144 21389510 22123330 22925045 23752924 24668473 25673887 26682570
5224B6682570J111689J259692J402479J484537J636243J815353K023148K297029
$$ 26682570 27794259 29053951 30456430 31940967 33577210 35392563 37415711 39712740
5216C9712740K576466K952640L279974L725989M189400M702295N457290O231778
$$ 39712740 42289206 45241846 48521820 52247809 56437209 61139504 66596794 72828572
5208G2828572P182620Q308849R532437J0947049J2515250J3936625J4705075J5072481
$$ 72828572 80011192 88320041 97852478 108799527 121314777 135251402 149956477 165028958
5200A65028958J3946609Q621527M23938n531349p675491p074003m116698j60995
$$ 165028958 178975567 187597094 188021032 182489683 174814192 167740189 163623491 163462496
5192A63462496L484627N590449N430889K558073l737335j2102280j7304997j7752154
$$ 163462496 166947123 172537572 177968461 180526534 176789199 164686919 147381922 129629768
5184A29629768j6200039j3911730j1497854r392331p584335o262511n275409m478861
$$ 129629768 113429729 99517999 88020145 78627814 71043479 64780968 59505559 55026698
5176E5026698l846555l363727k964889k630520k422237k220751k063066j941973
$$ 55026698 51180143 47816416 44851527 42221007 39798770 37578019 35514953 33572980
5168C3572980j812805j658900j570316j470926j351306j232160j186776j092485
$$ 33572980 31760175 30101275 28530959 27060033 25708727 24476567 23289791 22197306
5160B2197306j004253q82365q70893q10746p30740o57645o50860o49443n96349
$$ 22197306 21193053 20310688 19439795 18629049 17898309 17240664 16589804 15940361 15344012
5151A5344012n32028m97684n30415m55909m92636m70876m35453l79294l45695
$$ 15344012 14811984 14314300 13783885 13327976 12835340 12364464 11929011 11549717 11204022
5142A1204022m00954l44147k81341k68258k73371k86955k40145k20381k46125
$$ 11204022 10803068 10458921 10177580 9909322 9635951 9348996 9108851 8888470 8642345
5133H642345k33963j87458k30074k31717j63352k00079j65015j69294j73936j22670
$$ 8642345 8408382 8220924 7990850 7759133 7595781 7395702 7230687 7061393 6887457 6764787
5123F764787j22723j37885j65782j09816j13666j32060j41441p1960p0212j48868
$$ 6764787 6642064 6504179 6338397 6228581 6114915 5982855 5841414 5769454 5699242 5550374
5113E550374j16515j10956j11784o2217r9414q7098p9643j14072o0685o1162n7499
$$ 5550374 5433859 5322903 5211119 5148902 5049488 4962390 4882747 4768675 4707990 4646828 4589329
5102D589329l0580m1298p7654o7621r4777m1704p4910m6341l3216l5996l6584
$$ 4589329 4558749 4517451 4439797 4372176 4277399 4235695 4160785 4114444 4081228 4045232 4008648
5091D008648l4104j8040n0175j0329l2566p696j4840k7329m665r429p187k3423
$$ 4008648 3974544 3956504 3906329 3896000 3863434 3855738 3840898 3813569 3808904 3799475 3792288 3768865
5079C768865j9047k9354l2936l5087j580m250n4510o899p650l9711k1079L3758
$$ 3768865 3749818 3720464 3687528 3652441 3650861 3646611 3592101 3585202 3577552 3537841 3516762 3550520
5067C550520J750J2261J229m6388j6651N157l0989j4014n0815k1546K1660K140
$$ 3550520 3552270 3564531 3565760 3519372 3502721 3507878 3476889 3462875 3412060 3390514 3412174 3414314
5055C414314J6218M961J5087p539K2426L8647K766J9746M3486J27553Q3096L7896
$$ 3414314 3430532 3435493 3450580 3443041 3465467 3504114 3506880 3526626 3570112 3697665 3780761 3818657
5043C818657Q1193J00728J15224J25285J34064J86924J95607J72057J63167K7916
$$ 3818657 3899850 4000578 4115802 4241087 4375151 4562075 4757682 4929739 5092906 5120822
5033E120822n4234m8323K472Q5663N3829R6497J57534J78473J81072J04877j9160
$$ 5120822 5066588 5018265 5020737 5106400 5160229 5256726 5414260 5592733 5773805 5878682 5859522
5022E859522r0123o6724p3894j1003j44M7441P9327Q9339Q2002R9295R0976J12816
$$ 5859522 5769399 5702675 5628781 5617778 5617634 5665075 5744402 5833741 5915743 6015038 6106014 6218830
5010F218830O1693J42247J60625J52331K24197K13479K12670K31854J99935J78776
$$ 6218830 6280523 6422770 6583395 6735726 6959923 7173402 7386072 7617926 7817861 7996637
5000G996637J94356K58782K37306K13132K73137K80628K79500K97918L05490K91758
$$ 7996637 8190993 8449775 8687081 8900213 9173350 9453978 9733478 10031396 10336886 10628644
4990A0628644L26675L82915L69868M28154M63242M93494N54670N86680O21001
$$ 10628644 10955319 11338234 11708102 12136256 12599498 13092992 13647662 14234342 14855343
4981A4855343O78902P88795Q62935R03295J101208J309376J479138J675975J890033
$$ 14855343 15534245 16323040 17185975 18089270 19190478 20499854 21978992 23654967 25545000
4972B5545000K176338K497942K890550L297769L725475M276756N009378N881563
$$ 25545000 27721338 30219280 33109830 36407599 40133074 44409830 49419208 55300771
4964E5300771O958692Q125457R477325Q964348L472688m304324p886672o808034
$$ 55300771 62259463 70384920 79862245 88826593 92299281 87994957 80108285 73300251
4956G3300251m277992j627307N45608K348175L974287N672698O383646K959194
$$ 73300251 69022259 67394952 67940560 70288735 74263022 79935720 86319366 89278560
4948H9278560m906543j1001923j1538506r633109p249628n401041m160962l338014
$$ 89278560 84372017 73370094 61831588 52198479 44948851 39547810 35386848 32048834
4940C2048834k674881k298711k040998j820820j592378j360073j167533j042723
$$ 32048834 29373953 27075242 25034244 23213424 21621046 20260973 19093440 18050717
4932A8050717r63733q70420q03535p27705o55112o62320p39151o54224o21500
$$ 18050717 17086984 16216564 15413029 14685324 14030212 13367892 12628741 11974517 11353017
4923A1353017n26486m90580m52129m48094m00744l52263l08771l26571k96434
$$ 11353017 10826531 10335951 9883822 9435728 9034984 8682721 8373950 8047379 7750945
4914G750945k66662k32603k65014k27426k12058k74392k38772j69361k26555j69978
$$ 7750945 7484283 7251680 6986666 6759240 6547182 6272790 6034018 5864657 5638102 5468124
4904E468124j41207j40862j27403j27010j70384j13072o3012r4842p2186j30471
$$ 5468124 5326917 5186055 5058652 4931642 4761258 4648186 4585174 4490332 4418146 4287675
4894D287675q6984q4589m6952q1934l2724o5966p8654J8224j556j9789k4449l6897
$$ 4287675 4200691 4116102 4069150 3987216 3954492 3888526 3809872 3828096 3826540 3806751 3782302 3745405
4882C745405k6573l7958l8000l8939o8234m4773q5958q8357o3195l0074q564q5325
$$ 3745405 3718832 3680874 3642874 3603935 3535701 3490928 3404970 3316613 3253418 3223344 3214780 3129455
4870C129455o4533p0448q8921j16429r9472j24986j08664o4576j02060r9874j8404
$$ 3129455 3064922 2994474 2905553 2789124 2689652 2564666 2456002 2391426 2289366 2189492 2171088
4859B171088j9926p6563q3005l5745l5105l8424N845j5501m6370r2690o0170m7682
$$ 2171088 2151162 2074599 1991594 1955849 1920744 1882320 1888165 1872664 1826294 1733604 1673434 1625752
4847A625752n75l3170n8380j9020l4649l1700l5980j2459R054l4815n1348J2756
$$ 1625752 1625177 1592007 1533627 1514607 1479958 1448258 1412278 1399819 1408873 1374058 1322710 1335466
4835A335466p143l3149j6241o0749k3224j3016k9316l9188j901m829m9170m8246
$$ 1335466 1328323 1295174 1278933 1218184 1194960 1181944 1152628 1113440 1111539 1106710 1057540 1009294
4823A009294l962r220p920k5153r764j6958k2511k5810J6179K6089l2211j3822
$$ 1009294 1005332 996112 988192 963039 953275 936317 913806 887996 904175 930264 898053 884231
4811H84231r060j0123k6843L264L3471m2837k6522r028L422j5234l6374j1891
$$ 884231 875171 865048 838205 841469 874940 832103 805581 796553 799975 784741 748367 736476
4799G36476p34P761o328j2592j5859M2471J38k1933j3156n586k1014m5205j6357
$$ 736476 735742 743503 737175 724583 708724 751195 751333 729400 716244 710658 689644 644439 628082
4786F28082l0094J8194P710k6053m7151O785K1504j6493J4009j2629p832k6343
$$ 628082 597988 616182 623892 597839 550688 557473 578977 562484 576493 563864 556032 529689
4774E29689j2830l655o957j2709p404K5717j3375j2217j7115j2038k7287Q601
$$ 529689 516859 513204 506247 493538 486134 511851 498476 486259 469144 457106 429819 438420
4762D38420j4001o183N607J8284O60L443o339k4458k3462j553P150l1136j2084
$$ 438420 424419 418236 423843 442127 442787 446230 439891 415433 391971 390418 397568 366432 354348
4749C54348m46P457k0344J68J6807m1472R874K4931o8030J9558J008l607P255
$$ 354348 353902 361359 341015 341183 357990 316518 326392 351323 283293 302851 303859 300252 307507
4736C07507M0095j6256j5537K5675k89p22R718l9462L3238j4457J691K352J1139
$$ 307507 347602 331346 315809 341484 341195 340473 350191 310729 343967 329510 331201 333553 344692
4723C44692m3381k3596N3585k339l2075K0904J454J0568j9282l6618l53k184j9463
$$ 344692 301311 277715 331300 328961 296886 317790 319244 329812 310530 273912 273559 271375 251912
4710B51912K8023P736l6830M207J9937K9501o884M542p036l5327k781Q299J7324
$$ 251912 279935 287671 250841 255048 274985 304486 297602 302144 295108 259781 257000 265299 282623
4697B82623k2988p966L1540r466M6168l710k7996k3601L0605q862j6099k7024
$$ 282623 259635 251669 283209 273743 319911 316201 288205 264604 295209 286347 270248 243224
4685B43224J821J3395J919K9574k1005k5349K9494k2978J2430J6020M3138j5053
$$ 243224 245045 258440 260359 289933 268928 243579 273073 250095 262525 278545 321683 306630
4673C06630l6485J5626M437k8598j5580j2667K8828J0984K1556l0876Q085J2885
$$ 306630 270145 285771 290208 261610 246030 233363 262191 273175 294731 263855 271940 284825
4661B84825O09l8067M32L7268K4346Q841q606M5556o154K8089K2380M9933O0843
$$ 284825 285434 247367 247799 285067 309413 318254 309648 355204 349050 377139 399519 449452 510295
4648E10295J3494O2905M9333k2L94o6283j9861j833m4109j7533K1758M8175M989
$$ 510295 523789 586694 636027 636005 636399 570116 550255 548422 504313 486780 508538 556713 561702
4635E61702J2694O669k2239m1475n9297l5901j2583k0187m1500K843m7165k1910
$$ 561702 574396 581065 558826 517351 458054 422153 409570 389383 347883 350726 303561 281651
4623B81651L8859M864O622p183l9470R269k1293k214Q527J184j4521m751l217
$$ 281651 320510 325374 331996 324813 285343 294612 273319 271105 279632 280816 266295 261544 258327
4610B58327k8740J8526M2503L301L1364q524r30o320j2532m8272J013J7580o728
$$ 258327 229587 248113 290616 293917 325281 316757 315827 309507 296975 248703 249716 267296 260568
4597B60568P674j6492J5952J980L853J6504k0785J0828J7780K2213J2155N120
$$ 260568 268242 251750 267702 269682 273535 290039 269254 280082 297862 320075 332230 337350
4585C37350p758m88Q254M1254M716j2519Q091J2650K6941n7502m832J5291j6660
$$ 337350 329592 329104 337358 378612 383328 370809 378900 391550 418491 360989 356157 371448 354788
4572C54788l6044j0835L0791N524j9208o446M1304J0200N627k1870j7422o070
$$ 354788 318744 307909 338700 344224 325016 318570 359874 370074 375701 353831 336409 330339
4560C30339k2890j349L5907l402j2321j9286k455L0293j5123K5192k6543J1414
$$ 330339 307449 306100 342007 338605 326284 306998 304543 334836 319713 344905 318362 329776
4548C29776j2651O46r676J6790j6026j4753j8480m4467j7653J3318J6513k0196
$$ 329776 317125 317771 308095 324885 308859 294106 275626 231159 213506 226824 243337 223141
4536B23141j5469K6340K2882J0802k8730m9686N5122o381l1811J7561K1883J2925
$$ 223141 207672 234012 256894 267696 238966 189280 244402 238021 206210 223771 245654 258579
4524B58579j3296K514J7399q226m0628L0731Q423K817p857O4058J0899o7826q455
$$ 258579 245283 247797 265196 256970 216342 247073 255496 258313 250456 314514 325413 257587 249132
4511B49132J1537o89J7602m5161l5887J6325J2823J7143l4596r149K6788m424
$$ 249132 260669 259980 277582 232421 196534 212859 225682 242825 208229 199080 225868 221444
4499B21444k914Q605j2339k2966L111k1199q88L701j1673K6298k2698J567J9994
$$ 221444 218530 227135 214796 191830 194941 173742 172854 176555 164882 191180 168482 170049 190043
4486A90043k6871K12J7183j6416L2188J344j5388J4208L788j4412j8858J021J1159
$$ 190043 163172 163384 180567 164151 196339 197683 182295 196503 200291 185879 167021 168042 179201
4473A79201j5052K7978r848j2968k270K0705K1867l5657J8067J4728N142k853
$$ 179201 164149 192127 182279 169311 167041 187746 209613 173956 192023 206751 211893 209040
4461B09040j8320L944l0288L1090m237J6355k1349L5363k2612R1L872N595Q3966
$$ 209040 190720 194664 164376 195466 191229 207584 186235 221598 198986 199077 202949 208544 292510
4448B92510j2013J7250L93l5201J9456J3600N3305M2896j5785K5997O8582J3681
$$ 292510 280497 297747 298140 262939 282395 295995 349300 392196 376411 402408 470990 484671
4436D84671K4257r094P0463L9088q487K0977J1261K7582J9296L8745N2142J7570
$$ 484671 508928 499834 570297 609385 600898 621875 633136 660718 680014 718759 770901 788471
4424G88471l2238q960j8442l1510r846j2701j3888L7772K1400J7355j06737m5120
$$ 788471 756233 747273 728831 697321 687475 674774 660886 698658 720058 737413 630676 585556
4412E85556l6566j6619k0400l1895k6589k2980p0309k181L2306j0812m2715l5283
$$ 585556 548990 532371 511971 480076 453487 430507 360198 358017 390323 379511 336796 301513
4400C01513Q33K0254L0089m8630l6678k4410l195q033j763j9466O541K7996J6789
$$ 301513 302346 322600 352689 304059 267381 242971 239776 231743 229980 210514 217055 245051 261840
4387B61840j0336l1051j8827l8402K8677J2424R57q852K0345O135q772k2240k8818
$$ 261840 251504 220453 201626 163224 191901 204325 205282 196430 216775 222910 214138 191898 163080
4374A63080P364L6604k0790j6238j1343O573j732j5446J0712P070L1116m5136
$$ 163080 170444 207048 186258 170020 158677 165250 163518 148072 158784 165854 196970 151834
4362A51834M009K5969j2001l113K8492L1214n5686p136O0240M844J633j7420k2708
$$ 151834 155843 181812 169811 166698 195190 226404 170718 163582 223822 228666 230299 212879 190171
4349A90171l6677N986L3965j8173K439k602m530J0414m4396J4546j3310K4846
$$ 190171 153494 159480 193445 175272 177711 175109 170579 180993 136597 151143 137833 162679
4337A62679k3609M401R618L173J726M98J6480k0241l368L5366j9280j4987J3521
$$ 162679 139070 143471 153089 156262 157988 158486 174966 154725 151357 186723 167443 152456 165977
4324A65977l992K0751j636J0888M2376O981n1244K4061l0980J8407k4185J4783
$$ 165977 161985 182736 181100 191988 234364 241345 190101 214162 183182 201589 177404 192187
4312A92187j40J1080J0476j0480O272J5497m7277J4175j1539J3828L9955j3837
$$ 192187 192047 203127 213603 203123 209395 224892 177615 191790 180251 194079 234034 220197
4300B20197p032M711J4422o811O533j4252L729j2577J2826M828K1329K2419N215
$$ 220197 213165 217876 232298 225487 232020 217768 221497 208920 221746 226574 247903 270322 275537
4287B75537k9044n117K7674J6504J0091k0175l6467r25L2028K1305j8304P996
$$ 275537 246493 241376 269050 285554 295645 275470 239003 238078 270106 291411 273107 281103
4275B81103k0743L2176k3474j016o88K1254j3326J2190L9377j4119R557l130J2332
$$ 281103 260360 292536 269062 268046 267358 288612 275286 287476 326853 312734 322291 319161 331493
4262C31493J854l6573m2953M8043K3179K367k124j9298J1510L851l717J4394R702
$$ 331493 333347 296774 253821 301864 325043 327410 325286 305988 317498 321349 317632 332026 341728
4249C41728M437J694r061L9060k8409n802j9048j9501N3102L0608J9078q509l6426
$$ 341728 346165 347859 338798 377858 349449 343647 324599 305098 358200 388808 407886 399377 362951
4236C62951n0691J20J9334j1930j1660M78J9369j6170j2898P571P817R605k1830
$$ 362951 312260 312380 331714 319784 308124 308602 327971 311801 298903 306474 314291 323896 302066
4223C02066N2029p771l1788L6078L119j9617j1680j5131j0970K078M4292N9894
$$ 302066 354095 346324 314536 350614 353733 334116 322436 307305 296335 298413 342705 402599
4211D02599k9379n1910R759m234m904K6911o447J7341r614K8179l2248k2111j0848
$$ 402599 373220 321310 331069 326835 321931 348842 342395 359736 350122 378301 346053 323942 313094
4198C13094K3272j4521O698K2571K0244J8460k8982N822r539L1643m505j4626
$$ 313094 336366 321845 328543 351114 371358 389818 360836 366658 357119 388762 384257 369631
4186C69631m554L3662P845j0486M390K5250k2735K9251J9188j6095j0197J076
$$ 369631 365077 398739 406584 396098 400488 425738 403003 432254 451442 435347 425150 426226
4174D26226M0138J6843k8805K694l809Q263p408l996j2440K0466K8331J0483J1287
$$ 426226 466364 483207 454402 457096 453287 461550 454142 450146 437706 458172 486503 496986 508273
4161E08273Q749j2071j5358K34Q877j2969L1045J2714J6971m1605J6224L2868
$$ 508273 517022 504951 489593 489827 498704 485735 516780 529494 546465 504860 521084 553952
4149E53952Q253J376l0164K1487K3393q0n582K6576j7053m629P784L073N7k4044
$$ 553952 562205 563581 533417 554904 578297 578217 572635 599211 582158 577529 585313 588386 588443 564399
4135E64399K4856K5225J7682L049J141J8578J8725q541l2731J2637Q545N9438
$$ 564399 589255 614480 632162 635211 636352 654930 673655 665114 632383 645020 653565 713003
4123G13003m811k34K9031J6137O972L86m474n337j0354O128K1017O219K7917J4055
$$ 713003 708192 707958 736989 753126 760098 760484 756010 750673 740319 746447 767464 773683 801600 815655
4109H15655L863K0608j0848k3825j932N677J3243O0275J4875M8801K0811N3332
$$ 815655 819518 840126 829278 805453 803521 809198 822441 882716 897591 946392 967203 1020535
4097A020535J8431q4J7216K2892K6700J0180K8651J2782m527O1330K4382K0418
$$ 1020535 1038966 1038882 1056098 1078990 1105690 1115870 1144521 1157303 1152776 1214106 1238488 1258906
4085A258906O2449K4890k6362J3697M8978j2295L8944J9480N9689N2072N9619
$$ 1258906 1321355 1346245 1319883 1333580 1382558 1370263 1409207 1428687 1488376 1540448 1600067
4074A600067o005L9669O0059L4388N0538Q221L8506M1092L5756J1330M8764R0560
$$ 1600067 1594062 1633731 1693790 1728178 1778716 1786937 1825443 1866535 1902291 1913621 1962385 2052945
4062B052945N1158n335L6613N0909M2533J7669K2997M2339N3804O239K8407K1098
$$ 2052945 2104103 2098768 2135381 2186290 2228823 2246492 2269489 2311828 2365632 2371871 2400278 2421376
4050B421376J3219M8015K0490J5811M0474L7446M5443m265L3733J6190j585M4870
$$ 2421376 2434595 2482610 2503100 2518911 2559385 2596831 2642274 2638009 2671742 2687932 2686347 2731217
4038B731217n388L2307K4902O9750J2573L8652L6018M8196O4406L9102K7483Q4268
$$ 2731217 2725829 2758136 2783038 2852788 2865361 2904013 2940031 2988227 3052633 3091735 3119218 3203486
4026C203486M1646Q0519R7447J06850J22310J35743J64548J60658K21193K03753
$$ 3203486 3245132 3325651 3423098 3529948 3652258 3788001 3952549 4113207 4334400 4538153
4016D538153K11268J53741J92988J78370J56425J79050K02933J87219K52821L02572
$$ 4538153 4749421 4903162 5096150 5274520 5430945 5609995 5812928 6000147 6252968 6555540
4006F555540L12421M63990N09612N45082N93737N47280L49005R8290j26049l79268
$$ 6555540 6867961 7331951 7841563 8386645 8980382 9527662 9876667 9974957 9848908 9469640
3996I469640n99879p36959p09409o46510n73664m58784l44959k78650j72709j22365
$$ 9469640 8869761 8132802 7423393 6776883 6203219 5744435 5399476 5120826 4948117 4825752
3986D825752q7552n6624q2661o3502p0856o6783m9456l2705l863R161J5665M4530
$$ 4825752 4738200 4681576 4598915 4535413 4464557 4397774 4348318 4315613 4311750 4320911 4336576 4381106
3974D381106O2984M1948k5826m9654m6987k1112J2636r713M8890P0746J07966
$$ 4381106 4444090 4486038 4460212 4410558 4363571 4342459 4355095 4345382 4394272 4465018 4572984
3963D572984N4162j8710q912o265K441k4202M5573J0259N4626R2269P6451O0170
$$ 4572984 4627146 4608436 4599524 4593259 4595700 4571498 4617071 4627330 4681956 4774225 4850676 4910846
3951D910846Q9232O7351J00563Q6149P9768P8230O6019R9082Q6084J19007J27379
$$ 4910846 5000078 5067429 5167992 5254141 5333909 5412139 5478158 5577240 5663324 5782331 5909710
3940E909710J37866J63198J63304J73523J85431J58092J15366P0360J00721R8967
$$ 5909710 6047576 6210774 6374078 6547601 6733032 6891124 7006490 7076850 7177571 7276538
3930G276538J49177J82031K28346J84561J82214J97414K05022J80084J70859K08997
$$ 7276538 7425715 7607746 7836092 8020653 8202867 8400281 8605303 8785387 8956246 9165243
3920I165243K09019K51345K84819L17567K95139K55366K53192K06535K59899K81615
$$ 9165243 9374262 9625607 9910426 10227993 10523132 10778498 11031690 11238225 11498124 11779739
3910A1779739L07618L13922L68133L43067L51116L75113M03144L75485L95492
$$ 11779739 12087357 12401279 12769412 13112479 13463595 13838708 14241852 14617337 15012829
3901A5012829M39695M19623M90823N20536N94299O46731O35507O47086P53001
$$ 15012829 15452524 15872147 16362970 16883506 17477805 18124536 18760043 19407129 20160130
3892B0160130Q17966R05592R80631J138186J247400J408270J548887J757479K049893
$$ 20160130 20978096 21883688 22864319 24002505 25249905 26658175 28207062 29964541 32014434
3883C2014434K354014K683110L070263L494462L984002M428236M617156M807787
$$ 32014434 34368448 37051558 40121821 43616283 47600285 52028521 56645677 61453464
3875F1453464N110933M867376M076938L148730K434017K344008L213731M543967
$$ 61453464 66564397 71431773 75508711 78657441 81091458 83435466 86649197 91193164
3867I1193164N937043O970150P262782N970620J660717l668210n962196n726165
$$ 91193164 97130207 104100357 111363139 117333759 118994476 115326266 109364070 103637905
3859A03637905m739263l049197j147069O90974K206326L198727K176707l089513
$$ 103637905 98898642 95849445 94702376 95393350 97599676 100798403 102975110 99885597
3851I9885597q836043r703324q183067o501271m996825l695165k593314j640504
$$ 99885597 91049554 81346230 73163163 66661892 61665067 57969902 55376588 53736084
3843E3736084p47470l42897j263896l373113m223497l606445k880346k208972
$$ 53736084 52988614 52645717 51381821 48008708 43785211 40178766 37298420 35089448
3835C5089448j719678j411785j152817r71613q49653p02429o17666n18614m01695
$$ 35089448 33369770 31957985 30805168 29833555 28983902 28281473 27663807 27145193 26743498
3826B6743498l65022k31795k20145j96905q8821l7523K2692N5643P3786J80069
$$ 26743498 26378476 26146681 25926536 25729631 25640810 25603287 25625979 25681622 25755408 25935477
3816B5935477K31601K54875L01762L43935L59000M18534M60728M87623N65685
$$ 25935477 26167078 26421953 26723715 27067650 27426650 27845184 28305912 28793535 29359220
3807B9359220O26801P00395P23805Q13006Q50150Q94089R77142J017985J084083
$$ 29359220 29986021 30686416 31410221 32223227 33073377 33967466 34944608 35962593 37046676
3798C7046676J190533J219128J307508J404905J512239J607239J681923J798274
$$ 37046676 38237209 39456337 40763845 42168750 43680989 45288228 46970151 48768425
3790D8768425J875275J977788K037164K159974K298159K359685K513765K579485
$$ 48768425 50643700 52621488 54658652 56818626 59116785 61476470 63990235 66569720
3782F6569720K629932K793557K939928K986125L104418L239414L312494L387661
$$ 66569720 69199652 71993209 74933137 77919262 81023680 84263094 87575588 90963249
3774I0963249L488442L456245L435657L445050L432183L396820L249756L280895
$$ 90963249 94451691 97907936 101343593 104788643 108220826 111617646 114867402 118148297
3766A18148297L211179L147185L076586L017793K957373K861515K725483K677547
$$ 118148297 121359476 124506661 127583247 130601040 133558413 136419928 139145411 141822958
3758A41822958K511895K303248K043535J722955J431618J089128Q35090N76967
$$ 141822958 144334853 146638101 148681636 150404591 151836209 152925337 153760427 154337394
3750A54337394L15675J95609M5480j17922k86496m36496o56801r46790j302290
$$ 154337394 154653069 154848678 154894158 154776236 154489740 154053244 153396443 152449653 151147363
3741A51147363j570795j893795k165657k313484k534337k634259k708965k792897
$$ 151147363 149576568 147682773 145517116 143203632 140669295 138035036 135326071 132533174
3733A32533174k885002k947026k976011l034070l184093l249727l288915l380610
$$ 132533174 129648172 126701146 123725135 120691065 117506972 114257245 110968330 107587720
3725A07587720l391659l393358l350252l365480l314928l247887l211399l077161
$$ 107587720 104196061 100802703 97452451 94086971 90772043 87524156 84312757 81235596
3717H1235596l054637k973917k909463k799899k730160k621437k564155k477733
$$ 81235596 78180959 75207042 72297579 69497680 66767520 64146083 61581928 59104195
3709E9104195k368424k356879k246154k184169k093024k012218j902324j829102
$$ 59104195 56735771 54378892 52132738 49948569 47855545 45843327 43941003 42111901
3701D2111901j745169j628527j515019j467526j402008j320218j255248j204952
$$ 42111901 40366732 38738205 37223186 35755660 34353652 33033434 31778186 30573234
3693C0573234j161709j110549j042335j004567r55159q64047q42007q00659p39017
$$ 30573234 29411525 28300976 27258641 26254074 25298915 24434868 23592861 22792202 22053185
3684B2053185o88802o86961n84345o06584n59828n12079m78312m35895m17403
$$ 22053185 21364383 20677422 20093077 19486493 18926665 18414586 17936274 17500379 17082976
3675A7082976m18894l16923l66598l59664l11112k98709k60117k64621k27847
$$ 17082976 16664082 16347159 15980561 15620897 15309785 15011076 14750959 14486338 14258491
3666A4258491j96445k29836j47787j24923j57090j48230j49689n7837n9882p4366
$$ 14258491 14062046 13832210 13684423 13559500 13402410 13254180 13104491 13046654 12986772 12912406
3656A2912406p6107p6592m0569m4629j2707j4486L646k2143j1742J5659n83J3448
$$ 12912406 12836299 12759707 12719138 12674509 12661802 12647316 12650962 12628819 12617077 12632736 12632153 12645601
3644A2645601j8940K5706k0316j3274n0122k1535l956Q539o151J8084K9628J543
$$ 12645601 12626661 12652367 12632051 12618777 12568655 12547120 12543164 12551703 12545552 12563636 12593264 12594807
3632A2594807j4249m0905K2807k246r4023n0268l4068o162j4618l278J2921J3435
$$ 12594807 12580558 12539653 12562460 12560214 12466191 12415923 12381855 12375693 12361075 12357797 12370718 12384153
3620A2384153J9810M3423M548j7882L6253K808J1687J8083O6690Q9853P7834N7218
$$ 12384153 12403963 12447386 12451934 12434052 12470305 12473113 12484800 12502883 12569573 12659426 12737260 12794478
3608A2794478Q2294R3450R2072R9280P4021J56298J50901J60062J61948J61859
$$ 12794478 12876772 12970222 13062294 13161574 13235595 13391893 13542794 13702856 13864804 14026663
3598A4026663J95990K13501K22186K33838K27961K64878K90925K89772L27589
$$ 14026663 14222653 14436154 14658340 14892178 15120139 15385017 15675942 15965714 16293303
3589A6293303L15588K68035K94119L65688L13922L06648L84679L79535L96192
$$ 16293303 16608891 16876926 17171045 17536733 17850655 18157303 18541982 18921517 19317709
3580A9317709M43131M24249M60398M66033M74612N55985N68205N61952N54613
$$ 19317709 19760840 20185089 20645487 21111520 21586132 22142117 22710322 23272274 23826887
3571B3826887O21833O73900O41209O76040P00254P68537P66293P60545Q14599
$$ 23826887 24448720 25122620 25763829 26439869 27140123 27908660 28674953 29435498 30250097
3562C0250097Q34954Q43985Q58175R52155J004019J037765J108070J172148J202969
$$ 30250097 31085051 31929036 32787211 33739366 34743385 35781150 36889220 38061368 39264337
3553C9264337J294541J418460J510577J616833J750557J887232K092416K328606
$$ 39264337 40558878 41977338 43487915 45104748 46855305 48742537 50834953 53163559
3545E3163559K555075K808684L149867L541430L984831M433096M975810N632637
$$ 53163559 55718634 58527318 61677185 65218615 69203446 73636542 78612352 84244989
3537H4244989O308722P075320P918780Q799398R841746J0888767J2056467J3248174
$$ 84244989 90553711 97629031 105547811 114347209 124188955 135077722 147134189 160382363
3529A60382363J4115139J4571238J4188692J2721576J0207056O967029L627656
$$ 160382363 174497502 189068740 203257432 215979008 226186064 233153093 236780749
3522B36780749O98229j469280k627219k964285k749332k071666j267293o57410
$$ 236780749 237478978 236009698 233382479 230418194 227668862 225597196 224329903 223672493
3514B23672493k04620j58580n64874j537657l164349n499544q189448j0763198
$$ 223672493 223467873 223309293 222744419 221206762 218042413 212542869 204353421 193590223
3506A93590223j2811426j3912629j4106331j3538101j2266423j0788705r350889
$$ 193590223 180778797 166866168 152759837 139221736 126955313 116166608 106815719
3499A06815719q075301o965315o097546n348761m736376m218144l758676l387229
$$ 106815719 98740418 91775103 85677557 80328796 75592420 71374276 67615600 64228371
3491F4228371l078228k777283k502884k306542k161988k030501j822590j604281
$$ 64228371 61150143 58372860 55869976 53563434 51401446 49370945 47548355 45944074
3483D5944074j471039j394745j299787j125748j005453r16336q74820p75760p10290
$$ 45944074 44473035 43078290 41778503 40652755 39647302 38730966 37856146 37080386 36370096
3474C6370096o58766n81967n28739m89513m12353m05947l48134k90016k88966
$$ 36370096 35711330 35129363 34600624 34111111 33698758 33292811 32944677 32654661 32365695
3465C2365695j85715j89529j28316q4679l3312R735N7558J14187J46589J61262
$$ 32365695 32179980 31990451 31862135 31777456 31744144 31753879 31811437 31925624 32072213 32233475
3455C2233475J87870K43551K76576K55751K71856K17390K69167L12322K90296
$$ 32233475 32421345 32664896 32941472 33197223 33469079 33686469 33955636 34267958 34558254
3446C4558254L31030M01122M35670M41141N05214N29852O11347O91378P14996
$$ 34558254 34889284 35290406 35726076 36167217 36672431 37202283 37813630 38505008 39220004
3437C9220004P66351Q35834Q79401Q98197R67481R51119J047506J008323J065536
$$ 39220004 39986355 40822189 41701590 42599787 43567268 44518387 45565893 46574216 47639752
3428D7639752J128310J117326J100866J111484J158388J254440J293691J349694
$$ 47639752 48768062 49885388 50986254 52097738 53256126 54510566 55804257 57153951
3420E7153951J399121J516310J585957J593349J616953J531533J430165J350192
$$ 57153951 58553072 60069382 61655339 63248688 64865641 66397174 67827339 69177531
3412F9177531J273103J211142J180643J102889J144443J184348J262006J269741
$$ 69177531 70450634 71661776 72842419 73945308 75089751 76274099 77536105 78805846
3404G8805846J324140J365539J388535J370271J354063J281558J309024J340618
$$ 78805846 80129986 81495525 82884060 84254331 85608394 86889952 88198976 89539594
3396H9539594J326394J386589J475892J572957J690084J963292K096204K285200
$$ 89539594 90865988 92252577 93728469 95301426 96991510 98954802 101051006 103336206
3388A03336206K580653K826091L076256L364853L752822M200816M605876N143610
$$ 103336206 105916859 108742950 111819206 115184059 118936881 123137697 127743573 132887183
3380A32887183N750599O405695P099797P911205Q767947R614197J0566885J1566233
$$ 132887183 138637782 145043477 152143274 160054479 168822426 178436623 189003508 200569741
3372B00569741J2692866J3862325J5198302J6557896J8054735J9585873K0952158
$$ 200569741 213262607 227124932 242323234 258881130 276935865 296521738 317473896
3365C17473896K1865423K1668964K0148142J7599850J4676297J1905352R540732
$$ 317473896 339339319 361008283 381156425 398756275 413432572 425337924 434878656
3358D34878656P569664O114888N406212N279789N592404O124411O507076O653009
$$ 434878656 442448320 448563208 453969420 459249209 464841613 470966024 477473100 484126109
3350D84126109O331321N502041M223495K481540K53677k872876o937010j1009179
$$ 484126109 490457430 495959471 500182966 502664506 502918183 500045307 493108297 482099118
3342D82099118j3530868j4140807j3317989j1874708j0474382r366142q713429
$$ 482099118 468568250 454427443 441109454 429234746 418760364 409394222 400680793
3335D00680793q348105q375316q627929q916276r377004r850336j0307689j0796007
$$ 400680793 392332688 383957372 375329443 366413167 357036163 347185827 336878138 326082131
3327C26082131j1106473j1281759j1132717j0883098j0421148r893891r422688
$$ 326082131 314975658 303693899 292561182 281678084 271256936 261363045 251940357
3320B51940357q947225q722385q590583q516967q426508q286205q116115p885482
$$ 251940357 242993132 234270747 225680164 217163197 208736689 200450484 192334369 184448887
3312A84448887p580951p134954o521509n720042m830639l966372l027480k342234
$$ 184448887 176867936 169732982 163211473 157491431 152660792 148694420 145666940 143324706
3304A43324706j754177j441594j235701j244122j380312j607180j929711k245644
$$ 143324706 141570529 140128935 138893234 137649112 136268800 134661620 132731909 130486265
3296A30486265k380108k381755k218303k015123j886848j669511j516488j424718
$$ 130486265 128106157 125724402 123506099 121490976 119604128 117934617 116418129 114993411
3288A14993411j463101j613848j951057k391689k766678l054398l231179l273982
$$ 114993411 113530310 111916462 109965405 107573716 104807038 101752640 98521461 95247479
3280I5247479l271167l226059l116945k987182k819567k704165k632543k504826
$$ 95247479 91976312 88750253 85633308 82646126 79826559 77122394 74489851 71985025
3272G1985025k454322k361711k219858k044357j923123j734150j648596j556211
$$ 71985025 69530703 67168992 64949134 62904777 60981654 59247504 57598908 56042697
3264E6042697j492466j453080j512181j567626j604687j615558j660026j590698
$$ 56042697 54550231 53097151 51584970 50017344 48412657 46797099 45137073 43546375
3256D3546375j589391j499464j389096j384605j259927j157714j079486j029003
$$ 43546375 41956984 40457520 39068424 37683819 36423892 35266178 34186692 33157689
3248C3157689r68061q78484q27756p99485p22178p63604p19729o36232n80074
$$ 33157689 32189628 31311144 30483388 29683903 28961725 28198121 27478392 26842160 26262086
3239B6262086o29975o07621n20006n22509n41460m92419m48822m28105m71602
$$ 26262086 25632111 25024490 24504484 23981975 23440515 22948096 22499274 22071169 21599567
3230B1599567m21487l92319m23658l94655l41121l74108l42121l65018l29494
$$ 21599567 21178080 20785761 20362103 19967448 19626327 19252219 18910098 18545080 18215586
3221A8215586l19006k93783l19457l15441l16246l53730l04186k92273k85188
$$ 18215586 17896580 17602797 17283340 16967899 16651653 16297923 15993737 15701464 15416276
3212A5416276l06490k46907k80073k69942k54613k37765k65120k15731k02663
$$ 15416276 15109786 14862879 14582806 14312864 14058251 13820486 13555366 13339635 13136972
3203A3136972k16905k26103j36429j82400j83447j03910j82273j58461j12517
$$ 13136972 12920067 12693964 12557535 12375135 12191688 12087778 11905505 11747044 11634527
3194A1634527j57531j42870j41752j41759j08825j39204j56911j06463j05922
$$ 11634527 11476996 11334126 11192374 11050615 10941790 10802586 10645675 10539212 10433290
3185A0433290j53888j73317j21559p3986j21422r9809p8636j21556j13194p9231
$$ 10433290 10279402 10106085 9984526 9910540 9789118 9689309 9610673 9489117 9375923 9296692
3175I296692j11455p4013j14418p8424r0388q6400m5643j21274q8653o0629q3051
$$ 9296692 9185237 9111224 8996806 8918382 8827994 8741594 8695951 8574677 8486024 8425395 8342344
3164H342344q0641n4928n7471p7906q4419o9094o6236l4182o8333n5582m3259
$$ 8342344 8261703 8206775 8149304 8071398 7986979 7917885 7851649 7817467 7749134 7693552 7650293
3153G650293k9103o8365k7664o1088l5830l3409n3866l0400n147j5854k5295l3487
$$ 7650293 7621190 7552825 7525161 7464073 7428243 7394834 7340968 7310568 7305421 7289567 7264272 7230785
3141G230785m6197j1085n4402L9751J671j5288k6415j4530O428L8632O1117j6185
$$ 7230785 7184588 7173503 7119101 7158852 7160523 7145235 7118820 7104290 7110718 7149350 7210467 7194282
3129G194282k4723K2300R473l671L0658l8903k7066K8029M2939J9648J875M4161
$$ 7194282 7169559 7191859 7201332 7197661 7228319 7189416 7162350 7190379 7233318 7252966 7254841 7299002
3117G299002R613K905M1182L0532K7607L7728R986L5881J5402L7456J3626N4900
$$ 7299002 7308615 7311520 7352702 7383234 7410841 7448569 7458555 7494436 7509838 7547294 7560920 7615820
3105G615820N2621K2162N7393L7325M6599O0506O1992P4496N4899P5408R8648
$$ 7615820 7668441 7690603 7747996 7785321 7831920 7892426 7954418 8028914 8083813 8159221 8257869
3094H257869M6060P8074P9517J14699J15163R5329J35585J19023J01886J25949
$$ 8257869 8303929 8382003 8461520 8576219 8691382 8786711 8922296 9041319 9143205 9269154
3084I269154J47652J47177J68554J40433J27099J59131J85591J58725J46961J36844
$$ 9269154 9416806 9563983 9732537 9872970 10000069 10159200 10344791 10503516 10650477 10787321
3074A0787321K12144K11707J93544J66282J42366J80652J59425J70095J66623
$$ 10787321 10999465 11211172 11404716 11570998 11713364 11894016 12053441 12223536 12390159
3065A2390159J61336J79534J59555J65854J94399J97427J85260J82048J32575
$$ 12390159 12551495 12731029 12890584 13056438 13250837 13448264 13633524 13815572 13948147
3056A3948147J14022J05444J38246J42361Q3504J18777R8217J02061J32064J01390
$$ 13948147 14062169 14167613 14305859 14448220 14531724 14650501 14748718 14850779 14982843 15084233
3046A5084233J04992J16400J57228J92806J37543J41571J82348K35089J88307
$$ 15084233 15189225 15305625 15462853 15655659 15793202 15934773 16117121 16352210 16540517
3037A6540517K01587K16769K02998K36504K32741K45547K53465K49982K30949
$$ 16540517 16742104 16958873 17161871 17398375 17631116 17876663 18130128 18380110 18611059
3028A8611059K68273L36650L65026L33828L68881L80923M45336N12512N18638
$$ 18611059 18879332 19215982 19581008 19914836 20283717 20664640 21109976 21622488 22141126
3019B2141126N59570N54757N59575N58818N16232M30757L69624L11363J32024
$$ 22141126 22700696 23255453 23815028 24373846 24890078 25320835 25690459 26001822 26133846
3010B6133846N7063k178j49073k07313k67004k44645k24552j74630j72753j79363
$$ 26133846 26190909 26188731 26039658 25832345 25565341 25320696 25096144 24921514 24748761 24569398
3000B4569398j61014j87656k50218k68919k29852k30888k60385k51202k98946
$$ 24569398 24408384 24220728 23970510 23701591 23471739 23240851 22980466 22729264 22430318
2991B2430318k66155k82552k57124k56453k69013k66389l03927k65827k49471
$$ 22430318 22164163 21881611 21624487 21368034 21099021 20832632 20528705 20262878 20013407
2982B0013407k42355k41952k45301k73006k48572k57798k42982k21913k26241
$$ 20013407 19771052 19529100 19283799 19010793 18762221 18504423 18261441 18039528 17813287
2973A7813287k32497k48077k47125k31829k45551k25279k35171k48830k42031
$$ 17813287 17580790 17332713 17085588 16853759 16608208 16382929 16147758 15898928 15656897
2964A5656897k28698k49747k53691k38497k47928k44754k51034k63541k10928
$$ 15656897 15428199 15178452 14924761 14686264 14438336 14193582 13942548 13679007 13468079
2955A3468079k05351k54009k26227k22890j97107j99777j89101j74319k04214
$$ 13468079 13262728 13008719 12782492 12559602 12362495 12162718 11973617 11799298 11595084
2946A1595084j95496j74984j83208j67752j70232j76258j33478j20804j71757
$$ 11595084 11399588 11224604 11041396 10873644 10703412 10527154 10393676 10272872 10101115
2937A0101115j53800j24605j67672k20307j53065j77988k16228j31504r7592j48558
$$ 10101115 9947315 9822710 9655038 9434731 9281666 9103678 8887450 8755946 8658354 8509796
2927H509796j36925j45242j59890j10046j50313j00166p5269j39251q6169q1736
$$ 8509796 8372871 8227629 8067739 7957693 7807380 7707214 7631945 7492694 7406525 7324789
2917G324789j02325j28870r7879p5823q4396p5001r5334n9797o8298q3215j17959
$$ 7324789 7222464 7093594 6995715 6919892 6835496 6760495 6665161 6605364 6537066 6453851 6335892
2906F335892q1915o0875n3773p6334n9941n9718j4409m8284p9930m4448k2181
$$ 6335892 6253977 6193102 6139329 6062995 6003054 5943336 5928927 5880643 5800713 5756265 5734084
2895E734084j7318l1315n945l4202r017J6407R468L0544Q5967M2510Q7951J21788
$$ 5734084 5716766 5685451 5679506 5645304 5636287 5652694 5662162 5692706 5778673 5821183 5909134 6030922
2883F030922J30769K11611K70603K09611j18695l81349l93697l50340k34424j76751
$$ 6030922 6161691 6373302 6643905 6853516 6734821 6353472 5959775 5609435 5375011 5198260
2873E198260j71554j50890j22081o0759m1526k1759k6800m9106n5406o453K0395
$$ 5198260 5026706 4875816 4753735 4692976 4651450 4629691 4602891 4553785 4498379 4491926 4512321
2862D512321J9959P719K4084N1045M6608N9261J31443J54560J67772K17321K32599
$$ 4512321 4532280 4539999 4564083 4615128 4661736 4720997 4852440 5007000 5174772 5392093 5624692
2851E624692l6212l73405m14274l30088k65773j87640j76841j45298r3921p4374
$$ 5624692 5588480 5215075 4800801 4470713 4204940 4017300 3840459 3695161 3601240 3526866
2841C526866q2788m5625j04487o9060k2557l0962o3354o9330n9778n3609J6021
$$ 3526866 3444078 3398453 3293966 3224906 3202349 3171387 3108033 3038703 2978925 2925316 2941337
2830B941337n8402l3390l5234n1881k8330j3213p8620m3401M763k2887k3891j4262
$$ 2941337 2882935 2849545 2814311 2762430 2734100 2720887 2642267 2598866 2603629 2580742 2556851 2542589
2818B542589l9482o1045n878j1672j7430m4548m5761K021k5712J5748l4484l0468
$$ 2542589 2503107 2442062 2436184 2424512 2407082 2362534 2316773 2318794 2293082 2308830 2274346 2243878
2806B243878K493o2605k6921K753L9586l8234m8195J0729P577m3972l5133p765
$$ 2243878 2246371 2183766 2156845 2159598 2199184 2160950 2112755 2123484 2131061 2087089 2051956 2044191
2794B044191j8699j7695L9884l7535r992L802M855r73k1039k5925J3266L6474
$$ 2044191 2025492 2007797 2047681 2010146 2000154 2003956 2008811 2007838 1986799 1960874 1974140 2010614
2782B010614k8734k1287l0608r985j775J3874j8812K2330n921J1036L4304K9152
$$ 2010614 1981880 1960593 1929985 1920000 1918225 1932099 1913287 1935617 1929696 1940732 1975036 2004188
2770B004188j2820m7631m193J5165K7648M0059o599J2505J2942k8742K6310L4712
$$ 2004188 1991368 1943737 1939544 1954709 1982357 2022416 2015817 2028322 2041264 2012522 2038832 2073544
2758B073544K083k458M27K2589R265N249k4732l8005j9762K5683k0415k5995M2324
$$ 2073544 2075627 2073169 2073596 2096185 2105450 2110699 2085967 2047962 2028200 2053883 2033468 2007473 2049797
2745B049797j608j0780L0181j1098L5953K9401R276J7150L2486K3206J4337K2481
$$ 2049797 2048189 2037409 2067590 2056492 2092445 2121846 2131122 2148272 2180758 2203964 2218301 2240782
2733B240782J9202n667L7966Q317N9101O5575J4763L2050N2867O7624n76K1892
$$ 2240782 2259984 2254317 2292283 2300600 2359701 2425276 2440039 2472089 2524956 2592580 2592004 2613896
2721B613896P0867N3077J9082Q163M599j8762K7009M3616J4369R061J5585M7673
$$ 2613896 2684763 2737840 2756922 2765085 2769684 2750922 2777931 2821547 2835916 2844977 2860562 2908235
2709B908235N3998O8350O0090M4535O2732J00806J04116J53754J02457Q1596J32726
$$ 2908235 2962233 3030583 3090673 3135208 3197940 3298746 3402862 3556616 3659073 3740669 3873395
2698C873395J84628J80872J41372J62513J40727J27259Q3363O1969P842K8406
$$ 3873395 4058023 4238895 4380267 4542780 4683507 4810766 4894129 4956098 4963940 4992346
2688D992346K9523j8130K5625J7631J4612L1804J3970l7388J4638N1715Q1755
$$ 4992346 5021869 5003739 5029364 5046995 5061607 5093411 5107381 5069993 5084631 5136346 5218101
2677E218101O2891O0281O3530N9817Q2108J30863J51838K14305K48592L25410
$$ 5218101 5280992 5341273 5404803 5464620 5546728 5677591 5829429 6043734 6292326 6617736
2667F617736L65548M06645M56819L54845L5758l67209n81618o07822n71733l83480
$$ 6617736 6983284 7389929 7846748 8201593 8237351 7870142 7288524 6680702 6108969 5725489
2657E725489l42760l05634k31517k26080j36176j01687j40127j01393m8397j04260
$$ 5725489 5382729 5077095 4845578 4619498 4483322 4381635 4241508 4140115 4091718 3987458
2647C987458m9574m0646l8153J781p064O435m302k1951M6533M0637J97N4709L8224
$$ 3987458 3937884 3897238 3859085 3860866 3853802 3860237 3855935 3833984 3880517 3921154 3921351 3976060 4014284
2634D014284J3463k9582q9919j52273j68345j87317j45826j58790j57765j22362
$$ 4014284 4027747 3998165 3908246 3755973 3587628 3400311 3254485 3095695 2937930 2815568
2624B815568r6723r8577p0400m7645r0458p2325j05207r5739q4068p7033r0764
$$ 2815568 2718845 2620268 2549868 2502223 2411765 2339440 2234233 2138494 2054426 1977393 1886629
2613A886629k6965n2769o9663m7438p3298n3587n8334k6656m7229p0270k8420
$$ 1886629 1859664 1806895 1737232 1689794 1616496 1562909 1504575 1477919 1430690 1360420 1332000
2602A332000K679k0142l0339l8547k7709q308j8402n236q144j3869k0619m2054
$$ 1332000 1334679 1314537 1284198 1245651 1217942 1209634 1191232 1185996 1177852 1163983 1143364 1101310
2590A101310j5777k0323k9208k0054j0840L186l5569k5729J3767k7924J9397l8347
$$ 1101310 1085533 1065210 1036002 1015948 1005108 1008294 972725 946996 960763 932839 952236 913889
2578I13889l9180J9522j2116j8531m5351k7187q016J0449k516N86k3141Q802l1546
$$ 913889 874709 894231 882115 863584 818233 791046 783030 793479 790963 791549 768408 777210 745664
2565G45664r430N360k429K4506k0220K7480J3063k3883m4048l3878k2166k8313
$$ 745664 736234 741594 739165 763671 743451 770931 783994 760111 716063 682185 660019 631706
2553F31706K197j4111M3080K2413k6257n0131K600L2662m654P752k8557k5600
$$ 631706 633903 619792 662872 685285 659028 608897 611497 644159 639505 647257 618700 593100
2541E93100K2759j6075L350M971P256k1020j9462J570J7924L546q8654L66O6464
$$ 593100 615859 599784 603134 608105 615361 594341 574879 576449 594373 597919 509265 509631 576095
2528E76095j702j3437k5318L011k6370N917J0590N856l9883P941L0345L554j176
$$ 576095 574393 560956 535638 538649 512279 518196 528786 534642 494759 502700 533045 536599 535423
2515E35423l4263j6338k4930k750J0100L4231j9816l0693K98q243k8916J8980
$$ 535423 501160 484822 459892 457142 467242 501473 481657 450964 451262 443019 414103 433083
2503D33083K5234M840L0421m3984L885m197k1233L0157j5460n289j4149L160j3749
$$ 433083 458317 463157 493578 449594 453479 449282 428049 458206 442746 437457 423308 426468 412719
2490D12719k7220N1479J0821k2253k1066R398r514K7147k3977q042j8736j2948
$$ 412719 385499 436978 447799 425546 404480 413878 404364 431511 407534 399492 380756 367808
2478C67808J6718J8810j913J401k5894r015K7411k9830R320L670L2322j8211K1470
$$ 367808 384526 403336 401423 402824 376930 367915 395326 365496 374816 378486 410808 392597 414067
2465D14067j8419j649m4122J9296K905l230K454M960N526L652K8642k1583j6889
$$ 414067 395648 393999 349877 369173 372078 368848 371302 376262 381788 385440 414082 392499 375610
2452C75610r201L5348O05l9423k558r660l5487l254O6614M768j2661p520J6322
$$ 375610 366409 401757 402362 362939 360381 350721 315234 311980 378594 383362 370701 363181 379503
2439C79503k9248L547L4273L5913K599p447n745l344J1016K951J210l4566k7868
$$ 379503 350255 353802 388075 423988 426587 419140 413395 410051 421067 424018 425228 390662 362794
2426C62794j0792K3689K7065j7681j905K0321P006n471o289k739N650l1844k61
$$ 362794 352002 375691 402756 385075 383170 403491 410497 405026 398737 395998 401648 369804 369543
2413C69543J1027K7840n370k2022n376l3907q061L4966K2967K3176K2435j8830
$$ 369543 380570 408410 403040 381018 375642 341735 333674 368640 391607 414783 437218 418388
2401D18388K4404O935k7646K9946K7683j9344o584k2175j6808J9392J0648J4825
$$ 418388 442792 449727 422081 452027 479710 460366 453782 431607 414799 434191 444839 459664
2389D59664L5666n2129j1863N208J7172R182L067L7099K365n362K599r395M990
$$ 459664 495330 443201 431338 436546 453718 462900 465967 503066 505431 500069 502668 493273 498263
2376D98263R246j311j7205M158J2467J8646k9868j1606L0851M432j841k5057K7938
$$ 498263 507509 506198 488993 493151 505618 524264 494396 482790 513641 518073 516232 491175 519113
2363E19113k8590k9441K4022j0572j6558j0475J4694J8243n318k7253j3060M4587
$$ 519113 490523 461082 485104 474532 457974 447499 462193 480436 475118 447865 434805 479392
2351D79392l11o892M7609J0147J0418k4231R879J7088j876k9079J8961K5794j729
$$ 479392 479081 472189 519798 529945 540363 516132 526011 543099 541223 512144 531105 556899 555170
2338E55170J3377l0353m7040n977l0332J2636L899J849k857P120l3533j94j6818
$$ 555170 568547 538194 491154 485177 454845 467481 471380 473229 470372 477492 443959 443765 426947
2325D26947j207J7055J3243R540m298j8199m0049J5712R181K84L0748k1843l1381
$$ 426947 425740 442795 456038 465578 461280 443081 403032 418744 427925 428209 458957 437114 405733
2312D05733K185J8254K030j2080L7162j398j8661j3096p017j1955n0094o505J1133
$$ 405733 407918 426172 428202 416122 453284 451886 433225 420129 413112 401157 351063 344558 355691
2299C55691K3j0547J3313J7790k5104N702m398k5130n411J0227k1531p744L4964
$$ 355691 355714 345167 358480 376270 351166 356868 352470 327340 321929 332156 310625 302881 337845
2286C37845j6033j5499p049l6963J5688K1725j694o773N385l6165L0112r140n7196
$$ 337845 321812 306313 299264 262301 277989 299714 298020 291247 296632 260467 290579 281439 224243
2273B24243J4368K2383J8790Q298Q222n6055k4556k614j2357k1220K1748O3254
$$ 224243 238611 260994 279784 288082 296304 240249 215693 213079 200722 179502 201250 264504
2261B64504m9434j8838k8639M5820K3770l086j192K1160r441l4840r393J264M910
$$ 264504 215070 196232 167593 213413 237183 234097 232905 254065 244624 209784 200391 201655 206565
2248B06565K3436k8766k8108L9078K8150n003m5712J2822K336j5322J5638j3589
$$ 206565 230001 201235 173127 212205 240355 235352 189640 202462 204798 189476 205114 191525
2236A91525j2495n137K9075j0707L095j8837n809k211p190J2903J6069q484L6052
$$ 191525 179030 173893 202968 192261 195356 176519 170710 168499 161309 174212 190281 181797 217849
2223B17849k579j3808j7535k3206k962M637l458k2864K6017n344J4938R153P248
$$ 217849 215270 201462 183927 160721 157759 162396 158938 136074 162091 156747 171685 180838 188086
2210A88086J4019o561j7922K1631n480j0817q980j6835m4357Q398p317L0986K86
$$ 188086 202105 195544 177622 199253 193773 182956 173976 157141 112784 121182 113865 144851 145137
2197A45137L4847l303l0640q71j3292Q826Q446o377j296K0145J0993q474O864
$$ 145137 179984 176681 146041 145170 131878 140704 149150 142773 141477 161622 172615 164141 171005
2184A71005K2229o7327L1270L4630j7149p193l2302j3115J3904j4540j3336J1192
$$ 171005 193234 125907 157177 191807 174658 167465 135163 122048 135952 121412 108076 119268
2172A19268J933k7587M1604k3875N928j4952L80M4811k1929J3675K0p385o980
$$ 119268 121201 93614 135218 111343 117271 102319 102699 147510 125581 139256 139276 131891 124911
2159A24911J3727j5919j3486K7162m7450n953M2673j9510K8457j3891L0047M3900
$$ 124911 138638 122719 109233 136395 88945 82992 125665 106155 134612 120721 150768 194668
2147A94668j1293l4246j7106K0277k0070k4019J6561J6424K7291j960q405m4802
$$ 194668 183375 149129 132023 152300 132230 108211 124772 141196 168487 166527 158122 113320
2135A13320N854M3676J1636j6086K2710J9670J4437k3850l4402k3014J7908L3945
$$ 113320 119174 162850 174486 158400 181110 200780 215217 191367 156965 133951 151859 185804
2123A85804k2763n4479L5169M2605q166l1330j1828J6271l045j2206r911k1157
$$ 185804 163041 108562 143731 186336 178170 146840 135012 151283 148238 136032 126121 104964
2111A04964J717J4188j6927J7987L146k3552J2794K9076J145l7991q451k5202
$$ 104964 106681 120869 103942 121929 125075 101523 114317 143393 144538 106547 98096 72894
2099G2894k3217N6053K9379M324j3141j8373K2373J145j352Q063j4713l3455J7353
$$ 72894 49677 105730 135109 139433 126292 107919 130292 131437 130085 138148 123435 89980 107333
2086A07333K9637j8000q370L241q428j948j9497J7290L0362k820J9382j9521j8361
$$ 107333 136970 118970 110600 113841 105413 103465 83968 101258 131620 128800 148182 128661 110300
2073A10300K1339J8104m2833r364R206J4214R572j8791k5315j564o699L4204K8545
$$ 110300 131639 149743 106910 97546 106752 120966 130538 111747 86432 84868 78169 112373 140918
2060A40918Q411m305o601k5498l2329N502k0607J9567J0513j8524M672k5619L1920
$$ 140918 149329 145024 138423 112925 80596 86098 65491 85058 95571 77047 81719 56100 88020
2047H8020M0057l8786k37M0269k4943L5873l675j7253o230M914j9199P456m1621
$$ 88020 128077 89291 89054 129323 104380 140253 136578 119325 113095 118009 98810 106266 64645
2034F4645K4303L9826O523j0012j1282K364k7836k4659L326R578K976L8277L674
$$ 64645 88948 128774 135297 125285 114003 116367 88531 63872 67198 76776 79752 118029 121703
2021A21703J8075J0666J5611R264n2591j4061j4803j4857L2930P784k7132l2663
$$ 121703 139778 150444 166055 175319 122728 108667 93864 79007 111937 119721 92589 59926
2009E9926K4062J7031j7558k8900K5697L7365k1157j6635M6816l664k3868k3140
$$ 59926 83988 101019 83461 54561 80258 117623 96466 79831 126647 122983 99115 75975
1997G5975J2563J3730O925J3857j8241j2253Q864j792j3616K570J3840n0554R849
$$ 75975 88538 102268 109193 123050 104809 92556 101420 99628 86012 88582 102422 51868 61717
1984F1717N3055M1927J0303j5727k5360p909N510J9865J7197n2428l1O8813J3479
$$ 61717 114772 156699 167002 151275 125915 118006 123516 143381 160578 108150 108119 176932 190411
1971A90411l5014J904p675K975O263J16L408M969N22j5399J3077j369J2557L1863
$$ 190411 155397 157301 149626 152601 158864 158980 162388 167357 167879 152480 165557 164188 176745 208608
1957B08608J6070m4455l074J8182r218j2463J8924J6472j7978J1723l0397o155
$$ 208608 224678 180223 177149 195331 186113 173650 192574 209046 191068 202791 172394 166239
1945A66239J1783J0583m045J210K2649K3233M644N196L952K5519L8604J0282j2017
$$ 166239 178022 188605 184560 185770 208419 231652 236296 241492 245444 270963 309567 319849 307832
1932C07832k672K1879J5462l818k6291M3561M964m6200j1041J0076J8805L9710
$$ 307832 305160 327039 342501 338683 312392 355953 360917 314717 303676 313752 332557 372267
1920C72267K6159L01l6867K4957K1163K9291K7409q088j4855L7500L486k346p940
$$ 372267 398426 398727 361860 386817 407980 437271 464680 456592 441737 479237 482723 480377 472437
1907D72437J4823L1084O498R831K5818K9750M030K0442L9881N4833K1447P403
$$ 472437 487260 518344 524842 534673 560491 590241 594271 614713 654594 709427 730874 738277
1895G38277K0338j2676j5530O1033M0919Q0108K5696O4475L8013M3847K0787N3420
$$ 738277 758615 745939 730409 791442 832361 912469 938165 1002640 1040653 1084500 1105287 1158707
1883A158707P7277J01354J33115J32596J14316J59546K06764J21676J28343J54411
$$ 1158707 1235984 1337338 1470453 1603049 1717365 1876911 2083675 2205351 2333694 2488105
1873B488105K69785K81768L64595M22029M70287O10825O96483Q54600J009764
$$ 2488105 2757890 3039658 3404253 3826282 4296569 4907394 5603877 6458477 7468241
1864G468241J342452J551149L17167j583921j909214j483295j048152o90195m97982
$$ 7468241 8810693 10361842 10679009 9095088 7185874 5702579 4654427 3964232 3466250
1855C466250m13989l07274k26957j96547j40456j47618m9493q5169r3082r7592
$$ 3466250 3052261 2744987 2518030 2321483 2181027 2033409 1983916 1898747 1805665 1708073
1845A708073j51483j52709m3963p4202j05910n2640p1664n4139n5695m3877l4503
$$ 1708073 1556590 1403881 1359918 1285716 1179806 1127166 1055502 1001363 945668 901791 867288
1834H67288n7596m6387l9114n935n879j5549l0596m8620j878m4006l0863j2459
$$ 867288 809692 763305 724191 718256 712377 696828 666232 617612 615734 571728 540865 528406
1822E28406l7259k1997R8J5254k3676n411k8108l320j6118o293j932j7830q957
$$ 528406 491147 469150 469248 484502 460826 455415 427307 423987 407869 401576 399644 381814 372857
1809C72857o802r829K1306k8727n1873k0706L2089L74k8392K605M400j8544Q965
$$ 372857 366055 356226 377532 348805 296932 276226 308315 308689 280297 282902 287302 268758 277723
1796B77723l6876j5336k074k5152p929J7062L1163k1116l1707k2585m498M5201
$$ 277723 240847 225511 223437 198285 190356 207418 238581 217465 185758 163173 158675 203876
1784B03876J7150l2548o900L001J7141p616j169k2359l3837M732J0741O001N420
$$ 203876 221026 188478 181578 184579 201720 194104 192935 170576 136739 141471 152212 158213 163633
1771A63633q687j488p586P540l8561L6953K6129q576j7577O778q640k0550j3247
$$ 163633 154946 153458 145872 153412 114851 151804 177933 169357 151780 158558 149918 129368 116121
1758A16121J4743j1943j418q000j8080M6105j4634j3402J8422N316k6531J200
$$ 116121 130864 118921 117503 109503 91423 137528 122894 109492 127914 133230 106699 107899
1746A07899J5722k8151N13p129M44K2724j5780l0360K608q89J4257K5908L0541
$$ 107899 123621 95470 95983 88854 89298 112022 96242 65882 68490 67601 81858 107766 138307
1733A38307k4195L900J3533k0589m1369M181J4698j512R699l9058K6262L340J8505
$$ 138307 114112 118012 131545 110956 69587 73768 88466 86954 96653 57595 83857 87197 105702
1720A05702m515k3219j1197r228L5101n054k0622J3675L079L2413k9335j6464
$$ 105702 101187 77968 66771 57543 92644 87590 66968 80643 83722 116135 86800 70336
1708G0336l2877m824N2318M625l3579q206j9780r881M2194J7608J3778M048j1880
$$ 70336 37459 32635 84953 89578 55999 47793 28013 18132 60326 77934 91712 95760 83880
1695H3880j9301r39J912L6450L916O751j0727l0305k1865j6651K3189J6508L1309
$$ 83880 64579 63640 65552 102002 105918 112669 101942 71637 49772 33121 56310 72818 104127
1682A04127k5445j1420J728j2826M0073J851P272k4890J448o755l6849K365J7884
$$ 104127 78682 67262 68990 56164 96237 98088 105360 80470 81918 75163 38314 40679 58563
1669E8563P158m5169J1553J4836K9418p520l0443k7785K8937r230j0228J8897
$$ 58563 65721 20552 32105 46941 76359 68839 38396 10611 39548 30318 20090 38987
1657C8987K2877m3432J0736K8588p366j1675p046M242j7860j8063Q669N3545j4430
$$ 38987 61864 18432 29168 57756 50390 38715 31669 35911 18051 -12 8657 62202 47772
1644D7772R180k7567L5203J3121k4059k1933j0717K6224L0532l5765o743j3318
$$ 47772 56952 29385 64588 77709 53650 31717 21000 47224 77756 41991 35248 21930
1632B1930J09j2738l2318K202K5679M7458j6894k5351o296R174L246K0506l6150
$$ 21930 22039 9301 -23017 -20815 4864 52322 35428 10077 3781 12955 16201 36707 557
1619E57L9901J3005j2523L0817k6059j1099R161K3566J9469k1096r188o670k6659
$$ 557 40458 53463 40940 71757 45698 34599 43760 67326 86795 65699 56511 49841 23182
1606B3182Q042l699j2871R519K3500L9382k6827j8925J0865P814K0165K573O865
$$ 23182 31224 27525 14654 24173 47673 87055 60228 41303 52168 59982 80147 82720 89585
1593H9585k2251j5784k608K1312K3973k9668k5128R388N0l877j9024K314N969
$$ 89585 67334 51550 48942 70254 94227 64559 39431 48819 48869 44992 25968 28282 34251
1580C4251k2609K4500J4791l8285n030J2110l8862k527J1975J930K4374k315j0670
$$ 34251 11642 36142 50933 12648 7618 19728 -19134 -21661 -9686 -7756 16618 14303 3633
1567C633N319M0189n955Q718L1978k6824l6976J5466j9383l5441J4967J4286J7744
$$ 3633 8952 49141 43186 51904 83882 57058 20082 35548 16165 -19276 -4309 9977 27721
1554B7721N697O029j1565L0802l668k7586R679J928j7133l545J1768l3264n700
$$ 27721 33418 39447 27882 58684 55016 27430 37109 39037 21904 18359 30127 -3137 -8837
1541h837K9511J083l50J2713J3581q348o1967P1275L6708m1092m5033l3653L3051
$$ -8837 20674 21757 21407 34120 47701 39353 -22614 48661 85369 44277 -756 -34409 -1358
1528a358O005P469l483L424K5741k2850j9209J7865O078p712M9457k3064j958
$$ -1358 4647 12116 8633 12057 37798 14948 -4261 13604 19682 11970 61427 38363 36405
1515C6405Q361j9597J637j4957J3744P336Q327m141K8614J3274q978m6392j7296
$$ 36405 44766 25169 26806 11849 25593 32929 41256 37115 65729 79003 70025 23633 6337
1502F337M601J9926K953l6294J6999L3984l4159n494m053K230J0345o483M6505
$$ 6337 10938 30864 33817 -2477 14522 48506 14347 8853 4800 7030 17375 10892 57397
1489E7397l6140k7286K61K1825J1996m3756k837R406J5169K4525k5843l634P025
$$ 57397 21257 -6029 -5768 16057 28053 -15703 -18540 -9134 6035 30560 4717 1083 8108
1476H108J6458Q882m7959j1340K7518J7254J5374n055n655K385k7699j6708P703
$$ 8108 24566 33448 -14511 -25851 1667 18921 34295 29240 23585 25970 -1729 -18437 -10734
1463a0734K3828K3863j5387J1409K0855m1783R582K4789N499l3479J0438k4869
$$ -10734 13094 36957 21570 32979 53834 12051 21633 46422 51921 18442 28880 4011
1451D011l293j492J9957M1321Q406l2758N459r251o97O039j6937Q396O445L234
$$ 4011 718 -774 19183 60504 68910 36152 41611 32360 31663 37702 20765 29161 35606 38840
1437C8840k4006m789P341j900j8588J8053J7035n446k4878R175j0096P763O617
$$ 38840 14834 10045 17386 15486 -3102 14951 31986 26540 1662 10837 741 8504 15121
1424A5121j7288R49m598J3758m078k7176N092m054P077J8229K1785R816j1320
$$ 15121 -2167 -1218 -5816 7942 3864 -23312 -18220 -22274 -15197 3032 24817 34633 23313
1411B3313J5617j0056K6921l6225l0995n5j7751p435O02L1641J8418Q431Q584
$$ 23313 38930 28874 55795 19570 -11425 -11480 -29231 -36666 -36064 -4423 13995 22426 31010
1398C1010j0321l2032Q52K1546J3130j1321m0166O145M326m0875K3846J1714M157
$$ 31010 20689 -11343 -10491 11055 24185 12864 -27302 -21157 -16831 -57706 -33860 -22146 -17989
1385a7989K2398K3987k0630m100K6787Q4k5836o926k0546L6560J0001k6780J3723
$$ -17989 4409 28396 7766 3666 30453 30537 4701 -2225 -22771 13789 23790 -2990 10733
1372A0733m89P952k58k566l3246r566P255K0032J7116k4872M5329L090j5690j7251
$$ 10733 10244 18196 17938 15372 -17874 -27440 -20185 -153 16963 -7909 37420 40510 24820 7569
1358G569K3836o794j7498k4170m2062n571R799L2142J4901L3431R542m9851J3096
$$ 7569 31405 24611 7113 -17057 -59119 -64690 -54891 -22749 -7848 25583 35125 -14726 -1630
1345a630k5508j1779J7100k0160L0483L2460J991l4817k843j0084J37L7955j3716
$$ -1630 -27138 -38917 -21817 -41977 -11494 20966 22957 -11860 -14703 -24787 -24650 13305 -411
1332d11L44J2598j8660m2316P826M0767J3341O827l5828J4380l0414M3431M2088
$$ -411 -67 12531 -6129 -48445 -40619 148 13489 20316 -15512 -1132 -31546 11885 53973
1319E3973O709j3392k1447O283L1635N110l2713k1701P340k355j6042J1995J5931
$$ 53973 60682 47290 25843 32126 63761 68871 36158 14457 21797 19442 3400 15395 31326
1306C1326j1791k0418n2295j3102M6540l789J6726l007M129L7828l0025p263K5441
$$ 31326 19535 -883 -53178 -66280 -19740 -23529 -6803 -9810 -5681 32147 2122 -5141 20300
1293B0300Q446J141k8749l5391j0251J0494K6952j5941K1366l255k0105K2194
$$ 20300 28746 29887 1138 -34253 -44504 -34010 -7058 -22999 -1633 -4888 -24993 -2799
1281b799O71J347J0545j561j6710K2845j7610n2593j6309L0722K587J4352K9938
$$ -2799 -2128 -781 9764 8203 -8507 14338 -3272 -55865 -72174 -41452 -38865 -24513 5425
1268E425o347k3996J2099M1887J1500j4672p62n132J3116j2534M0181j7505n0450
$$ 5425 -922 -24918 -12819 29068 40568 25896 25134 20002 33118 20584 60765 43260 -7190
1255g190R617K690m544j1449J0525r366q102j911j2537K5290J062L524j405q712
$$ -7190 2427 5117 573 -10876 -351 -9717 -17819 -19730 -32267 -6977 -5915 -2391 -3796 -12508
1241a2508k7635K939m066J1218K5103k3333Q86J389M969q73r632P979L773m548
$$ -12508 -40143 -37204 -41270 -30052 -4949 -28282 -27396 -26007 -21038 -21911 -31543 -23564 -19791 -24339
1227b4339K5705N523N639j916J0341j2213J3028l5633n468L6193J6634j7285M668
$$ -24339 1366 6889 12528 10612 20953 8740 21768 -13865 -19333 16860 33494 16209 20877
1214B0877l4046j301O1643m085l9275k4309L1598J6173q516K8553l505m2982j7602
$$ 20877 -13169 -14470 47173 43088 3813 -20496 11102 27275 18759 47312 43807 825 -16777
1201a6777o254J3823j4428J3375J9642j7069J2024J6516q862n58L378Q418N56
$$ -16777 -23031 -9208 -23636 -10261 9381 -7688 4336 20852 11990 11432 14810 23228 23784
1188B3784l401j80K686n616J6430j5657o559J9505l8643m917M546r689n539K3778
$$ 23784 20383 20203 22889 17273 33703 18046 11487 30992 -7651 -12568 -8022 -17711 -23250 528
1174E28J7909j2480l6808o108m023K3765K4256j5310j2168q971L7755K6876l6508
$$ 528 18437 5957 -30851 -36959 -40982 -17217 7039 -8271 -20439 -29410 8345 35221 -1287
1161a287l884K8171o132m181l2626L2520O13j1337m962k0195K7736L7075j1345
$$ -1287 -5171 23000 16868 12687 -19939 12581 13194 1857 -3105 -23300 4436 41511 30166
1148C0166k8517k1480R498J5183j3914q0L0736k7024K9287L555k3625p507l038
$$ 30166 1649 -19831 -10333 4850 -9064 -9144 21592 -5432 23855 27410 3785 -3722 -6760
1135f760q106M79J2813P767K7291j5687J3087L0959l3531p805L40L529l308J1320
$$ -6760 -14866 -14387 -1574 6193 33484 17797 30884 61843 28312 20507 20847 24376 21068 32388
1121C2388q492k2262K0027J0070J2651j9194j5785O523j381l7271M094J6409R918
$$ 32388 23896 1634 21661 31731 44382 25188 9403 15926 14545 -22726 -18632 -2223 7695
1108G695l1254L337K9423L2414j7468o2805j572J6459K2808K4795j7783K8298
$$ 7695 -23559 -20222 9201 41615 24147 -38658 -40230 -23771 -963 23832 6049 34347
1096C4347m381R209k4459j0065j5313L1847l0046j9376L669R738L4748R85l2171
$$ 34347 29966 39175 14716 4651 -10662 21185 -8861 -28237 -24568 -14830 19918 20903 -11268
1083a1268J2650j9863M7423J5167o3253P346j1560J3418j6335J1978O923L2638
$$ -11268 1382 -18481 28942 44109 -19144 -11798 -23358 -9940 -26275 -14297 -7374 25264
1071B5264n2672L5855r469l7002M7325K3493k5861j3009k5051L3810j3742j6144
$$ 25264 -27408 8447 -1022 -38024 9301 32794 6933 -6076 -31127 2683 -11059 -27203
1059b7203j0433K0661M8127l2885R200K066l7366R924l9768N411L570j0650M0135
$$ -27203 -37636 -16975 31152 -1733 7467 9533 -27833 -17909 -57677 -52266 -48696 -59346 -19211
1046a9211J9132p3m0097l501M2362K6414j3539j8168l0876L6453O522j3133K2436
$$ -19211 -79 -152 -40249 -43750 -1388 25026 11487 -6681 -37557 -1104 5418 -7715 14721
1033A4721m965k6057j1898L1399K6331k5346j1467l6055q880M0034J2023j8862
$$ 14721 9756 -16301 -28199 3200 29531 4185 -7282 -43337 -52217 -12183 -160 -19022
1021a9022r246K43q440j8503K3678J7640j0452j6497R570K3326k95N235N333j3789
$$ -19022 -28268 -28025 -36465 -54968 -31290 -13650 -24102 -40599 -31029 -7703 -7998 -2763 2570 -11219
1007a1219N232J1119K8782j089j7687k4444m195K9023k2607J2556J0154k1095
$$ -11219 -5987 5132 33914 32825 15138 -9306 -13501 15522 -7085 5471 15625 -5470
995e470J7624O887l1096J039k5579K5053j288O847P468n381L6018k317k1924r1
$$ -5470 12154 19041 -12055 -11016 -36595 -11542 -12830 -5983 1485 -3896 32122 29805 7881 7790
981G790j707l0615L964k1173l1844M1220L6010k9766k6109J5113k0101L9467L4382
$$ 7790 6083 -24532 -20568 -41741 -73585 -32365 3645 -26121 -52230 -37117 -57218 -17751 16631
968A6631k0877m385j8370M016N761K5150K5931J320k4992O653Q901j4601j7376
$$ 16631 -4246 -8631 -27001 -22985 -17224 7926 33857 35177 10185 16838 25739 11138 -6238
955f238j0233N022j1424o296R711K0699j5583L8776L31j8303j620k7500M1751
$$ -6238 -16471 -11449 -22873 -29169 -19458 1241 -14342 24434 24765 6462 4842 -22658 19093
942A9093j2208j1496p753J9150K406L433l1471j5252N7970n501l5603m0J7861
$$ 19093 6885 -4611 -12364 6786 9192 12625 -18846 -34098 23872 18371 -17232 -17272 589
929E89j0996K2799L8537k5378J2000l3938k384k932J6289m192j5599k6145j3976
$$ 589 -10407 12392 50929 25551 37551 3613 1229 -1703 14586 10394 -5205 -31350 -45326
916d5326J9713J8823k383k1515L0207r377J3950K0609m964j5166j4577k348N4210
$$ -45326 -25613 -6790 -9173 -30688 -481 -9858 4092 24701 19737 4571 -10006 -12354 41856
903D1856n281J5448l2598n046o358L902L0053k4644N365j115j5871l2765q415
$$ 41856 36575 52023 19425 14379 8021 11923 41976 17332 22697 21582 5711 -27054 -35469
890c5469N189l740J3175L2324p741q679K0985M513O854l629j6903k7536j7895
$$ -35469 -30280 -34020 -20845 11479 3738 -4941 16044 20557 27411 23782 6879 -20657 -38552
877c8552n900l3538K1818L0422R288L698j8342Q532r626K3792K0788l3685l9599
$$ -38552 -44452 -77990 -56172 -25750 -16462 -12764 -31106 -22574 -32200 -8408 12380 -21305 -60904
864f0904L3862J2042J1600q874k745J1587k0305j5474M4232J0223r478J5460m757
$$ -60904 -27042 -15000 -3400 -12274 -15019 -3432 -23737 -39211 5021 15244 5766 21226 16469
851A6469q549l5729P71K1981j3589j3919K5016l0719j6344L2084K4386m4008K1694
$$ 16469 7920 -27809 -27038 -5057 -18646 -32565 -7549 -38268 -54612 -22528 1858 -42150 -20456
838b0456k718j8626K3941K0088o455J3612o843j0156J2339J2820k918p706P297
$$ -20456 -23174 -41800 -17859 2229 -4226 9386 2543 -7613 4726 17546 14628 6922 14219
825A4219m5785L773M6170k0971k5009L978k720J8379j1111k240K0192K4703j2543
$$ 14219 -31566 -27793 18377 -2594 -27603 -23625 -26345 -7966 -19077 -21317 -1125 23578 11035
812A1035m6626R33j3125J2629M0581K9183m9906J78M0281k5501j290k4745K2130
$$ 11035 -35591 -34658 -47783 -35154 5427 34610 -15296 -15118 25163 -338 -1628 -26373 -4243
799d243k359r422K0847K1083O941R47o0177k1771J7898j7195l385L1302L0974
$$ -4243 -6602 -16024 4823 25906 32847 33794 -26383 -48154 -30256 -47451 -50836 -19534 11440
786A1440N792J0865r480m4653P25K3211K1425N063j340n992l0455j5380J3868
$$ 11440 17232 28097 18617 -26036 -25311 -2100 19325 24388 23048 17056 -13399 -28779 -14911
773a4911K0536J9693k9665j3000L0145K7315p129j2114j4186m4919l675K845L3908
$$ -14911 5625 25318 -4347 -17347 12798 40113 32984 20870 6684 -38235 -41910 -39065 -5157
760e157J260j5101j1144Q341N0903q681k3194r971l649K3437p727k434J373n505
$$ -5157 -3897 -18998 -30142 -21801 29102 20421 -2773 -12744 -16393 7044 -683 -3117 -1744 -7249
746g249j0400K1072R694K48O222m8117J7292q999l3525J2225o690J7227L590N4998
$$ -7249 -17649 3423 13117 13365 19587 -28530 -11238 -20237 -53762 -41537 -48227 -31000 -27410 27588
732B7588J3950k2933l558l384k422k3352k9731O3115K3599o0623k7400M213m607
$$ 27588 41538 18605 15047 11663 9241 -14111 -43842 19273 42872 -17751 -45151 -40938 -45545
719d5545L534o504M4034K2610k4044k178N186K5890M705k7191M2293k534o1119
$$ -45545 -42011 -48515 -4481 18129 -5915 -8093 -2907 22983 27688 497 42790 40256 -20863
706b0863J0316K57L6147J243N200r289l913K7442j7160l6465k4245J0753J6886
$$ -20863 -10547 -10290 25857 27100 32300 23011 19098 46540 29380 -7085 -31330 -20577 -3691
693c691K2206J5330m1923J0281J3593N616o536o651j7353J0393L8074m0679O507
$$ -3691 18515 33845 -8078 2203 15796 21412 14876 8225 -9128 1265 39339 -1340 5167
680E167k1230p682L137r265K1206K268m560J5343L7693o364j5966k8999j5608
$$ 5167 -16063 -23745 -20608 -29873 -8667 -6399 -10959 4384 42077 35713 19747 -9252 -24860
667b4860R068K956l2788J8935M7989P553l4953K356J0146l4210k1319K0311K086
$$ -24860 -15792 -12836 -45624 -26689 21300 28853 -6100 -3744 6402 -27808 -49127 -28816 -26730
654b6730m1489K0630J7485J7614L4415k2515R49J110R020K1537m3186j2229j2877
$$ -26730 -68219 -47589 -30104 -12490 21925 -590 359 1469 10489 32026 -11160 -23389 -36266
641c6266K881K9971J940J1886k872J349k8187K6075k9837L38r599k0662L3259
$$ -36266 -33385 -3414 -1474 10412 7540 8889 -19298 6777 -23060 -22722 -32321 -52983 -19724
628a9724j4932K1220j1334M4705q222O376m3066k5967p265K9770J7155L1465J5730
$$ -19724 -34656 -13436 -24770 19935 11713 18089 -24977 -50944 -58209 -28439 -11284 20181 35911
615C5911k2654k8866k0562m287J1945M5971r277j8687K6676m495l2776P214N835
$$ 35911 13257 -15609 -36171 -40458 -28513 17458 8181 -10506 16170 11675 -21101 -13887 -8052
602h052K7071k0494k2088K8j9951K5002J7294k8700J1414J7711J3174j4226k5879
$$ -8052 19019 -1475 -23563 -23535 -43486 -18484 -1190 -29890 -18476 -765 12409 -1817 -27696
589b7696O974k0170K265L3710m8586K1576J3625j8199j2829J7560l558J5725q406
$$ -27696 -20722 -40892 -38627 -4917 -53503 -31927 -18302 -36501 -49330 -31770 -35328 -19603 -28009
576b8009n993J5311J6165k2172J2149N1621k4409j8366j7587P938n708R435j140
$$ -28009 -34002 -18691 -2526 -24698 -12549 39072 14663 -3703 -21290 -13352 -19060 -9625 -10765
563a0765m1823Q048K0528M1930q256J7717P539j323l0154k5993K5795L266j7666
$$ -10765 -52588 -44540 -24012 17918 9662 27379 34918 33595 3441 -22552 3243 6509 -11157
550a1157l819k576K0852k8584o213j1561J834M7427K2490p229j9984l3986K1191
$$ -11157 -14976 -17552 3300 -25284 -31497 -43058 -41224 6203 28693 21464 1480 -32506 -11315
537a1315P380k9600L1255l5478J2893J287N2014J8764m3007l397j3484j8366Q037
$$ -11315 -3935 -33535 -2280 -37758 -24865 -23578 28436 47200 4193 796 -12688 -31054 -23017
524b3017j011R412N1440J4764l5712l7517J0253R926k114N119m50j5531q988L9154
$$ -23017 -24028 -14616 36824 51588 15876 -21641 -11388 -1462 -3576 1543 1093 -14438 -23426 15728
510A5728l8458K9310J3703j4235j9873J6991l6605K4545p37J9836J8389j8058
$$ 15728 -22730 6580 20283 6048 -13825 3166 -33439 -8894 -9631 10205 28594 10536
498A0536L4409l7690r789o999j0608L513p123L9666p980j6951J261L8299J7343
$$ 10536 44945 7255 -2534 -9533 -20141 -16628 -23751 15915 7935 -9016 -7755 30544 47887
485D7887L476m8878j6901K3102q606o230m0260M691J0577j6781K7544M6761j0292
$$ 47887 51363 2485 -14416 8686 80 -6150 -46410 -41719 -31142 -47923 -20379 26382 16090
472A6090R631j9421o848J1617L6819j5721o4349p843K8006M0251l6435K0907n19
$$ 16090 25721 6300 -548 11069 47888 32167 -32182 -40025 -12019 28232 -8203 12704 12185
459A2185K2085K5023k5514l0104l7620L3655K1721L1525k3628k9663j2473J6665
$$ 12185 34270 59293 33779 3675 -33945 -290 21431 52956 29328 -335 -12808 3857
447C857O143j7371l162n624j9389K731q491M9378L032O281R61o843Q981M958k1004
$$ 3857 10000 -7371 -10533 -16157 -35546 -32815 -41306 8072 11104 17385 18346 11503 20484 25442 4438
432D438j4883Q318M421j550J0568m6287k4519K7282l560j9564J3445J6581O480
$$ 4438 -10445 -2127 2294 744 11312 -34975 -59494 -32212 -35772 -55336 -41891 -25310 -18830
419a8830K0731l136l0152N001L394J2661J5124q804q035L988j6242r442j7064
$$ -18830 1901 -1235 -31387 -26386 -22992 -10331 4793 -4011 -12046 -8058 -24300 -33742 -50806
406e0806r895L5218R201o090m9720N3213M0046l5380J1854o226J8505k2589K2187
$$ -50806 -60701 -25483 -16282 -22372 -72092 -18879 21167 -14213 -2359 -8585 9920 -12669 9518
393I518j2825P608r107J66j2095K33J2673n170k1189K8303K7972m4655j8161j7756
$$ 9518 -3307 4301 -4806 -4640 -16735 -16502 -3829 -8999 -30188 -1885 26087 -18568 -36729 -54485
379e4485J9551M0918J4779k8851l469o257j518k4734K8930k4375j1666K0672L5593
$$ -54485 -34934 5984 20763 -8088 -11557 -17814 -19332 -44066 -15136 -39511 -51177 -30505 5088
366E088l4057K7270N726J3944q275k6631j042J7043Q749j4671k3902J1918R596
$$ 5088 -28969 -1699 4027 17971 9696 -16935 -17977 -934 7815 -6856 -30758 -18840 -9244
353i244m668k2917q674K3640j159J0163R37K9483m5257j185K2469M5184l3240
$$ -9244 -13912 -36829 -45503 -21863 -23022 -12859 -11922 17561 -27696 -28881 -6412 38772 5532
340E532j4133J3692j1800j0284R254K4492p916J6887n9346P606j1098j9820N361
$$ 5532 -8601 5091 -6709 -16993 -7739 16753 8837 25724 -33622 -26016 -37114 -56934 -51573
327e1573j0124L3848j9302K8039K9075m017k440L221j5126k3369j1475m766J5465
$$ -51573 -61697 -27849 -47151 -19112 9963 5946 3506 6727 -8399 -31768 -43243 -48009 -32544
314c2544r406L0165j2954K5899J2093k8559M648k426j4821K5182K8m0280k1078
$$ -32544 -41950 -11785 -24739 1160 13253 -15306 -10658 -13084 -27905 -2723 -2695 -42975 -64053
301f4053J3265l46J2783L827N800R023j5220L9095Q105R569K864k2436J884o7063
$$ -64053 -50788 -51134 -38351 -34524 -28724 -19701 -34921 4174 12279 21848 24712 2276 4160 -62903
287f2903k1409L4351J4491M4791N814j0479k1055j7106K3629L7909m7554k2784
$$ -62903 -84312 -49961 -35470 9321 15135 4656 -16399 -33505 -9876 28033 -19521 -42305
275d2305j0505K5096K1446k790k8977n873L3574l0564O125J7433N678J2793k324
$$ -42305 -52810 -27714 -6268 -9058 -38035 -43908 -10334 -40898 -34773 -17340 -11662 1131 -1193
262a193j0341K2705p076j8176O002j8077j3773k240J6940R336J7239k5685K8048
$$ -1193 -11534 11171 4095 -14081 -8079 -26156 -39929 -42169 -25229 -15893 1346 -24339 3709
249C709L94r124p150j9341j1033K0318M2596l2238o239Q643k7618p76J5734j2122
$$ 3709 4103 -5021 -12171 -31512 -42545 -22227 20369 -11869 -18108 -9465 -37083 -37859 -22125 -34247
235c4247L961P570p049k708K6585L592K8572l3489j4758J8416j3449Q228j2615
$$ -34247 -30286 -22716 -29765 -32473 -5888 -2296 26276 -7213 -21971 -3555 -17004 -8776 -21391
222b1391L370q834l021K1714k2103K4477q637j988J2156J4557j2185j9579n553
$$ -21391 -18021 -26855 -29876 -8162 -30265 -5788 -14425 -16413 -4257 10300 -1885 -21464 -27017
209b7017M926m688J0124J3580j6986K6544n17l2023n496J1812j1587L673K9466
$$ -27017 -22091 -26779 -16655 -3075 -20061 6483 5966 -26057 -31553 -19741 -31328 -27655 1811
196A811O983k2743J5178j1997l512K958k8331M2969K6142k6807l349j2676k2400
$$ 1811 8794 -13949 1229 -10768 -14280 -11322 -39653 3316 29458 2651 -698 -13374 -35774
183c5774K8360M160j6092J7835k7917j8940M920K5274L6737J0478j2274l0757
$$ -35774 -7414 -3254 -19346 -1511 -29428 -48368 -43448 -18174 18563 29041 16767 -13990
171a3990o1209L5851k6250j1400L5247M4046j6015Q873k5642J1549J4768j4543
$$ -13990 -75199 -39348 -65598 -76998 -41751 2295 -13720 -4847 -30489 -18940 -4172 -18715
159a8715o758k1537J3231j5199K3799J1176p86n691n103k8145J2696j9751j0497
$$ -18715 -25473 -47010 -33779 -48978 -25179 -14003 -14789 -20480 -25583 -53728 -41032 -60783 -71280
146g1280M9806J2259m1804J7240K9880r166K1022q844j1052j8495n062Q727J2642
$$ -71280 -21474 -9215 -51019 -33779 -3899 -13065 7957 -887 -11939 -30434 -35496 -26769 -14127
133a4127J6485l1545P892R286K50J1243k4508J3865K5934l36R535Q50l488j9322
$$ -14127 2358 -29187 -21295 -12009 -11759 -516 -25024 -11159 14775 14439 23974 24824 21336 2014
119B014N252j4156j6009K543Q811k7576m775K6688l005j1105J5930O898j8691
$$ 2014 7266 -6890 -22899 -20356 -11545 -39121 -43896 -17208 -20213 -31318 -15388 -8490 -27181
106b7181J3753j353N861J6132r656j8675K8172l292k6917M520l1L555l9527J4966
$$ -27181 -13428 -14781 -8920 7212 -2444 -21119 7053 3761 -23156 -18636 -18667 -15112 -54639 -39673
92c9673K5132K4409k5030Q015j605m051K697J6549j4859k9276J84L5067L934l042
$$ -39673 -14541 9868 -15162 -7147 -8752 -12803 -10106 6443 -8416 -37692 -37508 -2441 1493 -1549
78a549j7848r969n476J3968R618L925q396k8324L7499k8641O725k967k0727q203
$$ -1549 -19397 -29366 -34842 -20874 -11256 -7331 -15727 -44051 -6552 -35193 -28468 -31435 -52162 -60365
64f0365J7048k8926J2328J4034O896J2360k2058J4499K5803K047J068L687Q367
$$ -60365 -43317 -72243 -59915 -45881 -38985 -26625 -48683 -34184 -8381 -6334 -5266 -1579 6788
51F788O503o550r786K789k0714j6489J8355K0437j6483p716K08m605o081P172
$$ 6788 13291 6741 -3045 -256 -20970 -37459 -19104 1333 -15150 -22866 -22658 -27263 -33344 -26172
37b6172J9052j0113p316j596R019J496j3902K375Q682j2615J2115L686j142J593
$$ -26172 -7120 -17233 -24549 -26145 -17126 -15630 -29532 -27157 -18475 -31090 -18975 -15289 -16431 -14838
23a4838r233k286L0280j4241k1830L3489j9313j2898K1844L769n960q201L72R843
$$ -14838 -24071 -26357 3923 -10318 -32148 1341 -17972 -30870 -9026 -5257 -11217 -19418 -19046 -9203
9i203J0033m136J2519j6379m556l6031o916K4729J3122
$$ -9203 830 -3306 9213 -7166 -11722 -47753 -54669 -29940 -16818
0a6818
$$ -16818
$$ Imaginary data points
##PAGE= N=2
##DATA TABLE= (X++(I..I)), XYDATA
16383b359601O1261K0107K6596L5313K7087K7098L5855K781L0666L9665L6984
$$ -2359601 -2298340 -2278233 -2251637 -2216324 -2189237 -2162139 -2126284 -2123503 -2092837 -2053172 -2016188
16372b016188K4340K0248K3035L0503K5183L9735M3308J9148K4557K5871K3620
$$ -2016188 -1991848 -1971600 -1948565 -1918062 -1892879 -1853144 -1809836 -1790688 -1766131 -1740260 -1716640
16361a716640K4783J5478L4095L0728L4480L8427R772K4423M1969J6864L8581
$$ -1716640 -1691857 -1676379 -1642284 -1611556 -1577076 -1538649 -1528877 -1504454 -1462485 -1445621 -1407040
16350a407040K7331K5998L5335K2783L5941M1524l092K5478L9591J0014K4609
$$ -1407040 -1379709 -1353711 -1318376 -1295593 -1259652 -1218128 -1221220 -1195742 -1156151 -1146137 -1121528
16339a121528M2347L1410P046L4635L4681L4876J5889K681K8441L3427K5735L4910
$$ -1121528 -1079181 -1047771 -1040725 -1006090 -971409 -936533 -920644 -917963 -889522 -856095 -830360 -795450
$$ [...]
##END NTUPLES=NMR SPECTRUM
##END=
