##TITLE=1H_CA-9273-4
 CDCl3
 8 sc, 
 31.5.2024
##JCAMPDX= 6.0         $$ Bruker NMR JCAMP-DX V2.0
##DATA TYPE= NMR SPECTRUM
##DATA CLASS= NTUPLES
##ORIGIN= UXNMR, Bruker Analytische Messtechnik GmbH
##OWNER= root
$$ XWIN-NMR		Version 3.5
$$ Fri May 31 13:39:13 2024 Russian Standard Time (UT+4h)  she@DPX200
##.OBSERVE FREQUENCY= 200.1309
##.OBSERVE NUCLEUS= ^1H
##.ACQUISITION MODE= SIMULTANEOUS
##.ACQUISITION SCHEME= undefined
##.AVERAGES= 8
##.DIGITISER RES= 18
##SPECTROMETER/DATA SYSTEM= spect
##.PULSE SEQUENCE= zg30
##.SOLVENT NAME= CDCl3
##.SHIFT REFERENCE= (INTERNAL, CDCl3, 0, 15.8163)
##AUDIT TRAIL= $$ (NUMBER, WHEN, WHO, WHERE, WHAT)
$$ ##TITLE= Audit trail, XWIN-NMR		Version 3.5
$$ ##JCAMPDX= 5.01
$$ ##ORIGIN= Bruker BioSpin GmbH
$$ ##OWNER= she
$$ F:/spectra/data/she/nmr/H-F/1/pdata/1/auditp.txt
$$ ##AUDIT TRAIL=  $$ (NUMBER, WHEN, WHO, WHERE, WHAT)
(   1,<2024-05-31 13:38:07.21 +0400>,<she>,<DPX200>,
      <created by zg, POWCHK disabled, PULCHK disabled
       configuration hash MD5:
       00 E9 B6 7A A2 85 ED C7 34 08 36 98 17 FE 4E 26
       data hash MD5: 16K
       76 21 CC 77 2C D1 8A A6 10 A2 B8 A0 D9 FF 49 F3>)
(   2,<2024-05-31 13:38:10.51 +0400>,<she>,<DPX200>,
      <Start of raw data processing
       efp BC_mod = 2 LB = 0.24 FT_mod = 6 PKNL = 1 PHC0 = -25308.95 PHC1 = 8.58748 SI = 16K 
       data hash MD5: 16K
       7F 37 A0 F4 83 E6 36 F0 5E 74 99 E1 36 EC 2E FB>)
(   3,<2024-05-31 13:38:27.79 +0400>,<she>,<DPX200>,
      <pk PHC0 = -1.448063 PHC1 = 2.2 
       data hash MD5: 16K
       EF 0B 46 2B 8F 00 A6 6B AE D1 E4 74 72 BA 80 69>)
(   4,<2024-05-31 13:38:31.37 +0400>,<she>,<DPX200>,
      <abs ABSG = 5 
       data hash MD5: 16K
       E9 15 1D B4 55 05 34 D5 92 DB 94 D3 B0 94 8A B2>)
$$ ##END=
$$ 
$$ hash MD5
$$ EF 35 2D 6E E0 36 A5 DD 6F 0D 4B F7 DF B8 78 3C
##$RELAX= 
##$RELAX= 
##$RELAX= 
##$RELAX= 
##$RELAX= 
##$RELAX= 
$$ Bruker specific parameters
$$ --------------------------
##$DU= <F:/spectra>
##$EXPNO= 1
##$NAME= <H-F>
##$PROCNO= 1
##$TYPE= <nmr>
##$USER= <she>
##$AMP= (0..31)
100 100 100 100 100 100 100 100 100 100 100 100 100 100 100 100 100 100 
100 100 100 100 100 100 100 100 100 100 100 100 100 100 
##$AQSEQ= 0
##$AQ_mod= 1
##$AUNM= <au_zg>
##$AUTOPOS= <>
##$BF1= 200.13
##$BF2= 200.13
##$BF3= 200.13
##$BF4= 200.13
##$BF5= 200.13
##$BF6= 200.13
##$BF7= 200.13
##$BF8= 200.13
##$BYTORDA= 1
##$CFDGTYP= 0
##$CFRGTYP= 5
##$CHEMSTR= <none>
##$CNST= (0..31)
1 1 145 1 1 1 1 1 1 1 1 1 1 1 1 1 1 1 1 1 1 1 1 1 1 1 1 1 1 1 1 1 
##$CPDPRG= <>
##$CPDPRG1= <>
##$CPDPRG2= <>
##$CPDPRG3= <>
##$CPDPRG4= <mlev>
##$CPDPRG5= <mlev>
##$CPDPRG6= <mlev>
##$CPDPRG7= <mlev>
##$CPDPRG8= <mlev>
##$CPDPRGB= <>
##$CPDPRGT= <>
##$D= (0..31)
0 1.2 0 0 0 0 0 0 0 0.06 0 0.03 0 0 0 0 0.0002 0 0 0 0 0 0 0 0 0 0 0 0 
0 0 0 
##$DATE= 1717148286
##$DBL= (0..7)
120 120 120 120 120 120 120 120 
##$DBP= (0..7)
150 150 150 150 150 150 150 150 
##$DBP07= 0
##$DBPNAM0= <>
##$DBPNAM1= <>
##$DBPNAM2= <>
##$DBPNAM3= <>
##$DBPNAM4= <>
$$ [...]
##$SUBNAM3= <"">
##$SUBNAM4= <"">
##$SUBNAM5= <"">
##$SUBNAM6= <"">
##$SUBNAM7= <"">
##$SUBNAM8= <"">
##$SUBNAM9= <"">
##$SW= 18.0517689322627
##$SWIBOX= (0..15)
0 0 2 0 0 0 0 0 0 0 0 0 0 0 0 0 
##$SW_h= 3612.71676300578
##$TD= 16384
##$TD0= 1
##$TE= 0
##$TE2= 300
##$TE3= 300
##$TEG= 300
##$TL= (0..7)
0 120 120 120 120 120 120 120 
##$TP= (0..7)
150 150 150 150 150 150 150 150 
##$TP07= 0
##$TPNAME0= <>
##$TPNAME1= <>
##$TPNAME2= <>
##$TPNAME3= <>
##$TPNAME4= <>
##$TPNAME5= <>
##$TPNAME6= <>
##$TPNAME7= <>
##$TPOAL= (0..7)
0.5 0.5 0.5 0.5 0.5 0.5 0.5 0.5 
##$TPOFFS= (0..7)
0 0 0 0 0 0 0 0 
##$TUNHIN= 0
##$TUNHOUT= 0
##$TUNXOUT= 0
##$USERA1= <user>
##$USERA2= <user>
##$USERA3= <user>
##$USERA4= <user>
##$USERA5= <user>
##$V9= 5
##$VALIST= <valist>
##$VCLIST= <CCCCCCCCCCCCCCC>
##$VD= 0
##$VDLIST= <DDDDDDDDDDDDDDD>
##$VPLIST= <PPPPPPPPPPPPPPP>
##$VTLIST= <TTTTTTTTTTTTTTT>
##$WBST= 1024
##$WBSW= 4
##$XGAIN= (0..3)
0 0 0 0 
##$XL= 0
##$YL= 0
##$YMAX_a= 750868
##$YMIN_a= -790496
##$ZGOPTNS= <>
##$ZL1= 120
##$ZL2= 120
##$ZL3= 120
##$ZL4= 120
##$ABSF1= 15.80422
##$ABSF2= -2.247671
##$ABSG= 5
##$ABSL= 3
##$ALPHA= 0
##$AQORDER= 0
##$ASSFAC= 0
##$ASSFACI= 0
##$ASSFACX= 0
##$ASSWID= 0
##$AUNMP= <proc_1d>
##$AZFE= 0.1
##$AZFW= 0.1
##$BCFW= 0
##$BC_mod= 2
##$BYTORDP= 0
##$COROFFS= 0
##$CY= -3
##$DATMOD= 1
##$DC= 0
##$DFILT= <>
##$DTYPP= 0
##$F1P= 0
##$F2P= 0
##$FCOR= 1
##$FTSIZE= 16384
##$FT_mod= 6
##$GAMMA= 0
##$GB= 0
##$INTBC= 1
##$INTSCL= 3.70164e-10
##$ISEN= 128
##$LB= 0.24
##$LEV0= 0
##$LPBIN= 0
##$MAXI= 10000
##$MC2= 0
##$MEAN= 0
##$ME_mod= 0
##$MI= 1.114404
##$NCOEF= 0
##$NC_proc= -5
##$NLEV= 6
##$NOISF1= 3.799351
##$NOISF2= 2.8
##$NSP= 0
##$NTH_PI= 0
##$NZP= 0
##$OFFSET= 15.81634
##$PC= 1
##$PHC0= -25310.4
##$PHC1= 10.78748
##$PH_mod= 1
##$PKNL= yes
##$PPARMOD= 0
##$PSCAL= 0
##$PSIGN= 0
##$REVERSE= no
##$SF= 200.129541042084
##$SI= 16384
##$SIGF1= 3
##$SIGF2= 2
##$SINO= 5.538805
##$SIOLD= 16384
##$SREGLST= <1H.CDCl3>
##$SSB= 0
##$STSI= 16384
##$STSR= 0
##$SW_p= 3612.71676300577
##$SYMM= 0
##$S_DEV= 0
##$TDeff= 16384
##$TDoff= 0
##$TI= <>
##$TILT= no
##$TM1= 0
##$TM2= 0
##$TOPLEV= 0
##$USERP1= <user>
##$USERP2= <user>
##$USERP3= <user>
##$USERP4= <user>
##$USERP5= <user>
##$WDW= 1
##$XDIM= 16384
##$YMAX_p= 314547755
##$YMIN_p= -150969
$$ End of Bruker specific parameters
$$ ---------------------------------
##NTUPLES= NMR SPECTRUM
##VAR_NAME=  FREQUENCY,     SPECTRUM/REAL,   SPECTRUM/IMAG
##SYMBOL=    X,             R,               I
##VAR_TYPE=  INDEPENDENT,   DEPENDENT,       DEPENDENT
##VAR_FORM=  AFFN,          ASDF,            ASDF
##VAR_DIM=   16384,         16384,           16384
##UNITS=     HZ,            ARBITRARY UNITS, ARBITRARY UNITS
##FACTOR=    0.220516191357247, 1,           1
##FIRST=     3165.31695451783, 0,            0
##LAST=      -447.399808487945, 0,           0
##MIN=       -447.399808487945, -150969,     0
##MAX=       3165.31695451783, 314547755,    0
$$ Real data points
##PAGE= N=1
##DATA TABLE= (X++(R..R)), XYDATA
$$ [...]
6707d9074j0872M3245j6949k3535O448k1137L7236l1646P7869k7393j4866K8979
6695a695L070k8636L6748n154p5977O670L0765J3682M6938J2914r479l6669J197
6682e626j1869l9946J9953L5658n2678r884j0520K0664N1606K4632j5870k203
6670C917J9002o6151l0387L8786K8209Q41p879l8709K7767k3785P035m5294N6813
6657b9835N0142j5353n2401K7782M31M4669k6879p517M0795j0234l0321N3104
6645D4383l735j4904n770J1206o7044k7943P8073M572P5909k7732l4656l8142
6633e783m8824N416J4401o098r628L6191l039L8295L4189n6687K6705m0176k0302
6620c5340k8285j147N3419j3877m0266O3068k9855K7193j3555k1777N038m012
$$ y = [-49074, -59946, -16701, -33650, -57185, -50737, -71874, -34638, -66284, 11585, -15808, -30674, -1695, 1375, -27261, 9487, 4333, -71644, -64974, -34209, -20527, 26411, 39325, 29846, -6823, -5626, -17495, -57441, -37488, -1830, -54508, -64392, -74912, -54248, -2642, 21990, 6120, 3917, 22919, -43232, -73619, -34833, -6624, -5783, -13662, -52371, -24604, -48389, -41354, -86648, -29835, 20307, 4954, -47447, -19665, -19234, 25435, -1444, -8961, 31834, 21600, -8721, 44383, 40648, 25744, 19974, 31180, -35864, -63807, 14266, 18838, 94747, 67015, 32359, -5783, -54607, -49191, -34790, -40888, -50516, -14325, -17364, 20931, 55120, -1567, 25138, -15038, -35340, -63625, -64772, -11353, -25230, -65496, -2428, -32283, -5090, -18645, -40422, -35384, -39396]
6608c9396K2465K24m9936K6851K8592k7060j017K8029k295j7834k6741J2176J9264
6595b6678K1316k7755j4518P399j6282m3214K5383O4519l4705L8755Q1233N85
6583G6038l2851L006j7327l3231m6414k714M3964j7215j7317K3458j9819L0525
6571i897N791q154j47L3181k0992l0014N4989o501m3989p762m0027K6512j1745
6558e8755N341j5834q727Q9653K2970k587l892J1054n768j9742L2146J3692k8442
6545C1109J2731r207p5467j0687L2720N4202j8817p370n5529M4070N1350j3184
6533C5921l5665K4163L3734K0622o1494n1986J4598j7763Q4262n065J498L4275
6521G7100j3373j9259R184m3817l5822L2475J3125Q391J4251r118m0466n2044
$$ y = [-39396, -16931, -16707, -66643, -39792, -11200, -38260, -39277, -11248, -13543, -31377, -58118, -45942, -26678, -5362, -33117, -47635, -40236, -56518, -99732, -74349, -9830, -44535, -5780, 75453, 76038, 43187, 46193, 28866, -4365, -50779, -53493, -9529, -26744, -44061, -20603, -40422, -9897, -4106, -12260, -12407, 20774, -218, -30232, 24757, 18256, -25733, -33495, -73522, -47010, -58755, -53414, -69248, -77975, 11678, 34648, 32061, 28169, 39223, 33455, 13713, 45859, 59551, 31109, 43840, 34633, -40834, -51521, -18801, 35401, 16584, 9214, -46315, -2245, 49105, 35921, 256, 24419, 58153, 78775, 17281, -34705, -20107, -37870, 46392, 41327, 42825, 77100, 63727, 44468, 53652, 9835, -25987, 6488, 19613, 28004, 42255, 33137, -7329, -59373]
6509e9373M3302O3902J0727m0243q6415K4223L9350k7031J1569L2223j9538K6122
6497A8818L3742n5296J6710l4068p3903J8548M9306K8211J0477k9525k6301L0195
6485a3086L079k3986L6764l851k4090k5612M2742j6151j7175N081l6108o899M5872
6472c3420M1495n0497k341L2012J18J1607l5358K2992l6881k1189K3622J9858
6460b7982o310j1948K4785K7987k7906n8729K4553N09J245J4969J5894M7019m3064
6447a8978M5865o143o7391K4847M4965M1844p3252K2122J3504L2664l1355m8445
6435a9753L4999K0546m9269k1335K7857N2669J9641m1075J679j0760p043K2682
6423C0838q282K0654j5225J0177m0047q127J3185m7329K3850M0693j5475K8711
$$ y = [-59373, -16071, 47831, 58558, 18315, -68100, -43877, -4527, -31558, -19989, 12234, -7304, 18818, 52560, -2736, 13974, -20094, -93997, -75449, -26143, 2068, 12545, -16980, -43281, -13086, -10007, -33993, 2771, -1080, -25170, -50782, -8040, -24191, -41366, -36285, -72393, -79292, -33420, 8075, -42422, -44763, -12751, -12633, -1026, -36384, -13392, -50273, -71462, -47840, -27982, -34292, -46240, -21455, 6532, -21374, -80103, -55550, -55041, -53796, -38827, -22933, 24086, -18978, 26887, 20744, -46647, -21800, 23165, 65009, -8243, 13879, 27383, 60047, 28692, -19753, 15246, 35792, -13477, -34812, -6955, 45714, 65355, 24280, 25959, 15199, 8156, 30838, 22556, 43210, 27985, 38162, -1885, -10012, 3173, -44156, -20306, 20387, 4912, 33623]
6411C3623o720j3947K7897N307j5137L7617k858o4997J8669M929j4465M359j5936
6398a659K390j2802m4789N7368L1592j8626J2384K5537p9905j6816j0963j2781
6386f9070L6093J7100K1485j2178R966K3106l8578m456o337J1361K2638j3475
6374b345L7815r569j1860o245N3990M4534n3794J8270j1957k3183q020K7611l8993
6361A6254l0954K655J7378N2612k2930j2149R54m9263M710J9541n260L7158J3537
6348D4243N4840m1930j729L6614J053l3211j0176k5563Q1094K2708l3871J9868
6336A13940m6032m0668q587K2927J4743L0396R724N2731l2867k6014m2706O707
6324E4294M8605P412J0387k1736k1233o654L5435o185n0039j8972j6816M1257
$$ y = [33623, 26903, 12956, 40853, 46160, 31023, 68640, 65782, 785, 19454, 24383, 9918, 14277, -1659, 731, -12071, -56860, 508, 32100, 13474, 25858, 51395, -28510, -45326, -56289, -69070, -32977, -15877, 5608, -6570, 3396, 26502, -12076, -16532, -22869, -11508, 11130, -2345, 35470, 25901, 14041, 7796, 61786, 106320, 52526, 70796, 58839, 35656, 27636, 55247, 16254, -14700, -12045, 5333, 57945, 35015, 22866, 23820, -25443, -20733, -1192, -6452, 30706, 44243, 99083, 57153, 55424, 92038, 93091, 59880, 49704, 24141, 105235, 127943, 94072, 113940, 67908, 27240, 18653, 41580, 56323, 86719, 96443, 149174, 116307, 90293, 47587, 54294, 102899, 110311, 120698, 98962, 77729, 71075, 106510, 100325, 50286, 31314, 14498, 55755]
6312E5755J3042K6614p1180L0794N4011k0531j9513l3747M0484L6171K3079J0359
6300A45338j4629M727o264N516l6607P762L5696J5842J37980l3421j40088l9702
6288H2150Q7658p189J2889K2169P3204J5021o0397j4719q695K3372o6245j05813
6276E3405M6912k4891l0511N8307J3594o7448K3935K443k1925k0178N6459K5912
6264A16014n7115M7533K1174k2646l7769k9486j4399K2041J1026l163K517L2290
6252H8017j9283n9497J186K1384J4816k7316r3519M9681J2J3992Q017l465r898
6239a5873K0560k2504N069J8997J0292L3708O325m8534m2621l8716L0539J4589
6227b8169j1038j3333J7713N5709m8153q834P7994N835o6942J4247p1L001m161
$$ y = [55755, 68797, 95411, 24231, 55025, 109036, 88505, 68992, 35245, 75729, 111900, 134979, 145338, 130709, 135436, 129172, 134688, 98081, 105843, 141539, 157381, 295361, 261940, 121852, 82150, 169808, 162619, 175508, 197677, 270881, 285902, 225505, 210786, 202091, 225463, 159218, 53405, 100317, 75426, 44915, 103222, 116816, 49368, 73303, 75746, 53821, 33643, 90102, 116014, 58899, 106432, 127606, 104960, 67191, 37705, 23306, 45347, 56373, 53210, 55727, 88017, 68734, 9237, 10423, 31807, 46623, 19307, -74212, -24531, -24519, -10527, -2510, -5975, -15873, 4687, -17817, -12748, 6249, 16541, 50249, 56574, 8040, -34581, -73297, -42758, -28169, -39207, -52540, -34827, 20882, -27271, -36105, 41889, 47724, -19218, -4971, -5042, -2041, -6202]
6214f202R166J806k1006O5332l3424J7063J3044k1081k2318q0379L8958M1672
6202B631L8464k1905o7870K2616J1961k0329J7701j4307L870l5608P4372J5562
6190B7158k0642k0453k1035J5601K0070n215J5701p326o392o832l4580L922L805
6177c6218K3018P961J3592M0069K9932n4726M2639M7035m6799n7071N1461k1410
6165C9483m2740k0679R454K7841p8738N1121L6373L7810j6203k1563J1398l008
6153C0549l7637k1247K7661K3091m9449K3077L9160K0417j2586l9293K1430k188
6141B2985n3612K8816j1584N990K8692k3830L751K6104M6997n2017J7406J7579
6129E7277j7027l0889j9190K1410L119l8738k176K8706j9709n063r812l4380k518
$$ y = [-6202, 2964, 4770, -16236, 49096, 15672, 32735, 45779, 24698, 2380, -77999, -39041, 2631, 41095, 19190, -48680, -26064, -14103, -34432, -16731, -31038, -27168, -62776, 11596, 27158, 6516, -13937, -34972, -19371, 699, -4516, 11185, 3859, -2533, -9365, -43945, -40023, -36218, -13200, -5239, 8353, 48422, 78354, 23628, 66267, 113302, 66503, 9432, 60893, 39483, -3257, -23936, -14482, 13359, -65379, -14258, 22115, 59925, 43722, 22159, 33557, 30549, -7088, -28335, -674, 22417, -27032, -3955, 35205, 55622, 43036, 3743, 25173, 22985, -30627, -1811, -13395, -7405, 21287, -2543, 1208, 27312, 74309, 22292, 39698, 57277, 40250, 9361, -9829, 11581, 14700, -24038, -26214, 2492, -17217, -22280, -32092, -66472, -68990]
6116f8990K602N3960J9948N789M6625l888J7547K687j03554q191o351N1123M287
6103A3594K1552Q54N73j4704r161l4480J3998J1876J0635K8298K3901Q756j2153
6090F3539J8376j393J5696n8622m4898J7398L7660m281l613j9009L7466k0959
6078C7360k3041k2746L8902n6238P393K9177o131K9616j08L2654l8845K8464K0916
6065G7373o015j7030k7982J1878K0932J7613J1912j6210N0713M8335j033J3104
6053A83590M53M0401K5256j1805N8428L4089J6244J4202l322K1640j9950p4876
6041B84350j02733l7367m4827L8174q147l2548Q910M341j8617l3658n33L729L9681
6028A00755J435J6758k2256j5676K2410J6948m771l0828J2827o4035M0963j2249
$$ y = [-68990, -66388, -12428, 7520, 13309, 59934, 56046, 73593, 76280, -27274, -35465, -41816, 9307, 13594, 35146, 36000, 36573, 21869, 12708, -21772, -7774, 4102, 14737, 43035, 66936, 75692, 63539, 81915, 80522, 96218, 37596, -7302, 10096, 47756, 43475, 39862, 20853, 58319, 37360, 14319, -8427, 30475, -25763, -18370, 10807, 4676, 34292, 34184, 66838, 27993, 56457, 77373, 71358, 54328, 26346, 38224, 59156, 76769, 88681, 72471, 123184, 171519, 170486, 183590, 184043, 224444, 249700, 237895, 296323, 330412, 346656, 360858, 357536, 379176, 359226, 284350, 181617, 144250, 99423, 137597, 129450, 96902, 105812, 110153, 91536, 57878, 57345, 61074, 100755, 102190, 118948, 96692, 81016, 103426, 120374, 115603, 84775, 97602, 33567, 74530, 62281]
6016F2281j9123N6758P02j4208k4602J3748k9234J5764M171N6759k0382m3068
6004E9566K2134k0188K1642M7922J691j3481l6637m6353l1378K4283N2421Q887
5992I0509m1738J6947m670n2121M1499L7770k4667m3691K0046J1308m3242M1381
5980D9331M985K3919N515k0748q069o4299o195N6645N6210k4080l5295M7612l3851
5967E1680J7196M6409m440l9103k7305J8102J5848J2412m0926n392K0728M13k1941
5954D3681Q366j0488k0388R597J2720M6707L1178m2620n633L3662O9735k0005
5942A56512J5654n8084m611O249j615L3864J1275j3080j3190j8317J8169R578
5930A42404j0910R394k3182J95q009j5346P537R428L4059l4490m2934J8621M0091
$$ y = [62281, 43158, 99916, 100618, 86410, 61808, 75556, 46322, 62086, 66257, 123016, 102634, 59566, 81700, 61512, 83154, 131076, 132767, 119286, 82649, 36296, 4918, 29201, 81622, 90509, 48771, 65718, 61048, 8927, 50426, 88196, 63529, 19838, 39884, 51192, 7950, 49331, 54316, 78235, 83750, 63002, 54933, -9366, -15561, 41084, 97294, 73214, 37919, 85531, 51680, 68876, 115285, 110845, 71742, 44437, 62539, 78387, 90799, 49873, 44481, 65209, 65622, 43681, 52047, 41559, 21171, 30768, 43488, 90195, 121373, 78753, 73120, 106782, 176517, 156512, 172166, 114082, 109471, 115720, 114105, 147969, 159244, 146164, 132974, 114657, 132826, 142404, 131494, 140888, 117706, 117901, 109892, 94546, 102083, 111511, 145570, 111080, 68146, 86767, 126858]
5917A26858M1745q01l0055L8917K651k8173J441l4630N8450q884K4866O029k9483
5904A68931M3125M581n3665M3290j2912K0078L1816k0153M7726L2020K8114O833
5892C39784J256K6540J4369n0261l496L6361J2826J561Q474l6110o3984l3284
5880B54036j6867M6971k7615p9471k7187j688R813K5574m2531O174m032m680k6625
5867A11872L8166Q768R11o1367p727M464j4922P3535j6205p555p8487R673K1255
5854H2381J9305L7880p581l9079M5262L5392k1229N7840L6264m5173l0757J0379
5842A80884K0366R441K1686k2838P48M8113j7105P620L5245Q5964L9101L7559
5830D46784L1760m72K6194j4537j5498l1396K6036M0992k9966p2089l4726N2370
$$ y = [126858, 168603, 167802, 137747, 176664, 179315, 151142, 152583, 117953, 176403, 167519, 192385, 198414, 168931, 212056, 216637, 162972, 206262, 193350, 213428, 245244, 225091, 272817, 304837, 332951, 339784, 341040, 367580, 381949, 331688, 328192, 364553, 377379, 378940, 387414, 351304, 287320, 254036, 237169, 284140, 256525, 177054, 149867, 148179, 157992, 183566, 141035, 147209, 143177, 138497, 111872, 150038, 158806, 159717, 98350, 90623, 95087, 80165, 153700, 137495, 129940, 51453, 61126, 82381, 101686, 139566, 131985, 92906, 138168, 173560, 152331, 210171, 246435, 201262, 170505, 180884, 201250, 210691, 232377, 209539, 210287, 258400, 241295, 248915, 284160, 370124, 409225, 446784, 478544, 478072, 504266, 489729, 474231, 442835, 468871, 509863, 479897, 407808, 373082, 425452]
5818D25452N310l9211n6303j7927j9228n3999l0316k7499o2207M1652j1640k358
5806A51726L6623j2113l7949r268J8189M715K1866N971k0619K7472n9036l4285
5794I3292j1997K8211L2934k0061K457j6840M3563N302L5644l3122m0875L4346
5782A52854J661m3991P0043K1012k6720M4550k241l8964o192j3886J7742o8794
5770A07074l1206M5384O5703L7780l125p6378N3021J1895K671n329l5744L8340
5758B10086k901k5937k1166k2155N8461j924J899l9149p676N4171j9036o500j5729
5745A62444j6629o814P5959j4615k1880M2929p786r933n0608m1629O9769L4404
5733B15611l0854K7304m894k4692j4969p269Q956J5715n1834J3383L2213k2870
$$ y = [425452, 430762, 391551, 335248, 317321, 298093, 244094, 213778, 186279, 124072, 165724, 154084, 151726, 188349, 176236, 138287, 129019, 147208, 151923, 173789, 179760, 159141, 186613, 127577, 93292, 81295, 109506, 142440, 122379, 124836, 107996, 151559, 156861, 192505, 159383, 118508, 152854, 154515, 110524, 180567, 201579, 174859, 219409, 217168, 178204, 172012, 158126, 175868, 107074, 75868, 121252, 186955, 224735, 221610, 145232, 198253, 210148, 212819, 207490, 171746, 210086, 207185, 181248, 160082, 137927, 196388, 194464, 196363, 157214, 149538, 203709, 184673, 178173, 162444, 145815, 139001, 214960, 200345, 178465, 221394, 213608, 203675, 153067, 111438, 181207, 215611, 184757, 212061, 207167, 182475, 167506, 160237, 169193, 184908, 133074, 146457, 178670, 155800]
5721A55800J9274N208K1406k4335J274J6889l7477K4290M1264P753L940N413n795
5708B34904q9566r519Q0935O1478l3685j816J3092N58K9269K9863J1130P951j0891
5695C23703J8486L8376J16411J7138j210P8173M0518j6004O0171o0350M8908N7518
5683G21838p2051J0676J9558L7077l3196k9871j1115L052K4551k2525K2140n8835
5671F11299o4845m9891p8901n4708K4443L5178l3992n7494j8743J2829k9055J4998
5659C11118J2628K6970j4714l521p923n0232N5250P93j4530L9385j0340n6573
5647B88311j3768k8395L0217N9534J6658K8597l8477m7463k229K9319K1252J675
5635C45231K3575m715l9930k6769R458L1446P9431J5466m1734k9794K0076J5935
$$ y = [155800, 175074, 180282, 201688, 177353, 178627, 195516, 158039, 182329, 223593, 231346, 235286, 240699, 234904, 145338, 135819, 216754, 278232, 244547, 242731, 255823, 256381, 285650, 315513, 326643, 334594, 323703, 342189, 380565, 496976, 514114, 512904, 591077, 631595, 615591, 675762, 615412, 664320, 721838, 649787, 660463, 680021, 717098, 683902, 654031, 642916, 645968, 670519, 647994, 670134, 611299, 546454, 496563, 417662, 362954, 387397, 422575, 388583, 331089, 312346, 325175, 296120, 311118, 323746, 350716, 336002, 332481, 324558, 274326, 329576, 330369, 315839, 355224, 344884, 288311, 274543, 246148, 276365, 335899, 352557, 381154, 342677, 295214, 292985, 322304, 343556, 345231, 368806, 364091, 324161, 297392, 306850, 338296, 417727, 433193, 391459, 361665, 381741, 397676]
5623C97676j9579L8587M3099m828k8063j6608m5790J3214L2467k0896K954N3465
5611D45698O541j3706o24J7301k4428J1262l9191O1471m3291K3313k4636p0903
5599C48807P740M6734M5073R155L7660k5071k9759L372k891m3878p8471M0977
5587C59448O2332J2443M224Q462O7316l0331l5459L1863k248L8256J0584L914
5575E30804m8122Q287M3286j7405K1893R384K9254M5568j6072o654L0410m4858
5563E85775l3694N12L0552J6027n0317O969L2479M494o1171l8737J5758o2136
5551D46511K4396J6105J0773K8923Q7240o140L1877O764k9649k6456m9587K0892
5539E61649n775N5691K9313K9229R695J8029K627l6848M0591J6118m7928l1606
$$ y = [397676, 378097, 416684, 459783, 454955, 426892, 410284, 364494, 377708, 410175, 389279, 392233, 445698, 452239, 438533, 437909, 455210, 430782, 442044, 402853, 464324, 421033, 444346, 419710, 348807, 356547, 403281, 448354, 457509, 495169, 470098, 440339, 443711, 440820, 396942, 318471, 359448, 421780, 434223, 438447, 446909, 514225, 483894, 448435, 480298, 478050, 516306, 526890, 530804, 482682, 490969, 534255, 516850, 538743, 548127, 577381, 622949, 606877, 600223, 630633, 585775, 552081, 552593, 583145, 599172, 548855, 555824, 588303, 592797, 531626, 492889, 508647, 446511, 470907, 487012, 497785, 526708, 613948, 607808, 639685, 646449, 616800, 590344, 540757, 561649, 555874, 611565, 640878, 670107, 679802, 697831, 700458, 663610, 704201, 720319, 672391, 640785]
5527F40785r614J0294M2556K7475m2926l026L5435K2755K5397L6189M0943n0054
5515G76209N3580J1720k6177j9277P6347L3893k9380L5817k5074l99K1059O4906
5503I73224m8998N440M1860J5846M6871k3727K5502L4229j8409K8239O8847k182
5491A146742j693N6263J2883q621n452P0083Q361m469K0016P3712O6329L692j0700
5478A427146P493M8135j937J9155M7435Q2074L4648L2430K9026J7266O3045J06954
5466A912870M2850J0793K588K8733Q7424R7949M2695N3644N9033O5756N3375R0914
5454B548624R0508Q3807N5932J50581R6889J25493J09288R4756J10896J37786
5444C604560J66746J27912J13085J07096J19342J62289J17541J04210J21769J28602
$$ y = [640785, 631171, 641465, 684021, 711496, 668570, 665544, 700979, 723734, 749131, 785320, 826263, 776209, 829789, 841509, 815332, 796055, 872402, 906295, 876915, 912732, 887658, 887259, 908318, 973224, 924226, 929666, 971526, 987372, 1034243, 1010516, 1036018, 1070247, 1051838, 1080077, 1148924, 1146742, 1145049, 1201312, 1214195, 1205574, 1200122, 1270205, 1278566, 1274097, 1294113, 1367825, 1434154, 1437846, 1427146, 1434639, 1482774, 1480837, 1499992, 1547427, 1629501, 1664149, 1696579, 1725605, 1742871, 1805916, 1912870, 1955720, 1966513, 1969101, 1997834, 2085258, 2183207, 2225902, 2279546, 2338579, 2404335, 2457710, 2548624, 2639132, 2722939, 2778871, 2929452, 3026341, 3151834, 3261122, 3355878, 3466774, 3604560, 3771306, 3899218, 4012303, 4119399, 4238741, 4401030, 4518571, 4622781, 4744550, 4873152]
5434D873152J68551J43205J82767K01040J44413R7750J93314J36900J04891J56428
5424F402411K08409J47292J87910K01783K05335K63402K33495K54197K92263L04751
5414H701248K48968K46574K90561K83548K69398L10801L84997L25679M28071L95827
5404A1885672L70147L84154M58482M09064N15575M59548N77156N81480O38687
5395A6279965O82941P35750Q88450Q92140J045697J148158J334537J483921J668014
5386B6159573J827983K176620K478776K803865L290674L677705M262762N109890
5378E1787848O060696P152672Q151491Q967651R419951R075643O006219P59007
5370A07381178l127067m645061m361920k537290j98100K000032L532783L715853
$$ y = [4873152, 5041703, 5184908, 5367675, 5568715, 5713128, 5810878, 6004192, 6141092, 6245983, 6402411, 6610820, 6758112, 6946022, 7147805, 7353140, 7616542, 7850037, 8104234, 8396497, 8701248, 8950216, 9196790, 9487351, 9770899, 10040297, 10351098, 10736095, 11061774, 11489845, 11885672, 12255819, 12639973, 13098455, 13507519, 14023094, 14482642, 15059798, 15641278, 16279965, 16962906, 17698656, 18587106, 19479246, 20524943, 21673101, 23007638, 24491559, 26159573, 27987556, 30164176, 32642952, 35446817, 38737491, 42415196, 46677958, 51787848, 57848544, 65001216, 73152707, 82120358, 91540309, 100615952, 106622171, 107381178, 104254111, 99609050, 95247130, 92709840, 92511740, 94511772, 98044555, 101760408]
5362A01760408K244047j590748o877185j0172983j0577069r614663q316746p034270
5354D9820791n875389m864595m055776l332426k809553k457576k136729j863776
5346B2424971j596131j418954j294557j137452j047297r27340q28893q11047p44676
5337A2618624p11690n86376n83949m82587m47841m60826m35625l38316l09242
5328H262172k89978l06883l21148k92473k29790k42567j48555j71160k01982j82359
5318E875277k50608j61382q7685j71494j65048q5920j51025j54764j72746o6329
5308D408276j01935j02577m8177j16945o6558j00864o3216r8787j22954n7990
5298C528273j08062r3539o6197m3763m9868j03989p4757l5804j19704n9022n906
$$ y = [101760408, 104004455, 102413707, 95536522, 85363539, 74786470, 65171807, 56855061, 49820791, 43945402, 39080807, 35025031, 31692605, 28883052, 26425476, 24288747, 22424971, 20828840, 19409886, 18115329, 16977877, 15930580, 15003240, 14174347, 13363300, 12618624, 11906934, 11320558, 10736609, 10254022, 9806181, 9345355, 8909730, 8571414, 8262172, 7972194, 7665311, 7344163, 7051690, 6821900, 6579333, 6430778, 6259618, 6057636, 5875277, 5624669, 5463287, 5375602, 5204108, 5039060, 4953140, 4802115, 4647351, 4474605, 4408276, 4306341, 4203764, 4155587, 4038642, 3972084, 3871220, 3808004, 3709217, 3586263, 3528273, 3420211, 3326672, 3260475, 3216712, 3166844, 3062855, 2988098, 2952294, 2832590, 2773568, 2767662]
5287B767662l8582n5937m931o7499m4048k1619o1978l8458J8263n8187j05804
5276B288882p421L7161m9879j1358K1317o4629l5951l191l8700l1136Q623O4779
5264B178497q8891j8648K9791m5287L6747J3913l0732k8495k6913O3616M9577
5253B133175P1044J5238k8392r136N7329N4117q624m2650j8869O9332O4061P0968
5241B427593N1890M2023L7580N9513O9615j5634O266K5156J6293k4140k4074m7376
5229B624705n8292k0439l9528m9376j4507j4803l9915o849q6183M6139L6961j291
5217B376622L2710K2982P0528J6806L8249N6868O6216J89475K6441J45899J22500
5206C165296N6796p522K9421L4104P1496Q11O2966J00279K8858Q2235J40033O8574
$$ y = [2767662, 2729080, 2673143, 2668212, 2600713, 2556665, 2535046, 2473068, 2434610, 2452873, 2394686, 2288882, 2281461, 2318622, 2268743, 2257385, 2278702, 2214073, 2178122, 2174931, 2136231, 2105095, 2113718, 2178497, 2089606, 2070958, 2100749, 2055462, 2092209, 2106122, 2075390, 2046895, 2019982, 2083598, 2133175, 2204219, 2219457, 2191065, 2181929, 2239258, 2293375, 2284751, 2242101, 2223232, 2292564, 2356625, 2427593, 2479483, 2521506, 2559086, 2618599, 2688214, 2672580, 2678846, 2704002, 2720295, 2696155, 2672081, 2624705, 2566413, 2545974, 2506446, 2457070, 2442563, 2427760, 2387845, 2380996, 2294813, 2340952, 2377913, 2376622, 2409332, 2432314, 2502842, 2519648, 2557897, 2614765, 2680981, 2870456, 2896897, 3042796, 3165296, 3222092, 3214570, 3243991, 3278095, 3349591, 3350402, 3413368, 3513647, 3542505, 3624740, 3764773, 3833347]
5194C833347k686O7092L8276N3797K5518k9703L0058R8017O2605J02351J16719
5183D395391R6241J81570J25150J67212J75833J66171L13051K87404L38112K64701
5173F510836L26701K67712K58352K08953J77728J64295J33371J0686k8208l0879
5163G999547o8180j00641r8485j00324j26392q6867J3217O6856Q6770R2850J70989
5152G849340K59437J88135K88033M06532L79307M77368N45815O63000Q71399Q65883
5142A2794249J051653J163410J337440J519276J839006K221746K573289L095864
5134B7595933L719457L984150L058548N49015j981491k846517k367745j361557
5126C0349793l50646L34920R56185J741189K367114K140147Q8707k733674m397208
$$ y = [3833347, 3830661, 3897753, 3936029, 3989826, 4015344, 3985641, 4015699, 4113716, 4176321, 4278672, 4395391, 4491632, 4673202, 4798352, 4965564, 5141397, 5307568, 5620619, 5908023, 6246135, 6510836, 6837537, 7105249, 7363601, 7572554, 7750282, 7914577, 8047948, 8058634, 8030426, 7999547, 7931367, 7830726, 7732241, 7631917, 7505525, 7418658, 7431875, 7498731, 7585501, 7678351, 7849340, 8108777, 8296912, 8584945, 8991477, 9370784, 9848152, 10393967, 11056967, 11928366, 12794249, 13845902, 15009312, 16346752, 17866028, 19705034, 21926780, 24500069, 27595933, 31315390, 35299540, 38358088, 38907103, 36925612, 34079095, 31711350, 30349793, 29999147, 30334067, 31290252, 33031441, 35398555, 37538702, 37627409, 34893735, 30496527]
5117C0496527m364871l622459k837849k276087j912892j606566j316996j124326
5109A1434481r27243q54860p96638o65221n87771m27356m24910l99841l39720
5100F010921l15143k21074k60714k61782k42262k99715j68799j72655j71090j70198
5090C727489j55576r6704q6927j51527j30601j42287r3397j01131p2050n7199
5080B640090j46705r4468k3096m0817o1933j6794n1966r6868l4537k9575q3284
5069A960047K1066m5069k9981q5161M618K8254m2245k7364l7721N220k2176J579
5057A731067N9448K624k6977k5465l9515L2039l9313J2016k9398p8837r368o7961
5045A520360l92n884p4521m2223n3699L5280p9304q3816m0759p3720j4588j5874
$$ y = [30496527, 26131656, 22509197, 19671348, 17395261, 15482369, 13875803, 12558807, 11434481, 10507238, 9652378, 8855740, 8190519, 7602748, 7175392, 6750482, 6350641, 6010921, 5695778, 5474704, 5213990, 4952208, 4709946, 4410231, 4241432, 4068777, 3897687, 3727489, 3571913, 3475209, 3388282, 3236755, 3106154, 2963867, 2870470, 2769339, 2697289, 2640090, 2493385, 2398917, 2375821, 2335004, 2273071, 2256277, 2204311, 2107443, 2072906, 2043331, 1960047, 1981113, 1936044, 1906063, 1820902, 1825520, 1853774, 1811529, 1784165, 1746444, 1751664, 1729488, 1731067, 1790515, 1793139, 1766162, 1740697, 1701182, 1733221, 1693908, 1705924, 1676526, 1597689, 1588321, 1520360, 1519968, 1514084, 1439563, 1397340, 1343641, 1378921, 1299617, 1215801, 1175042, 1101322, 1086734, 1070860]
5033A070860k0799o2433l7737k0937k902m8890p1736l6613l913k691M8158l9753
5021G70614k1828j8642m8392n043J084n886k4438p0542O2436L1209l6409l3398
5009F00765m6170L2478N3088l1448o4345k5849K7907N9734k8621m6445k3924r509
4997D97661J2551k0513o66p9061j5748j8982L9955M0065l5372K6020k2901K6973
4985D49982m5308m2269J1035N9755o9172k2757L7943j3122L8568J6038q9234j7486
4973C13973j8372n693L1381m5507Q6738M6464k8658j3065k6631j1978n0731q051
4961B69870k1684P6252O3288j8394m6950N6056j1673k0879j4465L6281L5439n6745
4949C46396K4910n600m3041L6204k5814l2761n969p3964O1135j2638j4757L0848
$$ y = [1070860, 1050061, 987628, 949891, 928954, 926052, 877162, 805426, 768813, 764900, 762209, 810367, 770614, 748786, 730144, 681752, 676709, 677793, 671907, 647469, 576927, 639363, 670572, 634163, 600765, 554595, 587073, 640161, 608713, 544368, 518519, 546426, 606160, 577539, 531094, 507170, 497661, 510212, 489699, 489033, 409972, 394224, 375242, 415197, 455262, 419890, 445910, 423009, 449982, 404674, 362405, 373440, 433195, 364023, 341266, 379209, 366087, 404655, 420693, 331459, 313973, 295601, 289908, 321289, 275782, 362520, 408984, 380326, 367261, 340630, 328652, 277921, 269870, 248186, 324438, 387726, 369332, 322382, 378438, 366765, 345886, 331421, 367702, 403141, 346396, 371306, 365706, 322665, 358869, 333055, 300294, 294325, 220361, 281496, 268858, 254101, 284949]
4937B84949L044n3352K7533l2346Q881L621l6403K1556J2682O5127l7663o1836
4925B05793m9957K5582L2965n3811l3059l4168N0944K7472l6270N9126L3370o142
4913B21845l3316m253R260k4816Q46k282L919K8682L526J4474n8327j8389O1518
4900B02687l7317k6192M3417K9326m161m1361l9738m985M6175O13m0590J0638
4888A38512J06676O6812n6639p6834L6101j8545J2830k6997l7719R3685l1643
4877B06239l7845r967k0848o449O4742R557j9642K4860k0895k4084K4525J9720
4865B09913J7038n109P526K8413Q420k7108J045m9418k2091K0726N7292K459l822
4852B45284L9290J486j6901J0351j6407k0482J766o1301N126m2659R2891k8389
$$ y = [284949, 287993, 234641, 262174, 229828, 238709, 242330, 205927, 227483, 240165, 305292, 267629, 205793, 155836, 181418, 214383, 160572, 127513, 93345, 144289, 171761, 135491, 194617, 227987, 221845, 188529, 184276, 193536, 168720, 169566, 167284, 171203, 199885, 203411, 217885, 159558, 141169, 202687, 165370, 139178, 182595, 211921, 207760, 166399, 126661, 121676, 167851, 168464, 127874, 138512, 245188, 312000, 255361, 178527, 214628, 196083, 208913, 181916, 144197, 237882, 206239, 168394, 158427, 137579, 131130, 195872, 205429, 185787, 210647, 189752, 165668, 190193, 209913, 226951, 221842, 229368, 257781, 266201, 239093, 240138, 190720, 168629, 189355, 246647, 249106, 245284, 284574, 286060, 269159, 279510, 263103, 242621, 244387, 183086, 188212, 145553, 238444, 210055]
4840B10055j17635O7683Q0892J5766j6354j3046p0481N987N5610l0754l815K4798
4828B08706Q3310k7362j2280L0352o909R336J8545N6922p353J7161K0986k178
4816C89236l5153o546r5984J9636O089P757N2506L3937j9875J684N2405k0776
4804C84916L5917l7613q5897l7596J392J9923p9048k8879K6727R472k7237r856
4792A72221j209L1018k2610K1190L6523p9735k864O6892J4544j0739k3213l5418
4780A66600L5098j4356K1900j0058k1434Q525J2004J8715K896j972p4843K6047
4768A69122J0821J5659o204k4815M1725N312j3642k8311j1571j4825J9648N357
4756A68276q450j7660J2493P6356o8292m110J2302j7656l070m6730O1108j521
$$ y = [210055, 92420, 160103, 240995, 256761, 240407, 227361, 156880, 162867, 218477, 187723, 183908, 208706, 292016, 264654, 252374, 282726, 275817, 285153, 303698, 360620, 353267, 370428, 391414, 389236, 354083, 347537, 251553, 271189, 277278, 285035, 337541, 371478, 351603, 353287, 405692, 384916, 420833, 383220, 297323, 259727, 261119, 281042, 201994, 173115, 199842, 209314, 182077, 172221, 171012, 202030, 179420, 200610, 237133, 157398, 154534, 221426, 235970, 225231, 202018, 166600, 201698, 187342, 209242, 199184, 177750, 186275, 198279, 216994, 219890, 217918, 143075, 169122, 179943, 195602, 189398, 164583, 206308, 211620, 197978, 169667, 158096, 143271, 162919, 168276, 159826, 142166, 154659, 231015, 162723, 158613, 170915, 153259, 150189, 103459, 164567, 163046]
4744A63046k6052k731N9876n0819p144K0461K3560Q697N5351L9001q6709k0065
4732A76472n5858J9276J8791k5494l2822M8391R3047P713l0831N197l2722N840
4720A97000K7835l1621K6037K2562l85J0510m292n8377L6231Q730j5219N50K152
4707B21713L5147m2408n5863K0841r068r165K74M5913k4589L1460N317q553j8004
4694A93015j6460J7446J0546L4714M5891m3927k5172R810j4818k065Q2803n32
4682B91251p65J5992o5446k2068L2751J7775l680k6006l0253O9470p357K4245
4670B95909j5027j3480J152k0139M9866O032K7835j8473k734M9784j2856l0583
4658C17286J0959J1265J0049K7213n3804m7238J1551K4461M9147M2503n3770m484
$$ y = [163046, 136994, 134263, 194139, 143320, 136176, 156637, 180197, 188894, 244245, 283246, 196537, 176472, 120614, 139890, 158681, 133187, 100365, 148756, 241803, 249516, 218685, 223882, 191160, 197000, 224835, 193214, 219251, 241813, 241428, 251938, 247646, 189269, 225500, 234230, 219011, 219561, 221713, 256860, 214452, 158589, 179430, 170362, 161197, 161471, 207384, 182795, 214255, 219572, 211019, 193015, 176555, 194001, 204547, 239261, 285152, 241225, 216053, 225863, 211045, 208980, 291783, 291251, 290486, 306478, 241032, 218964, 251715, 269490, 265810, 239804, 209551, 279021, 271664, 295909, 280882, 267402, 268554, 248415, 298281, 304313, 332148, 313675, 310941, 360725, 347869, 317286, 328245, 339510, 349559, 376772, 322968, 275730, 287281, 311742, 360889, 403392, 349622, 345138]
4646C45138l3817P9727l145k357K8674j6075L4171p358n5329K5449L6215n855
4634D25438k2483m890l0200L7496l1830k825J1759K158j6450l8569J1341J929
4622C42874L1394K5042k0167o1301Q0337L0737j895O3515K3223n9045K4442K4670
4610E03826Q544K8416k7050K6803J3774j5170k633N715M0210O319k1972o77J0520
4597E76625n6332k7661Q3671M3265N2309N1947J3051j8049k0559n8928j8338p5487
4585E45514o051O6902Q855J1469N909j3595l131m0076k7598j7017o3813L181J1916
4572D82465j744m1544m4388L3462k7872K8175J6031k3196n0006j6757M4336k9527
4560C69435K0182J1242m3450r82r469n5776R789J9020K7821j7482q307L0104L1223
$$ y = [345138, 311321, 391048, 387903, 385546, 414220, 398145, 432316, 424958, 369629, 395078, 431293, 425438, 402955, 398065, 367865, 405361, 373531, 370706, 382465, 384623, 368173, 329604, 340945, 342874, 374268, 399310, 379143, 317842, 398179, 428916, 427021, 490536, 513759, 454714, 479156, 503826, 512370, 540786, 513736, 540539, 554313, 539143, 536510, 542225, 582435, 588754, 566782, 566105, 576625, 520293, 492632, 576303, 619568, 671877, 723824, 736875, 718826, 698267, 639339, 621001, 545514, 539463, 606365, 615220, 626689, 632598, 619003, 615872, 575796, 548198, 531181, 467368, 470549, 482465, 480721, 439177, 394789, 428251, 400379, 428554, 444585, 421389, 371383, 354626, 398962, 369435, 389617, 400859, 357409, 356427, 346958, 291182, 300971, 319991, 347812, 330330, 322023, 352127, 383350]
4547C83350Q175N0751n4298j7249m4657j5057j3676p181M0530L8767J8152l94
4535C87213K9707n652l5219j8344J2762J2045K2056l0283m0417L3952J2949K4696
4523D05465M2361j6506N0025k2814n8692M2671K8939l9500o4286O8492k0139N716
4511D21732O7020l2338m7993l960k2699M6566J486k4400k9297l0066K9146M368
4499C79565q65M6265r238l2322L4732k4008J374L3026j8263k6632L6429k6009
4487C94054K4421L5235Q632m307R352J2121J2276K899j4816n650m0343q063k84
4474D25527R0695R203l4899k5139l5655L1069n471k7801l7190n078K6428K103
4462D13792l1716J0643l5702j9341K7529J2119j0165J8431k6949M6092j7193j1285
$$ y = [383350, 391525, 442276, 387978, 370729, 326072, 311015, 297339, 290158, 330688, 369455, 387607, 387213, 416920, 411268, 376049, 357705, 370467, 382512, 404568, 374285, 333868, 367820, 380769, 405465, 447826, 431320, 481345, 458531, 399839, 442510, 471449, 431949, 367663, 436155, 416016, 421732, 488752, 456414, 408421, 404461, 381762, 428328, 429814, 405414, 376117, 346051, 375197, 379565, 378700, 424965, 415727, 383405, 418137, 394129, 395503, 428529, 410266, 383634, 420063, 394054, 418475, 453710, 462342, 458035, 467387, 479508, 491784, 494683, 479867, 474217, 433874, 425811, 425527, 516222, 525425, 490526, 465387, 429732, 460801, 455330, 427529, 390339, 385261, 411689, 413792, 382076, 392719, 357017, 337676, 365205, 377324, 367159, 385590, 358641, 404733, 387540, 376255]
4450C76255J9385K3204Q219l2029K354n5404J6574q25P86J4748K3441j4205L1434
4437D13937p349l3497N838R892O9630K2204k8444K6723n0816j3553l9537n5204
4425C19824P879K1929P4729L2118k1851k9116K192q2592J7348J4968J6552J3356
4413C87336J4728l5032K4822N4414n4294l0362O5648K176M326m6445K1174K1753
4401D30244J3823N947k5566K34k289l8013j455L5434O498m795l9903J4877m0646
4388C54390N2333L0369k8360K6572J881l5361k4932m3871J0544L7444P178J4840
4376D03027O3291m1362p3616q38J6440L6933k8266O118K7642N2882L3638l5155
4364D60734J1957k8185n7530M7349N0446j6300R931k058M6621k8075l9889k8388
$$ y = [376255, 395640, 418844, 427063, 395034, 397388, 341984, 358558, 357733, 358519, 373267, 396708, 382503, 413937, 406588, 373091, 378929, 388821, 458451, 480655, 452211, 478934, 428118, 414565, 375028, 319824, 327703, 349632, 424361, 456479, 434628, 405512, 407704, 325112, 342460, 357428, 373980, 387336, 402064, 367032, 391854, 446268, 391974, 361612, 427260, 429436, 433762, 387317, 408491, 430244, 444067, 450014, 424448, 424682, 422393, 384380, 382925, 418359, 424857, 420062, 380159, 395036, 354390, 406723, 437092, 408732, 435304, 437185, 401824, 376892, 333021, 343565, 381009, 388187, 403027, 466318, 424956, 351340, 350502, 366942, 403875, 375609, 381727, 409369, 462251, 495889, 460734, 472691, 444506, 386976, 434325, 484771, 468471, 478402, 476344, 522965, 494890, 455001, 426613]
4352D26613J0284M5468K1621N0816j0124o7021n7860N5972N7651M8320J4259m7558
4340E48441J2594k4367J6010n6610M2039L7262J937J6622j1940L7984n7968K8108
4328E90112L772N8560L2415j4310n3181o388Q3387q273n8269L7106o3906p788
4316E93237M1437l6354J4112m264N1522L5558M3115n0990R663j4197M584M789
4304F92212m075j3008L836M1092n289K3744o434O770P422P21J6318j7003L215
4291G49521K2668L8993J044Q85K3881l0503o8593N4515M0372N055o019l3857L977
4278H01939M0912k7183k2668K313J9801N5020R558k5974k3816K1341j4595L6254
4266H72902L4727k7985j0414L2345l6825L7465L4292L9119M3515j0535J9273K5441
$$ y = [426613, 436897, 482365, 503986, 554802, 544678, 477657, 419797, 475769, 533420, 581740, 595999, 548441, 561035, 536668, 552678, 496068, 538107, 575369, 577306, 593928, 581988, 619972, 562004, 590112, 593884, 652444, 684859, 670549, 617368, 610980, 694367, 686094, 627825, 664931, 601025, 593237, 634674, 598320, 612432, 608168, 659690, 695248, 738363, 687373, 697036, 682839, 687423, 692212, 688137, 675129, 678965, 720057, 714768, 738512, 732078, 738848, 746270, 746991, 763309, 746306, 749521, 772189, 811182, 812226, 813111, 836992, 806489, 737896, 792411, 832783, 837838, 831819, 797962, 801939, 842851, 815668, 793000, 795313, 815114, 870134, 879692, 853718, 829902, 851243, 836648, 872902, 907629, 879644, 869230, 901575, 864750, 902215, 936507, 975626, 1019141, 1008606, 1027879, 1053320]
4254A053320k9590L5387J15720P530m4314L3635J731l9198M7487L4291J2732K1744
4242A250475j6565J0909j5408K1352R437o9539Q2593M6938M6196r118j7274L8003
4230A377999J6528L0963L4668J3599o1166P2008M3627m5504j149K7932R322M653
4218A523480l245K5014k0753J0361K7650l793P571K1746l3788M5399L3981m8866
4206A584757J4314K4863M016j4017M7288M0633j4701q7652k0227Q3694L3043J147
4194A697158J4273k8512J6210O2039j8750L8425M5186K7028L8131o306k675j6143
4182A866064j2694j9156K0115K5428q165j615R588l0463K0234J4196M6944J2263
4170A942739J7568r320o6448J8652l4417J499m6349K7714M492k9680m6616L1313
$$ y = [1053320, 1023730, 1059117, 1174837, 1182367, 1138053, 1171688, 1173419, 1134221, 1181708, 1215999, 1228731, 1250475, 1233910, 1244819, 1229411, 1250763, 1260200, 1190661, 1273254, 1320192, 1366388, 1357270, 1339996, 1377999, 1394527, 1425490, 1460158, 1473757, 1412591, 1484599, 1528226, 1482722, 1481573, 1509505, 1518827, 1523480, 1520235, 1545249, 1524496, 1534857, 1562507, 1558714, 1566285, 1588031, 1554243, 1599642, 1633623, 1584757, 1599071, 1623934, 1627950, 1613933, 1661221, 1701854, 1687153, 1599501, 1579274, 1662968, 1696011, 1697158, 1711431, 1682919, 1699129, 1761168, 1742418, 1780843, 1826029, 1853057, 1891188, 1884882, 1882207, 1866064, 1853370, 1834214, 1854329, 1879757, 1871592, 1869977, 1879565, 1849102, 1869336, 1883532, 1930476, 1942739, 1960307, 1950987, 1884539, 1903191, 1868774, 1870273, 1823924, 1851638, 1856130, 1826450, 1779834, 1811147]
4158A811147N7963K2830m0635j226P2926M4018L2618J07Q9424M4897J4507O1281
4146B209857K7215m4658J6569M3109O5808R1821K0997O0246n410l1266N7868m3434
4134B468722J4818L3533L8773K6161P6238M1584L6007J2877q2972O9016j7468
4123B717289N8580O3336R586O1828J8654K9720K4832K4353O3729Q3075K9954Q1837
4111C266773R2588P3421R3656J23021m1691J9427R0629J60118J20737M9189O3925
4100D111793N7120R9003Q0364P5791Q0563J81275J23564R9398Q8712J09458J46584
4089E253625J36123Q0277J17828J59410R2273J31226J15563J40387J46083J77964
4079F550759J77733J70039J75584J83983J88659K53146J65346K04157K18123K25202
$$ y = [1811147, 1869110, 1891940, 1851305, 1850079, 1923005, 1967023, 1999641, 1999748, 2089172, 2134069, 2148576, 2209857, 2237072, 2192414, 2208983, 2252092, 2317900, 2409721, 2430718, 2490964, 2485554, 2454288, 2512156, 2468722, 2483540, 2517073, 2555846, 2582007, 2658245, 2699829, 2735836, 2748713, 2665741, 2734757, 2717289, 2775869, 2839205, 2848791, 2910619, 2929273, 2958993, 2983825, 3008178, 3071907, 3154982, 3184936, 3266773, 3359361, 3432782, 3526438, 3649459, 3607768, 3627195, 3717824, 3877942, 3998679, 4047868, 4111793, 4168913, 4267916, 4348280, 4424071, 4504634, 4685909, 4809473, 4908871, 4997583, 5107041, 5253625, 5389748, 5470025, 5587853, 5747263, 5839536, 5970762, 6086325, 6226712, 6372795, 6550759, 6728492, 6898531, 7074115, 7258098, 7446757, 7699903, 7865249, 8069406, 8287529, 8512731]
4069H512731K71538J71350J60141L13827L03569K68061K58636L19724M11143L80226
4059A1370946L57908M09595M31994M76423O32201O64373P49342P87030Q97535
4050A6777347J037147J121386J349859J631376J821541K113792K385436K571715
4042C0809599K632571K829034K757583K191285J619984J155802J054588J435127
4034D6485573K139111K984041L733862M015137L773977K118971j206217l240541
4026F0803914l511805l030207k165318j267177l09508O16641J153376J239842
4018E3529758J3383l031307m980007m725528l833362k958007k404701j845357
4010B9764872j252391p53102l52998q9737q33577j764745j978650j627237j110174
$$ y = [8512731, 8784269, 8955619, 9115760, 9429587, 9733156, 10001217, 10259853, 10579577, 10990720, 11370946, 11728854, 12138449, 12570443, 13046866, 13679067, 14343440, 15092782, 15879812, 16777347, 17814494, 18935880, 20285739, 21917115, 23738656, 25852448, 28237884, 30809599, 33442170, 36271204, 39028787, 41220072, 42840056, 43995858, 45050446, 46485573, 48624684, 51608725, 55342587, 59357724, 63131701, 65250672, 64044455, 60803914, 57292109, 54261902, 52096584, 50829407, 50519899, 51136540, 52289916, 53529758, 53543141, 50511834, 45531827, 40806299, 36972937, 34014930, 31610229, 29764872, 28512481, 27759379, 27406381, 27316644, 26483067, 24718322, 22739672, 21112435, 20002261]
4001B0002261q44659o48514n39215n19043l40634k63164k23135j65098n0510K3621
3991A6431910j4563P7214L6150N0416J02505J81933K05305K60929K03755L02096
3981A7837650L27464K99225L42334L71494L54910L38851L39407M90718M85918
3972B1187971N20254N77975N24834O46428P13910O67291O84011P15931P98014
3963B7036619Q61785R26718R82758J007996J083753J162971J172446J235112J303416
3954C6773574J332452J379806J495947J581736J585943J636245J720399J765998
3946D9272100J877158J932543J961839J980182K021437K042115K080580K003127
3938F5171081J943530J905285J944355J952028J880033J923301J927380J902925
$$ y = [20002261, 19157602, 18509088, 17969873, 17450830, 17110196, 16847032, 16623897, 16458799, 16408289, 16431910, 16417347, 16494561, 16530711, 16581127, 16683632, 16865565, 17070870, 17331799, 17535554, 17837650, 18165114, 18464339, 18806673, 19178167, 19533077, 19871928, 20211335, 20702053, 21187971, 21708225, 22286200, 22811034, 23457462, 24171372, 24838663, 25522674, 26238605, 27036619, 27898404, 28825122, 29807880, 30815876, 31899629, 33062600, 34235046, 35470158, 36773574, 38106026, 39485832, 40981779, 42563515, 44149458, 45785703, 47506102, 49272100, 51149258, 53081801, 55043640, 57023822, 59045259, 61087374, 63167954, 65171081, 67114611, 69019896, 70964251, 72916279, 74796312, 76719613, 78646993, 80549918]
3930H0549918J903395J870328J785133J704908J556154J503581J330723J174341
3922I3378481R96824R82729Q59106P65389P44690N65875N30025M62766L71696
3913I9657581K56315N3185J593j44974k66011l47708n34191n91302p18893q72143
3903I6493452r27183r47660j021400j058148j127060j283910j289433j300557
3895H7538101j332210j416264j430956j498755j531387j617348j678524j789973
3887G5242684j839020j808935j750852j777244j812225j730209j659097j638407
3879F1226695j603306j657200j630827j669298j820496j862172j827813j876253
3871D7279330j854916j798959j829046j644783j594395j534168j493327j418710
$$ y = [80549918, 82453313, 84323641, 86108774, 87813682, 89369836, 90873417, 92204140, 93378481, 94375305, 95358034, 96217140, 96982529, 97727219, 98293094, 98823119, 99285885, 99657581, 99913896, 99967081, 99968674, 99823700, 99557689, 99209981, 98675790, 98084488, 97365595, 96493452, 95566269, 94618609, 93597209, 92539061, 91412001, 90128091, 88838658, 87538101, 86205891, 84789627, 83358671, 81859916, 80328529, 78711181, 77032657, 75242684, 73403664, 71594729, 69843877, 68066633, 66254408, 64524199, 62865102, 61226695, 59623389, 57966189, 56335362, 54666064, 52845568, 50983396, 49155583, 47279330, 45424414, 43625455, 41796409, 40151626, 38557231, 37023063, 35529736, 34111026]
3863C4111026j411323j262636j281627j335210j286474j266507j267973j180530
3855B3818746j066735j023443j021582r39779q29737q17304p34353o31901o23945
3846A6129967n96616n57391n09223n26586m61725m51194m21714l69048l43380
3837A1893090k86209l34967k72994k68895k25712k17669k28018j09432j57532
3828I791662j66216j08559j65522j31050n7791p2458j46478m9839J9203j6673
3818H896279o3949k4631l0631K5493k3972n0926K4442j6797L9674j5159p1987
3807H687836r129O169P1574k2696j1129R5856k6762M0741p624j9649j4895O710
3795H797002R197p3635L8773N6318M6095N5704l9405M0140J5405K1575M0905r664
$$ y = [34111026, 32699703, 31437067, 30155440, 28820230, 27533756, 26267249, 24999276, 23818746, 22752011, 21728568, 20706986, 19767207, 18937470, 18120166, 17385813, 16753912, 16129967, 15533351, 14975960, 14466737, 13940151, 13478426, 13027232, 12605518, 12236470, 11893090, 11606881, 11271914, 10998920, 10730025, 10504313, 10286644, 10058626, 9949194, 9791662, 9625446, 9516887, 9351365, 9220315, 9162524, 9090066, 8943588, 8893749, 8912952, 8896279, 8832330, 8807699, 8777068, 8802561, 8778589, 8727663, 8752105, 8735308, 8774982, 8759823, 8687836, 8678707, 8684876, 8756450, 8733754, 8722625, 8818481, 8791719, 8832460, 8824836, 8805187, 8790292, 8797002, 8806199, 8732564, 8771337, 8827655, 8873750, 8929454, 8890049, 8930189, 8945594, 8967169, 9008074, 8998410]
3783H998410M8280K6511M1943N3308O8283l885K6945J27131P2315J11599J06540
3772I677380R1868P9826Q5005J25897R4317J58743J79444R4090J19387J88692
3762A0894649J46785J68729J48716K42264K55567J69355J98951K41295J81432
3753A2647743K19760K71214K71138K62368K00200K74264K66839K55408K81054
3744A4949988L11616K90568L31987M27312L25738L56665L72385L68846L60164
3735A8095269M70251M30059M14819M80199M87254M79428N17039N74880O35805
3726B2585003O56875O41304O59132P10226P63059P66486P74030Q15048R98296
3717B9369459J055639J154438J241386J470499J557305J730998J993291K323411
$$ y = [8998410, 9046690, 9073201, 9115144, 9168452, 9236735, 9232850, 9259795, 9386926, 9459241, 9570840, 9677380, 9769248, 9849074, 9934079, 10059976, 10154293, 10313036, 10492480, 10586570, 10705957, 10894649, 11041434, 11210163, 11358879, 11601143, 11856710, 12026065, 12225016, 12466311, 12647743, 12867503, 13138717, 13409855, 13672223, 13872423, 14146687, 14413526, 14668934, 14949988, 15261604, 15552172, 15884159, 16311471, 16637209, 16993874, 17366259, 17735105, 18095269, 18565520, 18995579, 19410398, 19890597, 20377851, 20857279, 21374318, 21949198, 22585003, 23241878, 23883182, 24542314, 25252540, 26015599, 26782085, 27556115, 28371163, 29369459, 30425098, 31579536, 32820922, 34291421, 35848726, 37579724, 39573015, 41896426]
3709D1896426K616290K813653L091755L509759L812526M200760M768057N314202
3701G2023428N998134O743816P529505Q256590Q636193Q594429P839149O360793
3693A31982037M462511K492666O31285q03536j544294j850623j790389j531144
3685A32048513j098885o50735k87766j64965l16400q19621j706865l059751m655951
3676A19287574o202539p392071q110283q292198p998414p398394o490421n646654
3668F1756600m993351m326773l831483l293558k906805k545810k203912j946663
3660C5708245j748459j541144j406304j285419j133947r76616r70400q89555p61459
3651B4994942p21693o46541o28693m86717m53514l66336l25132k82980l34539
$$ y = [41896426, 44512716, 47326369, 50418124, 53927883, 57740409, 61941169, 66709226, 72023428, 78021562, 84765378, 92294883, 100551473, 109187666, 117782095, 125621244, 131982037, 136444548, 138937214, 139568499, 138764963, 137220669, 135370046, 133579657, 132048513, 130949628, 130298893, 130011127, 129846162, 129529762, 128710141, 127003276, 123943525, 119287574, 113085035, 105692964, 97582681, 89290483, 81292069, 73893675, 67403254, 61756600, 56763249, 52436476, 48604993, 45311435, 42404630, 39858820, 37654908, 35708245, 33959786, 32418642, 31012338, 29726919, 28592972, 27616356, 26645956, 25756401, 24994942, 24273249, 23626708, 22998015, 22511298, 22057784, 21691448, 21366316, 21083336, 20748797]
3642B0748797k63576j57358j82774j71345j59183o4515p5385j47430J8322J5645
3632A9561198n4654J7512L0691L2426P1810L9622N4036J20156J59771J19300R4700
3621B0246568J55817K06497J29921J61432J83313J82680K24280K80919L08054
3612B2079481K92240L91454L82933M12268M01698M54464N76345N27801N75085
3603B6093769O79894O63370P19980P23110Q12027P79042Q45984R09957R09044
3594C3136177R48444R24290R76334J015163J001827J026228J121471J230749J272029
3585D2652712J284621J285160J271279J265479J188363J276238J178804J102284
3577E2504940J107687J116223J046231R98535J069735R89893J009866J121926
$$ y = [20748797, 20485221, 20327863, 20145089, 19973744, 19814561, 19750046, 19674661, 19527231, 19545553, 19561198, 19506544, 19524056, 19554747, 19587173, 19658983, 19698605, 19752641, 19872797, 20032568, 20151868, 20246568, 20402385, 20608882, 20738803, 20900235, 21083548, 21266228, 21490508, 21771427, 22079481, 22371721, 22763175, 23146108, 23558376, 23960074, 24414538, 24990883, 25518684, 26093769, 26773663, 27437033, 28157013, 28880123, 29692150, 30471192, 31317176, 32227133, 33136177, 34084621, 35008911, 35985245, 37000408, 38002235, 39028463, 40149934, 41380683, 42652712, 43937333, 45222493, 46493772, 47759251, 48947614, 50223852, 51402656, 52504940, 53612627, 54728850, 55775081, 56773616, 57843351, 58833244, 59843110, 60965036]
3569F0965036J086219R55136R58905J003711R44926R01851Q85998Q68345Q41968
3560F9412095Q86941Q88515R74876J108264J089791J221655J429522J639862J739036
3551H0390557J936729K236286K462248K820498L136574L441394L832918M306846
3543A04564050M781610N389307N855465O347362P114737P945560Q734879R669312
3535A60402282J0661220J1520191J2231196J2329730J1643703J0501577R153019
3528B38442918P927990O831690N870248N065763M606465M597810M731046N003001
3520B83076931N237902N390804N317406M925775M364262L463209K301300M70166
3512C14547755j790402l972119n344244n586896n318669m697349m258380l824089
$$ y = [60965036, 62051255, 63006391, 63965296, 64969007, 65913933, 66815784, 67701782, 68570127, 69412095, 70299036, 71187551, 72162427, 73270691, 74360482, 75582137, 77011659, 78651521, 80390557, 82327286, 84563572, 87025820, 89846318, 92982892, 96424286, 100257204, 104564050, 109345660, 114734967, 120590432, 126937794, 134052531, 141998091, 150732970, 160402282, 171063502, 182583693, 194814889, 207144619, 218788322, 229289899, 238442918, 246370908, 253202598, 259072846, 264138609, 268745074, 273342884, 278073930, 283076931, 288314833, 293705637, 299023043, 303948818, 308313080, 311776289, 314077589, 314547755, 312757353, 308785234, 303440990, 297854094, 292535425, 287838076, 283579696, 279755607]
3504B79755607l626771l586913l679176l906452m154845m486193m858159n231308
3496B46225790n628332n838036n868461n862244n759959n613379n392334n037954
3488B01225091m878972m666788m611935m592105m514222m388286m124881l927449
3480A65520453l494398l096150k538940j786521j009041N6588J218037K439809
3472A57309837L512586M249775M591405M642010M223451L306862K054402N23314
3464A84413642r87898k152921k960391l202587l105245k710927k178052j683558
3456A65432063j394358j249928j358047k097211l340600m703184o087350p207377
3448A37994008p826190q160665q169883q055430p507355o688449n954681n258884
$$ y = [279755607, 276128836, 272541923, 268862747, 264956295, 260801450, 256315257, 251457098, 246225790, 240597458, 234759422, 228890961, 223028717, 217268758, 211655379, 206263045, 201225091, 196346119, 191679331, 187067396, 182475291, 177961069, 173572783, 169447902, 165520453, 162026055, 158929905, 156390965, 154604444, 153595403, 153651991, 154870028, 157309837, 160822423, 165072198, 169663603, 174305613, 178529064, 181835926, 183890328, 184413642, 183425744, 181272823, 178312432, 175109845, 172004600, 169293673, 167115621, 165432063, 164037705, 162787777, 161429730, 159332519, 155991919, 151288735, 145201385, 137994008, 130167818, 122007153, 113837270, 105781840, 98274485, 91586036, 85631355, 80372471]
3440H0372471m681221m153626l687365l336709k915137k571018k272850k111978
3432E4642567j887931j754700j707345j696502j647917j609774j723716j687991
3424D0926691j565811j564601j457968j398999j258564j204218j056757j063027
3416C0356746r45834q78651q66454q19023q54748q70582q07020p74315o67271
3407B2872848o51350p06905o86174o06825n86121n44405n27118m85312m15991
3398A7662647l55449m47858l92102l70294l53421l30170k86825k66787l10982
3389A4548759k16210l20308l17298k88006k92888k08273k50122l20265k21653
3380A2113736k37845j79294k28376j72294k20860j77613j62621j52146k12408
$$ y = [80372471, 75691250, 71537624, 67850259, 64513550, 61598413, 59027395, 56754545, 54642567, 52754636, 50999936, 49292591, 47596089, 45948172, 44338398, 42614682, 40926691, 39360880, 37796279, 36338311, 34939312, 33680748, 32476530, 31419773, 30356746, 29410912, 28532261, 27665807, 26846784, 25992036, 25121454, 24314434, 23540119, 22872848, 22221498, 21514593, 20828419, 20221594, 19635473, 19091068, 18563950, 18078638, 17662647, 17307198, 16859340, 16467238, 16096944, 15743523, 15413353, 15126528, 14859741, 14548759, 14332549, 14012241, 13694943, 13406937, 13114049, 12905776, 12655654, 12335389, 12113736, 11875891, 11696597, 11468221, 11295927, 11075067, 10897454, 10734833, 10582687, 10370279]
3371A0370279j23412j78389j38560j28748j28306j00094j38223r8724q8147j43783
3361I103893p8382j10119r8576m7513p3211j07359j11595m6690r7355p2033q3797
3350H177263j2050k6801o8614p4797p9911j4393o6972p7403n0977m9311m6277
3339G609757J6079p1611o0253L935m5250n0745j2468k7358r9518o1279M6671J0502
3327G258462j11188n5446m1536K8839j1855p2611J5979k2558l1287p431n7652
3316F891716l1482Q902R564K2093J4372k8991k9613N1218q196l4008K4778M054
3304F894407O580J0554l895p241L0581R1421J3799J297L9959L4384K8082L4784
3292G174712M5590L4763N0606N7163O778N2296L6478L356Q6641O0929M3928M2470
$$ y = [10370279, 10246867, 10068478, 9929918, 9801170, 9672864, 9572770, 9434547, 9335823, 9247676, 9103893, 9025511, 8915392, 8816816, 8769303, 8696092, 8588733, 8477138, 8430448, 8333093, 8261060, 8177263, 8165213, 8138412, 8069798, 7995001, 7915090, 7900697, 7833725, 7756322, 7705345, 7656034, 7609757, 7625836, 7554225, 7493972, 7497907, 7452657, 7401912, 7389444, 7362086, 7262568, 7201289, 7247960, 7258462, 7147274, 7091828, 7050292, 7079131, 7067276, 6994665, 7010644, 6988086, 6956799, 6949368, 6891716, 6860234, 6869136, 6878700, 6900793, 6915165, 6886174, 6856561, 6907779, 6899583, 6865575, 6890353, 6894407, 6900987, 6911541, 6907646, 6900405, 6930986, 7022407, 7036206, 7037503, 7077462, 7111846, 7139928, 7174712, 7220302, 7255065, 7305671, 7362834, 7369612, 7421908, 7458386, 7461742, 7548383, 7609312, 7653240, 7695710]
3280G695710K4832K1538P5553j0869M3528L8755O8026O9815O0709O4221J4317
3269H166135L5455O5922L2894Q9762M5919K1986K234J06236R5939O5383R2342
3258H820207N0188R9599J16246R1002P7032J02344J04418J68111J10219R7059
3248I836425J57516J8221N5680J87338K03421J46216R5719J24261J17954J41774
3238A1084525J25402J17002J42435P7794R2080J11792J43009J23038J12922L4960
3228A2164959J20269J84899Q6528M5779J52302P5527K8897J27828M7127Q0973
3218A3115088Q6686O2567M7705M5388M8066J5835P3009L8097N9412J21218K0614
3207A3733685L7554O4396Q7867K2336O6892K8497J5570N0646M8078N7342J50901
$$ y = [7695710, 7720542, 7742080, 7817633, 7806764, 7850292, 7889047, 7957073, 8026888, 8087597, 8151818, 8166135, 8201590, 8267512, 8300406, 8390168, 8436087, 8458073, 8460307, 8566543, 8662482, 8727865, 8820207, 8870395, 8969994, 9086240, 9177242, 9254274, 9356618, 9461036, 9629147, 9739366, 9836425, 9993941, 10012162, 10067842, 10255180, 10458601, 10604817, 10700536, 10824797, 10942751, 11084525, 11209927, 11326929, 11469364, 11547158, 11639238, 11751030, 11894039, 12017077, 12129999, 12164959, 12285228, 12470127, 12556655, 12602434, 12754736, 12830263, 12859160, 12986988, 13034115, 13115088, 13201774, 13264341, 13312046, 13357434, 13405500, 13421335, 13494344, 13532441, 13591853, 13713071, 13733685, 13771239, 13835635, 13923502, 13945838, 14012730, 14041227, 14056797, 14107443, 14155521, 14212863, 14363764]
3196A4363764L1836M7769K9388J9161N6331L1721N9621P7910P7913O1865Q8191
3185A4945470O9168M9562J20727j1843O6065J05780J18680M5932K6546J9188M4953
3174A5600228M2095l6039j6394L548L3717m4942m707r540q033j06723j25692j70171
3162A5157347j60019k14282j84218j79958k41357j14308j57880j63293o5833k09738
3152A3466461k16972r0997j42169j31847q5751p8484j40133j80135j19273r0806
3142A2189894j32949j20371j35034j08397p6387j46165j13337j52964j74673j64455
3132A0865162j02535o5671j44175q8346r6657j04614r8188j39202j28687q3394
3122I813693j19482j58820r6892j21872o2018r6878j03850j17880r3795j02330
$$ y = [14363764, 14395600, 14443369, 14472757, 14491918, 14548249, 14579970, 14639591, 14717501, 14795414, 14857279, 14945470, 15014638, 15064200, 15184927, 15173084, 15239149, 15344929, 15463609, 15509541, 15536087, 15555275, 15600228, 15642323, 15606284, 15589890, 15593438, 15627155, 15582213, 15577506, 15567966, 15559933, 15453210, 15327518, 15157347, 14997328, 14783046, 14598828, 14418870, 14177513, 14063205, 13905325, 13742032, 13676199, 13466461, 13249489, 13158492, 13016323, 12884476, 12798725, 12720241, 12580108, 12399973, 12280700, 12189894, 12056945, 11936574, 11801540, 11693143, 11616756, 11470591, 11357254, 11204290, 11029617, 10865162, 10762627, 10696956, 10552781, 10464435, 10367778, 10263164, 10164976, 10025774, 9897087, 9813693, 9694211, 9535391, 9438499, 9316627, 9254609, 9157731, 9053881, 8936001, 8842206, 8739876]
3112H739876j19563q6591j02768p0490j22693j12823o6976p1227r6452r2190p6235
3101G721868j48903n5619j09951q1873r9416k6683p3980j21256j13213r5752n1425
3090F743797j8571p9585j16502m3051o8701n0952q9289l0098r0463r3052p5665
3079E987868j08131j22139j0761o1835r049p5532o3767p2348n3617p5093o5102
3068E270494l2525q8198m6330o9580p007m1052p2856q5199p3669l519l080m8396
3056D699083p0499p367N4641j1828r2055q6122k4655J815j0649r1446m5222r3464
3044D222232q3031o9587j2624k5677r7464n4711l5503O914p3001l9780q445n8044
3032C671279m7791j3777K3415m6372J4138j5756j1411j2131j3296n9086l2451
$$ y = [8739876, 8620313, 8533722, 8430954, 8360464, 8237771, 8124948, 8057972, 7986745, 7890293, 7798103, 7721868, 7572965, 7517346, 7407395, 7325522, 7226106, 7199423, 7125443, 7004187, 6890974, 6795222, 6743797, 6725226, 6645641, 6529139, 6486088, 6417387, 6366435, 6277146, 6247048, 6156585, 6063533, 5987868, 5879737, 5757598, 5746837, 5685002, 5675953, 5600421, 5536654, 5464306, 5410689, 5335596, 5270494, 5237969, 5149771, 5103441, 5033861, 5026854, 4985802, 4912946, 4827747, 4754078, 4750559, 4747479, 4699083, 4628584, 4621217, 4675858, 4664030, 4571975, 4485853, 4461198, 4463013, 4452364, 4360918, 4315696, 4222232, 4139201, 4069614, 4056990, 4031313, 3933849, 3879138, 3843635, 3850549, 3777548, 3737768, 3729323, 3671279, 3623488, 3609711, 3633126, 3586754, 3600892, 3585136, 3573725, 3561594, 3548298, 3489212, 3456761]
3021C456761M8511l3744l9192n1772j10388n2760n0876m8339j1950p5138N645
3010C036758p0269k5549j7817l8863l6917k8263m7866j7317q2754m2622L357j6271
2998B615607m886k5772m0190n1745n325p214k4790J1459l301o7231m0861j1676
2986B344075J0777m8972J7792n2829k9634j3007j7235j1761l0588J2559m8869
2975B132308Q143N3039j4591l6216l3284q3845l5042M4619q818j6436l342N1657
2963B058192o3175m0319K3516K4092o4760J2025K0728M0485J9609n4368l3098
2952A942927l8490J4136k6938L2443m9373M7808L1457l8592K3883O3582j9739
2941A983104K4680K831j2748J7002k2415j7602R8780K7020L8207N6722J0783M2205
$$ y = [3456761, 3505272, 3471528, 3432336, 3380564, 3270176, 3217416, 3166540, 3118201, 3106251, 3031113, 3036758, 2966489, 2940940, 2923123, 2884260, 2847343, 2819080, 2771214, 2753897, 2671143, 2628521, 2631878, 2615607, 2610721, 2584949, 2544759, 2493014, 2487689, 2480475, 2455685, 2467144, 2463843, 2396612, 2355751, 2344075, 2354852, 2305880, 2323672, 2270843, 2241209, 2228202, 2210967, 2199206, 2168618, 2181177, 2132308, 2140451, 2193490, 2178899, 2142683, 2109399, 2025554, 1990512, 2035131, 2026313, 2009877, 2006535, 2058192, 1995017, 1954698, 1978214, 2002306, 1937546, 1949571, 1970299, 2010784, 2030393, 1976025, 1942927, 1904437, 1918573, 1891635, 1924078, 1874705, 1922513, 1953970, 1915378, 1939261, 2002843, 1983104, 2007784, 2010615, 1997867, 2014869, 1992454, 1974852, 2073632, 2100652, 2138859, 2195581, 2206364, 2248569]
2929B248569P661N210M5347o631P3168K2370J6309J0883m9518m2173M275o0659
2917B274811m0878k474l1301K3973k4036p9877j1819L693p1919N9717j682k1923
2905B076285J4829j403j7844N7641L5943L9376L6470L5299L6613Q9885P3951J44711
2893B621756R3461P9625O6440N5994P6467Q4751J9610k8205o246j72754k0281
2882B870618o5817o8101q0820n4035r5502j68792j01979q7504n1642j03566l6233
2871A956627n2315M6086j7637p6279K590r130j2395J05283L701L4419p188L1598
2859B005360J04151L5848K7129K6672Q6536l839k985m8377L8448j0030m5192l3290
2847B180431q9438l4059m1555p0878n7492l9017j04357q8845n7262k5980L159
$$ y = [2248569, 2256230, 2261440, 2306787, 2300156, 2373324, 2395694, 2412003, 2422886, 2373368, 2331195, 2335470, 2274811, 2233933, 2231459, 2200158, 2224131, 2200095, 2120218, 2108399, 2112092, 2040173, 2099890, 2098208, 2076285, 2091114, 2089711, 2071867, 2129508, 2165451, 2204827, 2241297, 2276596, 2313209, 2403094, 2477045, 2621756, 2715217, 2794842, 2861282, 2917276, 2993743, 3078494, 3098104, 3069899, 3063653, 2890899, 2870618, 2804801, 2736700, 2655880, 2601845, 2506343, 2337551, 2235572, 2148068, 2096426, 1992860, 1956627, 1904312, 1950398, 1932761, 1856482, 1859072, 1849942, 1837547, 1942830, 1946531, 1980950, 1973762, 2005360, 2109511, 2145359, 2172488, 2199160, 2285696, 2281857, 2278872, 2230495, 2268943, 2258913, 2213721, 2180431, 2090993, 2056934, 2015379, 1944501, 1887009, 1847992, 1743635, 1654790, 1597528, 1571548, 1574707]
2836A574707n3392m4942K0562K1662K1150k9870q8346j2347O648p5590n5528l3020
2824A251694o514K8144m41p7130l3141l2663m0367l2417O961N6390P770j1284
2812A117002o6570O409M7367k7969O4698m4643l1402O165K7872Q348k4617N8422
2800A141082m0571M802l1388k4132p662k5048m28l5722j0297j2808L0100L4707
2788A022635p1260m3123R2160k8040k946m47n1286L2715J0093j1923n3136J3278
2776I08720L553k1127o3676l7143k4861l1339Q532m9464l0364q956l1609p060
2764F15206k5846J6195m1049J4559M3437k4218n2301M9597j3854L4919l3093n3441
2752E30111l1883J5930j4146J2036l4514K4322M9956m1620R857l3356j3623K402
$$ y = [1574707, 1521315, 1476373, 1496935, 1518597, 1539747, 1509877, 1421531, 1409184, 1415832, 1340242, 1284714, 1251694, 1245180, 1273324, 1272883, 1195753, 1162612, 1129949, 1089582, 1057165, 1064126, 1120516, 1128286, 1117002, 1050432, 1056841, 1104208, 1076239, 1140937, 1096294, 1064892, 1071057, 1098929, 1107277, 1082660, 1141082, 1100511, 1105313, 1073925, 1049793, 1042131, 1017083, 1016655, 980933, 970636, 957828, 987928, 1022635, 951375, 908252, 1000412, 972372, 969426, 968979, 917693, 950408, 960501, 948578, 895442, 908720, 912273, 891146, 827470, 790327, 765466, 734127, 742659, 693195, 662831, 653875, 622266, 615206, 589360, 605555, 564506, 579065, 622502, 598284, 545983, 595580, 581726, 616645, 583552, 530111, 498228, 514158, 500012, 512048, 477534, 501856, 551812, 510192, 520049, 486693, 473070, 475472]
2740D75472N3165j8922l7415k0908M0228L2619o8854o733K0401j0987L1594K37
2728D89897k0806k0519K1639p308J1847k8024n2099J879R426N955j5812L5735
2716D31810J9103j4075J8365J7739j1726k8896l306k0606m7957q950R594J619
2704C62714J2606R551q474k109k0861M543J0670k644o242n2177J8930K8544J8980
2691C74031k7475J2829k6365K6498k8863N107L0914n8960k7541J1420L8745n501
2679C24839L4879j7673r013j6395L1452Q431O896l2341l5745n4682j2504O3383
2667B91527N5412k0527k2438P454l1487J8437J7629L9159K051q690p3035K8894
2655C04386K7061m1303M8147N411j9500m37n0811K2603J0840j1508n5727K8443
$$ y = [475472, 528637, 509715, 472300, 451392, 491620, 524239, 455385, 448652, 469053, 458066, 489660, 489897, 469091, 448572, 470211, 462903, 474750, 446726, 394627, 396506, 405932, 411887, 396075, 431810, 450913, 436838, 455203, 472942, 461216, 432320, 429014, 408408, 360451, 351501, 361095, 362714, 375320, 384871, 376397, 374288, 353427, 357970, 368640, 365996, 359754, 307577, 326507, 355051, 374031, 346556, 359385, 333020, 359518, 330655, 335762, 366676, 307716, 280175, 291595, 330340, 324839, 359718, 342045, 333032, 316637, 348089, 356520, 363416, 331075, 295330, 240648, 228144, 291527, 346939, 326412, 303974, 311428, 279941, 298378, 316007, 355166, 357217, 348527, 275492, 304386, 331447, 290144, 338291, 343702, 324202, 323765, 272954, 295557, 306397, 294889, 239162, 267605]
2643B67605l4597Q059J1537o606J3977L8022l0780q353N3690N921o6222j8623
2631B33630K2496M194L9981l1878n5944m383M5695L4305j9396J8270j7499l7741
2619B31730k6536l800L2404J5277k8564K3623M5019k3587N775N831n9145l6829
2607A81198Q0161M324n0590M227Q3378j7386j2897J6832J2449o68N9209l1102
2595C29135n3306J8615l4607l2712M3131L4666K4100j3830J6808j6189j7415O4812
2583C63208L31K177j341N207M0762o57L0260j444L344j6491k3660N6648M9351
2570E07695Q816m6852P703l916m0024O659K740O9891L20k4600k544j8707J083
2557D68264L5461J2571P800L4555L0325Q6143M6137o9089r563J9300J0705j0131
$$ y = [267605, 233008, 241067, 252604, 245998, 259975, 297997, 267217, 258864, 312554, 318475, 252253, 233630, 256126, 260320, 300301, 268423, 212479, 208096, 253791, 288096, 268700, 286970, 269471, 231730, 205194, 201394, 233798, 249075, 220511, 244134, 289153, 265566, 271341, 277172, 218027, 181198, 261359, 265683, 215093, 219320, 302698, 285312, 272415, 289247, 301696, 301028, 360237, 329135, 275829, 294444, 259837, 227125, 270256, 304922, 329022, 315192, 332000, 315811, 298396, 363208, 363539, 365716, 364375, 369582, 410344, 409687, 439947, 438503, 441847, 425356, 401696, 458344, 507695, 516511, 469659, 477362, 473446, 433422, 440081, 442821, 512712, 513032, 488432, 485888, 467181, 468264, 503725, 516296, 524096, 558651, 588976, 675119, 721256, 652167, 642604, 661904, 672609, 662478]
2545F62478J7535K7231L2519l2563j4343q800P9110k6747o526M5243J7162K4232
2533H16531L6841k7564k0514J813l5298j0557J8264M3964j0137l493q786j5968
2521G85096n6787K9227L2306K878K2486m8813M3356J6674P0239M3394l7913P0667
2509I72810M740k1928j398j5966J2988K5276j16318m7506J8969R485n6341N9641
2497H44452p1098m5506q213j0432k6050P427J1401J4167q83Q596j892n1242k3201
2484F47526M2627j279k0643j9559J6371K7033l9351K5178K1193m280m0386L3407
2472F87837M0975p7369l8659k8214Q989l6943l1645j7533l9029J068l823r179
2460D56475n4855m502K7949M0243j0296p6637J4223q822R013p139j0360j6362
$$ y = [662478, 680013, 707244, 739763, 707200, 692857, 684057, 763167, 736420, 729894, 775137, 792299, 816531, 853372, 825808, 805294, 807107, 771809, 761252, 779516, 823480, 813343, 809850, 801064, 785096, 728309, 757536, 789842, 792720, 815206, 766393, 809749, 826423, 896662, 940056, 902143, 972810, 977550, 955622, 954224, 938258, 951246, 976522, 860204, 812698, 831667, 841152, 784811, 844452, 773354, 727848, 719635, 709203, 683153, 690580, 701981, 716148, 715265, 723861, 721969, 670727, 647526, 690153, 688874, 668231, 648672, 665043, 692076, 652725, 677903, 699096, 694816, 654430, 687837, 728812, 651443, 612784, 584570, 593559, 556616, 524971, 507438, 468409, 469477, 465654, 456475, 401620, 397118, 425067, 465310, 455014, 378377, 392600, 383778, 392791, 385652, 375292, 358930]
2448C58930m9001M048n2507K2567L2050K8312m8786n986o479m7341J5744O3047
2436C14598L631k5307K4983R994l3275k8268o7531l3816K5068k2829j2225K4290
2424A79313Q015M109K3733k9029J6391o8585J3048K4797K8079l1456l0223K7611
2412A65803m0662P57K85q0323M6706P028Q959K0912r397J9572j1157m2892o0268
2399B5323M6451j527p192L211N510l255N1360m8828q051m0460N6665R650r343
2386G9514M3593K9350l1377n2510p2830K7811M1863J7063l9837J2706l9729j5562
2374E5K8392K0227J2291N921L5930j7803K3349l4419k8648J3402Q8792J6409r1201
2361G2697j7881L5180J207L084J967l4280m1364K8725n980J1897m0994L8159p2702
$$ y = [358930, 309929, 313977, 261470, 284037, 316087, 344399, 295613, 289627, 283148, 235807, 251551, 314598, 318229, 292922, 317905, 327899, 294624, 266356, 198825, 165009, 190077, 167248, 155023, 179313, 187328, 191437, 215170, 186141, 202532, 133947, 146995, 171792, 199871, 168415, 138192, 165803, 125141, 125898, 126183, 45860, 92566, 99594, 108553, 129465, 120068, 139640, 128483, 85591, 25323, 71774, 70247, 63055, 66266, 71776, 68521, 119881, 71053, 63002, 22542, 79207, 88857, 79514, 123107, 152457, 121080, 68570, -4260, 23551, 65414, 82477, 42640, 55346, 15617, 55, 28447, 48674, 60965, 66886, 102816, 85013, 108362, 73943, 45295, 58697, 147489, 163898, 72697, 54816, 89996, 91203, 94287, 96254, 61974, 20610, 49335, 43355, 55252, 14258, 52417, -20285]
2348b0285M6700K7935M6484K0003k6927J3274m9020l364K8106J3451j9792l8766
2336C7799j546L8971J0444J2415J9222J8892n9016K6923m5306M938l1805L5531
2324F7462l1704K1536l1130K9180N630j1290k1758P333L1801k9784j1580M4944
2312G0640L6148n1477K2904L159O2343k3654k3l0466M7939j1385L947l5728J5044
2299A09391o843J3118K0515k4445L0844l7462m1970p195J0525K1309k6783l5926
2287B5078j3141m8113M5755M6542j7516K4202J0689J3640o7302J4333o845L956
2275C1278M25k8212N8412n780n4466l020R1828r186k0767J0949n1167J3474K1776
2262E5544n3249l972K4644K1072n3994O256N1407O271K3605O698k62j889P394
$$ y = [-20285, 26415, 54350, 100834, 120837, 93910, 107184, 58164, 54800, 82906, 96357, 76565, 37799, 36253, 75224, 85668, 98083, 117305, 136197, 77181, 104104, 58798, 63736, 31931, 67462, 35758, 57294, 26164, 55344, 60974, 49684, 27926, 35259, 67060, 37276, 25696, 70640, 106788, 55311, 78215, 81374, 143717, 120063, 120040, 89574, 137513, 126128, 130075, 94347, 109391, 102548, 115666, 136181, 111736, 142580, 105118, 63148, 55953, 66478, 87787, 61004, 25078, 11937, -36176, 9579, 56121, 38605, 62807, 73496, 87136, 19834, 34167, 27322, 31278, 31703, 3491, 61903, 56123, 1657, -1363, 90465, 81279, 60512, 71461, 20294, 33768, 55544, 2295, -1677, 22967, 44039, -9955, -3699, 47708, 53979, 77584, 84282, 84020, 82131, 89525]
2249H9525l287K9032n7135j2149J2384j2019j056r644K5625j8253l4814K78P3234
2236H1721k5590n4999J1285J9676n692L5783J4671l052P915L0226J7085p341j2865
2223A08823l3882L1113k129j5695l5991k1861K8676R261J3315k6747l7058L786
2211B1611o250k3175M53l3146M3564M8262J0732r437N825L7883J578k5749j6149
2198E6002J2132p347j0269J7030p574l1488j3077K1412K8638L0055K0346j7553
2186I8307l4737K0698K8253l0949l5003k9658J7032O7228n400j5231m0928l8771
2174H41J9285K3069J2133M175O4106j9234n760J581j2661q685r64m526J966K6215
2160A01541J1773j2213k527j5445O997q740K0949K3123R543n966p672r279p458
$$ y = [89525, 86238, 115270, 58135, 45986, 58370, 46351, 45295, 35651, 61276, 43023, 8209, 8487, 81721, 56131, 1132, 12417, 32093, 26401, 62184, 76855, 73803, 81718, 111944, 129029, 121688, 108823, 74941, 106054, 103925, 88230, 52239, 30378, 59054, 68315, 81630, 54883, 17825, 21611, 15361, -7814, -7361, -40507, 3057, 51319, 62051, 52614, 58439, 96322, 97900, 72151, 56002, 68134, 60787, 50518, 67548, 59974, 28486, 15409, 36821, 65459, 95514, 115860, 98307, 63570, 84268, 112521, 81572, 46569, 16911, 33943, 101171, 95771, 80540, 39612, 841, 20126, 43195, 55328, 59503, 123609, 104375, 98615, 100196, 87535, 78850, 77886, 73360, 75326, 101541, 113314, 101101, 98574, 83129, 90126, 81386, 102335, 125458, 135001, 129035, 121363, 112084, 104626]
2147A04626J5435J7725K0526K4821K4672q99k003j5338j8091n586q556K4973N914
2134A88219o145K4539j7203k3948l3429J9349Q499L9839j1579j5388N0463j9556
2122B03660K408J0432L4168K3198l6551J7629L0510k927j3241J1436l8791K6655
2110B68586N8171n657N191R4023R07j822M3377Q781L3664N6695j8696j3969L1768
2097E61019N9533J156N5077P1103L1811j2171o259j0521l2890j1153m3497m9395
2085F13813K6536P0863k1101r659Q38P5875L4836O592J06604M9981J559J9078
2073I75815M4266Q62J8390L3618K4977M9257O377N8939k781O1088L8880M4499
2061A354187L509K7387N6658K3306P4097M7447P3545P8433J15511J18800J42164
$$ y = [104626, 120061, 137786, 158312, 183133, 207805, 206906, 204903, 189565, 171474, 165888, 157332, 182305, 188219, 182074, 206613, 189410, 165462, 132033, 151382, 159881, 199720, 188141, 172753, 223216, 203660, 206068, 216500, 250668, 273866, 237315, 254944, 285454, 282527, 269286, 280722, 241931, 268586, 326757, 321100, 326291, 420314, 421221, 419399, 462776, 471557, 505221, 561916, 543220, 529251, 561019, 620552, 621708, 676785, 747888, 779699, 767528, 761269, 750748, 717858, 706705, 663208, 613813, 640349, 711212, 690111, 680452, 681290, 757165, 792001, 798593, 905197, 955178, 956737, 975815, 1020081, 1020943, 1039333, 1072951, 1097928, 1147185, 1153562, 1212501, 1209720, 1270808, 1309688, 1354187, 1357696, 1385083, 1441741, 1465047, 1539144, 1586591, 1660136, 1738569, 1854080, 1972880, 2115044]
2050B115044J34999Q4197J55418K50874K36599K56089K89387K31644K84871K99013
2040D338135M73574N12957O26455O62085Q42673J155278J344734J575460K109984
2031A3641335K857269K871319l1658l066090l395362k608151j660573j247167
2023G360922j015596q32382o72164n02905l72639l19438k60598l28493k09260
2014B847447j77560k19747j95997k08768j73962j31112q8995j18838j11594o0152
2004A360722j01394m6910n9515o8424n0526k5451p9396l0332o8051p4375m6380
1993G09968j1430j995J5635J2246l2349k2568L0944n9228o6854J961m7312l6318
1981D92700J9962m0404o5350j9526L0168Q852j7866N6514o1557o8611p159N787
$$ y = [2115044, 2250043, 2334240, 2489658, 2740532, 2977131, 3233220, 3522607, 3754251, 4039122, 4338135, 4811709, 5324666, 5951121, 6613206, 7455879, 8611157, 9955891, 11531351, 13641335, 16498604, 19369923, 19338265, 16272175, 12876813, 10268662, 8608089, 7360922, 6345326, 5512944, 4840780, 4337875, 3965236, 3645798, 3385200, 3056707, 2847447, 2669887, 2450140, 2254143, 2045375, 1871413, 1740301, 1651306, 1532468, 1420874, 1360722, 1259328, 1212418, 1152903, 1084479, 1033953, 1008502, 929106, 898774, 830723, 756348, 709968, 698538, 696543, 712178, 724424, 692075, 669507, 700451, 641223, 574369, 576330, 529018, 492700, 512662, 472258, 406908, 387382, 417550, 426402, 408536, 465050, 403493, 334882, 327723, 333510]
1969C33510o0874M2494J5112p2467J0142N2383N3522l4079l4502l6058k6979M145
1957B46349j534k0593q201n6352K6769L5474k8197J3452k9314J3946P154j4426
1945A84527p0362j380k5829J7566M8434n4460n57R698k5376L8594j2444J3512
1933A21923O4323j2066o1710l9490l5185Q0758K7242N260O687m8882m051j1960
1921I2849j1668O814j8771L0851M2069j3590k4418k9180j3681p1444L7954N8507
1909H6292M5149l2687j528K4399m5971L53J4705n5214J3619L0562l4222j1181
1897C4276R0081p46m5480J367m4018L5866L1903N090o3399K081O4720O615m1698
1884G6658j3535J2539o0257n312L0323m7382q141M0927l266K2215l2779K2847
$$ y = [333510, 272636, 315130, 330242, 257775, 267917, 320300, 373822, 339743, 305241, 269183, 242204, 246349, 244815, 224222, 216021, 159669, 186438, 221912, 193715, 207167, 177853, 191799, 198953, 184527, 114165, 112785, 86956, 104522, 152956, 98496, 97939, 107637, 82261, 120855, 108411, 121923, 186246, 174180, 112470, 72980, 37795, 118553, 145795, 151055, 157742, 108860, 104809, 92849, 81181, 87995, 69224, 100075, 142144, 128554, 104136, 74956, 61275, -10169, 27785, 86292, 131441, 98754, 97226, 121625, 75654, 76007, 90712, 35498, 49117, 79679, 45457, 34276, 124357, 123611, 78131, 79498, 35480, 71346, 103249, 108339, 44940, 47021, 111741, 118356, 76658, 63123, 75662, 15405, 10093, 40416, -6966, -15107, 25820, 22554, 44769, 11990, 34837]
1872C4837j0886n1568J3950j1956M2017N494q684o7309j5087O3166L7591J3129
1860D4694J0587j5822k2312j8308j721j9143J3847K500N571l142J1280O8992k3226
1847E3797n265m0783k385l5246L8174O0942r4536K1262J2606o102O2772j4817
1835E0419n4591M0114Q418p827J466J6230L7139m1473l2517n2848N0931m714j1584
1822h37O1489j7162m3038J753k4994J8232J7343k961m326K1031J2476j4829J0473
1809C4650J8525l82n5137l0002L4210j1183l8086Q904M7495j3178l7955k7356
1797f9495M3955O0834J5256l2951k3622k0936l1064L077N0979K8274M7725L0089
1785A02121p839o607k3737m765j7498L841m181J2245l1892P092j9805M4125K876
$$ y = [34837, 23951, -27617, -13667, -25623, 16394, 21888, 13204, -54105, -69192, -6026, 31565, 44694, 55281, 39459, 17147, -1161, -2882, -22025, -8178, -5678, -107, -3249, 8031, 77023, 53797, 48532, 7749, 5364, -29882, 8292, 69234, -25302, -4040, 8566, 2464, 65236, 50419, -4172, 35942, 44360, 36533, 37999, 54229, 91368, 49895, 17378, -35470, 15461, 10747, -837, 60652, 43490, 452, 2205, -22789, -4557, 12786, 9825, 5499, 26530, 39006, 24177, 34650, 53175, 52793, -2344, -32346, 1864, -9319, -47405, -38501, 8994, -4184, -42139, -69495, -25540, 35294, 50550, 17599, -6023, -26959, -58023, -54946, -3967, 24307, 72032, 102121, 94282, 87675, 63938, 59173, 41675, 45516, 41335, 53580, 21688, 28780, 8975, 53100, 55976]
1772E5976p2401k491N4478O822n7763J3298J9321N0175J6748j6937O285L8888
1760A12399K3254j5455K5558o4550j3664J1245j1029n9894j7672j3552M8335J7962
1748D2937j3881j2303J3368J1535L4984m5028n6548J4782O3531J8189k5884N737
1736E1419J7635q1464j9541J246L7566K5572k3198M863j7537P255K4952l3942
1724e174j7801J9657r072j3320K6569J7377o199J6062k1115L161n2800L9700L011
1711E6n8263P0971N7053p9751n0848l7728N0205r626m873J4524K4633K9550R234
1698A5137k4692n525l3487l3969N1156k2754K7478O0802m7749L4816l6420k8417
1686d3624Q769K2802J9678Q911J3070m702l9587n776K4536K4117m6583k1486R382
$$ y = [55976, -16425, -18916, 35562, 42384, -15379, -2081, 17240, 67415, 84163, 67226, 73511, 112399, 135653, 120198, 145756, 81206, 67542, 78787, 67758, 7864, -9808, -23360, 24975, 42937, 29056, 16753, 30121, 41656, 76640, 31612, -24936, -10154, 53377, 71566, 45682, 51419, 69054, -12410, -31951, -30705, 6861, 32433, 9235, 14098, -3439, 3816, 28768, -5174, -22975, -3318, -12390, -25710, 859, 18236, 12037, 28099, 6984, 10145, -42655, -2955, 56, -58207, 12764, 69817, -9934, -60782, -98510, -48305, -57931, -62804, -48280, -23647, 5903, 15137, -9555, -15080, -48567, -82536, -31380, -54134, -26656, 34146, -13603, 21213, -15207, -43624, -34855, -12053, 7625, 16536, 29606, 24904, -14683, -20459, 4077, 28194, -18389, -39875, -30493]
1673c0493L8427P662k5847J4304l10O559L0606o3438m2444L9242j8563J3721K8305
1660b269L3116K6465J3885m0100j2931m4558K0333Q2050j4528k4974K7771k4610
1648C9650l6064M701J6652l230n2685j8277o552J1140L2370O585m1294k0842J851
1635f5995L6691K6366l907K2740O86m5762K1023M817o6892L2132O069L611O690
1622b1731M684r609K6845q013p290q361L5989J9760m7502J7296k9876K8071K101
1609B364k9317M4689l539j5291n7561J1277L7503N777Q08m1474N3584J3593l1510
1596i097k4505j8065k5760M5294K5906o213J7919j1268n042j1313j6801j15Q851
1583c0209p189M160K8509L4202j0046k3326M231j6693n9505J5982l4616N0274
$$ y = [-30493, 7934, 15596, -10251, 4053, 3743, 10302, 40908, -22530, -64974, -25732, -44295, -30574, -2269, 30847, 57312, 71197, 31097, 18166, -26392, -6059, 75991, 61463, 36489, 64260, 39650, 3586, 8287, 24939, 21709, -30976, -49253, -55805, -44665, -12295, -5710, -47004, -67846, -65995, -29304, -2938, -6845, 15895, 16581, -29181, -8158, -3341, -70233, -38101, -32032, -28421, -21731, -17047, -26656, 189, -7824, -15114, -23475, 12514, 32274, -15228, 2068, -27808, 263, 2364, -26953, 17736, 14197, -1094, -58655, -47378, -9875, -4098, -3290, -44764, 8820, 22413, -9097, -33602, -51667, -77427, -32133, -6227, -12440, 5479, -5789, -10831, -22144, -38945, -39060, -30209, -37398, -33238, -4729, 29473, 19427, -3899, 332, -16361, -75866, -59884, -94500, -44226]
1571d4226R638o538K836L1936K847L2227J7177n8405L9907j9585r344j751j247
1558d528n425j720l9505J7177M3242j4861K5760n709l0379R439j3928P193n880
1545a9124K2734N8920m3063o186l6064m0986L5321N6593l2360n510j4005N686
1533a8044p490l2333M8558l8318j4877L7046J3019J6786J8887J8509N687j9003
1521B8427n1747K644M4585j5025n2M0030m955j8225j2135j6327l6125n934J3984
1508c0855k283K3922m883k5723j287k1513j7586N1425K8789j6086j8724N0j2400
1495d7154M858K1333L5523k4839R777k865j4413K3487k329q013l8467P98N0298
1482G994J2412j7561k5813O899P931K0338n1371n99J1237L9247j6459m9048J2939
$$ y = [-44226, -34588, -41126, -38290, -6354, -3507, 28720, 45897, -12508, 27399, 7814, -1530, -3281, -4528, -9953, -11673, -51178, -34001, 9241, -5620, 20140, 14431, -15948, -6509, -20437, -13244, -19124, 3610, 62530, 19467, 13281, -22783, -63769, -28448, 28145, -4215, -9725, -23730, -18044, -25534, -57867, -9309, -47627, -62504, -25458, -12439, 4347, 23234, 41743, 47430, 28427, -23320, -20676, 23909, 8884, 8832, 48862, 43907, 25682, 13547, -2780, -38905, -44839, -30855, -33138, -9216, -14099, -39822, -41109, -62622, -80208, -28783, 6, -16080, -34804, -34754, -47154, -42296, -20963, 14560, -10279, -502, -3367, -17780, 5707, 3378, -4635, -43102, -42304, 7994, 20406, 2845, -22968, -16069, -8138, 12200, -39171, -39770, -28533, 10714, -5745, -54793, -41854]
1469d1854K5441l7687L4590N5213k9733j0575L8718l3196k0924p04j6j114m9193
1456g1034J1316L040R3412o2625o1303m06N8962J1813L6912J732M1618m287q5073
1443b5923Q406k5655M856J8075j7196j866L6407k3855J1652P924K116j3105N694
1430a2470l476M0494k5082j0206m7739j9947P2634J8448l2436r511o329q812J0488
1417c3944L2107M352j1231N165k1050K6931n0851K5849K0785k7761M0950m2834
1405c1532m9020o611J1334K5582R690K5067j6790J7146j793o761K3688k0967J3344
1392g623Q477Q335l706l0393j6854J3475J1126l1788Q361J4749K7778N00n1847
1379d9410K9564N0268k6085O719j8596k6560L2413R682p902k787J9028j8261k7570
$$ y = [-41854, -16413, -54100, -19510, 35703, 5970, -4605, 34113, 917, -20007, -20711, -20727, -21841, -71034, -59718, -56678, 36734, -25891, -87194, -87600, -28638, -16825, 20087, 21819, 63437, 59150, -25923, -17517, -43172, -38316, -20241, -37437, -39303, -2896, -26751, -15099, -7175, -5059, -18164, -12470, -15946, 24548, -534, -10740, -58479, -78426, -5792, 12656, -19780, -29291, -35620, -44432, -33944, -1837, 2515, -8716, -3551, -24601, 2330, -48521, -22672, -1887, -29648, 11302, -31532, -80552, -87163, -75829, -50247, -40557, -15490, -32280, -15134, -16927, -23688, 0, -20967, -7623, 854, 9189, 5483, -24910, -41764, -28289, -17163, -48951, -40590, -25841, 1937, 2437, -49410, -19846, 30422, 4337, 11056, -7540, -34100, -1687, 7995, 93, -2694, 16334, -1927, -29497]
1366b9497k5611m5887M8416O0307k0386J8817J8457k9495k7459k0404k1859M1032
1354c3569P902l7990L2954J8614j1607L3541J1068l7880j873k7918M507l3876
1342g6127J8549k3571m5486O3782N3696k5590N603J4588P384M0164n8128L8723
1330A3587Q7411m6035M6642j6193o2130n1043K244N7211k8908j0454l82J4644
1318F594K0807m0012K4403L0190q678r40o3038q470J3440J9130j5290J8928n7
1305b993j9448n627M1883L7034m2517j1416k967n9790j5502P0620M6479L2345
1293F8101M921j6117k3453n836l9605Q369J5244N068m0190J454K7751M5142O358
1280E7207l2796j9847m0078l5436J9384O6601l4179m5334L4433N7313K9821k2709
$$ y = [-29497, -55108, -100995, -52579, 7728, -12658, 6159, 24616, -4879, -32338, -52742, -74601, -33569, -25667, -63657, -30703, -12089, -23696, 9845, 20913, -16967, -18840, -46758, -42251, -76127, -57578, -81149, -126635, -62853, -9157, -34747, -29144, -14556, -7172, 32992, -25136, 13587, 100998, 54963, 101605, 85412, 23282, -27761, -25517, 31694, 2786, -7668, -8050, 6594, 27401, -12611, 11792, 41982, 33304, 32364, -30674, -39144, -25704, -6574, -21864, -2936, -2993, -22441, -28068, 13815, 50849, 8332, -3084, -6051, -65841, -81343, -10723, 35756, 68101, 73022, 56905, 33452, 27616, -11989, -3620, 11624, 16692, -23498, -22044, 5707, 50849, 57207, 24411, 4564, -35514, -70950, -51566, 15035, -19144, -64478, -30045, 27268, 57089, 34380]
1268C4380r220R948k9776K1669L2847q3080K6654J5422r56K4275n1914J41j7300
1255b6910K7841p8607M0795L0507R131n2768m9490N8946L1388k6603o444M1644
1243e70L8171m8766K0147k2186K7442J1872j7190J0123K1447j0717j2595j4158
1231C020l368j0521k2670L6548K2718k9783r479J9763l6254k5811L952J0815l5438
1218g6508K3147K4762R9702j5774o6176N271j296k929J041Q347L660L9344M207
1205D6798n3784p843J3072K8326K089N177j8640n4067k8256K5987k7949L4623
1193c4467O7347k0994m2770N447J8423m4212J5120J1512K1085m435M465L5638
1181C2159l1687n4556M8564K2254m0410O490k3977L1365N0733N695j9097o3296
$$ y = [34380, 25160, 35108, 5332, 27001, 59848, -23232, 3422, 18844, 17888, 42163, -9751, -9610, -26910, 931, -77676, -36881, -6374, 2757, -50011, -99501, -40555, -9167, -35770, -42214, -570, 37601, -11165, 8982, -13204, 14238, 26110, 8920, 19043, 40490, 29773, 17178, 3020, -348, -10869, -33539, 3009, 25727, -4056, -13535, 6228, -30026, -55837, -51885, -41070, -76508, -53361, -28599, 71103, 55329, -10847, -5576, -6872, -9801, -8760, -413, 3247, 42591, 46798, -6986, -14829, -1757, 26569, 28658, 33835, 15195, -38872, -67128, -41141, -69090, -34467, 32880, 11886, -30884, -25437, -7014, -51226, -36106, -24594, -3509, -7944, -3479, 32159, 472, -54084, -5520, 16734, -23676, -17186, -41163, -9798, 40935, 46630, 27533, -35763]
1169c5763j3778P6176j5637j8941M7357o2404n430N2908n496L5390m3965j0129
1157B88o5114J2839K0593L6413K6578r0246M486O9216p172r528r695J043k0441
1144c0740L8282q341k6379K9025R589K3837p4664K996K8208n6443J2772N0502
1132a356K2810j4878L7945q7237k9439Q7645L57L3155L961n6887J9401K9175o792
1119C7860J4171m1528j3327Q827m5241J666K1017k7026J2569k4676N5913J5724
1107A5949r558k079Q375m5487l7531J5545N4537Nn297j8209o0455L4645K2937
1094b6623J3388j4084o393k718R374k3373o455M0953m1107L6039q390N3095k1255
1081B451J5828l551l7566M1638j3437K9282m285j9524r355K7587m2820m0826J5542
$$ y = [-35763, -49541, 26635, 10998, -7943, 39414, -22990, -28420, 24488, 18992, 54382, 10417, 288, -64826, -51987, -31394, 5019, 31597, -58649, -54163, 15053, 7881, -1647, -11342, -10299, -30740, 7542, -799, -27178, 1847, 11436, 35273, -39391, -36395, -8187, -64630, -51858, -1356, 21454, 6576, 44521, -42716, -72155, 15490, 15847, 49002, 52963, -3924, 15477, 44652, 37860, 52031, 10503, -2824, 6003, -39238, -37572, -16555, -43581, -31012, -55688, 225, 15949, 6391, 4312, 12687, -32800, -70331, -54786, -249, -244, -5541, -23750, -84205, -49560, -26623, -13235, -27319, -33712, -36430, -27056, -50429, -56884, -15931, -57038, -20999, -29389, 23706, 2451, 18279, 14728, -22838, 18800, 5363, 34645, 30360, 10836, 1481, 29068, -13752, -54578, -39036]
1068c9036M3766J947R155K3660N631J0878l068m0929j9748j7140K5883n0779l0332
1055h0112M6616L554J8222k7713L9839m704J0076l5892O487p233o0365P0618l518
1042b4125K6617O4121K3167j5643m4174N559o5260r990J5754L7589K8117l0590
1030A1142J9729K3521l3007k8163O0507k2793m2145J3675J4095m073m2576O6160
1018C6072K0572n4624n5250K6326l965M1363j7756m4685N7366n5823L6961k4006
1006c7449j0626q354o700M105M3064k204l0306J9914M3405j8527p7947M5537N3825
993A7737j4219p412J5892q428o624K2085j3272l0764j4641M8513K6403j8837o9392
980e2959K958M5221r595l8701O6702J2476j3176K9238k6558j5735j9450k3086
$$ y = [-39036, 4730, 6677, 15832, 39492, 45123, 56001, 52933, 12004, -7744, -24884, 999, -49780, -80112, -33496, -29942, -11720, -39433, 406, -4298, 5778, -30114, -23627, -30860, -91225, -20607, -24125, 2492, 66613, 89780, 74137, 29963, 35522, -29738, -39728, -23974, 13615, 41732, 11142, 30871, 54392, 21385, -6778, 53729, 30936, -11209, 2466, 16561, 12488, -30088, 36072, 56644, 2020, -53230, -26904, -30869, 10494, -7262, -51947, 5419, -50404, -13443, -37449, -48075, -56429, -63129, -59024, -15960, -18164, -48470, -28556, 14849, -3678, -81625, -36088, 17737, 3518, -3894, 11998, 3570, -3054, 19031, 5759, -25005, -39646, 8867, 35270, 16433, -52959, -50001, -4780, -14375, -53076, 13626, 26102, 12926, 42164, 15606, -129, -19579, -42665]
968d2665j0541J7390K0645K985J2060j7634j9473m3635K4233N4198K005l658j0818
955a4908L1683l7224K2322L4641m1201M5837J1622p0967l7483K927L9675j9102
943c2178R92k3153K0742L1113K8731o4578m2220K4737M2651K8360j7705O259q748
930d997l0648J9215K1697m0919M840J9766L0264k2309j4648K3959j3708k4238
918c1726j2752k3109K1043J2876O0391J0339p2278L6459p957O2712o978q6050
906c7030j3846K0017K2952l1513L679j7273o128K5105M6280j5647m5277L0316
894a8365o846K3434k7313O1488J4080j3762L1861k2966K7520m0646m3730k715
882a7960j1477L0720O5924m0664p996m6421R5M0682j1242j5832k0828N6680r527
$$ y = [-42665, -53206, -35816, -15171, -12186, -126, -17760, -37233, -80868, -56635, -2437, -432, -4090, -14908, 16775, -20449, 1873, 36514, -4687, 41150, 52772, -18195, -55678, -52751, -13076, -32178, -31186, -54339, -33597, -2484, 26247, -38331, -80551, -55814, -13163, 15197, -2508, 3751, -4997, -35645, -16430, 5267, -35652, -30812, -11046, 19218, -3091, -17739, 6220, -7488, -31726, -44478, -67587, -46544, -33668, 26723, 37062, -35216, 1243, -6714, 55998, 49020, -37030, -50876, -30859, -7907, -39420, -35741, -53014, -59142, -34037, 12243, -3404, -48681, -18365, -25211, -1777, -29090, 32398, 46478, 32716, 64577, 41611, 69131, 28485, -15245, -17960, -29437, 1283, 67207, 26543, 18547, -27874, -27779, 12903, 1661, -14171, -34999, 21681, 12154]
869A2154j2804k5235R9077Q37r9679L4942n166J9869m0224n7709N6579j1503J7731
856a1131K5174l7599p667N4067J4193n6816R956K325Q518j7748p5953P7251K9479
843A4049n6017m085p052L2154L5132J5964m739P582k3199O607j381J585l1385
830a4785K1929l686K7755M522l5712k945R427r108K7021j2208M2952n8977J8978
817A5163L2L4211r763m6678k053J1231Q086L2472q209j8073J0157j0572J9691
804C5695m5039k6523J6211L8945m6962K8023j0739L5860l5130L3152m3218J3998
792e727J7639O769K6098l6167j0314k7652J4193k697m2737J5962N8282k141J2578
779B4086k5442n6805O9674k1966j2968Q469M5821l2294l0494M5920q171r14M144
$$ y = [12154, -650, -25885, 73192, 74029, -25650, 9292, 4126, 23995, -16229, -73938, -17359, -28862, -11131, 14043, -23556, -31223, 22844, 37037, -19779, -9823, -7498, 1020, -16728, -92681, -15430, 14049, -41968, -46053, -53105, -20951, 14181, 30145, 25406, 32988, 9789, 16396, 15015, 16600, -14785, 7144, 3458, 31213, 35735, 23, -2922, 6505, -2603, 24418, 12210, 55162, -3815, 15163, 15195, 49406, 39643, -7035, -9088, 2143, 10229, 42701, 34492, 16419, 26576, 16004, 35695, -9344, -35867, -19656, 19289, -27673, 350, -10389, 25471, -9659, 23493, -19725, -5727, 11912, 18681, 44779, 8612, -1702, -29354, -15161, -17858, -60595, -44633, 13649, 11508, 24086, -1356, -58161, 11513, -10453, -23421, -14952, 30869, -1425, -31919, 14001, 5830, 4916, 9060]
766I060k9670J2970L0668Q648K521o6082L802k2363m734M6206P580O5856m0094
753B4368j22J8644l3012J2785J4483l6941j7444K0709l7428J8270L3691n513j606
740A0884k0825j7147J4964k7538K699j5446L0596L9049L1296Q864k6804p2977
728d2385K3243M0171j3769J966l9377j949j448L0343j47K5681Q113K0901j0910
715D0433o914o966K7926N3075q3801l6269m0196O054M548n818M6867J4398J7967
702C1304O9728k3531k3665j3401m079l7834K516M2721k0624l1324M159q108J5434
689C296J4907j6379m1877K1022N237L3515N012m9281Q2136j2550j5567k3250P390
676A3611o241j7502K9121J2032K2628o5514K229N6972n49k2062J6179J5752k5519
$$ y = [9060, -20610, -7640, 23028, 31676, 34197, -31885, -28083, -50446, -55180, -8974, -1394, 64462, 24368, 24246, 42890, 9878, 22663, 37146, 205, -17239, 3470, -33958, -15688, 18003, 12490, 10884, -9941, -27088, -12124, -39662, -36963, -52409, -21813, 17236, 48532, 57396, 30592, -42385, -19142, 21029, 7260, 9226, -30151, -32100, -33548, -3205, -3352, 22329, 30442, 51343, 40433, 33519, 26553, 54479, 107554, 23753, -12516, -52712, -46658, -42110, -47928, -1061, 13337, 31304, 101032, 77501, 53836, 40435, 36356, -1478, 1038, 43759, 23135, -8189, -4030, -12138, 3296, 18203, 1824, -40053, -19031, -13794, 19721, 24733, -24548, 57588, 45038, 29471, 6221, 13611, 7370, -10132, 18989, 31021, 53649, -11865, -9636, 47336, 46787, 24725, 40904, 56656, 31137]
663C1137k5650L3926M528k7060L4672k2457j0844q274Q791J3000L9228k2642k8623
650A9732j12n3559n345J8956M2108l1339L734j8849k4023K8481r103K6202j6615
637a9732J8111L2182N5597n7967p053K091k0200K7398k6123k0302M6203M0593
625G0798l0848J3928j8762J5051o1265l3790P436K064N9518K7383k5097o37k5458
612C21O004l1078n541J7729K8866J9837k8092L0953j9503L2184l1345p158L0636
599D3813l8679l6279M0604P9188j5255l3993k305k6549m89j4429l0733J5781N1120
586C1795N620l1686J9821K620q44m0568l7559J3360J0624o258L9968L4459j2961
573B8391l3957N0830l4533l927J0313o6228k5499N2917J3511l3581R309O9670
$$ y = [31137, 5487, 39413, 43941, 16881, 51553, 29096, 18252, 9978, 18769, 31769, 70997, 48355, 19732, 19620, -33939, -39284, -20328, 21780, -9559, -5825, -24674, -48697, -20216, -29319, -3117, -19732, -1621, 30561, 86158, 28191, 21138, 23229, 3029, 30427, 4304, -15998, 30205, 70798, 39950, 53878, 35116, 50167, -11098, -44888, -37452, -35388, 24130, 51513, 26416, 25779, 321, 6325, -24753, -30294, -12565, 16301, 36138, 8046, 38999, 19496, 51680, 20335, 13177, 43813, 5134, -31145, 9459, 88647, 73392, 39399, 37094, 10545, 10056, -4373, -35106, -19325, 31795, 37415, 5729, 25550, 28170, 27326, -13242, -50801, -37441, -26817, -33075, 6893, 41352, 28391, -5566, 45264, 10731, 6804, 17117, -49111, -74610, -21693, -8182, -41763, -32454, 37216]
561C7216J7945o7231R468L2651J9049p5355m537J289J5643k7173k7034Q5397J6739
548C4067n2594K06k7952P632N406M4963M7672p5676P438j398k7605R567N2611
535B4337M6846l4840j4164j4489K2714M7853j2088p6892m6662r047N2952J86K4716
522A1422J9285K4893j7561J5935k5119k545k7205M834J210J6534l158m2129j5150
509c8754K4020l1311J8721O7333m6705j2045Q637k045K0408O4025m5356p3769
497d6841l435M4073K0533m4652l7175M0468K1320O7240j9945m375m1680K7727
485B3258j5456l4350K9067L2625Q159m652m1077j3207k1422L7716K1255K5277
473D7193j5424k4276J0831N5057n565l8865K2453k2378j8664K2489q979l9342
$$ y = [37216, 55161, -12070, -2602, 30049, 49098, -26257, -30794, -29505, -13862, -41035, -68069, 17328, 34067, -18527, -18321, -46273, -38641, -33235, 11728, 59400, -16276, -8838, -10236, -37841, -28274, 24337, 71183, 36343, 22179, 7690, 30404, 78257, 66169, -10723, -57385, -66432, -13480, -13294, 11422, 30707, 55600, 38039, 53974, 28855, 26310, -895, 3939, 5149, 21683, 18525, -23604, -38754, -14734, -46045, -27324, 40009, -6696, -18741, -10104, -12149, 8259, 72284, 26928, -46841, -50276, -6203, 14330, -30322, -67497, -27029, -5709, 61531, 41586, 37211, -4469, 23258, 7802, -26548, 2519, 35144, 43303, 38651, -2426, -15633, -37055, 661, 21916, 47193, 31769, 7493, 18324, 73381, 67816, 28951, 51404, 29026, 10362, 32851, 23872, -15470]
461a5470j3031j9706j2446Q6145N2704q4099J4125O4511n8854l5925O0354q76
449C7432k4154m4513k9600M4531J5764M8941m2760n4664K5661Q029r049K1398
437b984J9633k5597L4158J1468l7397n44j2408k0781L8273M9985K3458m2723J2626
424D7167l9404J1686n803p5141O1415K2500l9079L5253o354K2947j3661L7996
412E9522r086L0557l2748r7044K8172J8917J7609K0163m190l5844K5393O5058
400H6479j7466p4547J5765M9659m0957J8235k076j4131j5063n4256N1102M889
388G633K7092K7167j0679n5614k9528J845L7022k1142J4514K3450m1265k2964
376d2469o9816K8539O6580j7218K3651L6475L1615k5645o339O4007n2039l8057
$$ y = [-15470, -28501, -48207, -60653, 25492, 78196, -5903, 8222, 72733, 13879, -22046, 38308, 37432, 13278, -31235, -60835, -16304, -540, 48401, 5641, -49023, -23362, -15333, -24382, -2984, 16649, -8948, 25210, 36678, -719, -1263, -13671, -34452, 3821, 53806, 77264, 34541, 47167, 7763, 19449, 13646, -61495, -80, 22420, -16659, 18594, 12240, 35187, 21526, 59522, 50436, 80993, 48245, -48799, -20627, -1710, 15899, 36062, 31872, -3972, 21421, 86479, 69013, -5534, 10231, 59890, 18933, 37168, 35092, 20961, 5898, -48358, 2744, 7633, 34725, 61892, 51213, -4401, -33929, -32084, 4938, -16204, -1690, 21760, -19505, -42469, -112285, -83746, -17166, -34384, -10733, 25742, 57357, 31712, 25373, 89380, 37341, -716]
364g16k4967k1903L9007K1759J3480j28j5451l0267k3759M6071j6188j6588j7141
351d6791N4505P2398l1185q1190j7250L9421R980M4878N0523k0885q996m0215
339B5193n8252K4974m796j7769L385O878r222N0835M6922l7759k4209k5798J3074
326f544J1365L478K6790l1041R373K0339k1146l1509k5763N9529j2773l4991L8476
313E583q39n0063L5490Q192K4162L1098K6657m4628n1247Q1193o870k9897p782
300B1049K1363R220L5679o2749j5270j2634j9132O1977k9505p073M2984Q806j7767
287C6948m0523J6939k5580p575j7525L3620J15911p0734m7225J8552K8946o0098
275a8344O6158J380K1192k1520k4330L1550n3881j6387j4100O4960j5788k48l6259
$$ y = [-716, -25683, -47586, -8579, 13180, 26660, 26532, 11081, -19186, -42945, 3126, -13062, -29650, -46791, 7714, 80112, 48927, -32263, -49513, -10092, -112, 44766, 95289, 74404, 65408, 25193, -33059, -8085, -12881, -30650, -27265, -20387, -29609, 21226, 68148, 30389, 6180, -19618, -6544, 4821, 8299, 35089, 4048, 13421, 33760, 12614, -18895, -44658, 14871, 2098, -32893, 5583, 4744, -45319, -9829, -1637, 22525, 53623, 80280, 35652, -15595, 65598, 58728, 28831, 21049, 42412, 51632, 87311, 24562, 9292, -3342, -22474, 39503, 9998, 2925, 45909, 54715, 36948, -3575, 13364, -12216, -19791, -37316, -3696, 112215, 41481, -5744, 12808, 41754, -18344, 47814, 49194, 70386, 48866, 24536, 56086, 2205, -14182, -28282, 36678, 20890, 20642, -15617]
262a5617q696p045L7963j4104n3308J9262L9806q281L426M5519l1703j7394J4511
249D339J168J6207p505J8060k3905L332k1263m7455M2273K2087J1630J9973M30
236C9371j5283R095L852m0626k3378J1983M3158l4283N756L2430j8767m8576L3774
223a494k281L0738n711n0082J3156N362Q276j6320o270j667L4915N6318k9638
210C5302o7646N5189j5692k5360M0989N288K4730k8332k5716m569J0458k3684
198a9043p7625J1394J02858O336L501J2692K38L4674j8187m2914m5276o604j9410
185e7366O3660P308l9522n986M6181l1108j5735n950j5771O476K8664M8875J7373
172D7099j5036n2042l6036M3160L7580L317J5507J485m2370K1717l3180N3227
$$ y = [-15617, -24313, -31358, 6605, -7499, -60807, -41545, -1739, -10020, -6594, 38925, 7222, -10172, 4339, 5507, 21714, 14209, 32269, 8364, 11696, -9567, -57022, -14749, 7338, 18968, 38941, 39371, 24088, 33183, 37035, -3591, -26969, -14986, 28172, -6111, -355, 32075, 13308, -35268, -1494, -3775, 26963, 21252, -28830, -15674, -10312, -2036, -18356, -24626, -26293, 8622, 64940, 35302, -32344, 22845, 7153, -18207, 22782, 28070, 52800, 24468, -1248, -5817, 4641, -19043, -96668, -85274, 17584, 23920, 27421, 40113, 40351, 75025, 56838, 13924, -31352, -37956, -57366, 6294, 13602, -25920, -31906, 14275, -16833, -32568, -38518, -54289, -47813, -19149, 29726, 47099, 32063, -19979, -56015, -12855, 24725, 28042, 43549, 45034, 2664, 24381, -8799, 44428]
160D4428R725j5045j5689M021n164l3382R518J6104M565J9103j6158k3308m048
147e330l260N3382j3942k0348j0735O622j2323j4442m36K7168n227k2817O2000
134D0312j6700L6542m7921O413J6399n4489J7777L891j9819K070L9435l3558O263
121c385m609M4671P855K420l5566K0581k9282l1433N3481J8140p156l0064j3970
108h317l63j0636p442K1692M8576l8953R217r371K6819k3865n759j149R593K781
94A2823J728N6l844Q095o652K5701J6870J2229j4119l543q879n482K4366n313
80E4036J7435m4564k5301J551p045O517k681N5275J9894j5707l0780k2442R139
67A5327m7364J1716n085l0825K090L7640K4031j8838J1792j0823L2822m6543j4556
$$ y = [44428, 54153, 39108, 23419, 27440, 22276, -11106, -1588, 14516, 19081, 38184, 22026, -1282, -5330, -8590, 44792, 30850, 10502, -233, 6389, -5934, -20376, -20812, 6356, 1129, -21688, 40312, 23612, 60154, 12233, 18646, 35045, -19444, -1667, 2224, -17595, -15525, 23910, -9648, -3385, -7994, 36677, 44532, 46952, 11386, 31967, 2685, -28748, 24733, 42873, 35717, 5653, -8317, -8680, -19316, -26758, -5066, 43510, 4557, 13774, 4403, 31222, 7357, 1598, 449, 10042, 12823, 14551, 14607, 10763, 18858, 12206, 37907, 54777, 67006, 52887, 49344, 40465, 34983, 59349, 54036, 71471, 26907, 1606, 3157, -3888, 2629, -52, 55223, 75117, 59410, 28630, 6188, 15327, -32037, -20321, -25406, -56231, -54141, -16501, 7530, -11308, 484, -10339, 22483, -24060, -38616]
$$ [...]
##END NTUPLES=NMR SPECTRUM
##END=
