##TITLE=1H_CA-9273-3
 CDCl3
 8 sc, 
 31.5.2024
##JCAMPDX= 6.0         $$ Bruker NMR JCAMP-DX V2.0
##DATA TYPE= NMR SPECTRUM
##DATA CLASS= NTUPLES
##ORIGIN= UXNMR, Bruker Analytische Messtechnik GmbH
##OWNER= root
$$ XWIN-NMR		Version 3.5
$$ Fri May 31 13:44:24 2024 Russian Standard Time (UT+4h)  she@DPX200
##.OBSERVE FREQUENCY= 200.1309
##.OBSERVE NUCLEUS= ^1H
##.ACQUISITION MODE= SIMULTANEOUS
##.ACQUISITION SCHEME= undefined
##.AVERAGES= 8
##.DIGITISER RES= 18
##SPECTROMETER/DATA SYSTEM= spect
##.PULSE SEQUENCE= zg30
##.SOLVENT NAME= CDCl3
##.SHIFT REFERENCE= (INTERNAL, CDCl3, 0, 15.8141)
##AUDIT TRAIL= $$ (NUMBER, WHEN, WHO, WHERE, WHAT)
$$ ##TITLE= Audit trail, XWIN-NMR		Version 3.5
$$ ##JCAMPDX= 5.01
$$ ##ORIGIN= Bruker BioSpin GmbH
$$ ##OWNER= she
$$ F:/spectra/data/she/nmr/H-F/1/pdata/1/auditp.txt
$$ ##AUDIT TRAIL=  $$ (NUMBER, WHEN, WHO, WHERE, WHAT)
(   1,<2024-05-31 13:43:23.20 +0400>,<she>,<DPX200>,
      <created by zg, POWCHK disabled, PULCHK disabled
       configuration hash MD5:
       00 E9 B6 7A A2 85 ED C7 34 08 36 98 17 FE 4E 26
       data hash MD5: 16K
       3A 5B BF 7D 77 67 6A 70 F1 17 8C CE 55 86 D6 61>)
(   2,<2024-05-31 13:43:25.64 +0400>,<she>,<DPX200>,
      <Start of raw data processing
       efp BC_mod = 2 LB = 0.24 FT_mod = 6 PKNL = 1 PHC0 = -25310.4 PHC1 = 10.78748 SI = 16K 
       data hash MD5: 16K
       22 A4 12 61 14 51 A5 C5 57 54 88 FB 1F 57 65 AE>)
(   3,<2024-05-31 13:43:40.23 +0400>,<she>,<DPX200>,
      <pk PHC0 = -1.920871 PHC1 = 1.8 
       data hash MD5: 16K
       F2 FA 74 CF 98 E2 53 14 C7 F2 5B 38 71 E7 E7 6E>)
(   4,<2024-05-31 13:43:43.95 +0400>,<she>,<DPX200>,
      <abs ABSG = 5 
       data hash MD5: 16K
       87 38 4F F5 B9 70 5C ED D3 56 A9 5C 3F DC 60 5D>)
$$ ##END=
$$ 
$$ hash MD5
$$ 90 3B 36 31 59 35 19 04 A0 8B FC AC 8D C2 9B 9D
##$RELAX= 
##$RELAX= 
##$RELAX= 
##$RELAX= 
##$RELAX= 
##$RELAX= 
$$ Bruker specific parameters
$$ --------------------------
##$DU= <F:/spectra>
##$EXPNO= 1
##$NAME= <H-F>
##$PROCNO= 1
##$TYPE= <nmr>
##$USER= <she>
##$AMP= (0..31)
100 100 100 100 100 100 100 100 100 100 100 100 100 100 100 100 100 100 
100 100 100 100 100 100 100 100 100 100 100 100 100 100 
##$AQSEQ= 0
##$AQ_mod= 1
##$AUNM= <au_zg>
##$AUTOPOS= <>
##$BF1= 200.13
##$BF2= 200.13
##$BF3= 200.13
##$BF4= 200.13
##$BF5= 200.13
##$BF6= 200.13
##$BF7= 200.13
##$BF8= 200.13
##$BYTORDA= 1
##$CFDGTYP= 0
##$CFRGTYP= 5
##$CHEMSTR= <none>
##$CNST= (0..31)
1 1 145 1 1 1 1 1 1 1 1 1 1 1 1 1 1 1 1 1 1 1 1 1 1 1 1 1 1 1 1 1 
##$CPDPRG= <>
##$CPDPRG1= <>
##$CPDPRG2= <>
##$CPDPRG3= <>
##$CPDPRG4= <mlev>
##$CPDPRG5= <mlev>
##$CPDPRG6= <mlev>
##$CPDPRG7= <mlev>
##$CPDPRG8= <mlev>
##$CPDPRGB= <>
##$CPDPRGT= <>
##$D= (0..31)
0 1.2 0 0 0 0 0 0 0 0.06 0 0.03 0 0 0 0 0.0002 0 0 0 0 0 0 0 0 0 0 0 0 
0 0 0 
##$DATE= 1717148602
##$DBL= (0..7)
120 120 120 120 120 120 120 120 
##$DBP= (0..7)
150 150 150 150 150 150 150 150 
##$DBP07= 0
##$DBPNAM0= <>
##$DBPNAM1= <>
##$DBPNAM2= <>
##$DBPNAM3= <>
##$DBPNAM4= <>
$$ [...]
##$SUBNAM3= <"">
##$SUBNAM4= <"">
##$SUBNAM5= <"">
##$SUBNAM6= <"">
##$SUBNAM7= <"">
##$SUBNAM8= <"">
##$SUBNAM9= <"">
##$SW= 18.0517689322627
##$SWIBOX= (0..15)
0 0 2 0 0 0 0 0 0 0 0 0 0 0 0 0 
##$SW_h= 3612.71676300578
##$TD= 16384
##$TD0= 1
##$TE= 0
##$TE2= 300
##$TE3= 300
##$TEG= 300
##$TL= (0..7)
0 120 120 120 120 120 120 120 
##$TP= (0..7)
150 150 150 150 150 150 150 150 
##$TP07= 0
##$TPNAME0= <>
##$TPNAME1= <>
##$TPNAME2= <>
##$TPNAME3= <>
##$TPNAME4= <>
##$TPNAME5= <>
##$TPNAME6= <>
##$TPNAME7= <>
##$TPOAL= (0..7)
0.5 0.5 0.5 0.5 0.5 0.5 0.5 0.5 
##$TPOFFS= (0..7)
0 0 0 0 0 0 0 0 
##$TUNHIN= 0
##$TUNHOUT= 0
##$TUNXOUT= 0
##$USERA1= <user>
##$USERA2= <user>
##$USERA3= <user>
##$USERA4= <user>
##$USERA5= <user>
##$V9= 5
##$VALIST= <valist>
##$VCLIST= <CCCCCCCCCCCCCCC>
##$VD= 0
##$VDLIST= <DDDDDDDDDDDDDDD>
##$VPLIST= <PPPPPPPPPPPPPPP>
##$VTLIST= <TTTTTTTTTTTTTTT>
##$WBST= 1024
##$WBSW= 4
##$XGAIN= (0..3)
0 0 0 0 
##$XL= 0
##$YL= 0
##$YMAX_a= 702407
##$YMIN_a= -742312
##$ZGOPTNS= <>
##$ZL1= 120
##$ZL2= 120
##$ZL3= 120
##$ZL4= 120
##$ABSF1= 15.81634
##$ABSF2= -2.235551
##$ABSG= 5
##$ABSL= 3
##$ALPHA= 0
##$AQORDER= 0
##$ASSFAC= 0
##$ASSFACI= 0
##$ASSFACX= 0
##$ASSWID= 0
##$AUNMP= <proc_1d>
##$AZFE= 0.1
##$AZFW= 0.1
##$BCFW= 0
##$BC_mod= 2
##$BYTORDP= 0
##$COROFFS= 0
##$CY= -3
##$DATMOD= 1
##$DC= 0
##$DFILT= <>
##$DTYPP= 0
##$F1P= 0
##$F2P= 0
##$FCOR= 1
##$FTSIZE= 16384
##$FT_mod= 6
##$GAMMA= 0
##$GB= 0
##$INTBC= 1
##$INTSCL= 3.70164e-10
##$ISEN= 128
##$LB= 0.24
##$LEV0= 0
##$LPBIN= 0
##$MAXI= 10000
##$MC2= 0
##$MEAN= 0
##$ME_mod= 0
##$MI= 1.114404
##$NCOEF= 0
##$NC_proc= -5
##$NLEV= 6
##$NOISF1= 3.799351
##$NOISF2= 2.8
##$NSP= 0
##$NTH_PI= 0
##$NZP= 0
##$OFFSET= 15.81414
##$PC= 1
##$PHC0= -25312.32
##$PHC1= 12.58748
##$PH_mod= 1
##$PKNL= yes
##$PPARMOD= 0
##$PSCAL= 0
##$PSIGN= 0
##$REVERSE= no
##$SF= 200.129541483324
##$SI= 16384
##$SIGF1= 3
##$SIGF2= 2
##$SINO= 5.538805
##$SIOLD= 16384
##$SREGLST= <1H.CDCl3>
##$SSB= 0
##$STSI= 16384
##$STSR= 0
##$SW_p= 3612.71676300577
##$SYMM= 0
##$S_DEV= 0
##$TDeff= 16384
##$TDoff= 0
##$TI= <>
##$TILT= no
##$TM1= 0
##$TM2= 0
##$TOPLEV= 0
##$USERP1= <user>
##$USERP2= <user>
##$USERP3= <user>
##$USERP4= <user>
##$USERP5= <user>
##$WDW= 1
##$XDIM= 16384
##$YMAX_p= 289568497
##$YMIN_p= -193628
$$ End of Bruker specific parameters
$$ ---------------------------------
##NTUPLES= NMR SPECTRUM
##VAR_NAME=  FREQUENCY,     SPECTRUM/REAL,   SPECTRUM/IMAG
##SYMBOL=    X,             R,               I
##VAR_TYPE=  INDEPENDENT,   DEPENDENT,       DEPENDENT
##VAR_FORM=  AFFN,          ASDF,            ASDF
##VAR_DIM=   16384,         16384,           16384
##UNITS=     HZ,            ARBITRARY UNITS, ARBITRARY UNITS
##FACTOR=    0.220516191357247, 1,           1
##FIRST=     3164.87665115937, 0,            0
##LAST=      -447.840111846403, 0,           0
##MIN=       -447.840111846403, -193628,     0
##MAX=       3164.87665115937, 289568497,    0
$$ Real data points
##PAGE= N=1
##DATA TABLE= (X++(R..R)), XYDATA
$$ [...]
$$ plain form
6697 -32761 -2250 30128 -19054 7869 115 -23565 11503 -33542 -56 -67946 -109275 -71355
6685 -71355 -50872 -15500 -38856 -97954 -98633 -82383 -84014 -39104 -5992 9104 -47849 -35320
6673 -35320 -37649 -66133 -76378 -50985 -48348 -64779 16368 -10267 -82113 -38841 2160 -10794
6661 -10794 8323 43233 -12654 -48924 -8217 -25128 -85772 -74553 -34165 26002 -21149 -41706
6649 -41706 -78882 4814 9844 -15869 -18053 -64916 -16074 -72092 -9393 -11988 -68888 -18704
6637 -18704 -13591 -2542 -30099 -252 -31707 -14781 10458 -1367 -9856 -7094 -10209 -42247 -36840
6624 -36840 -26370 -49301 5843 29232 48650 22879 -5778 -25611 -3263 38435 160 5436
6612 5436 958 29535 -8140 20081 27208 148 -22367 -22370 -48931 -34904 -15016 -68182 -63458
$$ packed form
6697c2761L0511L2378m9182K6923p754k3680L5068m5045L3486o7890m1329L7920
6685g1355K0483L5372k3356n9098o79J6250j631M4910L3112J5096n6953J2529
6673c5320k329k8484j0245K5393K637j6431Q1147k6635p1846M3272M1001j2954
6661a0794J9117L4910n5887l6270M0707j6911o0644J1219M0388O0167m7151k0557
6649d1706l7176Q3696N030k5713k184m6863M8842n6018O2699k595n6900N0184
6637a8704N113J1049k7557K9847l1455J6926K5239j1825q489K762l115l2038N407
6624c6840J0470k2931N5144K3389J9418k5771k8657j9833K2348M1698l8275N276
6612E436m478K8577l7675K8221P127k7060k2515lk6561J4027J9888n3166M724
$$ plain form
6599 -63458 -50496 -18236 -4268 21610 -70590 -70243 -92632 -57182 -70398 -77301 22156 9764
6587 9764 34388 -58 -19204 -16603 -20314 26717 27998 14884 7071 -11210 29046 -13652 -43275
6574 -43275 -69418 -569 5974 -14313 -48459 -45040 -47831 -57773 -56157 -44403 -67809 -79151 -83083
6561 -83083 -47992 -15344 7463 15321 9155 -37113 -60665 -16016 -9167 -24563 -68220 -85959
6549 -85959 -107421 -106363 -130561 -114898 -83855 -31043 -74882 -70104 -73080 -87000 -75033 -50034
6537 -50034 -42143 -50956 -84393 -66545 -49116 -75510 -84015 -84679 -67520 -12270 4596 -33546 -38517
6524 -38517 -47485 -25418 -61902 -57139 -30399 2690 -74043 -98931 -121709 -68134 -52531 -71082
6512 -71082 -49716 -24341 22222 31601 832 -18009 -6604 -27767 -1886 -5786 -30999 -81505
$$ packed form
6599f3458J2962L2260J3968K5878r2200L47k2389L5450j3216o903R9457j2392
6587I764K4624l4446j9146K601l711M7031J281j3114p813j8281M0256m2698k9623
6574d3275k6143O8849O543k0287l4146L419k791r942J616J1754k3406j1342l932
6561h3083L5091L2648K2807P858o166m6268k3552M4649O849j5396m3657j7739
6549h5959k1462J058k4198J5663L1043N2812m3839M778k976j3920J1967K4999
6537e0034P891q813l3437J7848J7429k6394q505o64J7159N5250J6866l8142m971
6524c8517q968K2067l6484M763K6740L3089p6733k4888k2778N3575J5603j8551
6512g1082K1366K5375M6563R379l0769j8841J1405k1163K5881l900k5213n0506
$$ plain form
6500 -81505 -47439 -13848 22088 14064 4363 -17875 -10653 57854 46073 69542 26224 1406
6488 1406 47920 -5755 -63891 -27085 17590 4575 -10890 -3256 -41906 -42859 -32703 -37771 -61598
6475 -61598 -41264 10533 -18742 -18590 -57312 -53986 -21981 -35775 -69424 -90022 -49240 -49727 -63885
6462 -63885 -57369 -82080 -86666 -56534 -10111 -39742 4308 -11472 7713 10433 -36983 -109087
6450 -109087 -116810 -81447 -30870 -39312 -14212 -12780 6427 -20087 -26717 -8479 1567 -6317 -3210
6437 -3210 -9882 36601 77291 11413 9865 -35022 374 -17005 18142 -18331 -43361 -40717 11109
6424 11109 1359 32861 9552 5165 -39550 7717 35006 6446 -60 -22894 -11209 3248
6412 3248 50269 22549 19100 -2426 -9410 18663 -905 50298 62726 25497 -12013 -16647 -3614
$$ packed form
6500h1505L4066L3591L5936q024r701k2238P222O8507j1781K3469m3318k4818
6488A406M6514n3675n8136L6806M4675j3015j5465P634l8650r53J0156n068k3827
6475f1598K0334N1797k9275J52l8722L326L2005j3794l3649k0598M0782m87j4158
6462f3885O516k4711m586L0132M6423k9631M4050j5780J9185K720m7416p2104
6450a09087p723L5363N0577q442K5100J432J9207k6514o630J8238J0046p884L107
6437c210o672M6483M0690o5878j548m4887L5396j7379L5147l6473k5030K644N1826
6424A1109r750L1502k3309m387m4715M7267K7289k8560o506k2834J1685J4457
6412C248M7021k7720l449k1526o984K8073j9568N1203J2428l7229l7510m634J3033
$$ plain form
6399 -3614 -17650 2422 -13170 5853 -906 -21567 -892 2611 11516 50388 46753 71750 84947
6386 84947 100334 39697 28745 15551 62705 65386 57313 53448 92794 107603 128964 125289 93641
6373 93641 59586 47325 65532 8391 12692 19091 24959 72899 60489 22390 81639 98444
6361 98444 82932 63483 79951 75100 94542 87835 66047 25480 102143 59319 47744 67733
6349 67733 93905 68845 9362 24386 17322 14202 37638 32008 26721 14236 9395 37946 66080
6336 66080 109526 101638 95523 118776 95411 91047 102469 101548 78418 44000 74225 93159 23522
6323 23522 -7998 62775 59012 25671 9839 19531 39779 57044 65788 107758 100327 79076 83145
6310 83145 51696 42379 73956 105273 128120 70493 117748 126459 92205 95952 125425 147107
$$ packed form
6399c614j4036K0072j5592J9023o759k0661K0675L503Q905L8872l635K4997J3197
6386H4947J5387o0637j0952j3194M7154K681q073l865L9346J4809K1361l675l1648
6373I3641l4055j2261J8207n7141M301O399N868M7940j2410l8099N9249J6805
6361I8444j5512j9449J6468m851J9442o707k1788m0567P6663m2824j1575J9989
6349F7733K6172k5060n9483J5024p064l120K3436n630n287j2485m841K8551K8134
6336F6080M3446p888o115K3253k3365m364J1422r21k3130l4418L0225J8934o9637
6323B3522l1520P0773l763l3341j5832R692K0248J7265Q744M1970p431k1251M069
6310H3145l1449r317L1577L1317K2847n7627M7255Q711l4254L747K9473K1682
$$ plain form
6298 147107 157499 154874 123026 119955 73372 119995 184870 155616 111940 67697 84778 101307
6286 101307 112132 80562 45318 55210 143524 149968 87510 119721 117967 83683 82361 102271
6274 102271 111526 93264 70819 64327 70344 67715 68662 26175 42705 63762 70146 21776 -20284
6261 -20284 -47526 -4576 45315 18334 45423 23433 19462 -30935 -8776 57107 44625 -20222
6249 -20222 -23920 -51940 -48045 -8376 -17901 4219 -40422 -26822 -72217 -92395 -70760 -78334 -28474
6236 -28474 -48076 -69005 -38243 -35894 -34111 -2715 11487 -20808 -5975 4453 -56223 -60376
6224 -60376 -15940 27988 17254 -18497 -20543 8917 -17482 -35402 -57086 -76937 -42384 -12849
6212 -12849 -40701 -51555 -23986 -18892 -39944 -19271 6386 -28548 -28349 -18180 21425 61515
$$ packed form
6298A47107J0392k625l1848l071m6583M6623O4875k9254m3676m4243J7081J6529
6286A01307J0825l1570l5244R892Q8314O444o2458L2211j754l4284j322J9910
6274A02271R255j8262k2445o492O017k629R47m2487J6530K1057O384m8370m2060
6261b0284k7242M2950M9891k6981K7089k1990l971n0397K2159O5883j2482o4847
6249b0222l698k8020L895L9669r525K2120m4641J3600m5395k0178K1635p574M9860
6236b8474j9602k0929L0762K349J783L1396J4202l2295J4833J0428o0676m153
6224f0376M4436M3928j0734l5751k046K9460k6399j7920k1684j9851L4553K9535
6212a2849k7852j0854K7569N094k1052K0673K5657l4934J99J0169L9605M0090
$$ plain form
6200 61515 5898 -1447 44233 -7898 6411 42796 54228 20603 41940 42874 31969 -13422
6188 -13422 -37231 -13505 -9991 -48913 -19545 53553 8537 5776 -14373 7713 -5243 20545
6176 20545 -491 9237 9072 8071 -30884 7211 32485 79906 112834 37581 -9545 -47807 -48289
6163 -48289 -8437 -53165 -38996 -15822 19892 -1010 -32471 22437 52709 44207 28084 60433
6151 60433 31385 11190 2251 -12467 45141 -4403 -43887 3177 -534 19280 -3644 -32795
6139 -32795 17183 88779 92807 120899 53501 53734 55908 50786 32153 23933 22490 15201 14111 -43554
6125 -43554 -6291 23698 -21804 34916 49608 -40206 -77363 -46957 17542 22983 24080 47981
6113 47981 792 31431 5877 36910 16639 36035 42677 10816 80617 71660 38977 62089
$$ packed form
6200F1515n5617p345M5680n2131J4309L6385J1432l3625K1337R34j0905m5391
6188a3422k3809K3726L514l8922K9368P3098m5016k761k0149K2086j2956K5788
6176B0545k1036R728j65j001l8955L8095K5274M7421L2928p5253m7126l8262m82
6163d8289L9852m4728J4169K3174L5714k0902l1461N4908L0272q502j6123L2349
6151F0433k9048k0195q939j4718N7608m9544l9484M7064l711J9814k2924k9151
6139c2795M9978P1596M028K8092o7398K33K174n122j8633q220j443p289j090n7665
6125d3554L7263K9989m5502N6720J4692q9814l7157L0406O4499N441J097K3901
6113D7981m7189L0639k5554L1033k0271J9396O642l1861O9801q957l2683K3112
$$ plain form
6101 62089 55428 25768 -18066 3164 -5536 -65400 2495 50306 38152 25612 54923 2280
6089 2280 23983 -4144 46017 89245 65412 39828 34367 46250 48871 82851 102305 129904
6077 129904 143071 102409 95881 125593 91893 124333 172971 152685 200837 217877 239593 232590
6065 232590 229420 191835 165520 240548 214124 162489 132807 88442 78088 107438 101453 115987
6053 115987 117774 82958 90130 105400 82567 52870 25164 33318 13872 51629 28439 13533
6041 13533 36993 73080 62088 54642 56227 69043 106311 91287 67714 54934 63500 39969
6029 39969 -8288 15461 59073 72282 56914 34165 86336 84766 75786 56051 41645 90938
6017 90938 9450 6546 18634 21431 28155 75724 27106 -8177 77398 52150 24889 38823
$$ packed form
6101F2089o661k9660m3834K1230q700n9864O7895M7811j2154j2540K9311n2643
6089B280K1703k8127N0161M3228k3833k5584n461J1883K621L3980J9454K7599
6077A29904J3167m0662o528K9712l3700L2440M8638k0286M8152J7040K1716p003
6065B32590l170l7585k6315P5028k6424n1635k9682m4365j0354K9350n985J4534
6053A15987J787l4816P172J5270k2833k9697k7706Q154j9446L7757k3190j4906
6041A3533K3460L6087j0992p446J585J2816L7268j5024k3573j2780Q566k3531
6029C9969m8257K3749M3612J3209j5368k2749N2171j570q980j9735j4406M9293
6017I0938q1488k904J2088K797O724M7569m8618l5283Q5575k5248k7261J3934
$$ plain form
6005 38823 30924 50113 20172 15307 6764 52118 101784 76564 78591 94917 75020 59374 101682
5992 101682 80756 47405 59086 37924 -6346 32202 -9064 599 33789 17499 -20449 33754
5980 33754 9887 13849 44267 52489 94307 81702 86157 87634 48207 61491 73076 6452 38362
5967 38362 65741 431 23133 -9743 42304 93230 87136 67584 57732 80676 44596 93993
5955 93993 156421 89213 80880 109794 80557 41390 42502 78105 111517 115185 120125 92297 90918
5942 90918 90794 106139 104375 120044 109407 122604 119527 114592 55619 37952 67946 92082 70910
5929 70910 67739 112822 133668 160759 135453 122044 125529 187692 141804 115896 151383 142794
5917 142794 81419 145785 224552 234726 231778 162400 215166 242802 196226 147841 212298 244573
$$ packed form
6005C8823p899J9189k9941m865q543M5354M9666k5220K027J6326j9897j5646M2308
5992A01682k0926l3351J1681k1162m4270L8548m1266R663L3190j6290l7948N4203
5980C3754k3867L962L0418Q222M1818j2605M455J477l9427J3284J1585o6624L1910
5967C8362K7379o5310K2702l2876N2047N0926o094j9552r852K2944l6080M9397
5955I3993O2428o7208q333K8914k9237l9167J112L5603L3412L668M940k7828j379
5942I0918j24J5345j764J5669j0637J3197l077m935n8973j7667K9994K4136k1172
5929G0910l171M5083K0846K7091k5306j3409L485O2163m5888k5908L5487q589
5917A42794o1375O4366P8767J0174k948o9378N2766K7636m6576m8385O4457L2275
$$ plain form
5905 244573 187621 186003 193656 235719 234190 154134 140606 148810 167970 171233 109588 204480 189678
5892 189678 200436 229810 188338 175837 179467 64342 86551 106320 99754 105992 82360 94668
5880 94668 136901 141458 180128 150361 108069 153345 166124 137726 135710 124898 152213 174747
5868 174747 114780 134979 139340 131565 156170 113421 170488 190031 164622 166586 205189 202336
5856 202336 278006 248344 169108 215949 255896 269671 297406 349139 329680 360384 326583 366202
5844 366202 376027 386318 405332 365101 329984 353600 314184 278525 312131 229453 160937 197192
5832 197192 156808 155505 145570 111386 91725 101022 118781 105375 115589 142731 200950 156672
5820 156672 141258 152726 185140 184027 145251 127742 105611 136023 128812 107978 91467 142930
$$ packed form
5905B44573n6952j618P653M2063j529q0056j3528Q204J9160L263o1645R4892j4802
5892A89678J0758K9374m1472j2501L630j15125K2209J9769o566O238k3632J2308
5880I4668M2233M557L8670k9767m2292M5276J2779k8398k016j0812K7315K2534
5868A74747n9967K0199M361p775K4605m2749N7067J9543k5409J964L8603k853
5856B02336P5670k9662p9236M6841L9947J3775K7735N1733j9459L0704l3801L9619
5844C66202R825J0291J9014m0231l5117K3616l9416l5659L3606q2678o8516L6255
5832A97192m0384j303r935l4184j9661R297J7759j3406J0214K7142N8219m4278
5820A56672j5414J1468L2414j113l8776j7509k2131L0412p211k0834j6511N1463
$$ plain form
5808 142930 148506 154232 125437 96062 71131 44453 79306 127870 99593 67339 74877 99260
5796 99260 91007 101137 94411 110232 131461 124927 111817 137339 84381 80841 113544 139961 125796
5783 125796 126433 136580 113652 134051 143931 137443 82145 83649 89426 110864 112199 167564 206993
5770 206993 217888 183785 156801 132161 118620 179693 180193 131277 150874 157180 129484 123235
5758 123235 135090 68804 63119 107380 163897 176380 178597 135504 79268 96561 131165 113833
5746 113833 189394 235151 138850 121037 83216 82545 87289 91022 118970 171775 196639 168835
5734 168835 119325 170319 156196 110508 192452 196666 207806 191002 182769 156472 169919 216243
5722 216243 209503 201947 166905 200336 201536 215505 219449 252716 292173 334772 294513 273192
$$ packed form
5808A42930N576N726k8795k9375k4931k6678L4853M8564k8277l2254P538K4383
5796I9260q253J0130o726J5821K1229o534j3110K5522n2958l540L2703K6417j4165
5783A25796O37J0147k2928K0399R880o488n5298J504N777K1438J335N5365L9429
5770B06993J0895l4103k6984k4640j3541O1073N00m8916J9597O306k7696o249
5758A23235J1855o6286n685M4261N6517J2483K217m3093n6236J7293L4604j7332
5746A13833P5561M5757r6301j7813l7821o71M744L733K7948N2805K4864k7804
5734A68835m9510N0994j4123m5688Q1944M214J1140j6804q233k6297J3447M6324
5722B16243o740p556l5042L3431J200J3969L944L3267L9457M2599m0259k1321
$$ plain form
5710 273192 280227 268846 286217 300660 277195 309110 331568 299287 338699 361361 388749 406901
5698 406901 425759 475906 485668 505019 530472 561187 622986 610871 650049 691389 724061 758851
5686 758851 719004 734864 783444 771131 780147 797309 804324 769469 715569 654924 674238 717121
5674 717121 729384 684730 621808 543064 550448 511780 405707 392321 426742 381559 377598 411197
5662 411197 369419 330719 334239 385371 376024 325622 246724 274587 282264 355779 369554 328126
5650 328126 289509 306823 363935 384412 359023 369318 347562 298130 381794 384430 345240 364742
5638 364742 414426 389820 414799 425173 408265 369256 269185 322929 364033 338812 347535 351846
5626 351846 369202 401388 435353 399943 370862 340219 434744 404161 358479 425716 434917 449033
$$ packed form
5710B73192P035j1381J7371J4443k3465L1915K2458l2281L9412K2662K7388J8152
5698D06901J8858N0147R762J9351K5453L0715O1799j2115L9178M1340L2672L4790
5686G58851l9847J5860M8580j2313R016J7162P015l4855n3900o0645J9314M2883
5674G17121J2263m4654o2922p8744P384l8668j06073j3386L4421m5183l961L3599
5662D11197m1778l8700L520N1132r347n0402p8898K7863P677P3515J3775m1428
5650C28126l8617J7314N7112K0477k5389J0295k1756m9432Q3664K636l9190J9502
5638C64742M9684k4606K4979J0374j6908l9009j00071N3744M1104k5221Q723M311
5626C51846J7356L2186L3965l5410k9081l0643R4525l0583m5682O7237R201J4116
$$ plain form
5614 449033 442839 453498 479967 474544 450350 481174 443974 412795 422026 425705 454841 490478
5602 490478 499704 476352 488941 481270 543845 503579 483883 500076 449936 514246 569223 595409
5590 595409 548314 530741 560723 536984 505195 491522 587917 600680 562045 555619 610843 587903
5578 587903 603633 639672 635394 604063 600442 600910 576153 601746 585260 607489 621325 638724
5566 638724 634332 606858 600681 619984 638259 628601 629508 644707 581249 596009 608952 638318 657954
5553 657954 691407 670699 673019 663009 668819 656681 678313 664144 679909 731850 828508 813500
5541 813500 756407 784200 786211 837736 866629 892994 840827 919848 893843 902334 922951 893015
5529 893015 894938 880641 924022 932685 894160 903060 991174 965290 965996 974649 948062 965801 1023252
$$ packed form
5614D49033o194J0659K6469n423k4194L0824l7200l1179R231L679K9136L5637
5602D90478R226k3352J2589p671O2575m0266j9696J6193n0140O4310N4977K6186
5590E95409m7095j7573K9982k3739l1789j3673R6395J2763l8635o426N5224k2940
5578E87903J5730L6039m278l1331l621M68k4757K5593j6486K2229J3836J7399
5566F38724m392k7474o177J9303J8275r658R07J5199o3458J4760J2943K9366J9636
5553F57954L3453k0708K320j0010N810j2138K1632j4169J5765N1941R6658j5008
5541H13500n7093K7793K011N1525K8893K6365n2167P9021k6005Q491K0617k9936
5529H93015J923j4297M3381Q663l8525Q900Q8114k5884P06Q653k6587J7739N7451
$$ plain form
5516 1023252 1074738 1079182 1025310 1066210 1035518 1033076 1057100 1088170 1197295 1209870 1228271 1243690
5504 1243690 1226959 1212991 1211811 1261834 1282595 1311313 1340521 1382115 1436161 1425681 1492382 1552951
5492 1552951 1556933 1529681 1525709 1583808 1661663 1718448 1692071 1727712 1753928 1805215 1814079 1836638
5480 1836638 1891103 1899830 2014359 2048193 2128199 2191082 2283802 2350608 2336903 2341059 2418334 2433045
5468 2433045 2472074 2568605 2640754 2694236 2759876 2799341 2891341 2984957 3130434 3220243 3329693
5457 3329693 3407455 3514620 3650831 3694570 3882895 4025741 4052913 4180396 4357955 4525116
5447 4525116 4606026 4733627 4884832 5077433 5280476 5455476 5676617 5853371 6005979 6201108
5437 6201108 6367915 6513497 6696672 6891780 7154063 7324077 7614898 7859580 8079015 8314465
$$ packed form
5516A023252N1486M444n3872M0900l0692k442K4024L1070J09125J2575J8401J5419
5504A243690j6731j3968j180N0023K0761K8718K9208M1594N4046j0480O6701O0569
5492A552951L982k7252l972N8099P7855N6785k6377L5641K6216N1287Q864K2559
5480A836638N4465Q727J14529L3834Q0006O2883R2720O6806j3705M156P7275J4711
5468B433045L9029R6531P2149N3482O5640L9465R2000R3616J45477Q9809J09450
5457C329693P7762J07165J36211M3739J88325J42846K7172J27483J77559J67161
5447D525116Q0910J27601J51205J92601K03043J75000K21141J76754J52608J95129
5437F201108J66807J45582J83175J95108K62283J70014K90821K44682K19435K35450
$$ plain form
5427 8314465 8580434 8802987 9002000 9264439 9653380 9916890 10209437 10550756 10880322 11243421
5417 11243421 11687181 12075548 12484345 12976752 13448549 13899789 14339516 14826837 15343355
5408 15343355 15880312 16370936 16957439 17555424 18167309 18822998 19506778 20204638 20919125
5399 20919125 21664700 22474500 23396356 24355857 25449928 26623902 27920908 29432386 31187458
5390 31187458 33188336 35346845 37958294 40874388 44190963 47880690 51984203 56614179
5382 56614179 61726519 67235072 73055894 79142719 85185747 91221996 97284770 103065580
5374 103065580 108386832 113109670 116668094 118463149 118611800 117488019 115755313 113721691
5366 113721691 111619623 109745810 107931632 105793523 102993203 99016977 93296005 86197041
$$ packed form
5427H314465K65969K22553J99013K62439L88941K63510K92547L41319L29566L63099
5417A1243421M43760L88367M08797M92407M71797M51240M39727M87321N16518
5408A5343355N36957M90624N86503N97985O11885O55689O83780O97860P14487
5399B0919125P45575Q09800R21856R59501J094071J173974J297006J511478J755072
5390C1187458K000878K158509K611449K916094L316575L689727M103513M629976
5382E6614179N112340N508553N820822O086825O043028O036249O062774N780810
5374A03065580N321252M722838L558424J795055J48651j123781j732706k033622
5366A13721691k102068j873813j814178k138109k800320l976226n720972p098964
$$ plain form
5358 86197041 78630076 71046997 63779998 57065879 51079940 45961464 41575772 37846574
5350 37846574 34740090 32054705 29724784 27676647 25817070 24140811 22612779 21165749
5342 21165749 19861405 18764208 17700129 16725464 15842190 15005228 14332932 13621773 12992918
5333 12992918 12479064 11936625 11439285 10984001 10523979 10137739 9792136 9427317 9093926
5324 9093926 8775830 8455902 8164883 7892762 7674592 7477603 7244071 7052314 6833000 6611253
5314 6611253 6398919 6227525 6059271 5921747 5784867 5596559 5476316 5365330 5185096 5010050
5304 5010050 4914250 4851479 4763442 4666525 4516746 4417817 4326883 4250882 4136670 4049706 3897330
5293 3897330 3830771 3732338 3639591 3585085 3513354 3378055 3302642 3284454 3265109 3186101 3136196
$$ packed form
5358H6197041p566965p583079p266999o714119n985939n118476m385692l729198
5350C7846574l106484k685385k329921k048137j859577j676259j528032j447030
5342B1165749j304344j097197j064079r74665q83274q36962o72296p11159o28855
5333A2992918n13854n42439m97340m55284m60022l86240l45603l64819l33391
5324I093926l18096l19928k91019k72121k18170j96989k33532j91757k19314k21747
5314F611253k12334j71394j68254j37524j36880j88308j20243j10986j80234j75046
5304E010050r5800o2771q8037r6917j49779r8929r0934p6001j14212q6964j52376
5293C897330o6559r8433r2747n4506p1731j35299p5413j8188j9345p9008m9905
$$ plain form
5282 3136196 3085521 3034846 3032947 2958814 2930433 2869147 2850954 2841307 2825902 2760123 2716142 2690227
5270 2690227 2664715 2663475 2648827 2610605 2525825 2536036 2585238 2563530 2580685 2602456 2599934 2580156
5258 2580156 2569753 2572813 2653660 2688287 2721092 2755814 2779791 2802329 2780753 2797598 2831952 2865429
5246 2865429 2943020 3014648 2997570 3038614 3056149 3094868 3141644 3209123 3254415 3262865 3292481 3262656
5234 3262656 3289291 3270177 3231687 3217581 3188481 3162082 3092905 3023265 2962156 2949083 2953277 2961245
5222 2961245 2992217 3052916 3052628 3082801 3096660 3123061 3176886 3278686 3391168 3466444 3496869
5211 3496869 3566757 3602453 3621692 3785215 3899590 3980620 4013773 4075274 4124366 4240685 4328532
5200 4328532 4374938 4377253 4470084 4475926 4481314 4572011 4640643 4661392 4755072 4833564 4909533 4993616
$$ packed form
5282C136196n0675n0675j899p4133k8381o1286j8193r647j5405o5779m3981k5915
5270B690227k5512j240j4648l8222q4780J0211M9202k1708J7155K1771k522j9778
5258B580156j0403L060Q0847L4627L2805L4722K3977K2538k1576J6845L4354L3477
5246B865429P7591P1628j7078M1044J7535L8719M6776O7479M5292Q450K9616k9825
5234C262656K6635j9114l8490j4106k9100k6399o9177o9640o1109j3073M194P968
5222B961245L0972O0699k88L0173J3859K6401N3825J01800J12482P5276L0425
5211C496869O9888L5696J9239J63523J14375Q1030L3153O1501M9092J16319Q7847
5200D328532M6406K315R2831N842N388R0697O8632K0749R3680P8492P5969Q4083
$$ plain form
5188 4993616 5101225 5171626 5244516 5357807 5571713 5750630 5932320 6181123 6433520 6737916
5178 6737916 7042820 7368358 7715835 8048028 8333056 8608763 8810155 9048102 9261508 9448442
5168 9448442 9575168 9606883 9610132 9551483 9485568 9420719 9385436 9286981 9182637 9140055 9160272
5157 9160272 9258161 9382819 9462893 9574963 9819038 10167980 10623181 11076166 11572043 12214611
5147 12214611 12940707 13778851 14824222 15946328 17170193 18640510 20270879 22005313
5139 22005313 23788083 25547644 27307776 29065944 30852009 32532865 34102030 35432896
5131 35432896 36170511 36070216 35473048 34763140 34160778 33572242 32965684 32632573 32460630
5122 32460630 32253161 31928228 31019805 29298311 26921973 24367835 21892619 19540465 17411801
$$ packed form
5188D993616J07609P0401P2890J13291K13906J78917J81690K48803K52397L04396
5178F737916L04904L25538L47477L32193K85028K75707K01392K37947K13406J86934
5168I448442J26726L1715L249n8649o5915o4849l5283r8455j04344m2582K0217
5157I160272R7889J24658Q0074J12070K44075L48942M55201M52985M95877O42568
5147A2214611P26096Q38144J045371J122106J223865J470317J630369J734434
5139B2005313J782770J759561J760132J758168J786065J680856J569165J330866
5131C5432896P37615j00295n97168p09908o02362n88536o06558l33111j71943
5122C2460630k07469l24933r08423j721494k376338k554138k475216k352154k128664
$$ plain form
5113 17411801 15550968 13992651 12725522 11614217 10731030 9959681 9340618 8750786 8198606
5104 8198606 7686405 7267734 6862515 6436196 6113834 5864254 5572387 5323973 5143543 4881301
5094 4881301 4665313 4477892 4252477 4091548 3905472 3782942 3659602 3494488 3380381 3281084
5084 3281084 3217351 3130649 3033895 2972588 2852149 2787036 2734712 2708554 2639601 2506348 2467521
5073 2467521 2415914 2374455 2351484 2373844 2229082 2209274 2192546 2125290 2101953 2076928 2089021
5062 2089021 2086086 2035782 2014633 2035887 2039175 2003182 1998969 1997506 1941956 1949583 1949930 1886066 1878746
5049 1878746 1850550 1774021 1738290 1763226 1764919 1672852 1596273 1535681 1460395 1448919 1379078 1319494
5037 1319494 1258924 1221657 1146711 1097483 1065199 1054360 1014438 985556 945050 950173 895946 864677
$$ packed form
5113A7411801j860833j558317j267129j111305q83187p71349o19063n89832n52180
5104H198606n12201m18671m05219m26319l22362k49580k91867k48414j80430k62242
5094D881301k15988j87421k25415j60929j86076j22530j23340j65114j14107r9297
5084C281084o3733q6702r6754o1307j20439o5113n2324k6158o8953j33253l8827
5073B467521n1607m1459k2971K2360j44762j9808j6728o7256k3337k5025J2093
5062B089021k935n0304k1149K1254L288l5993m213j463n5550P627L47o3864p320
5049A878746k8196p6529l5731K4936J693r2067p6579o0592p5286j1476o9841n9584
5037A319494o0570l7267p4946m9228l2284j0839l9922k8882m0506N123n4227l1269
$$ plain form
5025 864677 870409 848242 849037 807919 819969 749583 700742 772408 749945 717462 691844 672200
5013 672200 684378 688192 673095 664288 691121 652622 613952 589277 619875 634480 584615 561720
5001 561720 643232 626546 582210 570629 562248 524678 513382 506248 504812 499960 426220 483902
4989 483902 538417 457568 444745 473707 510298 476143 502166 499042 437983 435626 419280 426945
4977 426945 419298 433364 392345 411470 379035 382190 436774 378768 362764 388395 385170 338336
4965 338336 323187 381844 396354 400110 379845 307048 331956 333057 309210 350287 363653 385540
4953 385540 390166 377669 351423 350212 349831 348728 292344 237486 281066 346158 359073 308668 338126
4940 338126 335866 304679 347878 299547 253112 238487 227678 264832 254913 272541 274523 292018
$$ packed form
5025H64677N732k2167P95m1118J2050p0386m8841P1666k2463l2483k5618j9644
5013F72200J2178L814j5097q807K6833l8499l8670k4675L0598J4605m9865k2895
5001E61720Q1512j6686m4336j1581q381l7570j1296p134j436m852p3740N7682
4989D83902N4515q0849j2823K8962L6591l4155K6023l124o1059k357j6346P665
4977D26945p647J4066m1019J9125l2435L155N4584n8006j6004K5631l225m6834
4965C38336j5149N8657J4510L756k0265p2797K4908J101k3847M1077J3366K1887
4953C85540M626j2497k6246j211l81j103n6384n4858M3580O5092J2915n0405K9458
4940C38126k260l1187M3199m8331m6435j4625j0809L7154r919J7628J982J7495
$$ plain form
4928 292018 255637 286883 259920 253739 258859 215892 188424 238000 248473 259301 257808 297765
4916 297765 308787 246672 171157 179859 205034 231384 235607 267325 244183 260719 225849 258212
4904 258212 271090 207541 186808 175787 236944 192955 183561 199493 258897 212812 226441 176509
4892 176509 226262 194582 142046 200564 261628 264516 261160 270206 261667 215898 203860 188655
4880 188655 180663 172451 151760 195848 255322 221556 162217 133793 157594 134520 127614 196225
4868 196225 172634 166708 175077 207921 201775 170134 183461 157619 168225 222000 249597 222787
4856 222787 205532 211854 177442 191104 216791 231308 274627 301746 290961 263586 263426 225789
4844 225789 230931 235836 285871 266847 276274 256851 151223 162718 209108 220128 213944 193731
$$ packed form
4928B92018l6381L1246k6963o181N120m2967k7468M9576J0473J0828j493L9957
4916B97765J1022o2115p5515Q702K5175K6350M223L1718k3142J6536l4870L2363
4904B58212J2878o3549k0733j1021O1157m3989r394J5932N9404m6085J3629m9932
4892A76509M9753l1680n2536N8518O1064K888l356R046q539m5769j2038j5205
4880A88655p992q212k0691M4088N9474l3766n9339k8424K3801k3074o906O8611
4868A96225k3591n926Q369L2844o146l1641J3327k5842J0606N3775K7597k6810
4856B22787j7255O322l4412J3662K5687J4517M3319K7119j0785k7375j60l7637
4844B25789N142M905N0035j9024R427j9423j05628J1495M6390J1020o184k0213
$$ plain form
4832 193731 184764 210916 205482 249927 231635 195566 269895 237193 281854 277369 215818 230296
4820 230296 281188 314664 315427 309817 303906 336816 298340 321216 317269 326751 320266 281365 192902
4807 192902 215137 258318 310404 293336 267242 294704 282593 228329 250039 240699 170607 167872
4795 167872 145343 116689 147302 151105 226883 247542 186724 154734 136322 104244 111037 183136
4783 183136 176914 148076 181329 114811 85626 122702 115350 152521 191724 223780 206565 178369
4771 178369 110586 116823 161529 209430 215953 147345 179289 153129 84437 94899 110606 109145
4759 109145 84262 157384 135386 146146 157631 131197 140406 160990 110341 112457 100702 69557
4747 69557 93332 106101 193558 203248 208455 198687 159658 161733 156370 121980 156446 119786 115110
$$ packed form
4832A93731q967K6152n434M4445j8292l6069P4329l2702M4661m485o1551J4478
4820B30296N0892L3476P63n610n911L2910l8476K2876l947R482o485l8901q8463
4807A92902K2235M3181N2086j7068k6094K7462j2111n4264K1710r340p0092k735
4795A67872k2529k8654L0613L803P5778K0659o0818l1990j8412l2078O793P2099
4783A83136o222k8838L3253o6518k9185L7076p352L7171L9203L2056j7215k8196
4771A78369o7783O237M4706M7901O523o8608L1944k6160o8692J0462J5707j461
4759A09145k4883P3122k1998J0760J1485k6434R209K0584n0649K116j1755l1145
4747F9557K3775J2769Q7457R690N207r768l9029K075n363l4390L4466l6660m676
$$ plain form
4734 115110 96912 74684 94272 118183 113556 151347 181676 152628 163349 181852 212138 182380
4722 182380 174324 116552 145913 190735 184918 185428 182455 177769 172350 181554 107738 137791 161449
4709 161449 167996 198779 193835 194038 225251 227833 229304 219597 191832 192824 236913 265175 228446
4696 228446 282204 265166 220033 148746 194803 255974 232730 259976 273364 253231 246356 251137
4684 251137 269761 243378 202246 194754 190336 201435 244493 236382 238745 238367 228247 266726 304590
4671 304590 299338 209581 255153 274707 303837 323817 275795 271140 272936 269035 262503 312693 299895
4658 299895 362286 391575 349573 334263 378970 388397 367717 347405 333591 338538 324804 375179
4646 375179 389487 389313 439515 392726 351402 362746 393308 444055 395112 411939 434586 370996
$$ packed form
4734A15110j8198k2228J9588K3911m627L7791L0329k9048J0721J8503L0286k9758
4722A82380q056n7772K9361M4822n817N10k973m686n419R204p3816L0053K3658
4709A61449O547L0783m944K03L1213K582J471r707k7765R92M4089K8262l6729
4696B28446N3758j7038m5133p1287M6057O1171k3244K7246J3388k0133o875M781
4684B51137J8624k6383m1132p492m418J1099M3058q111K363l78j0120L8479L7864
4671C04590n252q9757M5572J9554K9130J9980m8022m655J796l901o532N0190j2798
4658B99895O2391K9289m2002j5310M4707R427k0680k0312j3814M947j3734N0375
4646C75179J4308j74N0202m6789m1324J1344L0562N0747m8943J6827K2647o3590
$$ plain form
4634 370996 380038 387583 391310 388234 376533 375061 371435 355875 388947 396490 389201 347114 339161
4621 339161 401567 425234 445713 416752 433883 442331 456703 451077 439584 450989 459527 443146
4609 443146 472920 525341 524226 525006 529798 501884 513017 543200 582688 601829 615607 651638
4597 651638 621627 651509 645088 632396 582104 632048 661174 653139 630538 614698 660158 602436
4585 602436 587731 587061 596680 604207 643845 595038 553665 518499 484091 443243 457031 434318
4573 434318 435466 418664 429722 403591 395164 361658 363652 362946 367777 348301 384118 338815 278361
4560 278361 378567 379198 311756 342561 299033 250936 297188 335722 363637 358314 335630 318182
4548 318182 355302 331675 366908 376373 397306 325858 302874 289936 250430 257085 310183 282820
$$ packed form
4634C70996R042P545L727l076j1701j472l626j5560L3072P543p289m2087p953
4621C39161O2406K3667K0479k8961J7131Q448J4372n626j1493J1405Q538j6381
4609D43146K9774N2421j115P80M792k7914J1133L0183L9488J9141J3778L6031
4597F51638l0011K9882o421j2692n0292M9944K9126q035k2601j5840M5460n7722
4585F02436j4705o70R619P527L9638m8807m1373l5166l4408m0848J3788k2713
4573D34318J148j6802J1058k6131q427l3506J994p06M831j9476L5817m5303o0454
4560B78361J00206O31o7442L0805m3528m8097M6252L8534K7915n323k2684j7448
4548C18182L7120k3627L5233R465K0933p1448k2984j2938l9506O655N3098k7363
$$ plain form
4536 282820 256621 302485 283944 311962 319092 337379 400561 355783 370971 349314 343208 356772
4524 356772 372657 370765 348126 381448 410132 413996 452999 420763 403950 483367 463758 459145
4512 459145 399101 390666 385878 359883 375161 400459 415527 478935 468173 397681 399042 397776
4500 397776 395445 389200 409024 404780 373721 394424 412235 410513 393919 364906 432231 420668
4488 420668 408054 417952 441042 417305 440664 425460 385647 370838 389518 384696 427158 436100
4476 436100 371045 365143 381736 332882 329057 334929 356821 372453 357238 292917 302755 297142 334534
4463 334534 353107 266760 312502 300996 302707 278594 345734 377171 349293 338627 287542 275261
4451 275261 305828 315251 296253 341904 314409 324311 355624 370604 323366 252442 246622 228855
$$ packed form
4536B82820k6199M5864j8541K8018P130J8287O3182m4778J5188k1657o106J3564
4524C56772J5885j892k2639L3322K8684L864L9003l2236j6813P9417j9609m613
4512D59145o0044q435m788k5995J5278K5298J5068O3408j0762p0492J361j266
4500C97776k331o245J9824m244l1059K0703J7811j722j6594k9013O7325j1563
4488D20668j2614R898K3090k3737K3359j5204l9813j4809J8680m822M2462Q942
4476D36100o5055n902J6593m8854l825N872K1892J5632j5215o4321R838n613L7392
4463C34534J8573q6347M5742j1506J711k4113O7140L1437k7878j0666n1085j2281
4451B75261L0567R423j8998M5651k7495R902L1313J4980m7238p0924n820j7767
$$ plain form
4439 228855 276798 258072 298373 296034 268042 258425 293614 260131 240239 270079 270536 323248
4427 323248 344442 311344 310350 257086 230289 206611 270024 262231 252784 256568 261470 274953 303668
4414 303668 322773 316144 306643 273620 303466 295790 303958 300564 384744 422337 412499 380270 372837
4401 372837 322771 267715 301196 305198 275914 271280 300644 290456 327399 303458 307837 337195
4389 337195 332692 341507 314858 284163 317035 376172 378680 347384 369416 381776 347408 344016
4377 344016 382881 343770 336301 376205 361667 350890 341400 395010 403861 377615 351577 309976
4365 309976 358035 369242 343295 380278 363736 387905 433849 399123 364833 415092 442752 413294
4353 413294 403935 403072 402142 417490 494978 560193 534639 454190 477156 537492 541205 470003 455418
$$ packed form
4439B28855M7943j8726M0301k339k7992r617L5189l3483j9892K9840M57N2712
4427C23248K1194l3098r94n3264k6797k3678O3413p793r447L784M902J3483K8715
4414C03668J9105o629r501l3023K9846p676Q168l394Q4180L7593r838l2229p433
4401C72837n0066n5056L3481M002k9284m634K9364j0188L6943k3941M379K9358
4389C37195m503Q815k6649l0695L2872N9137K508l1296K2032J2360l4368l392
4377C44016L8865l9111p469L9904j4538j0777r490N3610Q851k6246k6038m1601
4365C09976M8059J1207k5947L6983j6542K4169M5944l4726l4290N0259K7660k9458
4353D13294r359q63r30J5348P7488O5215k5554q0449K2966O0336L713p1202j4585
$$ plain form
4340 455418 459625 434397 468852 472237 528692 517953 504416 516977 510302 562133 600486 558668
4328 558668 556162 596951 607711 557679 518904 475246 525512 567076 552669 559802 585810 570057
4316 570057 610009 629738 625068 602237 581855 612147 591493 616768 602365 600525 562327 595146
4304 595146 654775 632998 675257 691339 649368 663212 698532 642361 668826 695012 694663 723390
4292 723390 772593 731601 722660 734528 758305 770422 723217 768995 781638 794632 798186 793604
4280 793604 757006 758517 759883 685977 704259 752521 785645 768299 782881 822113 856054 860089
4268 860089 858137 878064 862554 870091 897282 931744 928734 911088 931659 961691 915970 971589
4256 971589 973428 1076766 1080445 1054304 1058533 1055551 1008171 1096831 1129536 1102259 1194557 1176827
$$ packed form
4340D55418M207k5228L4455L385N6455j0739j3537J2561o675N1831L8353m1818
4328E58668k506M0789J0760n0032l8775m3658N0266M1564j4407P133K6008j5753
4316E70057L9952J9729m670k2831k0382L0292k0654K5275j4403j840l8198L2819
4304E95146N9629k1777M2259J6082m1971J3844L5320n6171K6465K6186l49K8727
4292G23390M9203m0992q941J1868K3777J2117m7205M5778J2643J2994L554m582
4280G93604l6598J511J366p3906J8282M8262L3124j7346J4582L9232L3941M035
4268H60089j952J9927j5510P537K7191L4462l010j7646K0571L0032m5721N5619
4256I71589J839J03338L679k6141M229k982m7380Q8660L2705k7277R2298j7730
$$ plain form
4244 1176827 1136984 1109612 1168283 1181530 1256449 1225009 1227516 1223192 1249347 1262487 1274237 1263795
4232 1263795 1290641 1348260 1349856 1341450 1267901 1290397 1331577 1405455 1419497 1384204 1455948 1461905
4220 1461905 1437951 1446811 1438338 1485722 1455531 1450132 1417726 1405187 1409033 1455847 1560844 1526319
4208 1526319 1480998 1508062 1513635 1534649 1518978 1528814 1508370 1529496 1549802 1562896 1564440 1540621
4196 1540621 1630877 1614813 1624697 1643947 1624688 1651465 1691207 1686534 1668329 1714705 1688341 1684313
4184 1684313 1786783 1826856 1834589 1919854 1894084 1839384 1820914 1860859 1904481 1899355 1884700 1911688
4172 1911688 1954232 1930740 1944824 1915048 1944124 2027485 1963563 1945754 1943346 1894424 1889343 1878146
4160 1878146 1929322 1911149 1919512 1953930 1947191 2019687 2115512 2165932 2179101 2150897 2222405 2213030
$$ packed form
4244A176827l9843k7372N8671J3247P4919l1440K507m324K6155J3140J1750j0442
4232A263795K6846N7619J596q406p3549K2496M1180P3878J4042l5293P1744N957
4220A461905k3954Q860q473M7384l0191n399l2406j2539L846M6814J04997l4525
4208A526319m5321K7064N573K1014j5671R836k0444K1126K0306J3094J544k3819
4196A540621R0256j6064R884J9250j9259K6777L9742m673j8205M6376k6364m028
4184A684313J02470M0073P733Q5265k5770n4700j8470L9945M3622n126j4655K6988
4172A911688M2544k3492J4084k9776K9076Q3361o3922j7809k408m8922n081j1197
4160A878146N1176j8173Q363L4418o739P2496R5825N0420J3169k8204P1508r375
$$ plain form
4148 2213030 2211336 2249639 2231342 2265505 2301370 2302015 2380512 2429947 2473129 2531013 2563473 2544433
4136 2544433 2576046 2567302 2614648 2644204 2700552 2718090 2731177 2808049 2852411 2833495 2829207 2893864
4124 2893864 2936194 2952351 2983345 3031202 3111412 3203029 3253504 3358863 3387651 3449125 3534931
4113 3534931 3580166 3665896 3740073 3794149 3916018 4014874 4095988 4199611 4348078 4372097 4444121
4102 4444121 4574666 4733540 4914948 5011718 5136793 5330022 5368933 5502035 5696315 5807858
4092 5807858 5966572 6024640 6177124 6430413 6623906 6788910 6946654 7174255 7384863 7567165
4082 7567165 7727044 7922499 8109935 8331016 8594963 8849306 9088738 9375615 9665560 9915572
4072 9915572 10178660 10526891 10862077 11205158 11594748 11907758 12237579 12656984 13053860 13494503
$$ packed form
4148B213030j694L8303j8297L4163L5865O45P8497M9435M3182N7884L2460j9040
4136B544433L1613q744M7346K9556N6348J7538J3087P6872M4362j8916m288O4657
4124B893864M2330J6157L0994M7857Q0210R1617N0475J05359K8788O1474Q5806
4113C534931M5235Q5730P4177N4076J21869R8856Q1114J03623J48467K4019P2024
4102D444121J30545J58874J81408R6770J25075J93229L8911J33102J94280J11543
4092E807858J58714N8068J52484K53289J93493J65004J57744K27601K10608J82302
4082G567165J59879J95455J87436K21081K63947K54343K39432K86877K89945K50012
4072I915572K63088L48231L35186L43081L89590L13010L29821M19405L96876M40643
$$ plain form
4062 13494503 13921449 14438075 14995264 15583924 16214948 16975181 17830281 18702119 19733845
4053 19733845 20910760 22192187 23602531 25218459 26931414 28879666 30944463 33175653
4045 33175653 35469394 37950270 40490986 42952038 45568075 48171504 50654744 52999339
4037 52999339 55011620 56889144 58625669 60197105 61855599 63438926 64792536 65836059
4029 65836059 66456780 66178134 65053551 63397232 61625137 59828279 57945183 56334560
4021 56334560 54998289 53696403 52400985 50827031 48608688 45761908 42884776 40123449
4013 40123449 37563218 35175761 33092409 31420659 29922794 28731209 27657630 26647979
4005 26647979 25569656 24367780 23278975 22303193 21464940 20736834 20090370 19663177 19272581
$$ packed form
4062A3494503M26946N16626N57189N88660O31024P60233Q55100Q71838J031726
4053A9733845J176915J281427J410344J615928J712955J948252K064797K231190
4045C3175653K293741K480876K540716K461052K616037K603429K483240K344595
4037E2999339K012281J877524J736525J571436J658494J583327J353610J043523
4029F5836059O20721k78646j124583j656319j772095j796858j883096j610623
4021E6334560j336271j301886j295418j573954k218343k846780k877132k761327
4013D0123449k560231k387457k083352j671750j497865j191585j073579j009651
4005B6647979j078323j201876j088805r75782q38253p28106o46464m27193l90596
$$ plain form
3996 19272581 19015744 18778800 18650726 18578924 18553013 18557302 18614755 18657130 18757046 18895983 19052569
3985 19052569 19253219 19570547 19813780 20147870 20504145 20845697 21206417 21670183 22152443
3976 22152443 22732289 23259491 23761629 24289699 24866928 25587785 26310404 26988355 27774127
3967 27774127 28674814 29577724 30550919 31532084 32630745 33683726 34830559 36051026 37355142
3958 37355142 38681604 40098874 41556090 43078720 44654354 46306737 47948400 49715467
3950 49715467 51488619 53307749 55212619 57143635 59082589 61050345 63013969 64989438
3942 64989438 67013621 69002726 70923603 72904801 74828075 76666291 78514087 80252992
3934 80252992 81937537 83560582 85128079 86622789 88022666 89329943 90554543 91632891
$$ packed form
3996A9272581k56837k36944j28074p1802k5911M289N7453M2375R9916J38937J56586
3985A9052569K00650L17328K43233L34090L56275L41552L60720M63766M82260
3976B2152443N79846N27202N02138N28070N77229P20857P22619O77951P85772
3967B7774127R00687R02910R73195R81165J098661J052981J146833J220467J304116
3958C7355142J326462J417270J457216J522630J575634J652383J641663J767067
3950D9715467J773152J819130J904870J931016J938954J967756J963624J975469
3942F4989438K024183J989105J920877J981198J923274J838216J847796J738905
3934H0252992J684545J623045J567497J494710J399877J307277J224600J078348
$$ plain form
3926 91632891 92569616 93386565 94003156 94493554 94855582 95092379 95231053 95217238 94991811 94689646
3916 94689646 94262455 93712735 93122242 92334915 91415806 90379619 89191216 87895401 86569350
3907 86569350 85080450 83539695 81949786 80261130 78560133 76728669 74860202 73047445
3899 73047445 71201946 69267372 67438028 65492968 63605982 61650508 59685880 57790688
3891 57790688 55919475 54050639 52215971 50412049 48672969 47010408 45289079 43637865
3883 43637865 42064235 40519903 39000142 37528741 36084519 34686006 33332536 32092933
3875 32092933 30859427 29689148 28502791 27411963 26343973 25319043 24361782 23453205
3867 23453205 22517522 21709317 20932224 20102338 19414991 18697980 18066468 17442016 16807064
$$ packed form
3926I1632891R36725Q16949O16591M90398L62028K36797J38674j3815k25427l02165
3916I4689646m27191n49720n90493p87327r19109j036187j188403j295815j326051
3907H6569350j488900j540755j589909j688656j700997j831464j868467j812757
3899G3047445j845499j934574j829344j945060j886986j955474j964628j895192
3891E7790688j871213j868836j834668j803922j739080j662561j721329j651214
3883D3637865j573630j544332j519761j471401j444222j398513j353470j239603
3875C2092933j233506j170279j186357j090828j067990j024930r57261r08577
3867B3453205r35683q08205p77093q29886o87347p17011o31512o24452o34952
$$ plain form
3858 16807064 16212761 15651401 15137199 14636864 14120328 13664487 13296053 12863414 12496264
3849 12496264 12144714 11817660 11584274 11300173 11007866 10710285 10435122 10195157 9980718
3840 9980718 9786455 9544516 9404789 9251212 9056407 8890805 8833147 8760428 8672311 8568790
3830 8568790 8452362 8336186 8265370 8255355 8261091 8233238 8168178 8095350 8081508 8065631 8047949
3819 8047949 8038161 8017162 8052915 8078900 8108828 8104726 8111050 8167939 8177240 8151638 8168356 8161533
3807 8161533 8183963 8214916 8259489 8280798 8333990 8373679 8368039 8365427 8370365 8430890 8409115 8439174
3795 8439174 8476363 8471340 8500545 8585315 8635519 8643563 8622117 8672267 8705702 8743212 8850544 8905343
3783 8905343 9013073 9059750 9067989 9184816 9276331 9301814 9438402 9549641 9668164 9801743
$$ packed form
3858A6807064n94303n61360n14202n00335n16536m55841l68434m32639l67150
3849A2496264l51550l27054k33386k84101k92307k97581k75163k39965k14439
3840I980718j94263k41939j39727j53577j94805j65602n7658p2719q8117j03521
3830H568790j16428j16176p0816j0015N736k7853o5060p2828j3842j5877j7682
3819H047949r788k0999L5753K5985K9928m102O324N6889R301k5602J6718o823
3807H161533K2430L0953M4573K1309N3192L9689n640k612M938O0525k1775L0059
3795H439174L7189n023K9205Q4770N0204Q044k1446N0150L3435L7510J07332N4799
3783H905343J07730M6677Q239J16827R1515K5483J36588J11239J18523J33579
$$ plain form
3773 9801743 9954533 10050237 10239140 10431000 10581894 10776296 10973828 11211419 11416780 11564764
3763 11564764 11796863 12032145 12318347 12556298 12777720 13011872 13286650 13589065 13860232
3754 13860232 14149993 14472891 14795421 15084818 15441423 15835713 16255624 16702766 17085116
3745 17085116 17510114 17990457 18342132 18783310 19266670 19780350 20269981 20838836 21446609
3736 21446609 22042677 22713309 23386254 24012842 24724786 25449990 26157261 26950044 27778472
3727 27778472 28640641 29510508 30403992 31319967 32297968 33430961 34564948 35734599 37026799
3718 37026799 38469178 40025709 41752308 43635121 45665308 47970795 50605201 53595359
3710 53595359 56931833 60674830 64786423 69314686 74388854 79837571 85753417 92031446
$$ packed form
3773I801743J52790R5704J88903J91860J50894J94402J97532K37591K05361J47984
3763A1564764K32099K35282K86202K37951K21422K34152K74778L02415K71167
3754A3860232K89761L22898L22530K89397L56605L94290M19911M47142L82350
3745A7085116M24998M80343L51675M41178M83360N13680M89631N68855O07773
3736B1446609N96068O70632O72945O26588P11944P25204P07271P92783Q28428
3727B7778472Q62169Q69867Q93484R15975R78001J132993J133987J169651J292200
3718C7026799J442379J556531J726599J882813K030187K305487K634406K990158
3710E3595359L336474L742997M111593M528263N074168N448717N915846O278029
$$ plain form
3702 92031446 98628623 105593729 112691242 119800925 126808970 133540481 139826900 145457557
3694 145457557 150148747 153724421 156159810 157545381 157967339 157662147 156792947 155574437
3686 155574437 154131129 152503052 150730947 148737530 146394385 143604492 140206140 136164243
3678 136164243 131377462 125724236 119358510 112389590 104983336 97526142 90250617 83302472
3670 83302472 76835246 70876906 65601538 60977303 56805438 53145627 49960637 47108614
3662 47108614 44429113 42134951 40029238 38148874 36454557 34930249 33542906 32284172
3654 32284172 31073386 30031593 29109007 28224997 27444053 26704189 26098833 25531852 24973713
3645 24973713 24503131 24092875 23730754 23370623 23072355 22811004 22540826 22341437 22105192
$$ packed form
3702I2031446O597177O965106P097513P109683P008045O731511O286419N630657
3694A45457557M691190L575674K435389J385571M21958l05192q69200j218510
3686A55574437j443308j628077j772105j993417k343145k789893l398352m041897
3678A36164243m786781n653226o365726o968920p406254p457194p275525o948145
3670H3302472o467226n958340n275368m624235m171865l659811l184990k852023
3662D7108614k679501k294162k105713j880364j694317j524308j387343j258734
3654C2284172j210786j041793r22586q84010p80944p39864o05356n66981n58139
3645B4973713m70582m10256l62121l60131k98268k61351k70178j99389k36245
$$ plain form
3636 22105192 21920170 21819176 21673801 21543469 21521771 21500761 21503017 21482042 21472995 21487749 21527004
3625 21527004 21541324 21554617 21618600 21749859 21867837 21997770 22162701 22308724 22426582 22639404
3615 22639404 22839170 23082221 23352354 23661639 24022881 24346682 24721021 25227916 25670826
3606 25670826 26159084 26664148 27192065 27823206 28467950 29126923 29835465 30601228 31359455
3597 31359455 32104790 32900984 33709692 34492350 35335493 36278924 37157597 38081048 39018600
3588 39018600 40002046 41026711 42011059 43056666 44068271 45094463 46143701 47126255 48089710
3579 48089710 49025874 49911320 50860651 51765282 52687075 53656685 54617525 55596402 56526678
3570 56526678 57491624 58437226 59431832 60477880 61488712 62550248 63565164 64723641 65963541
$$ packed form
3636B2105192j85022j00994j45375j30332k1698k1010K256k0975r047J4754L9255
3625B1527004J4320J3293O3983J31259J17978J29933J64931J46023J17858K12822
3615B2639404J99766K43051K70133L09285L61242L23801L74339N06895M42910
3606B5670826M88258N05064N27917O31141O44744O58973P08542P65763P58227
3597C1359455P45335P96194Q08708P82658Q43143R43431Q78673R23451R37552
3588C9018600R83446J024665R84348J045607J011605J026192J049238R82554R63455
3579D8089710R36164Q85446R49331R04631R21793R69610R60840R78877R30276
3570E6526678R64946R45602R94606J046048J010832J061536J014916J158477J239900
$$ plain form
3561 65963541 67153383 68417883 69796327 71244243 72844599 74635467 76544568 78637628
3553 78637628 80894115 83372202 86174658 89252010 92668090 96460764 100582439 105128985
3545 105128985 110194101 115669295 121737532 128236950 135337612 142935923 151012368 159542088
3537 159542088 168401799 177602599 187064677 196595716 206062179 215460606 224350120 232672179
3529 232672179 240293071 247191366 253394616 258934132 263916297 268375928 272386843 276150612
3521 276150612 279655784 282766235 285364609 287459592 288879413 289568497 289400166 288270684
3513 288270684 286240466 283187853 279189056 274345210 269111011 263642878 258098890 252596120
3505 252596120 247222188 241976032 236691567 231319032 225891549 220303586 214528666 208507973
$$ packed form
3561F5963541J189842J264500J378444J447916J600356J790868J909101K093060
3553G8637628K256487K478087K802456L077352L416080L792674M121675M546546
3545A05128985N065116N475194O068237O499418P100662P598311Q076445Q529720
3537A59542088Q859711R200800R462078R531039R466463R398427Q889514Q322059
3529B32672179P620892O898295O203250N539516M982165M459631M010915L763769
3521B76150612L505172L110451K598374K094983J419821O89084j68331j129482
3513B88270684k030218l052613l998797m843846n234199n468133n543988n502770
3505B52596120n373932n246156n284465n372535n427483n587963n774920o020693
$$ plain form
3497 208507973 202306283 196025663 189659951 183254990 176864976 170648363 164547915 158620523
3489 158620523 152915267 147416560 142132934 137047546 132180851 127450396 122910401 118637660
3481 118637660 114608776 110907635 107532799 104458169 101745274 99509191 97673565 96220246
3473 96220246 95070873 94132702 93456516 92895381 92310596 91759235 91172027 90479608 89633838
3464 89633838 88689870 87586834 86382713 85128916 83767167 82372376 81058870 79684429
3456 79684429 78281040 76749203 75159541 73483957 71581922 69521554 67313835 64920263
3448 64920263 62503247 59998059 57567486 55173574 52818787 50707371 48601033 46632833
3440 46632833 44774094 43097351 41508848 39973371 38509955 37174570 35977454 34793883
$$ packed form
3497B08507973o201690o280620o365712o404961o390014o216613o100448n927392
3489A58620523n705256n498707n283626n085388m866695m730455m539995m272741
3481A18637660m028884l701141l374836l074630k712895k236083j835626j453319
3473I6220246j149373r38171o76186n61135n84785n51361n87208o92419q45770
3464H9633838r43968j103036j204121j253797j361749j394791j313506j374441
3456G9684429j403389j531837j589662j675584j902035k060368k207719k393572
3448F4920263k417016k505188k430573k393912k354787k111416k106338j968200
3440D6632833j858739j676743j588503j535477j463416j335385j197116j183571
$$ plain form
3432 34793883 33587035 32486463 31445802 30397427 29397799 28453615 27473146 26472221 25525423
3423 25525423 24626535 23756382 22914309 22180019 21491983 20820340 20177946 19602290 19004250
3414 19004250 18482784 18050042 17508584 17116085 16724911 16265483 15936112 15557023 15162841
3405 15162841 14848445 14512758 14208422 13967095 13685006 13402054 13167225 12916356 12700480
3396 12700480 12516542 12311550 12086720 11905354 11706713 11504921 11317901 11122679 10897831
3387 10897831 10791957 10577327 10373241 10263453 10057733 9915114 9759622 9610495 9422940
3378 9422940 9284844 9118309 9035213 8905024 8774337 8684947 8627185 8511603 8401514 8314021
3368 8314021 8238237 8176427 8065437 8016587 7868865 7759586 7741902 7756923 7644493 7592215 7574730
$$ packed form
3432C4793883j206848j100572j040661j048375r99628r44184r80469j000925r46798
3423B5525423q98888q70153q42073p34290o88036o71643o42394n75656n98040
3414A9004250n21466m32742n41458l92499l91174m59428l29371l79089l94182
3405A5162841l14396l35687l04336k41327k82089k82952k34829k50869k15876
3396A2700480j83938k04992k24830j81366j98641k01792j87020j95222k24848
3387A0897831j05874k14630k04086j09788k05720j42619j55492j49127j87555
3378I422940j38096j66535q3096j30189j30687q9390n7762j15582j10089q7493
3368H314021p5784o1810j10990m8850j47722j09279j7684J5021j12430n2278j7485
$$ plain form
3357 7574730 7475143 7402080 7316358 7277056 7274201 7207408 7204204 7177048 7134595 7064922 7026751 7024059
3345 7024059 6998129 6943005 6877251 6840888 6823610 6787135 6769010 6752457 6754783 6726200 6724565 6696081
3333 6696081 6648523 6646363 6655064 6704847 6670243 6624567 6612000 6615653 6642975 6628337 6570630 6539066
3321 6539066 6513417 6551915 6545277 6539526 6515043 6455463 6496042 6560197 6510073 6535401 6530063 6579157
3309 6579157 6608473 6565693 6573254 6567061 6550530 6546399 6574158 6585176 6575502 6629171 6691337 6701517
3297 6701517 6672257 6742189 6827734 6851602 6839853 6824361 6849783 6915147 6934822 6956991 6958675 6942054
3285 6942054 6937605 7000698 7074192 7111139 7182754 7252301 7241426 7376955 7437714 7416643 7441155
3274 7441155 7433856 7528066 7609427 7617482 7607376 7672320 7689837 7768366 7791824 7816675 7921000 8044591
$$ packed form
3357G574730r9587p3063q5722l9302k855o6793l204k7156m2453o9673l8171k692
3345G024059k5930n5124o5754l6363j7278l6475j8125j6553K326k8583j635k8484
3333F696081m7558k160Q701M9783l4604m5676j2567L653K7322j4638n7707l1564
3321F539066k5649L8498o638n751k4483n9580M0579O4155n0124K5328n338M9094
3309F579157K9316m2780P561o193j6531m131K7759J1018r674N3669O2166J0180
3297F701517k9260O9932Q5545K3868j1749j5492K5422O5364J9675K2169J684j6621
3285F942054m449O3093P3494L6947P1615O9547j0875J35529O0759k1071K4512
3274G441155p299R4210Q1361Q055j0106O4944J7517P8529K3458K4851J04325J23591
$$ plain form
3262 8044591 8087416 8174589 8200333 8207982 8312539 8364081 8475564 8575801 8639173 8796200 8878907
3251 8878907 8906241 8961482 9117733 9152053 9165361 9278609 9411727 9526279 9601145 9608117 9662785
3240 9662785 9811731 9940200 9985787 10037974 10203713 10264465 10296733 10352359 10436160 10504979 10523581
3229 10523581 10561097 10642633 10646966 10689631 10780024 10837716 10860651 10896363 10902482 10940837 10942441 10874359
3217 10874359 10876737 10851274 10906099 10971677 10997513 11033319 11026054 10958529 10996112 11012585 11006419 10982335
3205 10982335 11000788 11057548 10970061 11069751 11176459 11178097 11153813 11198326 11306708 11389027 11418666
3194 11418666 11452295 11533448 11649687 11761443 11858126 11988906 12088288 12228590 12346602 12456475
3184 12456475 12559908 12633882 12765724 12831889 12851428 12802030 12729359 12687847 12584687 12437823
$$ packed form
3262H044591M2825Q7173K5744P649J04557N1542J11483J00237O3372J57027Q2707
3251H878907K7334N5241J56251L4320J3308J13248J33118J14552P4866O972N4668
3240I662785J48946J28469M5587N2187J65739O0752L2268N5626Q3801O8819J8602
3229A0523581L7516Q1536M333M2665R0393N7692K2935L5712O119L8355J604o8082
3217A0874359K378k5463N4825O5578K5836L5806p265o7525L7583J6473o166k4084
3205A0982335J8453N6760q7487R9690J06708J638k4284M4513J08382Q2319K9639
3194A1418666L3629Q1153J16239J11756R6683J30780R9382J40302J18012J09873
3184A2456475J03433P3974J31842O6165J9539m9398p2671m1512j03160j46864
$$ plain form
3174 12437823 12281540 12160496 11916348 11772986 11585627 11407136 11264834 11053719 10848305
3165 10848305 10639610 10406108 10183297 9948603 9700919 9423768 9194003 8970307 8764295
3156 8764295 8629555 8472461 8224487 8064226 7924829 7772491 7599215 7438304 7287695 7101469
3146 7101469 6981449 6882003 6833627 6708540 6580301 6486626 6408507 6322957 6260755 6215794 6184073
3135 6184073 6100532 5971178 5845735 5780724 5681082 5610247 5557469 5480910 5357018 5262343 5235560
3124 5235560 5145547 5039291 4997797 4921205 4877996 4834578 4766828 4664931 4583365 4555690 4542977
3113 4542977 4527900 4471212 4395113 4365124 4318579 4299072 4205683 4147777 4089638 4062100 4041187
3102 4041187 4026515 4025494 3960311 3915507 3867618 3822304 3794072 3720408 3683058 3681040 3665835 3608195
$$ packed form
3174A2437823j56283j21044k44148j43362j87359j78491j42302k11115k05414
3165A0848305k08695k33502k22811k34694k47684k77151k29765k23696k06012
3156H764295j34740j57094k47974j60261j39397j52338j73276j60911j50609j86226
3146G101469j20020r9446m8376j25087j28239r3675p8119q5550o2202m4961l1721
3135F184073q3541j29354j25443o5011r9642p0835n2778p6559j23892r4675k6783
3124E235560r0013j06256m1494p6592m3209m3418o7750j01897q1566k7675j2713
3113D542977j5077n6688p6099k9989m6545j9507r3389n7906n8139k7538k0913
3102D041187j4672j021o5183m4804m7889m5314k8232p3664l7350k018j5205n7640
$$ plain form
3090 3608195 3527968 3496776 3479457 3480877 3473169 3452301 3365263 3344967 3325714 3282624 3271662 3205795
3078 3205795 3226030 3222812 3164189 3128245 3121448 3164696 3099668 3060142 3055337 2982771 2963022 2901278
3066 2901278 2845360 2792992 2853987 2851011 2818207 2864879 2847624 2837112 2837919 2800253 2774629 2748657
3054 2748657 2734112 2766247 2785974 2818739 2743028 2730923 2723216 2669475 2574988 2528287 2487816 2475261
3042 2475261 2442602 2428893 2379609 2378720 2385972 2349155 2298879 2305775 2300287 2318388 2369080 2357292
3030 2357292 2321874 2324962 2275728 2286962 2263029 2286279 2335097 2320741 2308303 2221219 2183218 2156665
3018 2156665 2113654 2103648 2118647 2080976 2002614 2007171 1941798 1905059 1875695 1852615 1820919 1818631
3006 1818631 1833890 1842727 1826039 1815707 1807805 1785292 1776048 1748319 1765877 1753975 1729244 1673547
$$ packed form
3090C608195q0227l1192j7319J420p708k0868q7038k0296j9253m3090j0962o5867
3078C205795K0235l218n8623l5944o797M3248o5028l9526m805p2566j9749o1744
3066B901278n5918n2368O0995k976l2804M6672j7255j0512Q07l7666k5624k5972
3054B748657j4545L2135J9727L2765p5711j2105p707n3741r4487m6701m0471j2555
3042B475261l2659j3709m9284q89P252l6817n0276O896n488J8101N0692j1788
3030B357292l5418L088m9234J1234k3933K3250M8818j4356j2438q7084l8001k6553
3018B156665m3011j0006J4999l7671p8362M557o5373l6739k9364k3080l1696k288
3006A818631J5259Q837j6688j0332p902k2513r244k7729J7558j1902k4731n5697
$$ plain form
2994 1673547 1688753 1665862 1592075 1568432 1597085 1597619 1573867 1558000 1589337 1576627 1527473 1517893
2982 1517893 1553859 1536108 1564796 1603156 1617665 1635878 1658837 1629043 1572861 1531566 1579977
2971 1579977 1553769 1514219 1511339 1533764 1583151 1603011 1588724 1583009 1595884 1592916 1576139 1592142
2959 1592142 1585034 1584044 1596522 1629616 1598673 1620054 1628298 1631237 1653888 1692195 1766269 1714115
2947 1714115 1705282 1731101 1695390 1740309 1753742 1771681 1793664 1833328 1859604 1868740 1969760 2009246
2935 2009246 2123520 2139421 2148085 2202772 2274501 2291820 2345248 2405561 2456147 2466854 2517076
2924 2517076 2533809 2518043 2598053 2629063 2625617 2573081 2612123 2579733 2562515 2524412 2501743 2485382
2912 2485382 2493103 2483709 2500194 2491768 2461908 2479817 2557946 2587163 2681934 2751229 2713408 2784631
$$ packed form
2994A673547J5206k2891p3787k3643K8653N34k3752j5867L1337j2710m9154r580
2982A517893L5966j7751K8688L8360J4509J8213K2959k9794n6182m1295M8411
2971A579977k6208l9550k880K2425M9387J9860j4287n715J2875k968j6777J6003
2959A592142p108r90J2478L3094l0943K1381Q244K939K2651L8307P4074n2154
2947A714115q833K5819l5711M4919J3433J7939K1983L9664K6276R136J01020L9486
2935B009246J14274J5901Q664N4687P1729J7319N3428O0313N0586J0707N0222
2924B517076J6733j5766Q0010L1010l446n2536L9042l2390j7218l8103k2669j6361
2912B485382P721r394J6485q426k9860J7909P8129K9217R4771O9295l7821P1223
$$ plain form
2900 2784631 2906261 2970202 3076518 3237428 3344224 3487009 3584385 3634298 3731249 3851497
2890 3851497 3879216 3885938 3963327 4042527 4035118 4031647 3984040 3912563 3806282 3772946 3664919 3648073
2878 3648073 3571714 3526249 3440105 3464158 3428004 3327429 3327083 3405755 3439006 3481273 3518765 3548938
2866 3548938 3614376 3736352 3865638 3874400 3945486 4017802 4125967 4174668 4264862 4325857 4332197
2855 4332197 4356695 4398170 4450974 4463953 4420354 4424907 4370084 4344365 4348731 4276387 4254380 4216020
2843 4216020 4194237 4230633 4219525 4263583 4319883 4363064 4396674 4375741 4452889 4465996 4465062 4465303
2831 4465303 4421954 4323078 4197031 4034476 3842030 3706273 3508989 3385641 3227079 3091287
2821 3091287 2898779 2793061 2763796 2717310 2716058 2723163 2649774 2570210 2551744 2553886 2545419 2558221
$$ packed form
2900B784631J21630O3941J06316J60910J06796J42785R7376M9913R6951J20248
2890C851497K7719O722P7389P9200p409l471m7607p1477j06281l3336j08027j6846
2878C648073p6359m5465q6144K4053l6154j00575l46P8672L3251M2267L7492L0173
2866C548938O5438J21976J29286Q762P1086P2316J08165M8701R0194O0995O340
2855D332197K4498M1475N2804J2979m3599M553n4823k5719M366p2344k2007l8360
2843D216020k1783L6396j1108M4058N6300M3181L3610k0933P7148J3107r34K41
2831D465303m3349r8876j26047j62555j92446j35757j97284j23348j58562j35792
2821C091287j92508j05718k9265m6486j252P105p3389p9564j8466K142q467J2802
$$ plain form
2809 2558221 2484835 2432975 2446306 2403982 2402798 2434795 2420933 2383969 2353819 2286855 2268818 2216424
2797 2216424 2107254 2090398 2027800 1923689 1801526 1743532 1692972 1640790 1594906 1514954 1484837
2786 1484837 1488119 1434065 1338823 1362362 1406490 1291842 1283685 1199060 1207881 1235247 1150534 1085338
2774 1085338 1015183 1088484 1017956 948806 932037 879881 872826 856176 852651 822929 835727 823971
2762 823971 805125 806337 734348 732331 741584 694924 705994 727115 680393 756148 731545 695813
2750 695813 672263 651878 707816 689337 629671 644011 655298 630201 609017 624180 633070 636063
2738 636063 638821 612184 565109 530022 563941 574865 515763 564754 525763 582783 511880 510023
2726 510023 555545 593350 594106 546468 488280 480967 481600 456608 500488 495470 488697 475672 471521
$$ packed form
2809B558221p3386n1860J3331m2324j184L1997j3862l6964l0150o6964j8037n2394
2797B216424j09170j6856o2598j04111j22163n7994n0560n2182m5884p9952l0117
2786A484837L282n4054r5242K3539M4128j14648q157q4625Q821K7366q4713o5196
2774A085338p0155P3301p0528o9150j6769n2156p055j6650l525k9722J2798j1756
2762H23971j8846J212p1989k017R253m6660J1070K1121m6722P5755k4603l5732
2750F95813k3550k0385N5938j8479n9666J4340J1287k5097k1184J5163Q890K993
2738F36063K758k6637m7075l5087L3919J0924n9102M8991l8991N7020p0903j857
2726E10023M5522L7805P56m7638n8188p313O33k4992M3880n018o773j3025m151
$$ plain form
2713 471521 465955 445909 473160 500857 445339 461939 436382 485164 485675 443392 422881 436515
2701 436515 472794 369951 407997 463801 420233 382331 364152 363339 363564 416653 371863 370611
2689 370611 362918 412952 424980 409754 416404 398863 392793 371725 385821 393662 337177 374777
2677 374777 351540 377133 349994 311618 329938 360346 313615 370997 413291 334995 329109 331360
2665 331360 357108 334547 310144 291897 296858 348830 381565 325243 340701 344406 369800 384254
2653 384254 352730 381943 364904 357637 356871 363285 387672 370333 320253 320862 324667 385256 415842
2640 415842 380019 402971 363501 328367 412666 420541 393390 349729 345982 370138 339615 323868
2628 323868 313774 353041 363985 379195 385804 386935 334422 344872 368528 361933 304856 331554
$$ packed form
2713D71521n566k0046K7251K7697n5518J6600k5557M8782N11m2283k0511J3634
2701D36515L6279j02843L8046N5804m3568l7902j8179q13K25N3089m4790j252
2689C70611p693N0034J2028j5226O650j7541o070k1068J4096P841n6485L7600
2677C74777k3237K5593k7139l8376J8320L0408m6731N7382M2294p8296n886K251
2665C31360K5748k2561k4403j8247M961N1972L2735n6322J5458L705K5394J4454
2653C84254l1524K9213j7039p267p66O414K4387j7339n0080O09L805O0589L0586
2640D15842l5823K2952l9470l5134Q4299P875k7151m3661l747K4156l0523j5747
2628C23868j0094L9267J0944J5210O609J131n2513J0450K3656o595n7077K6698
$$ plain form
2616 331554 378081 326242 328195 312290 337134 375701 361012 339145 333240 395247 447038 441380
2604 441380 405086 394619 433759 416497 419996 447028 418072 424888 471542 450869 415325 450347
2592 450347 441025 426501 441205 471438 521266 532191 528603 523943 535679 546896 596755 640743
2580 640743 566443 562667 601453 616672 610334 593780 642515 602673 635585 678890 713387 726464
2568 726464 712731 693708 700843 724940 691402 718744 759380 808214 785276 795406 796812 792736
2556 792736 818970 861799 848468 882091 905771 884738 862895 911434 923085 934783 941875 964874
2544 964874 980053 1052026 1144154 1100530 1064893 1083391 1064405 1080758 1082825 1087530 1138600 1088076
2532 1088076 1070005 1055658 1078324 1090592 1094468 1117169 1130570 1170944 1152282 1150706 1169159 1164406
$$ packed form
2616C31554M6527n1839J953j5905K4844L8567j4689k1867n905O2007N1791n658
2604D41380l6294j0467L9140j7262L499K7032k8956O816M6654k0673l5544L5022
2592D50347r322j4524J4704L0233M9828J0925l588m660J1736J1217M9859M3988
2580F40743p4300l776L8786J5219o338j6554M8735l9842L2912M3305L4497J3077
2568G26464j3733j9023P135K4097l3538K7342M0636M8834k2938J0130J406m076
2556G92736K6234M2829j3331L3623K3680k1033k1843M8539J1651J1698P092K2999
2544I64874J5179P1973R2128m3624l5637J8498j8986J6353K067M705N1070n0524
2532A088076j8071j4347K2666J2268L876K2701J3401M0374j8662j576J8453m753
$$ plain form
2520 1164406 1169926 1186861 1273613 1296044 1231803 1199980 1171936 1222551 1281556 1279602 1310073 1319585
2508 1319585 1376703 1353316 1292150 1296855 1298926 1296264 1307934 1242827 1182681 1197657 1171830 1156425
2496 1156425 1138327 1146274 1137708 1126642 1114016 1109025 1035315 988256 994810 1008388 1083278 1069743
2484 1069743 1012866 962561 972657 971513 1032940 1010183 1028046 984032 1018171 995298 990615 1014111
2472 1014111 1007524 1004137 928534 858302 855724 839249 823090 790466 729017 754234 728884 687058
2460 687058 619384 623045 666472 648443 632063 621242 593683 579866 586057 538153 515265 508245
2448 508245 482795 454780 403320 428011 436516 461834 406774 428453 476379 448857 472172 452051
2436 452051 452380 418801 368396 355725 313877 335331 338140 414694 339930 300273 247942 245040
$$ packed form
2520A164406N520J6935Q6752K2431o4241l1823k8044N0615N9005j954L0471R512
2508A319585N7118k3387o1166M705K071k662J1670o5107o0146J4976k5827j5405
2496A156425j8098P947q566j1066j2626m991p3710m7059O554J3578P4890j3535
2484A069743n6877n0305J0096j144O1427k2757J7863m4014L4139k2873m683K3496
2472A014111o587l387p5603p0232k578j6475j6159l2624o1449K5217k5350m1826
2460F87058o7674L661M3427j8029j6380j0821k7559j3817O191m7904k2888p020
2448E08245k5450k8015n1460K4691Q505K5318n5060K1679M7926k7522K3315k0121
2436D52051L29l3579n0405j2671m1848K1454K809P6554p4764l9657n2331k902
$$ plain form
2424 245040 287205 276458 274549 255180 248918 214458 247558 208051 241874 262880 230485 223341
2412 223341 233504 205785 205794 241769 216233 221909 177582 130624 126405 141056 161511 195790 244479
2399 244479 221248 123359 59288 81452 112632 143606 133172 156544 185798 148390 145504 140610
2387 140610 112946 124710 161360 138904 88707 66213 128558 172358 189627 178906 133234 122423
2375 122423 172837 132890 146134 138740 124881 129870 107841 144146 144789 176411 116110 106836 100269
2362 100269 108493 81990 99277 114778 107166 80735 61844 123969 131476 131020 122841 99163 62413
2349 62413 55129 97531 168227 195767 228396 152803 143186 157943 135207 128854 105128 116522
2337 116522 161077 170689 121391 161604 123173 135531 174918 206591 181666 86499 95585 116439
$$ packed form
2424B45040M2165j0747j909j9369o262l4460L3100l9507L3823K1006l2395p144
2412B23341J0163k7719RL5975k5536N676m4327m6958m219J4651K0455L4279M8689
2399B44479k3231r7889o4071K2164L1180L0974j0434K3372K9254l7408k886m894
2387A40610k7664J1764L6650k2456n0197k2494O2345M3800J7269j0721m5672j0811
2375A22423N0414l9947J3244p394j3859M989k2029L6305O43L1622o0301r274o567
2362A00269Q224k6503J7287J5501p612k6431j8891O2125P507m56q179k3678l6750
2349F2413p284M2402P0696K7540L2629p5593r617J4757k2736o353k3726J1394
2337A16522M4555R612m9298M0213l8431J2358L9387L1673k4925r5167R086K0854
$$ plain form
2325 116439 127140 126479 162085 196344 151649 117071 97857 97957 103123 83092 96328 103285 127341
2312 127341 130280 151544 152401 152502 174835 189834 181561 128442 120114 141717 167728 188739 198076
2299 198076 199283 177799 114267 138614 237769 221657 175013 136936 111923 121890 113610 102783
2287 102783 125703 142346 166709 170363 79410 53180 90211 111460 74118 100471 128141 148688
2275 148688 119951 134619 75136 67323 135659 156266 115272 57762 77223 119035 147205 141676
2263 141676 111518 58936 76145 85852 83555 95101 118751 70844 99687 80060 49165 46018
2251 46018 46778 97819 125958 164360 156488 130223 137872 114370 51983 122136 84531 60931 75929
2238 75929 93773 129035 76578 66307 143026 188118 173551 158665 111194 112348 124991 70904
$$ packed form
2325A16439J0701o61L5606L4259m4695l4578j9214J00N166k0031J3236O957K4056
2312A27341K939K1264Q57J01K2333J4999q273n3119q328K1603K6011K1011R337
2299A98076J207k1484o3532K4347R9155j6112m6644l8077k5013R967q280j0827
2287A02783K2920J6643K4363L654r0953k6230L7031K1249l7342K6353K7670K0547
2275A48688k8737J4668n9483p813O8336K0607m0994n7510J9461M1812K8170n529
2263A41676l0158n2582J7209R707k297J1546K3650m7907K8843j9627l0895l147
2251D6018P60N1041K8139L8402p872k6265P649k3502o2387P0153l7605k3600J4998
2238G5929J7844L5262n2457j0271P6719M5092j4567j4886m7471J154J2643n4087
$$ plain form
2226 70904 66283 89536 72239 92940 28900 62398 71146 69717 80428 138242 127059 116161
2214 116161 125869 163288 161438 169428 142632 129366 148384 109089 129424 166416 185420 142684
2202 142684 175630 205545 155605 122815 167510 188518 150166 123417 100532 148752 162943 129556
2190 129556 146785 123192 143767 121146 103079 121928 133378 82367 92046 108274 124586 80486
2178 80486 79625 146979 153576 152725 140007 113285 96920 85553 148516 137722 129395 125868 137645
2165 137645 72714 74014 132606 168297 191074 164945 164239 201496 211537 163000 154050 128911
2153 128911 199524 212202 228206 183901 158313 160290 98397 182681 233419 221676 237448 210973
2141 210973 226768 238923 251398 255334 271204 241833 241896 191002 226857 230856 211839 268112 250814
$$ packed form
2226G0904m621K3253j7297K0701o4040L3498Q748j429J0711N7814j1183j0898
2214A16161R708L7419j850P990k6796j3266J9018l9295K0335L6992J9004m2736
2202A42684L2946K9915m9940l2790M4695K1008l8352k6749k2885M8220J4191l3387
2190A29556J7229k3593K0575k2621j8067J8849J1450n1011R679J6228J6312m4100
2178H0486q61O7354O597q51j2718k6722j6365j1367O2963j0794q327l527J1777
2165A37645o4931J300N8592L5691K2777k6129p06L7257J0041m8537q950k5139
2153A28911P0613J2678J6004m4305k5588J977o1893Q4284N0738j1743J5772k6475
2141B10973J5795J2155J2475L936J5870k9371O3n0894L5855L999j9017N6273j7298
$$ plain form
2128 250814 256338 232466 255732 313062 302584 296723 286479 334597 357966 378957 376146 375817 372499
2115 372499 428046 436588 443232 431562 455484 505960 500362 514075 537035 577049 572880 553008
2103 553008 597470 648460 726504 760488 768970 810750 836840 907942 894786 930617 916078 927678
2091 927678 941540 875996 922236 951521 898513 924760 925674 916359 914279 971737 955256 995886
2079 995886 1019016 1025679 1105913 1181784 1210340 1233836 1220421 1232236 1224041 1243206 1286204 1390026
2067 1390026 1417205 1421451 1490352 1551939 1595701 1640240 1699503 1763406 1854697 1899367 1946646 2042276
2055 2042276 2135359 2221582 2341885 2465230 2553146 2648329 2873236 3156525 3377518 3630356
2045 3630356 3969093 4420569 4913115 5383609 5908856 6464085 7283344 8092470 8787495 9617255
$$ packed form
2128B50814N524k3872K3266N7330j0478n861j0244M8118K3369K0991k811l29l318
2115C72499N5547Q542O644j1670K3922N0476n598J3713K2960M0014m169j9872
2103E53008M4462N0990P8044L3984Q482M1780K6090P1102j3156L5831j4539J1600
2091I27678J3862o5544M6240K9285n3008K6247R14r315k080N7458j6481M0630
2079I95886K3130O663Q0234P5871K8556K3496j3415J1815q195J9165M2998J03822
2067A390026K7179M246O8901O1587M3762M4539N9263O3903R1291M4670M7279R5630
2055B042276R3083Q6223J20303J23345Q7916R5183K24907K83289K20993K52838
2045C630356L38737M51476M92546M70494N25247N55229Q19259Q09126O95025Q29760
$$ plain form
2035 9617255 10316465 10914460 11584289 12083959 12607807 13037959 13138585 12348660 11046588
2026 11046588 9813529 8637564 7534138 6495049 5649183 4980808 4507187 4096661 3812893
2017 3812893 3541050 3267956 3062244 2860124 2651526 2472100 2266781 2098717 1992698 1813169
2007 1813169 1674021 1618713 1552918 1392993 1266198 1251183 1204568 1172327 1077286 1045190 1016674
1996 1016674 894317 874004 852274 869240 854112 756520 706525 719525 716575 668372 628534
1985 628534 662326 626532 608713 666910 617518 602349 511361 464150 491061 550550 536402 477360
1973 477360 455648 467106 418597 376541 406138 419458 434933 406162 329187 294528 371935 380392
1961 380392 364083 293323 278118 294607 320366 293421 325337 351180 385286 334114 310193 285121
$$ packed form
2035I617255O99210N97995O69829M99670N23848M30152J00626p89925j302072
2026A1046588j233059j175965j103426j039089q45866o68375m73621m10526k83768
2017C812893k71843k73094k05712k02120k08598j79426k05319j68064j06019j79529
2007A813169j39148n5308o5795j59925j26795j5015m6615l2241r5041l2096k8516
1996A016674j22357k0313k1730J6966j5128r7592m9995J3000k950m8203l9838
1985F28534L3792l5794j7819N8197m9392j5169r0988m7211K6911N9489j4148n9042
1973D77360k1712J1458m8509m2056K9597J3320J5475k8771p6975l4659P7407Q457
1961C80392j6309p0760j5205J6489K5759k6945L1916K5843L4106n1172k3921k5072
$$ plain form
1949 285121 270387 251158 250783 249896 229134 185378 199224 228054 242839 257468 216633 249216
1937 249216 209504 187972 151821 187761 202289 233562 225936 165361 186227 183743 235205 190195
1925 190195 158350 194784 170679 149569 135292 99135 88437 172623 155637 199140 198927 173865
1913 173865 161779 143124 124175 122757 134633 114148 130402 143371 158616 190669 138898 103926
1901 103926 122877 59692 36542 64257 65849 119110 148146 148973 96085 60965 81293 61925
1889 61925 82358 121730 130648 129080 163080 162523 107366 140465 124277 145144 107014 63452 60764
1876 60764 105882 74344 94499 109786 55734 23571 56252 46325 -27013 26482 43125 70498
1864 70498 82409 36633 25001 51131 91841 78546 61907 65663 47785 63288 75539 61956
$$ packed form
1949B85121j4734j9229l75q87k0762m3756J3846K8830J4785J4629m0835L2583
1937B49216l9712k1532l6151L5940J4528L1273p626o0575K0866k484N1462m5010
1925A90195l1845L6434k4105k1110j4277l6157j0698Q4186j6986M3503k13k5062
1913A73865j2086j8655j8949j418J1876k0485J6254J2969J5245L2053n1771l4972
1901A03926J8951o3185k3150K7715J592N3261K9036Q27n2888l5120K0328j9368
1889F1925K0433L9372Q918j568L4000n57n5157L3099j6188K0867l8130m3562k688
1876F0764M5118l1538K0155J5287n4052l2163L2681r927p3338N3495J6643K7373
1864G0498J1911m5776j1632K6130M0710j3295j6639L756j7878J5503J2251j3583
$$ plain form
1852 61956 68405 60849 87000 62058 64466 66532 79529 64625 54717 140113 130847 72271 58946
1839 58946 70631 40309 58899 42274 93850 91656 90618 97643 109620 163474 179111 154257
1827 154257 183646 66907 78500 69373 50904 -8679 20543 65928 25933 4837 33483 17364
1815 17364 42547 74599 58750 71003 43708 46029 28601 52355 10852 32391 19103 52053
1803 52053 89009 97978 114450 69362 54880 7647 3083 40703 40199 52774 35000 62975 71571
1790 71571 88542 40066 20400 31392 44655 72280 62576 33302 44722 104337 55381 5339
1778 5339 21251 86793 117039 99626 118360 111983 72643 103140 129353 133325 100847 82264
1766 82264 103084 124473 104040 72535 98926 150820 164387 90219 57322 61423 59920 93035
$$ packed form
1852F1956O449p556K6151k4942K408K066J2997j4904r908Q5396r266n8576j3325
1839E8946J1685l0322J8590j6625N1576k194j038P025J1977N3854J5637k4854
1827A54257K9389j16739J1593r127j8469n9583K9222M5385l9995k1096K8646j6119
1815A7364K5183L2052j5849J2253k7295K321j7428K3754m1503K1539j3288L2950
1803E2053L6956Q969J6472m5088j4482m7233m564L7620n04J2575j7774K7975Q596
1790G1571J6971m8476j9666J0992J3263K7625r704k9274J1420N9615m8956n0042
1778E339J5912O5542L0246j7413J8734o377l9340L0497K6213L972l2478j8583
1766H2264K0820K1389k0433l1505K6391N1894J3567p4168l2897M101j503L3115
$$ plain form
1754 93035 111371 72250 36531 15014 -4149 -19862 -12540 -32639 -21054 4037 55062 6586
1742 6586 23552 36124 38677 48632 42450 34390 23407 32467 29625 -11029 11282 63507 79212
1729 79212 60939 50108 86048 68121 42183 53496 53997 130399 103453 105984 99800 35569 45615
1716 45615 -147 39080 16132 32097 53112 24423 35849 19739 30288 63357 18782 66331
1704 66331 76905 116829 117702 66850 85075 69849 -1619 71069 98823 64694 19616 -17648
1692 -17648 51016 46281 27243 9990 6310 18058 -23673 -11114 22138 32161 51756 87834
1680 87834 84681 9979 -14872 10532 69693 72015 29446 63457 22689 47460 60016 13675
1668 13675 -2738 -41960 -5741 -8416 -15735 -65544 -51972 11165 33384 42418 68155 63870 6505
$$ packed form
1754I3035J8336l9121l5719k1517j9163j5713P322k0099J1585K5091N1025m8476
1742F586J6966J2572K553R955o182q060j0983R060k842m0654K2311N2225J5705
1729G9212j8273j0831L5940j7927k5938J1313N01P6402k6946K531o184o4231J0046
1716D5615m5762L9227k2948J5965K1015k8689J1426j6110J0549L3069m4575M7549
1704F6331J0574L9924Q73n0852J8225j5226p1468P2688K7754l4129m5078l7264
1692a7648O8664m735j9038j7253l680J1748m1731J2559L3252J0023J9595L6078
1680H7834l153p4702k4851K5404N9161K322m2569L4011m0768K4771J2556m6341
1668A3675j6413l9222L6219k675p319m9809J3572O3137K2219R034K5737m285n7365
$$ plain form
1655 6505 21461 27762 6659 37450 11075 14451 29702 46394 48715 24024 66141 12729 -12626
1642 -12626 65790 70018 54132 38702 61137 79110 35076 42822 55784 40363 69032 43841
1630 43841 5673 -26502 -59980 -53438 -18304 -46810 -47602 6332 -24971 -88873 -81133 -18024 -188
1617 -188 25278 31032 28529 89846 82052 26325 -7546 -2920 -199 2413 -23699 -30285 -16387 -28430
1603 -28430 238 7263 -17256 -32266 -44616 -47789 19211 -497 1590 36425 19555 16679 -7489
1590 -7489 40074 13473 -14031 -32720 -32928 -15124 -15984 3303 8190 31298 29682 60763 34072
1577 34072 30597 47253 42699 17861 -275 12612 52867 69677 10639 11457 13696 -25531 -15724
1564 -15724 -11682 18432 -16616 1647 -855 24174 -5774 -29085 4039 39288 51764 54553
$$ packed form
1655F505J4956O301k1103L0791k6375L376J5251J6692K321k4691M2117n3412k5355
1642a2626P8416M228j5886j5430K2435J7973m4034P746J2962j5421K8669k5191
1630D3841l8168l2175l3478O542L5134k8506p92N3934l1303o3902P740O3109J7836
1617a88K5466N754k503O1317p794n5727l3871M626K721K612k6112o586J3898j2043
1603b8430K8668P025k4519j5010j2350l173O7000j9708K087L4835j6870k876k4168
1590g489M7563k6601k7504j8689k08J7804q60J9287M887K3108j616L1081k6691
1577C4072l475J6656m554k4838j8136J2887M0255J6810n9038Q18K239l9227R807
1564a5724M042L0114l5048J8263k502K5029k9948k3311L3124L5249J2476K789
$$ plain form
1552 54553 -8793 -54964 20367 10958 9624 -10201 -15582 22673 14223 19515 54792 8144 -14562
1539 -14562 -22558 34244 31899 16148 -27373 -20609 64856 90112 76326 38658 55522 50653 19014
1526 19014 -18734 9435 13444 -36715 9211 -9831 3376 7734 -14430 33238 72836 39138
1514 39138 41137 -97 -3515 -32583 -45268 -36405 -35067 -16250 -6842 -445 -24717 19891 43431
1501 43431 -16269 5804 43889 45415 42932 30895 47613 -37766 -43734 2726 44659 43693 -32570
1488 -32570 5907 33545 -4744 1581 -8628 1382 -24794 -8221 -2816 -7197 8152 24694
1476 24694 34429 46534 3923 -4808 12160 19691 -33214 -38966 42068 71648 30738 51420 -19811
1463 -19811 -26907 7545 -26277 -36363 -53234 -65608 -17658 38431 73105 67799 18049 -10256
$$ packed form
1552E4553o3346m6171P5331r409j334j9825n381L8255q450N292L5277m6648k2706
1539a4562p996N6802k345j5751m3521O764Q5465K5256j3786l7668J6864m869l1639
1526A9014l7748K8169M009n0159M5926j9042J3207M358k2164M7668L9598l3698
1514C9138J999m1234l418k9068j2685Q863J338J8817R408O397k4272M4608K3540
1501D3431n9700K2073L8085J526k483j2037J6718q5379n968M6460M1933r66p6263
1488c2570L8477K7638l8289O325j0209J0010k6176J6573N405m381J5349J6542
1476B4694R735J2105m2611q731J6968P531n2905n752Q1034K9580m0910K0682p1231
1463a9811p096L4452l3822j0086j6871j2374M7950N6089L4674n306m9750k8305
$$ plain form
1451 -10256 -10443 -5421 -2338 -17876 -62124 -14871 -8672 18149 58248 33041 -8423 3404 23488
1438 23488 35708 46795 41994 6318 -25492 -44137 -42344 8750 82960 8739 -20768 -11121
1426 -11121 -7909 -10979 60201 72270 28951 21362 5505 15421 29995 45308 72339 58938 87143
1413 87143 12757 75711 48338 -17752 54053 35158 -3234 -24115 -21857 4913 25068 2062
1401 2062 16438 -14651 13735 -16100 -1043 69154 73450 65729 82177 81358 83065 59615 17124
1388 17124 -4972 9964 -27463 -35752 17411 60937 26992 -38269 -48487 -50057 -74596 -25270
1376 -25270 24882 -15215 -36252 -16499 -16518 16257 44322 -55795 -17872 1667 -27247 -26684 -51028
1363 -51028 -30162 33392 51814 -4649 -14468 27794 48816 -10553 13110 51647 31301 10782
$$ packed form
1451a0256j87N022L083j5538m4248M7253O199K6821M0099k5207m1464J1827K0084
1438B3488J2220J1087m801l5676l1810j8645J793N1094P4210p4221k9507R647
1426a1121L212l070P1180J2069m3319p589j5857R916J4574J5313K7031j3401K8205
1413H7143p4386O2954k7373o6090P1805j8895l8392k0881K258K6770K0155k3006
1401B062J4376l1089K8386k9835J5057P0197M296p721J6448q19J707k3450m2491
1388A7124k2096J4936l7427q289N3163M3526l3945o5261j0218j570k4539M9326
1376b5270N0152m0097k1037J9753j9L2775K8065j00117L7923J9539k8914N63k4344
1363e1028K0866O3554J8422n6463r819M2262K1022n9369K3663L8537k0346k0519
$$ plain form
1351 10782 6643 1186 2483 23252 35243 -16689 -27604 -2857 48302 25868 17406 43831 20521
1338 20521 -30510 408 23463 -1380 -37525 -36422 -10182 41191 25233 -13887 -11575 59526
1326 59526 93859 55455 31511 -29726 -11367 8930 -7690 -23766 73955 67724 37499 32611
1314 32611 -21874 -32509 3010 33651 18185 5999 -34369 -47127 22399 27981 -36999 890
1302 890 18863 49887 43102 4161 33836 21913 33803 35084 1228 9340 25617 59912 72726
1289 72726 51373 34638 -2828 31659 68044 49597 -11617 13169 66503 27409 14301 35140
1277 35140 31372 -7884 16128 26896 64090 76721 37046 5483 -1546 -2487 -46010 -22134 38464
1264 38464 30172 5211 9031 15315 46538 -12107 -11348 -72730 -72274 -27466 12856 24535 64947
$$ packed form
1351A0782m139n457J297K0769J1991n1932j0915K4747N1159k2434q462K6425k3310
1338B0521n1031L0918K3055k4843l6145J103K6240N1373j5958l9120K312P1101
1326E9526L4333l8404k3944o1237J8359K0297j6620j6076R7721o231l0225m888
1314C2611n4485j0635L5519L0641j5466j2186m0368j2758O9526N582o4980L7889
1302H90J7973L1024o785l8941K9675j1923J1890J281l3856Q112J6277L4295J2814
1289G2726k1353j6735l7466L4487L6385j8447o1214K4786N3334l9094j3108K0839
1277C5140l768l9256K4012J0768L7194J2631l9675l1563p029r41m3523K3876O0598
1264C8464q292k4961L820O284L1223n8645P59o1382M56M4808M0322J1679M0412
$$ plain form
1251 64947 23046 -22783 -36069 -41362 -1505 -23828 -7818 3133 -34095 -46728 7820 11677
1239 11677 -59618 -23018 -30201 -33291 -33355 -57771 -64106 -46459 -46118 6176 15547 95 4352 -17873
1225 -17873 27612 21811 26399 4214 -33258 -78339 -23004 -19567 3828 45803 30683 2336
1213 2336 -7795 32376 97123 62750 37513 33542 3115 -58257 -46274 8337 -6673 -14707
1201 -14707 -9646 -50632 -76551 -66164 -25690 666 3402 -30871 -30063 -37127 -81122 -69016 -15270
1188 -15270 -13960 39204 62251 34050 49446 49976 30041 56055 32384 29082 29329 22504 54717
1175 54717 66912 9767 -45256 -9993 20434 57505 3591 -60098 -48887 4648 48940 -26947
1163 -26947 -18832 31616 -6044 -29804 -30761 1585 -6015 -16347 -36614 -7694 13530 66205 46068
$$ packed form
1251F4947m1901m5829j3286n293L9857k2323J6010J0951l7228j2633N4548L857
1239A1677p1295L6600p183l090o4k4416o335J7647L41N2294R371j5452M257k2225
1225a7873M5485n801M588k2185l7472m5081N5335L437K3395M1975j5120k8347
1213B336j0131M0171O4747l4373k5237l971l0427o1372J1983N4611j5010q034
1201a4707N061m0986k5919J0387M0474K6356K736l4273Q08p064m3995J2106N3746
1188a5270J310N3164K3047k8201J5396N30j9935K6014k3671l302K47o825L2213
1175E4717J2195n7145n5023L5263L0427L7071n3914o3689J1211N3535M4292p5887
1163b6947Q115N0448l7660k3760r57L2346p600j0332k0267K8920K1224N2675k0137
$$ plain form
1150 46068 26345 17521 44675 11029 -41073 -54311 -33489 24142 25038 49143 -19849 -19990 -3045
1137 -3045 86949 95903 20548 -25180 -36722 -14139 23552 41225 -9628 -20958 -23596 -7527
1125 -7527 -76031 -34577 -27238 -27488 -8246 -40689 -16220 34424 -24174 -66950 -31233 7460 7126
1112 7126 -35190 -30992 31519 70977 -21959 -22448 34695 50835 7527 -39602 -51108 -48391 -16602
1099 -16602 -4634 -24965 22210 19889 -6811 22612 -8719 -18298 -17124 -48960 -134210 -88153
1087 -88153 -792 -20344 -17870 -32260 -37693 -34495 -52060 -13344 46307 42019 23266 20224 22828
1074 22828 5966 -28496 -1581 5646 859 -5556 -5125 25030 10984 45584 74960 -13089 9644
1061 9644 -1797 -24371 -17879 -62233 -65545 -7025 4094 -917 6065 2991 17475 -33089 -60473
$$ packed form
1150D6068j9723q824K7154l3646n2102j3238K0822N7631Q96K4105o8992j41J6945
1137c045Q9994Q954p5355m5728j1542K2583L7691J7673n0853j1330k638J6069
1125g527o8504M1454P339k50J9242l2443K4469N0644n8598m2776L5717L8693l34
1112G126m2316M198O2511L9458r2936m89N7143J6140m3308m7129j1506K717L1789
1099a6602J1968k0331M7175k321k6700K9423l1331r579J174l1836q5250M6057
1087h8153Q7361j9552K474j4390n433L198j7565L8716N9651m288j8753l042K604
1074B2828j6862l4462K6915P227m787o415M31L0155j4046L4600K9376q8049K2733
1061I644j1441k2574O492m4354l312N8520J1119n011O982l074J4484n0564k7384
$$ plain form
1048 -60473 -77734 -80201 -24107 6716 -28842 -7623 49876 69135 3082 -1588 10235 -20934
1036 -20934 -11414 -27770 -17914 2406 18868 58139 3379 -6703 -20218 -7251 -7192 -37207 -25550
1023 -25550 20061 23524 1760 1226 15983 -28536 -24464 32089 33896 9180 16081 -2134 -48192
1010 -48192 -43543 -52359 -40311 -64361 -6117 48180 8506 -5360 -78658 -30443 10108 -16164
998 -16164 16987 -25040 -51160 -68962 -57314 -24453 -9976 -23148 -58850 -43226 -61731 -51665
986 -51665 -34642 -31592 560 -48338 -56686 -36607 -44731 -37882 7523 -26314 -13259 20396 21204
973 21204 34162 122008 47456 -37549 -11229 19128 24024 -10258 24386 40883 24156 20364
961 20364 13964 52944 50718 -32858 -15483 -13117 -10482 19349 31075 11443 -57476 -26831 41344
$$ packed form
1048f0473j7261k467N6094L0823l5558K1219N7499J9259o6053m670J1823l1169
1036b0934R520j6356R856K0320J6462L9271n4760j0082j3515J2967N9l0015J1657
1023b5550M5611L463k1764n34J4757m4519M072N6553J807k4716O901j8215m6058
1010d8192M649q816J2048k4050N8244N4297l9674j3866p3298M8215M0551k6272
998a6164L3151m2027k6120j7802J1648L2861J4477j3172l5702J5624j8505J0066
986e1665J7023L050L2152m8898q348K0079q124O849M5405l3837J3055L3655Q08
973B1204J2958Q7846p4552q5005K6320L0357M896l4282L4644J6497j6727l792
961B0364o400L8980k226q3576J7375K366K635K9831J1726j9632o8919L0645O8175
$$ plain form
948 41344 33385 1076 -4192 -8534 -21754 -41898 22530 35220 17234 14624 37609 7891 -40340
935 -40340 5728 900 -464 -23805 32801 -2947 25697 18832 -32372 12535 -42158 -17054 -925
922 -925 -32087 6003 6467 -27182 -24189 24950 13494 6592 -5283 -23073 -10523 30497 69204
909 69204 54315 57743 21335 31464 53818 33250 39121 -2706 -7133 -19702 -14700 -35053 -52503
896 -52503 -44377 -14595 -16538 -22805 -29550 -19823 9820 -10314 -21719 -35935 -10810 13136 -28419
883 -28419 -36981 -29230 -1645 -11999 -24919 17845 -26977 -46997 -52971 -2440 15991 29402 -17105
870 -17105 -23204 -4607 -12843 2217 -34558 -29396 -22720 -5515 44250 87124 72785 20669 12538
857 12538 34197 25845 16783 37142 10477 22320 -8651 -13011 29239 -41267 -51471 48940
$$ packed form
948D1344p959l2309n268m342j3220k0144O4428J2690j7986k610K2985k9718m8231
935d0340M6068m828j364k3341N6606l5748K8644o865n1204M4907n4693K5104J6129
922i25l1162L8090M64l3649K993M9139j1456o902j1875j7790J2550M1020L8707
909F9204j4889L428l6408J0129K2354k0568N871m1827m427j2569N002k0353j7450
896e2503Q126K9782j943o267o745R727K9643k0134j1405j4216K5125K3946m1555
883b8419q562P751K7585j0354j2920M2764m4822k0020n974N0531J8431J3411m6507
870a7105o099J8597q236J5060l6775N162O676J7205M9765M2874j4339n2116q131
857A2538K1659q352r062K0359k6665J1843l0971m360M2250p0506j0204J00411
$$ plain form
845 48940 81651 58072 55042 -19984 -2220 -124 17745 -21633 -17039 25089 -13770 27881 22714
832 22714 -11863 -19777 2871 5028 34843 4753 -32878 -56024 10001 2995 -61259 -29024 -2009
819 -2009 19502 -13445 -34308 -53763 -19435 -5747 -38226 -10222 -38124 -24883 -27790 -32708 -58551
806 -58551 -22139 -29236 -7768 -17820 -9669 19460 21643 9820 4232 -20973 -25917 -7956 17622
793 17622 1092 -1234 50429 -35165 -22981 -11597 -23240 -38338 10595 3282 -36269 17831
781 17831 7712 10604 64479 -8468 43485 71835 41928 -11197 -36607 -5225 -28272 -48622
769 -48622 12730 -5837 -48472 -46513 -8479 13996 15664 -13795 -44700 -87511 -38798 10235
757 10235 -12952 -21988 -25057 -56125 32337 41956 3865 32904 622 -27721 -51777 -51374 -42894
$$ packed form
845D8940L2711k3579l030p5026J7764K096J7869l9378M594M2128l8859M1651n167
832B2714l4577p914K2648K157K9815l0090l7631k3146O6025p006o4254L2235K7015
819b009K1511l2947k0863j9455L4328J3688l2479K8004k7902J3241k907m918k5843
806e8551L6412p097K1468j0052Q151K9129K183j1823n588k5205m944J7961K5578
793A7622j6530k326N1663q5594J2184J1384j1643j5098M8933p313l9551N4100
781A7831j0119K892N3875p2947N1953K8350k9907n3125k5410L1382k3047k0350
769d8622O1352j8567m2635J959L8034K2475J668k9459l0905m2811M8713M9033
757A0235k3187r036l069l1068Q8462R619l8091K9039l2282k8343k4056M03Q480
$$ plain form
744 -42894 -53551 -32560 -31941 -71849 -68526 -31446 14042 15606 -12002 7034 21000 38000 -11917
731 -11917 48902 71222 -27434 12597 378 53502 17776 -27468 1251 16438 -47113 -4005
719 -4005 -19010 -29167 -125 54855 38784 13934 13248 19845 39116 20991 -45064 -51117 -87237
706 -87237 -49809 -34727 -24754 30717 23576 29586 -3160 13785 -5710 -7001 -8404 -46853 -20350
693 -20350 4753 -1230 -764 22745 -1966 24481 65396 18786 -10772 -23344 -14985 -59675 -9657
680 -9657 20176 38324 -12422 -51845 -40710 229 1500 -30359 -35873 -48370 -60363 -75498 -56591
667 -56591 808 -7338 -23390 -10473 14013 27627 1680 -16346 -20859 -40172 -69901 -36378
655 -36378 27832 -14071 -18646 -3371 -44768 -51368 8775 48176 63679 27028 -12426 -26508
$$ packed form
744d2894j0657K0991O19l9908L323L7080M5488J564k7608J9036J3966J7000m9917
731a1917O0819K2320r8656M0031j2219N3124l5726m5244K8719J5187o3551M3108
719d005j5005j0157K9042N4980j6071k4850o86O597J9271j8125o6055o053l6120
706h7237L7428J5082R973N5471p141O010l2746J6945j9495j291j403l8449K6503
693b0350K5103n983M66K3509k4711K6447M0915m6610k9558j2572Q359m4690N0018
680i657K9833J8148n0746l9423J1135M0939J271l1859n514j2497j1993j5135J8907
667e6591N7399q146j6052J2917K4486J3614k5947j8026m513j9313k9729L3523
655c6378O4210m1903m575J5275m1397o600O0143L9401J5503l6651l9454j4082
$$ plain form
643 -26508 15168 11474 -15353 -13880 24573 41951 -60278 -23303 -14151 61930 63953 -707 -37290
630 -37290 -5608 23260 11425 -28042 -63688 -40706 8784 18882 -9648 -37843 12938 -15551
618 -15551 -41226 -25595 -37245 -47115 -26672 12820 27675 30146 25975 35944 23438 -32356 -5886
605 -5886 47067 419 -20604 1393 -23961 -71294 -31940 6577 45821 -369 -63677 -69304
593 -69304 -64013 -26361 -8154 -4739 53322 35695 16647 21631 7197 -26632 -66299 -32165 -40007
580 -40007 -77991 -65961 -83748 -29003 -36861 14836 -3131 -15441 -55333 -34742 8447 -24272
568 -24272 -41054 -47600 -20116 -13850 -18626 -41654 -59803 -25952 2768 -18811 13775 -26422 -12418
555 -12418 -13030 30292 62387 34867 1876 3607 -14035 -14460 -13596 -26273 27156 20430 35550 6633
$$ packed form
643b6508M1676l694k6827J473L8453J7378j02229L6975R152P6081K023o4660l6583
630c7290L1682K8868j1835l9467l5646K2982M9490J0098k8530k8195N0781k8489
618a5551k5675J5631j1650r870K0443L9492J4855K471m171R969j2506n5794K6470
605e886N2953m6648k1023K1997k5354m7333L9354L8517L9244m6190o3308n627
593f9304N291L7652J8207L415N8061j7627j9048M984j4434l3829l9667L4134p842
580d0007l7984J2030j7787N4745p858N1697j7967j2310l9892K0591M3189l2719
568b4272j6782o546K7484O266m776k3028j8149L3851K8720k1579L2586m0197J4004
555a2418o12M3322L2095k7520l2991J731j7642m25Q64j2677N3429o726J5120k8917
$$ plain form
541 6633 -28771 -11493 -7572 -7093 11020 -33132 -29774 -46309 -38269 5247 -2254 35839 -4226
528 -4226 -27722 -15600 38187 40497 -5755 5110 -50761 -21521 -9103 -15401 -32516 -62101 -32424
515 -32424 -25842 -27903 26409 43637 -27295 -12713 23595 20996 -20223 23795 81093 71301 79377
502 79377 37862 -11537 -42657 -64402 -16453 11607 24223 47428 30290 15280 18156 15774
490 15774 -51627 -25747 19979 36040 29967 14296 -7580 -32642 -58 -20392 -37383 -18665
478 -18665 71229 18707 10256 -7338 -46387 -7486 -26053 -55534 -9798 -10078 -3255 -21272 -53252
465 -53252 -29100 -9493 -8485 -4331 -19285 -32375 -35706 -35467 -1839 -22551 -4791 -20807 -34194
452 -34194 5766 -1602 -22575 10962 -3891 -22180 -38180 -31231 -13763 -12156 19399 -4278 -26831
$$ packed form
541F633l5404J7278L921M79J8113m4152L358j6535Q040M3516p501L8093m0065
528d226k3496J2122N3787K310m6252J0865n5871K9240J2418o298j7115k9585K9677
515c2424O582k061N4312J7228p0932J4582L6308k599m1219M4018N7298r792Q076
502G9377m1515m9399l1120k1745M7949K8060J2616K3205j7138j5010K876k382
490A5774o7401K5880M5726J6061o073j5671k1876k5062L2584k0334j6991J8718
478a8665Q9894n2522q451j7594l9049L8901j8567k9481M5736k80O823j8017l1980
465e3252K4152J9607J008M154j4954j3090l331K39L3628k0712J7760j6016j3387
452c4194L9960p368k0973L3537j4853j8289j6000O949J7468J607L1555k3677k2553
$$ plain form
439 -26831 -7189 27765 -66128 -81751 -75458 -48138 -26530 6909 -12796 -22215 23644 13175
427 13175 24121 1520 -302 30976 16178 24957 42256 43386 8768 -38386 -44152 2679 26290
414 26290 12939 -29454 -15573 18490 6410 1672 -33965 2103 -149 16710 15912 -13268 -20355
401 -20355 17108 30950 30828 13462 30688 48921 108230 42653 11758 1425 12407 -23809
389 -23809 -75714 -50332 -33001 -24778 -28450 34960 40532 -7984 -15407 -23173 -58880 -63867 39559
376 39559 39752 -25634 36734 43978 33146 68094 36897 -2638 26048 26163 19150 6094 1017
363 1017 51130 21877 -5025 22017 -35128 -50112 6692 6375 32368 -12209 -38189 -25036 -24111
350 -24111 -23912 21213 2580 -1836 39995 52678 56638 72921 61741 49176 74328 -6716 -35643
$$ packed form
439b6831J9642L4954r3893j5623O293K7320K1608L3439j9705r419M5859j0469
427A3175J0946k2601j822L1278j4798Q779J7299J130l4618m7154n766M6831K3611
414B6290j3351m2393J3881L4063j2080m738l5637L6068k252J6859p98k9180p087
401b0355L7463J3842j22j7366J7226J8233N9309o5577l0895j0333J0982l6216
389b3809n1905K5382J7331Q223l672O3410N572m8516p423p766l5707m987J03426
376C9559J93o5386O2368P244j0832L4948l1197l9535K8686J15p013j3056n077
363A017N0113k9253k6902K7042n7145j4984N6804l17K5993m4577k5980J3153R25
350b4111J99M5125j8633m416M1831J2683L960J6283j1180j2565K5152q1044k8927
$$ plain form
337 -35643 4399 7663 -11826 53125 40243 42632 30463 -37357 -31433 -35452 -44891 -5203 -24677
324 -24677 22319 -27639 -41834 26158 -18104 -77491 -56721 -18248 -35011 -55884 -7756 78720
312 78720 57941 96963 59993 40850 104796 51425 -2324 -32245 -29624 -12737 -12584 -22200 -25301
299 -25301 -34695 -88075 -37916 14613 -24059 -11567 39595 22118 6597 4178 -7374 5646
287 5646 33094 -4514 -6331 44337 19930 23720 8716 -20652 -60665 -49596 -16304 26740 52611
274 52611 42842 25939 11860 32713 27188 -6329 -2866 -12096 57768 39756 36925 45848 43061
261 43061 22648 -9599 -680 45333 35931 -13951 16283 39476 -7800 -59126 -25621 -62656
249 -62656 -43795 -2349 -3181 3596 -21182 20651 44225 41983 -9131 15685 26069 23190 33430
$$ packed form
337c5643M0042L264j9489O4951j2882K389j2169o7820N924m019r439L9688j9474
324b4677M6996m9958j4195O7992m4262n9387K0770L8473j6763k0873M8128Q6476
312G8720k0779L9022l6970j9143O3946n3371n3749k9921K621J6887J53r616l101
299b5301r394n3380N0159N2529l8672J2492N1162j7477j5521k419j1552J3020
287E646K7448l7608j817N0668k4407L790j5004k9368m0013J1069L3292M3044K5871
274E2611r769j6903j4079K0853n525l3517L463r230O9864j8012k831Q923k787
261D3061k0413l2247Q919M6013r402m9882L0234K3193m7276n1326L3505l7035
249f2656J8861M1446q32O777k4778M1833K3574k242n1114K4816J0384k879J0240
$$ plain form
236 33430 -8857 38481 16382 12850 42357 23881 -15152 -11237 -6944 -63270 -46738 1697 -32587
223 -32587 -10051 6798 -5633 29005 54019 26263 70294 16708 -1224 16588 48944 56495
211 56495 41764 34136 8113 24041 4684 3408 -27214 -3018 2745 8165 63257 61465 46333
198 46333 16723 -23427 -53878 -57032 -42419 -66559 -9947 24939 14634 -18259 -25177 -48340
186 -48340 -1157 92053 36892 42870 58215 67585 16329 4835 14605 12568 5811 -2090 2280
173 2280 18898 -13108 22642 59764 76181 41064 -8204 6900 -3800 -530 -44769 -18082
161 -18082 24574 14439 13894 -17583 -42444 -10652 8566 -3826 -3318 13090 25864 5296 -15122
148 -15122 -16056 -5909 -11464 -33724 -30924 4687 10752 15623 60625 36474 39701 6584 -9574
$$ packed form
236C3430m2287M7338k2099l532K9507j8476l9033L915M293n6326J6532M8435l4284
223c2587K2536J6849j2431L4638K5014k7756M4031n3586j7932J7812L2356P551
211E6495j4731p628k6023J5928j9357j276l0622K4196N763N420N5092j792j5132
198D6333k9610m0150l0451l154J4613k4140N6612L4886j0305l2893o918k3163
186d8340M7183R3210n5161N978J5345R370n1256j1494R770k037o757p901M370
173B280J6618l2006L5750L7122J6417l5117m9268J5104j0700L270m4239K6687
161a8082M2656j0135n45l1477k4861L1792J9218j2392N08J6408J2774k0568k0418
148a5122r34J0147n555k2260K800L5611O065M871M5002k4151L227l3117j6158
$$ plain form
135 -9574 -33331 -20033 -22278 3033 46408 26311 18762 -18710 -49403 15124 47997 55986 -25930
122 -25930 -31581 -22120 -48280 -22652 17963 -4878 -1820 9704 -22237 17997 35023 46173 -13099
109 -13099 -7258 18971 8705 -8604 3715 5981 34104 70223 45092 -3460 26514 5414
97 5414 20919 4088 -16189 25590 32451 19853 -338 -60682 -18728 27413 4338 -3278 1409
84 1409 13583 15831 12655 10108 7339 15542 -728 14105 6586 -9805 -11717 9808 24007 -22168
$$ packed form
135i574k3757J3298k245K5311M3375k0097p549l7472l0693O4527L2873P989q1916
122b5930n651R461k6160K5628M0615k2841L058J1524l1941M0234J7026J1150n9272
109a3099N841K6229j0266j7309J2319K266K8123L6119k5131m8552K9974k1100
97E414J5505j6831k0277M1779O861j2598k0191o0344M1954M6141k3075p616M687
84A409J2174K248l176k547k769Q203j6270J4833p519j6391j912K1525J4199m6175
$$ [...]
##END NTUPLES=NMR SPECTRUM
##END=
