##TITLE=1H_CA-9273-2
 CDCl3
 8 sc, 
 30.5.2024
##JCAMPDX= 6.0         $$ Bruker NMR JCAMP-DX V2.0
##DATA TYPE= NMR SPECTRUM
##DATA CLASS= NTUPLES
##ORIGIN= UXNMR, Bruker Analytische Messtechnik GmbH
##OWNER= root
$$ XWIN-NMR		Version 3.5
$$ Thu May 30 13:38:46 2024 Russian Standard Time (UT+4h)  she@DPX200
##.OBSERVE FREQUENCY= 200.1309
##.OBSERVE NUCLEUS= ^1H
##.ACQUISITION MODE= SIMULTANEOUS
##.ACQUISITION SCHEME= undefined
##.AVERAGES= 8
##.DIGITISER RES= 18
##SPECTROMETER/DATA SYSTEM= spect
##.PULSE SEQUENCE= zg30
##.SOLVENT NAME= CDCl3
##.SHIFT REFERENCE= (INTERNAL, CDCl3, 0, 15.7998)
##AUDIT TRAIL= $$ (NUMBER, WHEN, WHO, WHERE, WHAT)
$$ ##TITLE= Audit trail, XWIN-NMR		Version 3.5
$$ ##JCAMPDX= 5.01
$$ ##ORIGIN= Bruker BioSpin GmbH
$$ ##OWNER= she
$$ F:/spectra/data/she/nmr/H-F/1/pdata/1/auditp.txt
$$ ##AUDIT TRAIL=  $$ (NUMBER, WHEN, WHO, WHERE, WHAT)
(   1,<2024-05-30 13:37:21.07 +0400>,<she>,<DPX200>,
      <created by zg, POWCHK disabled, PULCHK disabled
       configuration hash MD5:
       00 E9 B6 7A A2 85 ED C7 34 08 36 98 17 FE 4E 26
       data hash MD5: 16K
       C8 D2 F5 8C 7E E8 67 9E 31 93 46 4D 01 B2 FC 34>)
(   2,<2024-05-30 13:37:35.60 +0400>,<she>,<DPX200>,
      <Start of raw data processing
       efp BC_mod = 2 LB = 0.24 FT_mod = 6 PKNL = 1 PHC0 = -25467.75 PHC1 = 10.38748 SI = 16K 
       data hash MD5: 16K
       AE 6A D4 EC F3 F6 66 B7 8F 30 F3 D2 11 FA 54 76>)
(   3,<2024-05-30 13:37:52.57 +0400>,<she>,<DPX200>,
      <pk PHC0 = 161.2305 PHC1 = -3.2 
       data hash MD5: 16K
       EA 51 4D 72 DA 6E BE D8 58 CC 7F 2D 29 53 6B E4>)
(   4,<2024-05-30 13:37:55.73 +0400>,<she>,<DPX200>,
      <abs ABSG = 5 
       data hash MD5: 16K
       D3 60 A4 50 C4 6B 64 8B 4F 7A 6D 9A 18 E5 3B F3>)
$$ ##END=
$$ 
$$ hash MD5
$$ 2C AC 5F 71 38 77 F9 B3 5A B7 B9 97 6E 6D 55 3D
##$RELAX= 
##$RELAX= 
##$RELAX= 
##$RELAX= 
##$RELAX= 
##$RELAX= 
$$ Bruker specific parameters
$$ --------------------------
##$DU= <F:/spectra>
##$EXPNO= 1
##$NAME= <H-F>
##$PROCNO= 1
##$TYPE= <nmr>
##$USER= <she>
##$AMP= (0..31)
100 100 100 100 100 100 100 100 100 100 100 100 100 100 100 100 100 100 
100 100 100 100 100 100 100 100 100 100 100 100 100 100 
##$AQSEQ= 0
##$AQ_mod= 1
##$AUNM= <au_zg>
##$AUTOPOS= <>
##$BF1= 200.13
##$BF2= 200.13
##$BF3= 200.13
##$BF4= 200.13
##$BF5= 200.13
##$BF6= 200.13
##$BF7= 200.13
##$BF8= 200.13
##$BYTORDA= 1
##$CFDGTYP= 0
##$CFRGTYP= 5
##$CHEMSTR= <none>
##$CNST= (0..31)
1 1 145 1 1 1 1 1 1 1 1 1 1 1 1 1 1 1 1 1 1 1 1 1 1 1 1 1 1 1 1 1 
##$CPDPRG= <>
##$CPDPRG1= <>
##$CPDPRG2= <>
##$CPDPRG3= <>
##$CPDPRG4= <mlev>
##$CPDPRG5= <mlev>
##$CPDPRG6= <mlev>
##$CPDPRG7= <mlev>
##$CPDPRG8= <mlev>
##$CPDPRGB= <>
##$CPDPRGT= <>
##$D= (0..31)
0 1.2 0 0 0 0 0 0 0 0.06 0 0.03 0 0 0 0 0.0002 0 0 0 0 0 0 0 0 0 0 0 0 
0 0 0 
##$DATE= 1717061840
##$DBL= (0..7)
120 120 120 120 120 120 120 120 
##$DBP= (0..7)
150 150 150 150 150 150 150 150 
##$DBP07= 0
##$DBPNAM0= <>
##$DBPNAM1= <>
##$DBPNAM2= <>
##$DBPNAM3= <>
##$DBPNAM4= <>
$$ [...]
##$SUBNAM3= <"">
##$SUBNAM4= <"">
##$SUBNAM5= <"">
##$SUBNAM6= <"">
##$SUBNAM7= <"">
##$SUBNAM8= <"">
##$SUBNAM9= <"">
##$SW= 18.0517689322627
##$SWIBOX= (0..15)
0 0 2 0 0 0 0 0 0 0 0 0 0 0 0 0 
##$SW_h= 3612.71676300578
##$TD= 16384
##$TD0= 1
##$TE= 0
##$TE2= 300
##$TE3= 300
##$TEG= 300
##$TL= (0..7)
0 120 120 120 120 120 120 120 
##$TP= (0..7)
150 150 150 150 150 150 150 150 
##$TP07= 0
##$TPNAME0= <>
##$TPNAME1= <>
##$TPNAME2= <>
##$TPNAME3= <>
##$TPNAME4= <>
##$TPNAME5= <>
##$TPNAME6= <>
##$TPNAME7= <>
##$TPOAL= (0..7)
0.5 0.5 0.5 0.5 0.5 0.5 0.5 0.5 
##$TPOFFS= (0..7)
0 0 0 0 0 0 0 0 
##$TUNHIN= 0
##$TUNHOUT= 0
##$TUNXOUT= 0
##$USERA1= <user>
##$USERA2= <user>
##$USERA3= <user>
##$USERA4= <user>
##$USERA5= <user>
##$V9= 5
##$VALIST= <valist>
##$VCLIST= <CCCCCCCCCCCCCCC>
##$VD= 0
##$VDLIST= <DDDDDDDDDDDDDDD>
##$VPLIST= <PPPPPPPPPPPPPPP>
##$VTLIST= <TTTTTTTTTTTTTTT>
##$WBST= 1024
##$WBSW= 4
##$XGAIN= (0..3)
0 0 0 0 
##$XL= 0
##$YL= 0
##$YMAX_a= 581863
##$YMIN_a= -613580
##$ZGOPTNS= <>
##$ZL1= 120
##$ZL2= 120
##$ZL3= 120
##$ZL4= 120
##$ABSF1= 15.80311
##$ABSF2= -2.248781
##$ABSG= 5
##$ABSL= 3
##$ALPHA= 0
##$AQORDER= 0
##$ASSFAC= 0
##$ASSFACI= 0
##$ASSFACX= 0
##$ASSWID= 0
##$AUNMP= <proc_1d>
##$AZFE= 0.1
##$AZFW= 0.1
##$BCFW= 0
##$BC_mod= 2
##$BYTORDP= 0
##$COROFFS= 0
##$CY= -3
##$DATMOD= 1
##$DC= 0
##$DFILT= <>
##$DTYPP= 0
##$F1P= 0
##$F2P= 0
##$FCOR= 1
##$FTSIZE= 16384
##$FT_mod= 6
##$GAMMA= 0
##$GB= 0
##$INTBC= 1
##$INTSCL= 3.70164e-10
##$ISEN= 128
##$LB= 0.24
##$LEV0= 0
##$LPBIN= 0
##$MAXI= 10000
##$MC2= 0
##$MEAN= 0
##$ME_mod= 0
##$MI= 1.114404
##$NCOEF= 0
##$NC_proc= -6
##$NLEV= 6
##$NOISF1= 3.799351
##$NOISF2= 2.8
##$NSP= 0
##$NTH_PI= 0
##$NZP= 0
##$OFFSET= 15.79981
##$PC= 1
##$PHC0= -25306.52
##$PHC1= 7.18748
##$PH_mod= 1
##$PKNL= yes
##$PPARMOD= 0
##$PSCAL= 0
##$PSIGN= 0
##$REVERSE= no
##$SF= 200.129544348371
##$SI= 16384
##$SIGF1= 3
##$SIGF2= 2
##$SINO= 5.538805
##$SIOLD= 16384
##$SREGLST= <1H.CDCl3>
##$SSB= 0
##$STSI= 16384
##$STSR= 0
##$SW_p= 3612.71676300577
##$SYMM= 0
##$S_DEV= 0
##$TDeff= 16384
##$TDoff= 0
##$TI= <>
##$TILT= no
##$TM1= 0
##$TM2= 0
##$TOPLEV= 0
##$USERP1= <user>
##$USERP2= <user>
##$USERP3= <user>
##$USERP4= <user>
##$USERP5= <user>
##$WDW= 1
##$XDIM= 16384
##$YMAX_p= 504521054
##$YMIN_p= -977233
$$ End of Bruker specific parameters
$$ ---------------------------------
##NTUPLES= NMR SPECTRUM
##VAR_NAME=  FREQUENCY,     SPECTRUM/REAL,   SPECTRUM/IMAG
##SYMBOL=    X,             R,               I
##VAR_TYPE=  INDEPENDENT,   DEPENDENT,       DEPENDENT
##VAR_FORM=  AFFN,          ASDF,            ASDF
##VAR_DIM=   16384,         16384,           16384
##UNITS=     HZ,            ARBITRARY UNITS, ARBITRARY UNITS
##FACTOR=    0.220516191357247, 1,           1
##FIRST=     3162.00885805307, 0,            0
##LAST=      -450.7079049527, 0,             0
##MIN=       -450.7079049527, -977233,       0
##MAX=       3162.00885805307, 504521054,    0
$$ Real data points
##PAGE= N=1
##DATA TABLE= (X++(R..R)), XYDATA
$$ [...]
8949 40895 -36853 -108860 -14148 83632 3500 -80144 -40313 29527 29231 72950 68037 144792
8937 144792 89300 125409 109894 97231 32028 73052 134281 104839 56625 83481 21571 -33361
8925 -33361 61514 117648 233228 186333 -7976 24475 122411 106778 96635 46439 60789
8914 60789 36132 107967 130640 106031 189299 94084 50707 58965 143420 189524 154797 159750
8902 159750 135665 138763 230339 184310 234421 251619 96866 41567 34583 114652 107161 203910
8890 203910 145575 94982 41949 89755 94848 110394 35529 5665 76531 38925 116812 216486
8878 216486 115784 90124 193895 193634 166672 254680 279881 226764 198757 207706 184925 127549
8866 127549 45240 117799 181717 196234 157276 204702 163693 204193 189350 156570 48411
8855 48411 -8051 94260 173426 175232 185456 98686 204080 268059 182415 186864 166951 210409
8843 210409 290888 269032 245282 285374 209133 267681 249220 237931 214721 299584 275079 229159
8831 229159 320017 241816 190522 187590 298786 331727 401217 421771 355848 306549 256687 240285
8819 240285 283586 299686 348816 390976 291615 314587 239565 345091 256762 221275 300486
8808 300486 311797 390894 476038 390514 324430 231221 259730 465256 417105 276319 262535
8797 262535 294750 380879 392400 425413 422851 394390 361120 315061 306201 369695 335002 351616
8785 351616 434766 372435 457562 526090 605526 515103 388256 452765 490706 414029 369196
8774 369196 332364 268648 327483 393835 379431 399068 551720 614138 619966 644879 751289
8763 751289 785755 690120 635740 627435 627769 633951 626503 598349 671950 718591 694921 681269 629158
8750 629158 556848 690718 755720 732756 853928 915750 903806 894566 943337 922118 855007
8739 855007 926481 986977 1010392 1140594 1300943 1291221 1214256 1215786 1308452 1288950 1272082 1298690
8727 1298690 1345474 1450177 1454000 1600466 1665176 1633960 1609154 1631757 1746686 1699227 1781568
8716 1781568 1833219 1878885 1880593 1906192 2069862 2028357 2043381 2215747 2227016 2244325 2179598
8705 2179598 2248286 2326880 2379579 2445999 2600571 2728425 2669117 2768032 2773792 2781084 2838967
8694 2838967 3051455 3253598 3208519 3324886 3426769 3547534 3672160 3843383 3951225 4067469
8684 4067469 4309004 4477037 4598244 4835498 5088357 5325770 5788241 6132898 6542405 7076777
8674 7076777 7627086 8337495 9137964 10116023 11040630 12173098 13660127 15233328 17096856
8665 17096856 19484184 22257714 25292195 29177432 34560285 41447461 46764353 45607158
8657 45607158 38047084 30040182 23948658 19680576 16599392 14186912 12173464 10728092
8649 10728092 9458682 8434359 7593381 6833898 6278813 5824556 5522136 5095210 4947727
8640 4947727 4745336 4480690 4164162 4055127 3814157 3578296 3482097 3285146 3087335 2924690
8630 2924690 2799665 2735733 2656015 2502124 2273267 2258476 2358035 2289683 2168500 2123688 2147007
8619 2147007 2006573 1958917 1971237 1798230 1739365 1775960 1769275 1727619 1674135 1656132 1680175
8608 1680175 1771450 1726961 1712117 1717806 1697955 1703346 1507469 1506638 1490846 1499383 1388173 1328648
8596 1328648 1259378 1181954 1272057 1262664 1166318 1173110 1135279 1092299 1166940 1123815 1125377 1164455
8584 1164455 1066703 1135417 1227159 1245663 1252379 1264381 1330534 1363227 1340499 1479564 1624298
8573 1624298 1494279 1321078 1309137 1271651 1255412 1125146 1059050 942033 866521 894602 840074
8562 840074 814282 790309 826524 842873 832447 816027 700671 636584 625067 644930 549365
8551 549365 433543 505315 607612 712457 598841 612297 707708 751494 770809 672449 683160
8540 683160 719907 595018 598947 590225 576206 444612 469193 478284 455824 417307 323966 386113
8528 386113 320145 304828 362828 308884 300518 373587 337082 287248 341109 353314 360337 358799
8516 358799 328484 249521 223153 103392 128670 179955 222336 235262 285682 250049 206689
8505 206689 330780 319326 220977 174674 246300 231623 290356 215663 182985 226174 120161
8494 120161 141902 180395 216331 216474 117072 143590 206807 164861 181758 160844 128132 115806
8482 115806 -1436 -23059 93301 187845 176274 150090 96399 57246 131857 176780 180319
8471 180319 204791 277871 194920 186681 264627 287177 319490 251115 99492 101072 147977 96136
8459 96136 180026 245850 157997 139596 59502 11784 103423 97752 -8251 73831 149792 76901
8447 76901 49072 89554 145144 158043 129268 152455 158381 134920 78569 47076 106095 143461
8435 143461 109441 32955 -20477 10439 60639 89100 105187 15752 -19447 -46313 28694 57557
8423 57557 41857 116273 73629 81718 92110 -1172 -84079 32932 106100 27351 101606 117927
8411 117927 44966 45353 135744 210157 203176 179557 191473 98421 51026 70239 101114 27969
8399 27969 38891 99520 198154 97811 60412 95409 204589 85475 202035 115432 102110
8388 102110 96441 55820 31149 -18656 7369 4825 5436 48193 133481 140988 293006 140253
8376 140253 151754 113786 3674 53100 71168 29255 34390 41027 -25897 65222 100035 -26125
8364 -26125 93973 47166 16303 61097 65529 31976 -95233 -44101 31713 52984 47135 35052
8352 35052 68850 126186 80390 104136 137356 112376 63246 24774 44433 -24512 -13515 -82534
8340 -82534 12474 48805 78173 57785 47568 -50163 -32384 -119978 -104094 -53919 7509 -67629
8328 -67629 -16717 -14558 -37102 -47911 -1362 20282 -69297 -89087 -45631 -23567 -61319 15994
8316 15994 -46855 -100519 -27698 53107 -15272 -37564 91059 98022 11527 74391 91939 5424
8304 5424 -25692 24306 23442 89581 40173 93173 134122 182272 27264 -6582 -20069 22857
8292 22857 4691 86718 100553 61849 102671 59344 61935 3256 79900 105373 30298 58095
8280 58095 93547 144347 43947 5879 -6479 40838 96830 64720 18367 -9732 -32218 -8116
8268 -8116 -56512 -42333 -32394 -139306 -64455 52252 34299 -10094 -40126 -32676 -29078 -32817
8256 -32817 51073 41543 36364 -34857 -64838 -36563 -43668 -87069 -152282 -104453 -46664 -73903
8244 -73903 31176 53779 93970 162679 49939 -113304 23032 698 28640 14261 54179
8233 54179 51155 32260 -27398 108050 103450 57877 44663 97449 79306 -66095 -51743 38970
8221 38970 92609 107599 -8726 17998 51744 48721 70549 40100 -75167 -37042 116923
8210 116923 52218 73201 145558 123127 101670 80301 2869 65414 46100 128938 156298 183599
8198 183599 195041 164750 139336 168680 84723 210030 -977233 -844446 -253065 -201534 -57885
8187 -57885 49766 154532 173348 220854 164233 184291 169186 120446 118512 104310 42398 42779
8175 42779 -65125 57470 154914 75529 -35508 97590 151047 96601 -44043 -555 -23683
8164 -23683 3227 -102421 27901 -3987 -11612 -25627 20505 -64090 -62382 -113667 -48223 84321
8152 84321 42740 -10259 -52381 -55671 11975 76945 45418 7572 3012 -47101 -36816 111397
8140 111397 66842 -29581 34829 68144 5370 14278 -113894 -70174 -14813 1240 82321 81573
8128 81573 99130 73700 -10521 21602 101203 118872 117418 254755 119457 87792 139538 128161
8116 128161 175530 167963 151306 50904 122799 217853 125220 62839 26639 -94120 -81039
8105 -81039 26430 -23622 -45429 36157 53153 -97894 -92895 -58090 -58535 -7177 56721 30274
8093 30274 22142 -130705 -151844 -1937 41787 73890 -21715 12609 42630 -17678 3066 12381
8081 12381 -35473 19995 112165 136023 92380 -21536 22062 31326 -22944 27628 64951 42572
8069 42572 11381 -14074 -22647 42599 105565 -38171 -83434 6994 -88123 -73211 -3439 108980
8057 108980 133795 26375 6993 -114904 -259156 -189076 -102922 44823 86447 87763 -54492
8046 -54492 -106970 -161843 -154724 -69556 -79079 -79825 -50100 -38945 7460 55640 145182 48332 -61654
8033 -61654 -160908 -205922 -135405 -27274 -22496 -61050 -65816 -80105 -120248 -31726 30303 -51201
8021 -51201 -81642 -95808 11487 33672 91051 2407 -76412 -38654 31105 1080 38101 53789
8009 53789 66516 -37382 -139726 -105761 -153136 -201715 -156988 -96408 -23359 1134 -43695
7998 -43695 -82921 -45762 -39626 39959 77690 -24692 -57973 48827 96128 20056 28747 -26745
7986 -26745 33411 114131 75969 147241 135552 59341 132081 211490 68279 23836 13698 91455
7974 91455 185224 150249 140633 204572 202538 182021 242846 142125 190544 206964 106200 52592
7962 52592 118820 42701 -14989 39045 6247 10474 80750 143713 12126 55188 25351 -36302
7950 -36302 -39705 61152 130230 43009 51473 181295 244034 232413 196584 233526 207019 124315
7938 124315 115494 124800 94067 150230 159874 61762 10032 -28455 -143608 -84832 -307 95618
7926 95618 206113 135267 101822 69821 23564 -24914 3427 110697 224987 212742 205048
7915 205048 88494 10280 -38354 -44909 -13592 29105 66296 44800 -31826 22106 115785 136606
7903 136606 61119 30536 -21368 75315 90673 83937 93041 -9325 -77884 -36006 -82611 -56630
7891 -56630 -52479 -204190 -254560 -137606 -37088 52001 -32593 -182074 -63928 -103778 -45530
7880 -45530 -80849 -126932 -125663 -155359 -154163 -70360 -103879 -85661 -102538 22694 45568 -36116
7868 -36116 -53877 -98119 -100974 -114430 -18220 21674 116369 68258 69769 -48359 -139472 -75614
7856 -75614 -31186 -37288 13853 -63554 16146 -62899 -106038 -168728 -119906 -134631 -78444 -120864
7844 -120864 -221997 -126766 -70844 -11856 -143259 -57842 -49294 -61905 -40354 -58790 -57389 -8015
7832 -8015 -26409 -165025 -144109 -27367 -96680 6811 9210 -99692 -40405 90189 405
7821 405 64041 38652 39800 18878 -98520 -109217 -111929 -172619 -136577 -407979 -209790 -9663
7809 -9663 -7936 10924 27831 57129 -9567 41365 7671 -55735 -34345 -19656 17768 80334
7797 80334 36639 64051 -33774 -90083 -158374 -57185 16541 18103 -71074 -141327 -158859 -154829
7785 -154829 -75431 36091 52295 -29864 -52927 37615 -100816 -82276 50479 22554 36037
7774 36037 57126 -25851 -148449 -177377 -124015 -40929 43529 21949 -27094 -121804 -141247 -101521
7762 -101521 -66574 261 -28663 -44394 -42162 -16684 -27085 -100019 -171225 -117829 -68980 8726
7750 8726 -23741 13973 -14341 -38998 5885 -44532 -34909 -84852 -97338 5884 92286 47691
7738 47691 6453 -54589 -3345 -2931 613 35944 41564 67703 53009 12701 -8875 114930
7726 114930 81478 48976 111866 94231 115357 -25720 -13171 -46379 -55043 42627 99968 44325
7714 44325 91974 26447 27930 -14454 -29033 44688 140021 216559 166185 154678 103379 205163
7702 205163 132793 132145 176265 249454 265316 297301 356347 297907 291855 360989 393250 472934
7690 472934 480986 458775 518223 412343 361971 376598 461893 467548 431296 336786 254180 297485
7678 297485 243425 296841 208577 153140 136689 24418 52050 169862 140811 133091 159929
7667 159929 79813 13608 88726 -33865 -81541 8135 33841 40530 21776 -10271 -126487
7656 -126487 -135928 47433 84576 73758 -13137 -63442 18313 63490 129132 79389 -22005
7645 -22005 -36626 103977 199159 42670 100589 220243 218167 118928 -30524 -73275 -110618
7634 -110618 -96916 -96034 -21211 31683 21282 -90110 -116930 -46983 -60443 861 -50922 -97037
7622 -97037 -25176 86625 31996 -118852 -141938 -100089 -152369 -125812 -94566 -61792 31333
7611 31333 -38841 -160390 -126345 -8164 -10773 62050 60931 -29275 -114142 -146255 -94564 69798
7599 69798 83033 104443 68502 64781 38575 -22441 -21154 -92684 -102362 -89336 -112012 -160659
7587 -160659 -115896 527 -48113 -146859 -74387 -28688 -94155 -99030 -22970 -27523 -57330 -129545
7575 -129545 -106175 -33638 -163844 -212186 -107097 -118681 -77992 37139 7301 -66645 -133724
7564 -133724 -109380 -41282 -92338 -110904 -12816 55999 49886 19801 -51702 44125 97478 -25841
7552 -25841 -41489 -54108 -9601 29953 -11645 -132845 -222915 -190557 -51122 22814 432
7541 432 -63890 -101299 -129686 -99144 -71308 928 -105699 -99722 -79278 -40 -31818 -43087
7529 -43087 -62929 -18786 140999 110933 44378 101691 96971 -72004 9557 83191 46585 32789
7517 32789 133109 139236 172405 120319 49800 84849 90182 30538 31880 15042 59023 165128
7505 165128 128052 123224 127433 169317 134052 122105 136042 208116 183591 235947 133576 109986
7493 109986 188495 218170 395416 396673 386757 337355 380882 446225 529675 635745 647688 613118
7481 613118 703309 695215 769622 863532 891479 813847 998636 1060835 874214 848446 780752
7470 780752 672587 755066 711754 644651 667651 550171 550497 688859 595511 556226 620692
7459 620692 697168 719611 628016 464978 381793 334575 477119 468872 306146 293261 377371
7448 377371 340732 316064 219692 200900 266334 144835 131293 265344 192666 234154 322536
7437 322536 246297 193925 136170 236301 203332 174914 198885 201066 155672 264233 322098
7426 322098 225740 340065 433186 355354 402477 462000 435734 395063 330760 267554 397394
7415 397394 389735 460808 505456 410093 389784 423968 550551 690700 767662 760485 697174 681256
7403 681256 771015 717248 837234 938146 1057673 1138181 1245715 1343137 1509133 1657990
7393 1657990 1759632 2030808 2180070 2304821 2505647 2763960 2943998 3283256 3365844 3226332
7383 3226332 3029929 2972515 2982478 3074709 3258386 3143319 2962049 2634856 2173142 2017671
7373 2017671 1912310 1809053 1589849 1455398 1244273 1050466 866803 861474 748411 708742
7363 708742 617010 600679 551291 405509 417570 338651 302201 332266 312912 312290 405570 350450
7351 350450 341862 280454 288803 230960 112893 156366 94190 136973 146730 119234 54043 162108
7339 162108 197143 188660 195875 216808 186208 76841 62149 37013 -17982 79325 183216 144985
7327 144985 104292 103398 74821 -32233 21047 -14356 50893 93095 183840 189880 89107 -11438
7315 -11438 60776 121129 69590 74699 78683 2446 39 -45595 -32901 78199 69420 -40973
7303 -40973 46790 58629 37178 -24245 -35726 28257 42311 130521 57247 -29562 -59183 -13270
7291 -13270 47930 14400 -22196 -5603 -15026 31687 87158 69542 15132 31702 85881 -21826
7279 -21826 19949 30080 95743 23150 39809 127365 102517 8464 -50339 7155 -4266 -70048
7267 -70048 -77976 -54176 -82781 -83196 -36534 -52332 -119499 -110753 50371 113862 153231 145568 -25674
7254 -25674 -136987 -84509 10213 17445 148267 85053 42787 45974 -22615 122122 232773
7243 232773 124738 41117 22618 -109593 45960 38310 -56746 22867 15587 151708 175488
7232 175488 -12046 25462 38753 44161 -70415 -12734 -5740 55968 3387 33075 16263 34905
7220 34905 53193 79724 125057 24767 85307 8349 89343 47229 87986 91785 104917 55199
7208 55199 65111 218606 213566 75151 159275 120598 240650 307204 273278 293333 317699 304624
7196 304624 313578 260681 264503 281281 391306 423134 352579 294252 326784 284335 324778 355946
7184 355946 335105 418250 363136 219854 161601 204858 91351 148907 344414 259214 183303
7173 183303 152413 113231 288763 193643 -28227 52004 146819 191646 151005 166456 242809
7162 242809 312961 337898 278324 194868 211477 225308 263540 290474 309793 195918 165700
7151 165700 175517 76637 80805 119544 196092 162246 196080 209800 290211 189719 -354 72929
7139 72929 32010 113417 119305 129485 103111 256017 270700 267120 186119 49581 87463 103353
7127 103353 45650 60765 168180 18997 140670 158464 129576 89325 131794 217716 178515
7116 178515 91304 53051 -24051 -13142 158673 177189 152940 210781 186346 207317 188350
7105 188350 227794 234757 274718 321150 357063 276984 277140 238557 221002 250509 388893 375108
7093 375108 422635 645916 594451 655028 674567 750834 809902 723397 700039 751811 824310
7082 824310 899884 958892 975455 958141 943535 1036019 1064022 1053964 1093665 1129789 1112661 1230525
7070 1230525 1211769 1117403 1049012 968169 890337 1027693 1040855 877011 842655 862039 794434
7059 794434 803036 846225 754019 871899 968256 961963 1007045 1067762 1198413 1313626 1367459
7048 1367459 1446396 1488446 1737385 1994556 2379775 2616386 2853161 3167976 3317019 3506954
7038 3506954 3559269 3645060 3653413 3646231 3674081 3620945 3544801 3399520 3158435 2853647 2581280
7027 2581280 2308833 2055834 1810897 1529212 1313228 1221193 1161482 997961 961035 880255
7017 880255 904885 860314 661567 742412 716211 740669 664304 668292 761360 532164 549365
7006 549365 547352 471293 491417 431307 425018 474639 422775 373830 375801 314474 225520 303556
6994 303556 367006 301843 248790 84200 106350 157354 170463 139256 174315 273656 293472
6983 293472 260758 222919 120783 37150 53747 114422 81369 150464 175665 145271 162509
6972 162509 138606 143683 134599 78134 48082 36974 44828 -34959 -46365 69130 163548 177043
6960 177043 87727 29744 42763 -37277 -22158 30669 54253 29398 -27861 -38799 -31509 2520
6948 2520 -150447 -106058 45193 -41535 -172636 -123060 -54873 -71232 -33009 -123795 -99241
6937 -99241 -39150 43308 33207 13099 32235 4842 -72718 -57173 -54430 11796 -7363 79672
6925 79672 81382 26306 15711 -67659 -57655 -31416 -101018 -110058 39200 31980 51095 -70311
6913 -70311 -135680 -161055 -135091 -25913 -57482 -26853 23500 -64966 -45604 -173392 -214454
6902 -214454 -147021 -144050 -85325 -33573 13950 60566 -13869 33612 82882 68213 -66622 -98734
6890 -98734 -82859 -79138 -137879 -132173 -77362 -101157 -127103 21072 26385 -80168 -69288 -67776
6878 -67776 -73596 -95134 -112472 -153815 -145312 -87757 -93157 -159971 -204973 -171490 -178082 -173178 -174408
6865 -174408 -202051 -123496 -53646 -61643 -145685 -120770 -94784 -41036 -29460 -107214 -174940 -136294
6853 -136294 -79738 -92290 -56570 -121217 -66559 -88867 -45747 -72903 -170838 -115410 -56051 -148645
6841 -148645 -208400 -9570 -1309 -60963 -62605 -196728 -197124 -70375 -31543 9362 -142051 -129361
6829 -129361 -50225 -79534 -115661 -108796 -126509 -173864 -157434 -135405 -256172 -268678 -190559 -199976
6817 -199976 -220980 -101189 -119822 -78652 44862 -4770 -14152 -34428 -68054 -131543 -156566
6806 -156566 -115853 -108032 -111017 -27594 -129667 -161050 -252166 -168393 -181483 -205850 -101904 -73540
6794 -73540 -90275 -157992 -163937 -157747 -107834 -161649 -183794 -128182 -169558 -260872 -270434 -126441
6782 -126441 -40284 -202512 -153211 -80250 -66036 -39873 -40767 -73454 -53479 -90663 -51790 -122101
6770 -122101 -143027 -103334 -114904 -114501 -73742 -159316 -105932 -60702 -8611 -90305 -174129 -114935
6758 -114935 -149891 -9297 -10191 -25903 48152 -15963 -75148 30984 28276 -10962 -55897 -8071
6746 -8071 -41811 -43185 -10612 14572 71857 200313 168707 167703 131834 58566 98539 -4314
6734 -4314 -31942 -6001 -27351 55925 132223 68373 1854 50443 -28165 -61380 -83231 -200548
6722 -200548 -121770 -118038 -138452 -5163 -14341 -68236 -92709 -100144 -55418 -35569 15996 -28829
6710 -28829 -5493 -81195 -165786 -111856 -40467 -78686 -59253 -25337 1475 -78812 -101575 -17678
6698 -17678 -158696 -80700 -1573 -74814 -116109 -159227 -41143 -77209 -53316 -124541 -209893
6687 -209893 -180560 -83780 -79182 -164403 -45587 5056 24898 -64728 -133869 -63109 -72509 -82062
6675 -82062 -89421 -77025 -15541 -120690 -123923 -66234 -19684 -90830 -151314 -108528 -138064 -96158
6663 -96158 -113291 -125886 -49713 -26368 -50264 -180350 -165407 3782 83775 -10681 -47533
6652 -47533 -159924 -232071 -216128 -187031 -205531 -215272 -142419 -130311 -28026 -47315 -20980 -132497
6640 -132497 -83669 -35058 -102950 -98231 -63545 -91725 -134213 -140995 -88822 -84988 -49577 -40163
6628 -40163 -31904 -47703 -116677 -160045 -202907 -55270 26214 32668 -125078 -78615 -110265 -4163
6616 -4163 113816 -41286 -54651 -27326 -37057 -37377 -97852 -119354 -57137 -41282 -109653 -98209
6604 -98209 -28340 -45861 28717 -24656 -176658 -97655 -16183 -40798 -231206 -215331 -239273
6593 -239273 -174152 -27092 -22382 -81455 -38290 -90211 -45206 -18665 31299 -18992 -44815 -35517
6581 -35517 -122092 20434 -13601 -79355 -164987 -53566 36099 -92485 -10566 -46057 -55755
6570 -55755 -89419 -114581 -24902 -15340 -5139 -63263 -168409 -161268 -69452 -76877 -44306 -6021
6558 -6021 53051 -60677 -43223 -17984 -145079 -148546 -85786 -89719 -77973 -102091 -112012 -94522
6546 -94522 -71007 -80765 -26426 1567 -20215 -51330 -8799 -30719 -150807 -190548 -214002 -207660
6534 -207660 -109841 -112824 -68027 48808 -29244 -134601 -44346 -51390 -127006 -161492 -148625 -81441
6522 -81441 -51914 -70778 -94038 -71658 -105678 -97257 -29393 -37495 -64935 -13489 -45142 -116676
6510 -116676 -133763 -183678 -150384 -86972 -121217 -178491 -115741 -132041 -162306 -208725 -258707 -202964
6498 -202964 -102519 -197865 -114355 -167350 -181316 -93914 -103780 -40345 127888 -20758 -119982
6487 -119982 -75246 -112846 -42667 -69959 -103502 -177748 -201329 -134002 -26780 -104885 -146002
6476 -146002 -253782 -229880 -139099 -135194 -168655 -137918 -142178 -169847 -38788 -73391 -185146
6465 -185146 -245683 -273824 -292207 -254036 -100220 -118657 -101782 -52765 -117908 -107235 -119731
6454 -119731 -93697 -143470 -114355 -76555 -159788 -176894 -132696 -171647 -166323 -131103 -116778 -147752
6442 -147752 -205837 -75833 -63829 -95085 -186672 -200533 -217452 -113982 -58934 -57055 -81028
6431 -81028 -78903 -102625 -11286 45767 -3980 -20528 -21390 29071 32577 -98893 -96087 23041
6419 23041 72476 39738 -71680 -45752 -2293 17909 30023 -105269 -41980 -21847 -177953
6408 -177953 -204301 -158458 -170681 -87108 -52392 -75328 8922 71869 80607 20125 -23194 -5878
6396 -5878 -62345 2655 26779 78030 29263 68197 -69525 -74421 40866 82555 126135 93561
6384 93561 74640 -26538 -3759 -4429 32638 63233 47467 -60337 67037 70633 80919 64851
6372 64851 -63666 -18318 42216 54806 24087 15826 75023 20105 -33278 60676 26858 -148973
6360 -148973 -16108 24902 34456 7939 17503 1515 16066 1318 42751 -8881 49963 172214
6348 172214 56975 -23203 -71411 -19785 71659 -22103 -23603 -21972 -45546 -37274 28963 2718
6336 2718 -35599 93855 117098 144684 124433 41613 118055 58202 54874 28424 90752 181995
6324 181995 106181 -21048 -15658 111620 31789 102806 107069 121571 46031 -45889 64129
6313 64129 107325 68346 103077 148376 145714 124768 169192 288402 240812 226214 208817 74613
6301 74613 133907 111603 142824 60662 12652 57769 -5420 -90196 -9150 -66288 -73898 64739
6289 64739 7314 -56182 -2563 102465 52739 185099 163515 1836 42839 26597 5339
6278 5339 -46534 -69780 -49721 -68562 -95958 -25479 -6014 -22358 57342 -30002 -109572 -29187
6266 -29187 -61768 -156508 -174478 -141442 -111031 -139578 -103762 -49164 -15979 -122141 -190196 -208197
6254 -208197 -154043 -144650 -161382 -74238 -171467 -138929 -101697 -185275 -128471 -53586 -126723 -119577
6242 -119577 -99116 -113109 -160449 -135576 -61517 -27286 -94294 -97627 -53194 -72230 -104720 -142813
6230 -142813 -81697 -87926 -82791 -56584 -144917 -96677 -96471 -116364 -200698 -163455 -177600 -191938
6218 -191938 -159230 -110941 -121424 -34480 -90711 -207595 -92331 -88944 -40941 -81009 -32585
6207 -32585 -50096 -103285 -191870 -193866 -137014 -100892 -52311 -11436 -75981 -129952 -175389 -114427
6195 -114427 -19836 -29496 -63065 -44470 -193555 -211584 -196361 -268033 -258885 -94606 -139019 -190719
6183 -190719 -150902 -233164 -164830 -118093 -232419 -82090 26240 -34069 -80694 -135113 -69234
6172 -69234 -52947 -90297 -91978 27029 -52276 -52739 18704 68881 -27579 -92406 -101720 -18856
6160 -18856 -22531 -247 43057 -12767 73620 20040 -47353 -71458 -20914 -21884 -60903 75009
6148 75009 63202 32641 -82643 -107206 -201247 -167879 -75289 -70425 -51771 8815 -30445 -80590
6136 -80590 -89719 -104214 -189111 -203968 -122590 -77295 35774 -2325 -15950 -102592 -83645 -117998
6124 -117998 75396 -15262 -101136 46892 67364 -13550 -69870 -60072 -70569 -83109 -130603
6113 -130603 -102096 -53952 -86045 -109498 -157822 -98193 65152 4015 65709 31063 -27843
6102 -27843 25079 60941 -66345 -86526 -3881 -10847 -19692 4453 99881 -25379 -15714 59731
6090 59731 138363 -19550 -38915 69090 147485 48619 68829 41343 158667 173707 136432
6079 136432 302683 331118 336280 339713 327817 289617 294344 290629 167183 47829 -14740 -90895
6067 -90895 84777 67071 24333 44665 144769 106620 94966 -5612 39174 -53659 -15575
6056 -15575 -4851 40315 27823 3402 62003 56523 65376 46508 19818 -39576 -213173 -150247
6044 -150247 -8268 2077 13674 -27693 -44358 6908 -18128 29509 -6769 -97139 23387
6033 23387 19031 -11634 -107672 -16071 45352 86248 52575 -68027 -118382 -75012 -109868 -116223
6021 -116223 -110149 -113546 -103387 -61697 8231 43821 71251 76798 -6326 23672 56431 -16513
6009 -16513 -79224 -16860 37820 -57193 1948 55400 -13085 -88602 -104954 -75918 -35947 -22310
5997 -22310 -55419 -29061 1771 30047 -19519 -58234 -32132 -18935 -71981 -33759 -114948 -132282
5985 -132282 -76785 -63013 -83392 -42886 -66180 -96372 -49129 -23736 83912 -14316 -10753 -25217
5973 -25217 148 -35385 8219 113219 43577 44974 65998 8621 -70312 22856 60171 -40680
5961 -40680 -15327 -40745 -41681 -67664 -49121 -8739 -90080 34555 38966 12149 34153 115764
5949 115764 72641 86354 97227 110879 -2628 -37121 8901 -14242 -17211 58939 150066 157785
5937 157785 162012 98173 116953 110992 12660 127454 206387 208372 269478 262626 312916 207361
5925 207361 273448 348152 309600 240589 314975 277567 203191 293236 269642 199885 296726 252530
5913 252530 146720 155537 167574 84306 39401 128082 192594 130745 94766 88085 -39728 11911
5901 11911 109799 136344 159499 136662 165754 177444 194688 255149 229449 308735 294095 242198
5889 242198 166555 153237 167338 66263 100682 54188 23112 68302 21284 78947 190940
5878 190940 143890 150659 152359 175863 209772 262598 175903 248865 277128 173917 233469 314690
5866 314690 374453 409235 484826 579233 614376 621124 576839 557234 572115 671951 622064 577123
5854 577123 540204 574982 567230 588485 592864 549425 499357 319770 136872 171836 212118 68138
5842 68138 118947 107466 173228 223508 106495 71733 115872 132910 78490 48306 91566 12408
5830 12408 -16855 3921 -19238 26884 39734 34246 53947 37755 134131 111448 121280 30383
5818 30383 81513 119870 193250 71101 -7647 89869 51122 56997 119002 91142 144993 92503
5806 92503 90537 93563 81254 89805 106455 -74490 -79712 121521 143962 89290 110809 119714
5794 119714 73736 24806 12253 59140 -4571 -32654 -23732 -16872 32275 117938 26602 88048
5782 88048 -10957 -70206 -6680 97940 27837 96273 154271 184407 82998 86232 -35378
5771 -35378 45009 112064 -9770 75600 142098 107885 56424 101902 44804 133673 7563
5760 7563 53662 80750 48172 117349 259833 201136 43533 68835 204580 207834 12011
5749 12011 -35138 13030 50135 5060 -15488 -55073 91772 167892 53788 135325 148712
5738 148712 42368 145600 63324 38920 144799 118003 161799 146981 166308 282983 425439
5727 425439 406191 301253 192567 244107 279124 192879 161749 208204 239665 245151 334436
5716 334436 444373 519635 532129 501138 535604 626272 623971 658423 666757 827432 1036547
5705 1036547 1004307 930137 977851 1161196 1129894 1040403 946320 913808 975725 1001978 1081351
5694 1081351 1146422 1124952 1051876 1062871 1003692 878438 805676 823482 811294 736767 714658
5683 714658 639906 552156 495835 449192 373192 339134 329330 258205 235177 269127 241518 200681
5671 200681 332885 284447 352772 418998 386231 393640 326384 247262 164750 200149 263434 349975
5659 349975 358103 293708 373457 364565 239150 325041 399357 324870 240318 310460 419041 452160
5647 452160 463435 413636 351997 460481 532167 486484 434799 419063 475724 439650 431480 428348
5635 428348 379915 412211 415975 425232 484891 448469 400240 376760 420352 625714 708097 578706
5623 578706 699665 725076 612697 423216 442611 468549 529112 606337 624323 616470 580621
5612 580621 588119 613741 657816 605375 568532 560571 641119 595822 694409 654629 646694 593820
5600 593820 527474 521680 621010 635930 635022 707325 731792 795861 638128 678562 715277 614906
5588 614906 717808 786788 693347 647981 673828 646196 712800 725685 766090 717850 695351
5577 695351 730437 794342 766672 704796 688039 688439 757407 805209 831950 885287 932496 892844
5565 892844 999823 940466 868929 825265 783809 944839 933463 881312 1062710 1136136 1288214
5554 1288214 1150156 1168708 1289955 1217251 1319082 1344897 1337114 1188283 1229064 1279094 1250437
5543 1250437 1339093 1360119 1367593 1392654 1298461 1404797 1552065 1649645 1533706 1544216 1525689
5532 1525689 1575600 1624850 1629160 1720782 1739755 1714913 1776706 1779199 1795499 1822500 1892394 1855458
5520 1855458 1863770 1948234 2024185 2015510 1903228 1988861 2097946 2126874 2178382 2311550 2314292
5509 2314292 2370296 2377413 2383774 2436197 2505102 2504447 2428131 2361386 2497827 2558070 2534749 2581006
5497 2581006 2746183 2836007 2859537 2880513 2857035 2863621 3044671 3030106 3123656 3177470 3264574
5486 3264574 3285883 3442280 3505310 3573016 3706068 3771164 3802395 3854638 3980984 4122952 4210092
5475 4210092 4391743 4566346 4696727 4812539 5078449 5355551 5528984 5700914 5958818 6142916
5465 6142916 6449927 6735593 6925229 7347373 7524761 7793381 8083302 8286474 8400057 8615553
5455 8615553 8894880 9110669 9287668 9505202 9822097 10130738 10449006 10779865 11005150 11265690
5445 11265690 11588691 11904815 12105384 12352520 12697135 13112774 13509811 13816495 14148756
5436 14148756 14702237 15116663 15566809 15976628 16448235 16982317 17569102 18023829 18521436
5427 18521436 19040231 19570386 20097501 20701771 21361277 22018816 22677870 23413659 24257157
5418 24257157 25070488 25969291 27009389 28114843 29256430 30406684 31739329 33272542
5410 33272542 34902145 36616521 38611058 40849880 43321431 46241072 49323394 52938521
5402 52938521 56944649 61489204 66566458 72326393 78948760 86577776 95323193 105587345
5394 105587345 117606270 131243382 146511489 163044953 180361424 195967448 205190454
5387 205190454 205458300 199190073 190548404 182634829 178019927 177540857 181004303 186815868
5379 186815868 192615765 194795440 189569439 175522497 156095450 136463414 118616325
5372 118616325 103113647 89997416 79346029 70428067 63051058 56823939 51507296 47050496
5364 47050496 43173990 40005144 37328045 34817072 32690425 30664833 28827076 27183053
5356 27183053 25629612 24287894 22998739 21798535 20761879 19770580 18889144 18045192 17278453
5347 17278453 16536697 15858505 15258483 14574025 14076269 13631236 13143188 12763489 12322433
5338 12322433 11895675 11505192 11273124 10952283 10638501 10381627 10045701 9735872 9440634
5329 9440634 9273115 9116822 8836474 8551725 8367741 8152169 8026820 7818149 7677576 7415342
5319 7415342 7338465 7104087 6917562 6777180 6530465 6380519 6303068 6251840 6019291 5844264
5309 5844264 5760962 5700138 5642771 5496536 5383244 5299345 5216588 5106389 4977574 4949245 4770538
5298 4770538 4717876 4707543 4596125 4597164 4614905 4545789 4424870 4384069 4281411 4236805 4127263
5287 4127263 4119266 4103991 4047244 4132059 4135129 4069995 3961073 3942837 3987010 3993792 3937909 3948800
5275 3948800 4006101 3956403 3986234 4089831 4203073 4130682 4041920 4104723 4130325 4201479 4262852
5264 4262852 4321604 4273835 4225032 4354741 4420658 4466833 4613741 4742840 4822609 4812061 4839336
5253 4839336 4891382 4798604 4927607 5036428 4976959 4940357 4849213 4823963 4696172 4590771 4519787
5242 4519787 4441512 4392781 4474609 4369505 4358671 4388041 4409992 4502636 4470390 4540262 4674154
5231 4674154 4766881 4759721 4948606 5122662 5301208 5498584 5704195 5913948 6230090 6484811
5221 6484811 6443095 6413316 6483958 6543198 6504615 6560573 6801170 6971252 7213909 7307938 7306680
5210 7306680 7394590 7430280 7438890 7424520 7494894 7572823 7615528 7704961 7912289 8102901 8140148
5199 8140148 8324243 8606057 8840491 9274379 9675101 10182570 10566957 11077668 11763418 12500368
5189 12500368 13098948 13675856 14109150 14432834 14749093 15005826 15170102 15147072 15072442 14918676
5179 14918676 14716626 14397689 14113352 13790440 13460744 13408927 13306898 13393351 13490130 13696609
5169 13696609 14078478 14518040 14906939 15372860 16032714 16788331 17765196 18888721 20129350
5160 20129350 21530499 23153538 25053755 27110818 29438577 32282387 35489757 39203101
5152 39203101 43532856 48742497 54937650 61757912 67163921 68386903 65151583 60305536
5144 60305536 56079946 53408341 52340168 52654463 54053104 56730907 60660577 64245997
5136 64245997 64528229 59914147 52382396 44792946 38437457 33262760 29152333 25794893
5128 25794893 23126447 20881395 18921664 17109481 15664445 14478101 13419737 12626393
5120 12626393 11917638 11283085 10582873 9984151 9610162 9290975 8771405 8424765 7927593
5111 7927593 7509607 7169591 6830260 6478687 6091402 6055485 5913726 5665262 5589338 5366023
5101 5366023 5178823 4996705 4881394 4705529 4576407 4442688 4381864 4237891 4140016 3958572
5091 3958572 3890899 3790183 3697264 3610683 3551562 3446931 3432223 3422596 3391486 3375436 3251724
5080 3251724 3329115 3359150 3170811 3047511 3057043 3140824 3323721 3298137 3223898 3219098 3226089
5069 3226089 3198792 3253964 3232401 3152948 3125225 3124561 2923441 2841038 2679920 2674753 2670601 2624680
5057 2624680 2526077 2386798 2410869 2389296 2235891 1997288 1871886 1792217 1681979 1686163 1623058
5046 1623058 1556015 1510553 1520468 1495481 1537821 1292577 1213658 1215547 1229993 1344800 1241606
5035 1241606 1027238 1135347 1152744 1081165 1036073 1107909 1103341 995473 930046 910490 854086
5024 854086 833175 793006 963051 906042 831338 939845 869687 798260 849541 911401 833169
5013 833169 784337 790920 790723 748015 732074 687011 636101 612574 622768 719942 673118 616952
5001 616952 656623 613777 632079 680150 672229 689736 838705 813033 795360 681854 764069
4990 764069 669190 705101 602296 563367 531200 456344 521017 510170 483101 509498 533317
4979 533317 510825 559889 563157 442098 527550 526400 513905 585052 596661 606835 539058 389530
4967 389530 411614 474478 598869 591024 589621 519790 554449 476381 408252 440878 378656 399866
4955 399866 426389 436846 469004 390492 308326 449383 449371 462986 464045 487280 551386 448790
4943 448790 429371 382481 262593 254385 322416 393083 366854 303550 298060 278682 317781 419543
4931 419543 360814 402373 336138 420526 501102 374995 310410 299684 243869 308938 319168
4920 319168 417208 489704 352583 270588 271956 322579 468455 451968 414041 372279 342673
4909 342673 470597 429844 337908 312078 309277 271119 224530 209688 154776 217271 314911 319662
4897 319662 320431 286534 248695 312878 364927 353702 241904 257545 354939 282858 239707 258420
4885 258420 285378 306767 314761 374240 361555 373727 319978 366362 381209 262178 375979
4874 375979 406718 357991 361312 334371 362329 418554 463236 459844 385060 299457 321695 333338
4862 333338 295155 332802 344843 297815 317913 299294 318793 329056 370191 431851 389319 355394
4850 355394 283724 336331 357929 316214 304945 251203 285991 147490 202044 303005 319945
4839 319945 372924 377782 392974 410107 434772 460355 563483 565299 519855 412008 396002 434440
4827 434440 456440 386274 357826 393069 441319 568689 579596 514524 449309 412910 473115
4816 473115 462708 454794 365480 301943 256729 160885 222929 288020 385726 260918 256612 185072
4804 185072 139042 172264 143833 177719 151388 111242 112827 166926 207187 236002 232884 288323
4792 288323 257636 257823 196075 154742 164942 156241 20320 152740 254642 206264 257624 196506
4780 196506 128365 164530 152847 153937 140629 72458 163533 135108 59106 27474 166109 152093
4768 152093 110053 174779 160461 166808 180490 303020 261640 231700 215774 147035 146142 180371
4756 180371 150407 116828 148417 176174 279664 355632 273851 132619 156320 229242 176087
4745 176087 106333 157388 163643 159710 153798 127945 135999 95795 151541 204135 206535 253698 202982
4732 202982 276923 351202 268336 251130 169502 287863 199085 134176 59697 110132 126951
4721 126951 211147 304499 273136 261839 202918 194285 216887 116584 90395 125476 252795
4710 252795 185984 238149 309636 258651 146441 215152 368344 272849 309521 136004 128378
4699 128378 285261 290851 256076 247011 286353 273454 233896 369300 356272 348554 371953 432534
4687 432534 448474 365256 350958 380372 358458 395086 411866 442838 407505 438658 368475 380878
4675 380878 425451 460531 379477 472120 462643 544767 605740 553644 508316 456343 590869 638883
4663 638883 589231 610823 647910 637727 661041 679011 706778 664104 607118 595973 643390 569821
4651 569821 548843 550550 548937 593134 632344 666314 551678 620205 565863 589932 535855 555630
4639 555630 497757 454772 440836 544007 570503 676508 674486 566122 612374 626548 771103
4628 771103 850087 875571 775146 857149 854885 855641 899664 814224 772536 786479 764816 876172
4616 876172 862092 971158 995242 973666 855594 927127 898253 961805 1015465 942388 985629
4605 985629 990050 928655 930758 847717 903044 936342 865081 792148 672328 795876 833693 736829
4593 736829 686159 723654 751338 750064 651010 616261 577755 608529 569355 543930 610466 561721
4581 561721 524095 541506 424783 433746 349769 380493 465395 475558 569294 557541 532476 545816
4569 545816 562202 598426 593259 527235 457972 441970 477549 426943 451199 467332 420336 330142
4557 330142 454119 442329 453557 501547 526772 500600 500500 483672 439572 416145 463665 437401
4545 437401 358529 458263 549914 418173 409460 499332 529689 591177 591702 574145 598361 548070
4533 548070 533712 459463 502777 494068 488852 565621 573669 547923 573600 578774 548348 562396
4521 562396 527633 574747 516047 430751 545768 575331 488609 539234 577370 571508 486811 497014
4509 497014 555577 525271 540369 602429 479617 477700 500716 448811 533933 615314 566072 594961
4497 594961 558082 622266 609451 589906 535116 597545 571742 545416 588039 556905 521534 453265
4485 453265 425409 443089 432417 430737 416040 408032 259425 237053 403056 445894 465470 469500
4473 469500 537456 493326 471237 487895 429122 356852 395790 385247 396164 346725 283423 407372
4461 407372 492799 365149 356969 446767 445339 486140 403047 400941 353367 380936 431852 308204
4449 308204 282364 322328 365780 379310 357188 357535 334732 294830 345208 326050 395476 358572
4437 358572 265636 319214 318500 392669 381056 402247 384030 332149 456054 350677 324542 428054
4425 428054 468353 550623 473821 512706 505325 532701 500900 392590 410745 446537 411941 383099
4413 383099 328570 416635 349637 266556 259902 248104 378316 414898 393302 305194 317137 348097
4401 348097 431709 517819 289414 266823 432780 387045 319446 185467 253067 358766 351051
4390 351051 422670 417805 359530 462579 446120 456630 420799 435850 471995 419598 404720 490066
4378 490066 519444 513020 478828 459519 538162 606778 652224 511825 537545 557875 576369 721275
4366 721275 719188 685076 623660 501893 619747 713526 749874 744729 661749 640021 687814 652373
4354 652373 643820 771486 752462 828477 768368 787448 792031 780403 839620 863268 835625 952230
4342 952230 826132 744552 715152 734454 703793 807832 890495 822224 763905 791317 835363
4331 835363 873837 956646 928286 899662 938695 869901 872474 932531 948102 1025787 1061643 958300
4319 958300 999965 1094377 1010529 898073 907012 1005280 914143 917752 953639 1000913 1023544 1018876
4307 1018876 916065 993497 1149459 1188613 1117381 1125147 1107402 1081287 1084419 1137155 1119820
4296 1119820 1146443 1123530 1207243 1156674 1223742 1238947 1197131 1260337 1156993 1163101 1192188
4285 1192188 1259807 1269711 1172542 1246812 1199135 1232236 1205567 1330870 1402410 1309565 1372968
4274 1372968 1313094 1301253 1280586 1364582 1369559 1339386 1467771 1536999 1606977 1658483 1686138
4263 1686138 1645172 1582047 1656851 1703736 1715818 1691484 1740863 1790481 1835776 1798587 1832324
4252 1832324 1870682 1886970 1943784 1891760 1896340 1859087 1902653 2011230 2063584 2146539 2235220
4241 2235220 2274694 2305845 2125784 2165594 2293710 2246713 2296726 2327747 2276005 2260698 2245599
4230 2245599 2390116 2421069 2409611 2396714 2404664 2481573 2498802 2629520 2616215 2493759 2513255
4219 2513255 2515813 2444295 2546981 2580325 2639924 2555046 2693829 2663402 2733697 2833083 2794142
4208 2794142 2787542 2818555 2945412 3009048 3050518 3079265 3148119 3236959 3238732 3217217 3333096
4197 3333096 3361318 3381302 3376318 3464072 3545085 3678024 3997825 4180418 4296946 4420637 4529645
4186 4529645 4713390 4696473 4662060 4395708 4176244 4131454 3855412 3694927 3524280 3457932
4176 3457932 3494995 3436548 3362288 3332946 3373105 3418936 3380795 3401310 3437490 3554766 3583718
4165 3583718 3614593 3703333 3696151 3644539 3596817 3577479 3625103 3647485 3618930 3815384 3983153
4154 3983153 3935618 3931774 4115924 4080275 4091135 4077124 4066841 4197763 4291772 4329910 4359909
4143 4359909 4498810 4482344 4562208 4624403 4731702 4682324 4680668 4769748 4852028 4874216 4903115
4132 4903115 5045633 5243757 5394396 5414648 5691909 5833862 5918680 5991739 6129819 6280956
4122 6280956 6339098 6505652 6723651 6879453 6980361 7181046 7491969 7601567 7837933 8084492
4112 8084492 8268711 8508930 8643504 8767338 8770292 9070575 9356400 9468143 9734702 10030868
4102 10030868 10292365 10594051 10948168 11191715 11432265 11714629 11896470 12051139 12394214
4093 12394214 12696643 12982492 13276540 13552025 13939239 14319942 14646168 15041299 15450592
4084 15450592 15871922 16349045 16822703 17351478 17787542 18369734 19010718 19652526 20157107
4075 20157107 20894422 21724516 22558855 23544733 24591307 25817499 27083345 28534319 30225002
4066 30225002 32151664 34316001 36677462 39297671 42599040 46338537 50533606 55165523
4058 55165523 59948955 65051222 70368968 75213782 79209846 82069234 84133667 86093413
4050 86093413 88970975 93038110 98415826 104676069 111556847 117348376 119467858 116358690
4042 116358690 110180067 103993929 98537954 94574268 92224057 91515464 92240731 93952616
4034 93952616 94952638 93222091 87038275 78344954 70401735 63802795 58550762 54310523
4026 54310523 51057783 48823501 47472338 46842827 46130730 44255814 41276139 38349418
4018 38349418 35776635 33874199 32365795 31172282 30315349 29673085 29000967 28537010 28150335
4009 28150335 27860332 27839036 27889504 27876473 28011108 28175650 28340317 28547320 28804882 29091289
3999 29091289 29462877 29853143 30273721 30918973 31485166 32086217 32697324 33326686 33965002
3990 33965002 34700379 35497966 36462975 37425355 38361512 39416602 40696097 41845446 43190429
3981 43190429 44560855 45918430 47447736 49043964 50845233 52602265 54444767 56516286
3973 56516286 58704177 60917929 63268679 65690107 68185920 70765007 73475008 76250428
3965 76250428 79193382 82196553 85266021 88587057 91953177 95407288 98850472 102267440
3957 102267440 105726986 109133320 112556066 115893832 119184990 122430650 125567417 128667937
3949 128667937 131605255 134482267 137489910 140353851 143103677 145811044 148246444 150627608
3941 150627608 152581363 154091523 155399157 156475811 157297850 157943160 158452726 158760357 158869348
3932 158869348 158797405 158542904 158022722 157216902 156429641 155443503 153997761 152412019 150571009
3923 150571009 148556905 146395118 144009567 141470828 138864561 136167996 133389339 130646055
3915 130646055 127798577 124865864 121958383 119059755 116058079 112994242 109911362 106757608
3907 106757608 103616106 100499555 97334069 94328724 91194517 88218042 85244572 82245765
3899 82245765 79416986 76748991 74179798 71570348 69020625 66473174 64169505 61715559
3891 61715559 59424676 57178932 54966222 52744695 50499621 48404151 46480529 44558000
3883 44558000 42751664 40968567 39447265 37872247 36296096 34935382 33565049 32185618
3875 32185618 31084694 29896298 28628590 27484323 26388221 25389648 24369899 23516232
3867 23516232 22749184 22044172 21277088 20690792 20007340 19323824 18742279 18275009 17818903
3858 17818903 17433997 17042357 16698852 16367530 15970899 15569346 15336185 15160605 14877265
3849 14877265 14595258 14442556 14290251 14043116 13925521 13859485 13677769 13512721 13504059 13399346
3839 13399346 13272944 13234452 13103306 13080523 13182093 13240842 13287602 13306843 13312160 13284394 13304527
3828 13304527 13372927 13390281 13351942 13400390 13457371 13396613 13427090 13467311 13474839 13353038 13407307
3817 13407307 13496859 13404451 13509786 13639747 13601906 13510677 13527239 13642038 13609743 13698789 13663889
3806 13663889 13713300 13835581 13785633 13840917 13841697 13943013 14030465 14169641 14272893 14267884 14366489
3795 14366489 14400931 14554878 14753703 14980283 15258088 15346069 15511861 15708009 15969137 16260552
3785 16260552 16530186 16717903 16995186 17363213 17679605 18011865 18228259 18552301 18859681
3776 18859681 19234906 19652399 19911628 20218122 20732859 21196356 21603788 22095141 22497623
3767 22497623 23128399 23495853 23967968 24452143 24956817 25491423 26048167 26489879 27028172
3758 27028172 27668747 28159224 28792083 29374634 30101535 30816994 31484273 32230215 32991418
3749 32991418 33843417 34702452 35511104 36410100 37365960 38337845 39409135 40520370 41647115
3740 41647115 42832379 44109634 45460675 46881127 48470255 50178433 52006957 54047405
3732 54047405 56224145 58584305 61307738 64219872 67412554 71088262 75215371 79914663
3724 79914663 85135384 90905726 97322690 104540281 112603744 121519737 131543579 142710268
3716 142710268 155157772 168818562 183904443 199806523 215892661 231058218 244048980
3709 244048980 253913080 260056619 262677168 262160233 259655376 256132653 252405755 249181105
3701 249181105 246652358 244855906 243657287 242876792 241945892 240417159 237518206 232739338
3693 232739338 225033263 214457256 201325325 186397759 170697455 155095024 140506429
3686 140506429 127317727 115836929 105921037 97230260 89868336 83394487 77636884 72810504
3678 72810504 68576598 64714047 61303144 58591709 55938196 53618389 51520295 49544130
3670 49544130 47910587 46355916 44770251 43293026 42027823 40967924 40136221 39264044
3662 39264044 38495705 37773199 37135166 36652292 36263389 35752407 35228238 35022196 34756705
3653 34756705 34465505 34361818 34207861 33988942 33805278 33683779 33685685 33717835 33757467 33624755
3643 33624755 33633492 33739608 33827265 33894094 34024628 34111522 34498246 34628560 34799693 35088181
3633 35088181 35426116 35717675 36088967 36416052 36950277 37411561 37850069 38469125 39066780
3624 39066780 39785449 40498119 41241592 42172529 43104826 44163574 45200292 46228405 47329815
3615 47329815 48503226 49833723 51091052 52513613 53923771 55387002 56804387 58211780
3607 58211780 59593331 60999166 62542620 64185000 65925117 67819852 69614629 71441409
3599 71441409 73184521 74956843 76655622 78219365 79784742 81306091 82642846 83938115
3591 83938115 85211813 86673781 88144890 89565468 90852807 92210769 93687260 95016616
3583 95016616 96312496 97729426 98957713 100208397 101445807 102658925 104072062 105658165
3575 105658165 107080932 108735113 110682789 112758548 115060732 117625925 120540102 123662927
3567 123662927 126969468 130932776 135414950 140346049 145862857 151859065 158566142 166037002
3559 166037002 174269759 183471825 193524273 204449744 216401272 229548795 244078571
3552 244078571 259905647 277216570 295922219 315928124 336354987 356304130 374715919
3545 374715919 390861307 404678976 416332143 426076498 434401233 441587578 448244547 454973253
3537 454973253 461848609 469155050 476748182 484218763 491211315 497131851 501561825 504286650
3529 504286650 504521054 501274958 494261381 484000483 472387576 460819698 450095592 440480865
3521 440480865 431682075 423355477 415583061 407643112 399567942 391225697 382239111 372946158
3513 372946158 362869700 352372663 341403221 330078384 318750485 307645367 296855173
3506 296855173 286452994 276706180 267518706 258687088 250216449 241798132 233544507 225433804
3498 225433804 217674494 210202072 203058767 196452956 190398620 185052463 180666170 177652652
3490 177652652 175837979 175246978 175777056 177327650 179546954 181958287 184313776 186242954
3482 186242954 187487233 187693830 186751193 184874082 182076706 178985730 175774237 172839411
3474 172839411 170206073 167985542 165956832 164199635 162384153 160205682 157443693 153578757
3466 153578757 148697551 142945190 136434171 129397673 122332149 115200863 108396441 102186064
3458 102186064 96509697 91353247 86625681 82432351 78605605 75163683 72042187 69142947
3450 69142947 66705613 64372744 62280772 60335800 58472640 56593890 54654624 52733327
3442 52733327 50788357 48819967 47054695 45286092 43453571 41763380 40209500 38785505
3434 38785505 37412696 36172021 35019544 33872072 32878182 32016963 31042376 30167863 29245444
3425 29245444 28459220 27754073 27031590 26289010 25565729 24935260 24337988 23801330 23142193
3416 23142193 22650783 22198881 21586374 21192175 20740339 20274594 19913121 19491599 19241109
3407 19241109 18888061 18534955 18243162 17858607 17385963 17156093 17012626 16690815 16226818
3398 16226818 15976631 15666034 15396879 15079833 14890800 14647488 14423020 14289308 14072697
3389 14072697 13806933 13607677 13451231 13289045 13176805 13002588 12861927 12689529 12494026
3380 12494026 12368729 12324847 12174970 12091854 11920057 11920178 11876374 11764508 11702698 11611122 11479774
3369 11479774 11388124 11378572 11337090 11255517 11138328 11048376 11089473 11114695 11075658 10992104 10912164
3358 10912164 10764893 10725709 10822987 10807341 10693447 10773833 10793145 10701336 10660730 10686599 10730375
3347 10730375 10780169 10733642 10694172 10660567 10647674 10680697 10725442 10710215 10721309 10639317 10595257
3336 10595257 10596063 10567491 10549225 10627558 10719350 10725572 10637910 10609116 10679403 10660461 10743706 10718045
3324 10718045 10777596 10770785 10915420 10840223 10778876 10800056 10835413 10972377 10951665 11092078 11126266
3313 11126266 11076078 11100045 11200070 11339432 11399021 11339821 11336526 11436635 11574543 11675153
3303 11675153 11664832 11607239 11691183 11811274 11803966 11731051 11921699 12027397 12064333 12168873 12206481
3292 12206481 12248280 12304494 12323036 12351928 12458422 12491584 12577654 12709392 12684865 12729436 12730639
3281 12730639 12829247 12913797 12972520 13120682 13110578 13210899 13322768 13463372 13434817 13593364
3271 13593364 13728643 13982478 14132802 14181527 14279936 14306769 14404595 14485691 14701533 14811027
3261 14811027 14909193 15053793 15178635 15315119 15456496 15742068 15978615 16096746 16152341 16245798
3251 16245798 16310011 16470719 16572973 16607512 16701484 16752429 16728336 16896086 16902540 16978144 17142877
3240 17142877 17108738 17057816 17064736 16975614 17000130 17086430 17029712 17059275 17041705 16962774 16940324
3229 16940324 16961658 16841031 16920917 16979880 16919027 16957637 16880298 16689497 16639972 16665895 16692666
3218 16692666 16571572 16487210 16447570 16374540 16410410 16411737 16388229 16289949 16256339 16222673 16131090
3207 16131090 16169838 16166021 16177572 16193897 16240118 16227419 16302101 16244011 16298220 16124793 16138569
3196 16138569 16276262 16334780 16210067 16265251 16311843 16340033 16409061 16405722 16559959 16486164 16625126
3185 16625126 16609040 16631959 16676189 16672741 16567642 16361222 16116662 15822331 15672126 15418416
3175 15418416 14964454 14717819 14501442 14321365 14003695 13714411 13555349 13342794 13229555
3166 13229555 13024414 12802930 12609738 12467131 12397101 12214389 12021382 11839742 11712400 11712972
3156 11712972 11532033 11292509 11356750 11205117 11038483 11030428 10902244 10727401 10575122 10547671
3146 10547671 10300459 10190709 10053834 10001955 9793092 9718713 9652313 9583498 9401220 9353534
3136 9353534 9375392 9242679 9157521 9008062 8938269 8801216 8770756 8672351 8552742 8475381 8322550
3125 8322550 8207518 8228620 8168300 8103255 7872409 7805259 7737691 7702291 7578454 7479279 7544119
3114 7544119 7431636 7350321 7260834 7181849 7171440 7034561 6993652 6988615 6844728 6736449 6671063
3103 6671063 6612829 6622439 6596467 6514853 6531722 6439256 6289739 6241969 6267319 6225549 6023700
3092 6023700 6053191 5969113 5936603 5863096 5811190 5749738 5628497 5563322 5536424 5502860 5514607
3081 5514607 5441006 5334190 5339650 5307280 5307319 5279694 5279699 5368802 5318065 5311822 5323425 5316706 5283218
3068 5283218 5137134 5243155 5308820 5381616 5308843 5147470 5035956 4870943 4758955 4650481
3058 4650481 4681028 4521786 4480813 4583880 4538198 4480687 4408763 4384736 4337627 4265543 4215002
3047 4215002 4313239 4314790 4249880 4217004 4224117 4102326 4143068 4250373 4270540 4295454 4331347
3036 4331347 4179807 3989049 3938700 3763434 3856193 3818921 3711320 3667793 3632515 3576249 3389711
3025 3389711 3481609 3460769 3464609 3500626 3426097 3355681 3348150 3272006 3256059 3180565 3077165 3090053
3013 3090053 3085024 3133416 3130909 2994572 2933705 2893201 2907061 2750276 2759580 2999614 2959776
3002 2959776 2900592 2882091 2874461 2853470 2882185 2749231 2771437 2910770 2835502 2808196 2794851
2991 2794851 2710000 2645881 2710570 2730476 2771009 2747721 2805071 2700899 2740545 2773190 2752232
2980 2752232 2787494 2689559 2745912 2693009 2608523 2613238 2610010 2627671 2647982 2652841 2640941 2616610
2968 2616610 2694071 2738767 2786617 2796344 2779719 2837333 2842515 2801357 2787735 2824348 2880525 2966301
2956 2966301 3061505 2999666 3025301 3125131 3184376 3155859 3141936 3205739 3284653 3371966 3536339
2945 3536339 3488849 3572224 3677773 3671677 3782774 3959066 4032270 4042538 4020794 4011265 4065186
2934 4065186 4008667 3856025 3845961 3803759 3762988 3729215 3681148 3587621 3539807 3472042 3479696
2923 3479696 3545469 3620137 3642248 3642307 3689485 3665892 3767740 3724097 3785374 3850247 4033183 4243483
2911 4243483 4433856 4568373 4795950 4972286 5222491 5468460 5698720 5804898 5675908 5800297
2901 5800297 5914152 5742061 5469636 5354452 5086191 4986669 4828054 4649587 4508150 4209236
2891 4209236 4035529 3857826 3700828 3532889 3406702 3289702 3293651 3236106 3128172 3141009
2881 3141009 3226441 3162404 3183088 3173962 3227055 3408533 3449842 3514431 3636520 3642773 3705958
2870 3705958 3815884 3946504 4088112 3982746 3976569 3917553 3886676 3821263 3622195 3444020
2860 3444020 3355536 3190871 3178841 3098292 2923257 2754959 2611620 2570038 2400352 2281278
2850 2281278 2268462 2168470 2115626 2052487 2092063 2124156 2129898 2012870 1855919 1905837 1845374
2839 1845374 1827249 1848397 1713788 1687054 1721046 1710305 1747955 1595725 1524027 1440702 1497292
2828 1497292 1618072 1629326 1668027 1575722 1633887 1604390 1517521 1500742 1572326 1517628 1486951
2817 1486951 1516337 1451640 1422278 1339850 1448649 1526647 1510579 1433808 1434079 1369489 1355509 1399999
2805 1399999 1540264 1541756 1617129 1625552 1559039 1481720 1452554 1392733 1336012 1365395 1332322 1269558
2793 1269558 1274360 1170639 1068489 1111668 1142423 1184830 1077205 1048560 1007681 998181 999635
2782 999635 1102243 1082299 1017817 966816 984646 957361 883615 802758 727787 755133 731082
2771 731082 804844 932719 910528 881174 805920 737199 768355 815119 871839 886085 774578
2760 774578 735372 778674 878338 777087 748891 803035 639674 557645 682340 733078 805298
2749 805298 788732 749370 727455 616104 688614 576420 649156 595509 701030 744753 670970
2738 670970 621866 591768 576577 500795 628759 701995 636371 539596 602669 539974 491071
2727 491071 493693 467693 489113 488011 526996 598857 553902 636506 584503 547072 578421 544141
2715 544141 577308 504712 482594 470472 562319 522274 517665 473920 419057 430254 439055 454802
2703 454802 576024 577122 456477 561074 606783 524801 431014 479851 454605 438706 472389
2692 472389 575359 480797 467951 447271 470037 498649 419392 472166 519114 645784 610072
2681 610072 602548 522568 443131 540819 529344 518491 490575 466054 413620 545050 503165 374430
2669 374430 449658 471257 479223 522055 598678 569319 465600 445941 476931 472189 577292 551254
2657 551254 504695 575048 398142 333159 277991 361608 400736 304300 318723 427407 524912
2646 524912 445541 407731 416831 486442 436686 453978 557342 582157 568575 551285 498605 388132
2634 388132 417465 440445 524131 459707 482474 574044 609078 579832 545600 570158 542828 571756
2622 571756 528402 566735 555334 675403 670601 549627 434888 450068 553612 638861 503567
2611 503567 561998 541546 628817 544093 481278 549924 597226 664144 642748 638398 740796 779973
2599 779973 767846 743620 587830 775644 811208 754667 820452 868503 799547 774969 861729
2588 861729 942185 950404 979469 930880 950531 1040836 1053318 1093684 1145147 1127772 1082876 1015679
2576 1015679 1077294 1081149 1084588 984458 983692 1124898 1167686 1256956 1290926 1344704 1307099 1355446
2564 1355446 1454157 1377070 1335052 1368331 1431800 1364844 1399373 1503388 1551659 1587517 1655204
2553 1655204 1655879 1617308 1593659 1539983 1595655 1526262 1471403 1502313 1637784 1754208 1708715
2542 1708715 1692257 1657336 1568885 1573674 1576698 1597513 1606386 1629436 1652648 1693607 1753414 1785985
2530 1785985 1855614 1981288 1878284 1865294 2049969 2120733 2177031 2015262 2091563 2038173 1975058
2519 1975058 1917167 1844110 1862282 1745963 1738492 1848948 1769302 1684775 1608626 1660204 1624539
2508 1624539 1560053 1637092 1445633 1416009 1451327 1426637 1496680 1524404 1471375 1344339 1395039
2497 1395039 1481844 1441405 1397765 1406151 1518841 1419820 1401945 1446537 1476782 1623276 1672166
2486 1672166 1517134 1386254 1277525 1167524 1187514 1103116 976114 907566 867194 877794
2476 877794 932737 879898 792832 860921 851381 781740 856973 877284 815134 749364 752045 711772
2464 711772 732645 801741 780725 719063 670066 678180 686410 649741 743040 749331 727610 656964
2452 656964 618931 641475 513518 496789 492262 465568 433215 335386 368816 413643 480629 433709
2440 433709 328985 395009 368529 375574 315754 265681 225946 272597 211433 351741 259540
2429 259540 275612 304258 257464 222401 274777 256368 281015 243078 213647 228828 152970 164572
2417 164572 222671 224141 87842 215681 228561 132210 135610 115108 116339 14814 30527 117684
2405 117684 106517 178776 160604 101581 -30961 39534 180568 170023 237303 213731 152323
2394 152323 139663 163631 178844 177985 147530 81154 4134 -61015 20799 44042 126665 160816
2382 160816 82496 209163 298390 157448 163633 210051 277302 220321 57502 32102 125658
2371 125658 199882 221700 137612 196999 155547 35072 27987 35104 -23716 -3446 51269 147635
2359 147635 117439 100231 198828 143352 114350 170501 71868 79703 205106 209837 170795 208008
2347 208008 164133 160966 158013 21929 36085 69401 -43725 88558 68606 73557 151068 94021
2335 94021 108866 180844 160459 39042 127271 151978 179040 189060 143591 155688 119126 124901
2323 124901 144513 146454 100160 149496 143986 154989 195042 184094 236103 260584 231683 226209
2311 226209 281718 264731 167612 157843 198963 183135 138212 179711 194887 186023 208195 131699
2299 131699 84670 52599 49890 129194 202987 81694 145648 166747 101077 136916 47954 16137
2287 16137 64405 36641 39910 40738 24875 -33350 5112 64217 127467 156507 186875 161973
2275 161973 162585 124294 47791 105418 205544 253399 182041 148284 95240 145984 159171 68669
2263 68669 120822 79851 153439 45673 163720 236605 112625 87547 161748 240456 249421
2252 249421 233619 230672 148074 264208 191216 197780 207225 149843 92311 96715 66930 -53295
2240 -53295 27079 130500 128030 155633 114167 78313 132208 165812 79044 97320 97623 127629
2228 127629 110253 25329 151719 139781 241326 238970 240600 162813 253890 292639 154790
2217 154790 137913 191801 104048 159402 192205 108324 227176 240739 189830 172939 59995
2206 59995 152750 235355 217935 18105 86030 188004 178091 92416 101245 174490 94488 76548
2194 76548 254536 208885 241784 322853 266917 197757 159593 158366 204508 256437 354394 285450
2182 285450 293073 370710 360721 346026 319147 293675 225621 192260 243495 348487 249971 252957
2170 252957 211686 267474 409618 310361 183918 121408 186111 189255 200180 334817 376313
2159 376313 345959 300623 219519 295645 339469 364416 422811 348183 372386 416258 371593 440858
2147 440858 400434 444008 406891 458244 484221 434259 454926 492636 585206 564943 533535 522411
2135 522411 587766 612314 689684 564200 646084 709745 689020 790771 765589 768820 822335
2124 822335 945328 1039635 974252 1006206 1115572 1255514 1255878 1319055 1384415 1434886 1438638 1373446
2112 1373446 1472458 1513906 1665932 1674726 1662552 1622026 1610261 1746020 1677029 1634026 1615729
2101 1615729 1651954 1583638 1606278 1709940 1725150 1722251 1854856 1906053 1933111 1925021 1996592
2090 1996592 1959260 2075052 2139834 2217854 2381287 2332212 2332242 2342030 2342026 2428346 2543122 2701438
2078 2701438 2786733 2928515 3093703 3232829 3225808 3262971 3389111 3598621 3758150 3959234
2068 3959234 4152937 4384739 4701984 5058797 5301576 5731780 6263093 6828036 7470618 8111113
2058 8111113 8710666 9374779 10158582 11191574 12229444 13619680 15379835 17480826 19746831
2049 19746831 22356372 25707057 30222131 36156035 40207583 38606499 31808210 25274393
2041 25274393 20334223 16925679 14352783 12403105 10812255 9423986 8423487 7552257
2033 7552257 6790915 6242436 5804397 5531710 5216252 4803191 4327832 3949820 3643556 3384559
2023 3384559 3177819 2912638 2768337 2749766 2470220 2291009 2204212 2062162 2083094 1934060
2013 1934060 1828306 1736001 1577044 1678467 1631376 1493351 1425546 1352197 1321006 1278909 1225608
2002 1225608 1149027 1092252 948973 972978 1022983 1131122 991289 890310 938237 1043052
1992 1043052 993532 899805 831378 771382 626411 639012 630016 663426 588752 581089 626238 590637
1980 590637 676138 701215 584834 544246 584193 491481 480913 446594 389553 418604 520946
1969 520946 417967 403895 394158 320362 260961 249922 396254 434116 328318 317266 304748
1958 304748 306571 254825 251618 234695 368369 469558 361399 304710 279177 241309 163050
1947 163050 116619 192684 231301 184087 235512 284794 306674 191305 215922 142932 118472
1936 118472 212360 162901 125046 165639 29227 141046 218560 158438 184178 274596 263252
1925 263252 216990 180362 108918 147440 94723 116537 178733 31789 -37596 50575 89778
1914 89778 183754 235229 199982 127418 144692 30290 83640 101217 -23559 37988 70073
1903 70073 38769 -9073 26522 36937 101152 74870 114500 137477 102888 102893 -16601 25822
1891 25822 -29758 39538 -26555 -113377 -914 24598 -74605 -60881 -52747 -74766 -35800 -985
1879 -985 111498 71786 -3459 -25704 19813 45261 82537 2613 -47852 1292 9708 -37383
1867 -37383 48035 161006 198876 144680 16752 137996 168614 149071 171569 99117 50033
1856 50033 21801 -29895 10323 -12864 39869 43121 77430 90927 159861 202130 20588 43409
1844 43409 72320 76852 -12497 82808 170985 163838 93614 6072 2143 -17461 -34529 -81610
1832 -81610 -39042 -19721 -36878 25630 35837 79723 63337 33162 58621 37943 121104 206960
1820 206960 53968 37836 -66766 -81409 -26169 -23743 204973 133816 -2994 39530 156734
1809 156734 123358 117802 26515 26111 29802 8517 19224 90047 50166 43345 -38909 -69873 -5298
1796 -5298 -13905 16723 165663 103969 18424 108432 159547 134708 52924 171175 106960 155813
1784 155813 33706 62748 133092 146434 211558 82797 181534 162445 100570 270799 191065
1773 191065 235165 97846 53722 81660 100516 9453 -36743 20452 -88000 -15582 58004
1762 58004 147565 36561 23323 48629 83665 180393 101971 -27876 -45223 -7642 -8663 -43772
1750 -43772 90724 117410 97243 128172 21829 -16786 3035 47489 114861 163265 42139
1739 42139 -12397 -11590 -50794 -65089 -65609 -71109 -17461 4256 -81734 6056 49027 16757 28214
1726 28214 49378 -84338 -41496 -73473 -113171 -57640 -62025 -5970 49855 52646 46308 150356
1714 150356 29134 -34300 102621 -5466 -12306 21089 4922 -24546 27432 58796 35517
1703 35517 -10189 -93623 -56639 106090 102531 -64895 -11271 15289 72398 94516 -7386
1692 -7386 77206 71147 -8916 -88963 -86768 21421 -48848 -37052 -58890 -97101 -161412 -90644
1680 -90644 -49005 -80697 -140677 -31528 -84108 -155637 -71169 -4459 16228 -6297 22843 -38975
1668 -38975 -24471 -114593 -151089 -38473 -38838 -62825 -44283 19230 -9874 -2399 26756 206
1656 206 57724 8276 -23164 -31532 -245 -61054 -137863 -129432 -146578 -170095 -55032 6683
1644 6683 -130404 -92234 -59843 -20708 -2321 -83227 -101289 176 16403 -74599 11586 -416
1632 -416 36444 108193 39679 38054 50733 59454 62389 41171 148978 98025 68433 51804 -52600
1619 -52600 -103703 -113918 74106 112523 16384 -83312 27899 139647 156918 145611 72129
1608 72129 -65809 -118073 -83773 -97779 -164374 -99106 -22402 -66430 57335 -37290 -77144
1597 -77144 -137618 -133265 -120920 -126499 -66110 -1753 -13531 22139 38659 -85346 -35189 1875
1585 1875 -45227 -15081 1456 -30220 86578 51216 115335 45289 12880 108366 77897 -7235
1573 -7235 -108475 36037 66303 -66765 18095 -3756 14018 48919 53290 14427 -61719 -98085
1561 -98085 -87425 44679 49089 70748 -112846 -128900 -151343 -143873 -145207 -40606 11860 -78690
1549 -78690 -25917 -82013 69575 73832 91921 33423 32587 101902 64424 15366 45234 17577
1537 17577 -5672 51436 -52105 -91817 -28003 -104275 -152303 -194116 -187739 -220727 -240995 -114518
1525 -114518 -99110 -17432 51125 37245 -37943 -35638 -105407 -31088 -28206 -55765 -95500 -86438
1513 -86438 -23849 -132582 -104102 74966 23775 -66349 -152322 -176817 -136716 -165408 -11964
1502 -11964 -69256 -12774 60677 64133 63355 -145653 -228304 -180167 -65396 31438 21095 8806
1490 8806 -21333 -146254 -127712 -65955 -65695 -36173 -43407 -17551 -59135 9975 45296 -47944
1478 -47944 -67799 -48041 -5292 40489 38308 8832 3725 4898 -116629 -160844 -89258 -151675
1466 -151675 -119139 -73854 -79766 -166390 12286 11289 -151991 -89002 -25881 36042 54879 -68724
1454 -68724 -51975 -30492 -46992 -30635 22959 -11027 -97710 -48302 -84500 -71084 -58499 38241
1442 38241 44737 -42052 -107118 -15126 -68089 -76098 -90220 -100000 -96331 -42626 9910 -72465 -1250
1429 -1250 25425 106256 68993 -77059 21701 35698 -19753 -22006 27123 21213 -40686 -175343
1417 -175343 -266835 -162420 -89899 24038 -5354 -87110 -126703 -153995 -95374 20095 27375
1406 27375 -11661 10778 41843 22654 -70297 -101678 -91177 -50149 3732 -17431 42339 52819
1394 52819 -19827 -22149 -34722 -2658 45007 -21657 -71734 -94460 -38884 67 -14364 -13041
1382 -13041 74341 28052 -14358 -31855 -9770 22523 -119302 -10950 55542 8829 -6437
1371 -6437 47748 49674 68857 11225 -12687 32672 54197 7261 -20413 -37965 -74395 -102095
1359 -102095 -146171 -64718 -9619 -54513 -110049 -160991 -164802 -57864 29316 22533 -102341 -128306
1347 -128306 9663 40500 -46948 -141400 -57972 -80499 -35659 -33874 -83284 -74510 -122626 -48351
1335 -48351 -52964 -59418 -106210 -140594 -10051 87813 144303 40115 -19341 -97092 -65638 -116251
1323 -116251 -163085 -172540 -50207 6012 -155289 -146661 -27724 57714 23648 -6794 -55315
1312 -55315 15056 -138393 -130816 -141434 -75970 -21014 -59218 -99702 -60832 8518 47759 -12777
1300 -12777 -112297 -72546 -18755 -33700 -23672 -116056 -54468 -56653 -95751 -110683 -107102 -15112
1288 -15112 -29974 -130885 -56563 34296 -99856 -64585 -1524 -92795 -119176 -71286 -54973
1277 -54973 -54203 -69561 22253 -12104 -69410 5817 -2723 -53311 -62374 -47162 -64320 -31902 70622
1264 70622 14906 -82613 -107977 -69789 -75917 -145772 -62231 -18837 -64572 5655 1488 -50904
1252 -50904 -22062 -59148 -107693 -58592 -6064 -41821 -103998 -437 -42903 9535 52536 31181
1240 31181 56472 -46679 9417 -7458 21269 14636 -29372 -96395 -105044 -65880 -13339 -84119
1228 -84119 -26043 63172 7939 145865 215636 87298 -40948 -29599 14986 -30876 -63444
1217 -63444 -8161 -67315 111490 96331 71773 15621 -33592 -78114 -144246 -192273 -226262 -95680
1205 -95680 -35058 -46967 -105159 -105917 -33657 -121375 -117432 16650 -35661 -33196 -89095 -209292
1193 -209292 -247843 -209332 -240449 -136985 -140800 -159655 -68673 -113163 -41115 -69381 -2902 16725
1181 16725 -129532 -153628 22422 -2402 -50611 -59402 -53527 -125109 -138601 -143767 -79587 -97774
1169 -97774 -117160 -44203 -27120 -50561 -71420 -41856 -49815 -117597 -91797 -90446 -106041 -25899
1157 -25899 -60057 -45048 -774 67675 28755 36633 -32456 -30602 -17670 34204 59809 18668
1145 18668 -27473 -30944 25610 12480 90186 86597 51714 -99334 -118071 66894 -12919 -98216
1133 -98216 -24721 -56176 -27471 78387 691 -46004 23252 148363 193622 170110 112221
1122 112221 41631 -66581 24152 13118 -78206 -148529 -105322 -97034 -56325 -13180 204 -6396
1110 -6396 -14103 7474 83055 -5087 -19594 -89157 -15076 -51541 -133731 -75239 51091 94858
1098 94858 -101163 -141954 -21545 94027 66943 101707 127113 106641 -19037 -4441 -66760
1087 -66760 -16810 -31075 -69989 -47926 -58428 26836 123817 30043 64985 57102 32176 53464
1075 53464 37181 -112877 -173291 -92013 -17308 36943 -6717 115130 49686 50908 5838 9428
1063 9428 47536 -47022 -89461 -34996 56772 109368 -25947 -54393 -85425 -224949 -166846 -79925
1051 -79925 -20065 -40158 14070 50154 -86256 -84170 -63174 -82942 -23103 -94428 -14207 -29499
1039 -29499 -104825 -93943 -34199 -18350 -14595 30392 54254 -27272 -113652 -40182 -42528 -34806
1027 -34806 -43257 -58364 4480 -33595 -42894 -8222 44574 10921 -4161 4509 -22641 -117191
1015 -117191 -76891 -92807 -97703 -108379 -61474 -50264 -92621 33457 28115 19651 -40747 729
1003 729 -95061 -148197 -92813 -23941 -3637 -43517 -141716 -126449 19206 6682 10485 -10010
991 -10010 5112 26904 5911 8543 79891 16027 -51036 16581 14154 69158 85502 -14336
979 -14336 -33948 -22967 45586 19035 -45704 -33208 36716 -1203 -136014 -98636 -297 101950
967 101950 122038 34740 42981 133769 30230 110349 78901 32498 -49976 -113091 -42377 -38565
955 -38565 60011 -35257 -11543 -20325 -60673 -73523 -131145 -117249 51126 17420 -40351 91023
943 91023 169418 131938 143187 97441 86929 12957 48487 57405 105231 105635 82552 52864 56695
930 56695 151077 100939 -8791 -24989 19532 23981 29219 30102 76634 -52879 -92627 -139443
918 -139443 -90515 -91356 7880 -16446 -92608 -82922 62331 38682 13595 -53287 -86899 15161
906 15161 -19128 21042 56120 -37994 -12751 -43171 -153332 -55535 28546 88056 58796 -16298
894 -16298 13972 44150 -121080 -66128 -2425 -59736 34384 67286 155544 72282 -60058 -92438
882 -92438 -47845 -101230 -87835 -71639 -27375 -35465 29343 -15432 -49358 -78519 -117218 7799
870 7799 16952 -53506 -122695 -10135 91817 -33070 -67026 2139 59129 62751 77760 5555
858 5555 52065 36146 5318 6689 -52476 69969 25784 33365 -53624 -17875 29267 -9119
846 -9119 -160281 -61379 -74105 -61204 -54759 -76163 -36878 -2787 -10455 -16658 -19731 -37483 -71680
833 -71680 294 68588 -21435 -13591 5609 -41835 -59689 -53033 51076 -45187 -113263 -23426
821 -23426 -37507 -82202 -11309 11034 -7003 -52969 -55233 -23566 -70878 -46461 -119908 -49983
809 -49983 -46577 -66622 24691 -31864 -57844 86384 90889 -45133 -32532 89479 13420 66603
797 66603 42780 -8892 -11206 -13840 2265 1635 -23856 -99066 -103762 -5895 -29548 -80986 -44488
784 -44488 88277 80602 -50045 719 49639 119867 152998 -68394 -70044 -41671 -53635 53688
772 53688 59731 134435 34709 68239 98341 57414 104332 16214 -47126 26436 -96805 -123868
760 -123868 -93227 7412 100854 41339 53490 -1005 -85257 -100985 -33061 -5557 -35053 8852
748 8852 65856 40084 -25620 -91534 -23961 79315 52836 -18210 39238 31029 -76062 -38244
736 -38244 -33146 105384 128124 20747 -22448 -4053 73620 64242 78210 106436 65192 -75452
724 -75452 -66037 75804 148617 141829 37650 65139 85342 -60848 -72396 -28560 -134098 -129088
712 -129088 -96275 -8189 -33625 -134714 -61151 35294 107176 37318 -103413 -9621 69228
701 69228 15527 15885 -22941 -42026 -77314 -894 44730 74962 52866 134 -93729 -84467 -65697
688 -65697 -5895 -8485 -33578 -45223 43650 16380 49180 58531 127058 65604 52858 35234
676 35234 24741 76583 75462 56163 -30551 -14148 -44919 -20334 -98715 -105330 -851 -14276
664 -14276 -99364 -55528 -32667 -105968 -96620 -147124 -128307 -80213 18450 160140 -6556 73821
652 73821 39622 18964 106460 41842 -21128 -64999 -54058 -76734 -27867 43417 9570 158991
640 158991 131515 38774 51599 80560 173838 67814 -59633 -35565 -60547 -57216 52123
629 52123 42046 43789 -19260 -111486 -46748 -47858 34554 66923 -15230 96241 163358 179773
617 179773 97009 16548 37558 118836 90870 12592 62537 27270 -36046 41930 117405 21534
605 21534 92263 -4231 -35848 154902 138171 81620 21334 6579 4926 -55942 -64835 -78404
593 -78404 -63645 -52863 -38193 -40533 -37363 -6613 42073 59377 60689 -124553 -36861 57839
581 57839 -16233 -70222 -49987 46270 88239 126074 27245 79441 136865 -13066 -63644 -3020
569 -3020 9539 295 -67500 -141513 -150623 -43731 -3087 27150 -29087 98566 160933 93300
557 93300 107508 110570 73717 28677 85307 51495 47046 1215 -56836 52554 137555 85676
545 85676 1793 -26037 19624 -33503 55795 158303 110873 12786 -45192 -4961 54270 112820
533 112820 110263 79056 -61084 -34670 75399 151865 113221 46943 132415 90472 63186 138639
521 138639 49208 36148 49553 16966 -81076 51366 69297 93588 92556 26010 -16835 -420
509 -420 6605 47063 119830 5917 45371 -24544 25399 92359 -29322 49419 64208 1931
497 1931 61362 151882 92058 28019 -38167 -185483 -88505 -25725 17564 36850 31834 43369
485 43369 26719 -42402 -29233 12765 -42325 39856 14397 58917 -5646 -86098 -44887 28073
473 28073 82964 52347 48127 -55267 -66726 -71822 -95608 -17445 -11180 11202 48603 69558
461 69558 150037 102129 30395 99151 41736 1266 7152 -66771 48172 2401 69711 109688
449 109688 149367 117714 106483 76457 71735 47988 55577 63593 30388 104669 113600 154621 116846
436 116846 47742 114942 170318 92582 11293 43649 68441 61506 91004 101239 113371 -4695
424 -4695 -55675 14993 60122 30686 27645 32253 32644 34042 36693 24279 70636 -39293 -67601
411 -67601 95662 34041 564 -52592 -121497 -35004 8873 17920 -43445 -66924 58626 7664
399 7664 65165 51175 -5252 -21484 67904 194990 62525 65871 133606 214239 143975 104531
387 104531 -50804 -99930 -17736 34874 73454 52791 139758 223536 189632 100776 11379 -21144
375 -21144 5209 48571 94318 42424 78343 58940 27998 -55834 107126 96949 -68419 -34559
363 -34559 75790 116191 70192 39029 -44501 6103 -50587 -65373 -18183 78997 83043 54906
351 54906 47786 67195 144939 101050 -13194 161106 101704 50718 7834 18063 11448 56175
339 56175 87617 -21329 1620 37543 74373 120594 78423 -69930 -78086 -13057 -36344 -20939
327 -20939 -11854 86516 140646 3701 88348 50396 44195 110670 127758 36285 46430 39969
315 39969 -37985 -16007 6092 -29305 -68207 -65206 -89950 -87266 -16300 -62169 81364 169019
303 169019 185582 109787 94940 80094 77188 173166 66419 38970 84071 97497 60925 35573
291 35573 30817 -60697 -56563 -70993 -39381 40107 33298 -29849 51166 -29664 -37946 19933 -9175
278 -9175 80481 35772 96688 63228 -4368 16562 -51043 -26493 27956 33617 91201 112609
266 112609 87640 125938 98439 87330 37019 -11460 110153 100457 122716 169819 188084 72452
254 72452 74131 82013 47888 17058 -1402 7801 52160 -25267 61934 120990 69829 85594 230
241 230 -51200 69246 244054 140189 -1254 -2321 103092 95898 -7206 22338 -30561 102200
229 102200 162031 34405 75362 117449 27361 -15748 3164 862 43871 104004 121354 20936
217 20936 -32129 20198 55695 59734 45592 35116 92702 70868 48869 35000 34722 72172 46489
204 46489 47503 148078 73423 -18790 132190 70465 80382 145971 9160 29061 42384 131218
192 131218 128108 99707 141168 100782 48074 50407 47263 -10410 50671 154482 82592 -15085
180 -15085 68661 79308 24950 121406 87064 31968 47040 128337 69609 69347 58013 -26026
168 -26026 -8144 41736 71633 57970 6810 -12910 -11932 63102 119387 93265 59573 -51905
156 -51905 -35085 26418 65392 50893 29837 58494 130387 140758 90778 102717 117070 161323
144 161323 163107 45750 3779 -26599 57240 47408 121695 120248 141851 120735 -88864 -60312
132 -60312 3354 -109090 -37356 -19355 -17316 59063 36739 40646 56848 53180 83238 49958
120 49958 60599 126021 132167 57718 8443 38041 83593 147934 53092 9641 22893 95714
108 95714 66253 63130 67294 92320 81604 107312 130384 118574 112613 133098 169456 147574 52272
95 52272 47394 120890 19757 -24014 4401 131064 141737 171371 79218 -26169 99648 117845
83 117845 55422 -14876 35720 38728 30117 -948 94814 151973 130948 108047 97777 107900
71 107900 93817 36339 82228 73098 20236 31368 161257 86783 99565 194601 127405 92643
59 92643 94046 66800 46362 34617 -12082 22601 180827 166575 60556 52326 -44432 -7245
47 -7245 -44286 -40486 23126 83834 52204 132973 160205 61465 77368 85318 51779 22131 70339
34 70339 125597 42838 -5320 19490 34036 -21132 16023 64906 52534 64366 59271 84019
22 84019 124291 156557 119031 116838 108045 163466 169173 155540 175054 98157 36149 -1529 78373
9 78373 35572 68065 93692 107161 64269 110438 69470 65252 48878
0 48878
$$ Imaginary data points
##PAGE= N=2
##DATA TABLE= (X++(I..I)), XYDATA
16383 -2325473 -2262577 -2256681 -2331430 -2317116 -2286866 -2271767 -2192934 -2200275 -2102224 -2060439 -2065854 -2048613
16371 -2048613 -2053385 -2042694 -2050775 -1976327 -1942385 -1862808 -1926336 -1860105 -1893396 -1797232 -1728271 -1704385
16359 -1704385 -1704153 -1694124 -1571408 -1550585 -1590616 -1575643 -1487209 -1502917 -1508722 -1461402 -1442538 -1359795
16347 -1359795 -1280207 -1240773 -1350487 -1256516 -1169614 -1185370 -1272179 -1226960 -1115006 -1145711 -1135273
16336 -1135273 -1093052 -1051077 -1024497 -1004361 -939726 -936698 -879176 -875323 -875966 -799984 -743311 -698598
16324 -698598 -703380 -691438 -715773 -639225 -575603 -511397 -547018 -561869 -563834 -463997 -426628 -402431
16312 -402431 -375767 -366650 -359832 -281461 -224687 -227825 -252418 -237147 -238778 -248748 -110122 -59924
16300 -59924 -105022 -70585 -51188 28652 49952 66509 60247 73757 79671 184577 191868 122679
16288 122679 179230 182113 193729 173834 185068 280537 355410 353645 354299 371498 359712 406160
16276 406160 397013 427727 463844 478844 585972 619236 624126 600868 630778 663516 712293 704604
16264 704604 612230 730620 764683 770490 881255 846302 850485 973863 915636 1017702 958992
16253 958992 961318 986958 992338 966025 987500 981599 1039946 1127701 1072139 1086383 1017466 1059660
16241 1059660 1096441 1141374 1061449 1044923 1217916 1241695 1185093 1235724 1266711 1310144 1263911
16230 1263911 1334021 1309248 1344425 1379276 1406726 1472688 1440784 1379404 1355308 1418924 1494094
16219 1494094 1532744 1552449 1518308 1538301 1522683 1466866 1503209 1502859 1502343 1585031 1572674 1633091
16207 1633091 1674166 1644614 1641051 1681783 1707690 1686087 1703405 1683552 1644228 1748393 1805098
16196 1805098 1723078 1671686 1703311 1663550 1624496 1650499 1685792 1759350 1814229 1805161 1818564
16185 1818564 1893216 1958482 1932664 1962772 1960280 1830743 1866459 1867882 1851701 1841043 1989724
16174 1989724 2063728 2007177 2004737 2003766 1922980 1901950 1942341 1926000 1970087 1846970 1781427 1864243
16162 1864243 1951852 2051669 2105028 2139654 2180394 2156562 2091093 2174406 2103578 2044206 2078427
16151 2078427 2091201 2146380 2195814 2200090 2176071 2205085 2156189 2216289 2167858 2070521 2109398
16140 2109398 2063902 1977291 2071689 2176208 2218563 2171993 2133762 2086791 2130627 2107371 2113879
16129 2113879 2211529 2260454 2266272 2226674 2142792 2127144 2153886 2194821 2155970 2195370 2160093
16118 2160093 2214960 2275224 2197244 2197167 2239824 2300226 2268537 2292791 2315622 2404809 2313081 2251917
16106 2251917 2196530 2273237 2327701 2282950 2339194 2336498 2264918 2232353 2221770 2201960 2195633 2342331
16094 2342331 2259481 2225380 2102632 2133762 2166431 2141014 2238589 2223849 2184438 2190204 2133110
16083 2133110 2087406 2093560 2161047 2274307 2288316 2264424 2269664 2214532 2209035 2197558 2190125 2272283
16071 2272283 2376060 2344600 2255675 2286533 2399948 2413007 2358410 2319944 2289509 2218426 2278279
16060 2278279 2250903 2361152 2370670 2286413 2210414 2217333 2373789 2422026 2387223 2327837 2486148
16049 2486148 2525527 2459894 2338874 2270383 2310641 2353990 2266590 2404440 2369806 2315566 2293618
16038 2293618 2313893 2304737 2268214 2280496 2346347 2305529 2364513 2398288 2467668 2474206 2381766 2261967
16026 2261967 2332923 2285643 2263594 2292422 2259119 2301756 2318373 2324963 2333913 2389009 2467102 2467505
16014 2467505 2453946 2450832 2298909 2356746 2408619 2455941 2362673 2441829 2421053 2295497 2288859
16003 2288859 2246157 2360591 2331970 2375956 2360650 2489544 2534227 2446858 2370953 2366649 2330519
15992 2330519 2251859 2393540 2382544 2336575 2416105 2384966 2377439 2429459 2475624 2424316 2390163
15981 2390163 2452784 2451780 2367257 2289437 2319446 2301150 2410092 2345235 2395073 2494513 2377902
15970 2377902 2317320 2356262 2337821 2393282 2411993 2365723 2405011 2330965 2335391 2464767 2392497
15959 2392497 2390437 2404008 2411120 2398126 2380182 2351898 2395332 2350978 2391141 2370516 2405796 2446521
15947 2446521 2407472 2269539 2428134 2530717 2389915 2315516 2177412 2291329 2307157 2338677
15937 2338677 2294958 2383021 2423516 2443622 2415520 2437385 2374742 2425085 2514857 2401282 2383711
15926 2383711 2381051 2378224 2312857 2317656 2452851 2422455 2336949 2305861 2332650 2340243 2348651 2435824
15914 2435824 2494615 2594696 2532578 2366738 2351342 2386742 2377517 2383289 2421028 2466779 2514221
15903 2514221 2481252 2443213 2377119 2345767 2373851 2451677 2561373 2465699 2357385 2342081 2340414
15892 2340414 2295539 2331421 2404943 2376464 2446938 2380075 2362731 2412097 2375623 2410319 2481431
15881 2481431 2509526 2326620 2382210 2363407 2244425 2203529 2338596 2428314 2387854 2397358 2348083
15870 2348083 2386779 2327642 2297655 2371504 2431905 2448526 2382597 2330818 2200809 2307643 2293954
15859 2293954 2364245 2411536 2435150 2391380 2298981 2294793 2338617 2501441 2467924 2474067 2452588
15848 2452588 2387379 2385684 2317573 2281407 2374900 2413434 2473567 2496238 2467589 2479869 2485994 2485442
15836 2485442 2376537 2397172 2441854 2397156 2356157 2321742 2355949 2375998 2365514 2387319 2440245
15825 2440245 2459448 2539009 2482460 2458402 2373314 2437167 2331502 2347921 2380487 2324079 2276561
15814 2276561 2352191 2443559 2461379 2445451 2407449 2469747 2514684 2415889 2374341 2442671 2520869
15803 2520869 2514635 2454658 2373521 2412827 2432900 2470457 2414766 2401075 2517034 2486020 2470285
15792 2470285 2495968 2515096 2357209 2353630 2426470 2442998 2413195 2369759 2286240 2305039 2438656
15781 2438656 2417150 2334714 2399854 2434098 2408735 2360375 2311556 2362007 2368403 2516667 2455627
15770 2455627 2308286 2284419 2326556 2438261 2246870 2400399 2563410 2434984 2356410 2375377
15760 2375377 2341175 2356028 2409135 2407947 2353898 2326622 2382767 2468599 2497329 2362916 2278760
15749 2278760 2329244 2325449 2462938 2453100 2469093 2441275 2471544 2519072 2435474 2449622 2417909
15738 2417909 2329686 2421324 2381304 2289768 2337877 2515152 2498115 2488225 2512991 2376975 2495164
15727 2495164 2526208 2516237 2574208 2512432 2354914 2372302 2437548 2364988 2363330 2471481 2429191
15716 2429191 2328659 2377014 2416877 2310798 2397419 2440985 2481543 2540409 2495409 2529753 2473043
15705 2473043 2399883 2450671 2450814 2463763 2566364 2561210 2514620 2495982 2477956 2513141 2494934 2549514
15693 2549514 2545617 2431385 2338664 2450634 2480869 2488195 2446640 2460371 2427724 2394776 2449920
15682 2449920 2436187 2505320 2484288 2440481 2454976 2489329 2527645 2463260 2393947 2372199 2450426
15671 2450426 2477343 2450093 2389040 2391739 2469015 2533968 2529781 2501486 2423721 2413782 2400315 2365797
15659 2365797 2392597 2326644 2428919 2475009 2403089 2420997 2491504 2434341 2565126 2482397 2459819
15648 2459819 2491277 2381105 2465068 2414478 2404030 2522484 2536473 2577500 2670868 2554522 2352416
15637 2352416 2405744 2370079 2369410 2431455 2454057 2374259 2465568 2505462 2430564 2457845 2505518 2458188
15625 2458188 2394527 2497473 2535386 2609545 2639756 2535342 2479116 2465976 2355927 2340852 2331742
15614 2331742 2371612 2530833 2569683 2499948 2432807 2485581 2548048 2450174 2462783 2466721 2414064
15603 2414064 2344646 2495937 2566164 2568845 2566842 2432779 2357454 2316927 2357389 2439912 2497891
15592 2497891 2557265 2427008 2416155 2333355 2436944 2564945 2567393 2624156 2462666 2469604 2412468
15581 2412468 2497664 2573555 2487625 2430733 2412371 2328701 2375892 2437392 2514075 2462773 2511548
15570 2511548 2534414 2478440 2361211 2357622 2527604 2529639 2596228 2574562 2527876 2448378 2430543
15559 2430543 2449002 2323389 2434677 2423609 2368714 2385774 2361402 2348260 2404980 2442390 2502494
15548 2502494 2507599 2582115 2658316 2624346 2621558 2515323 2540216 2520763 2517768 2429938 2425847 2478700
15536 2478700 2507914 2388587 2459215 2509309 2497037 2446539 2540517 2380551 2346576 2345748 2494660
15525 2494660 2513154 2490291 2519694 2404840 2335474 2404372 2466722 2374367 2564998 2602725 2646548
15514 2646548 2537126 2501460 2486102 2500387 2509087 2515639 2513381 2489589 2432725 2394490 2495549
15503 2495549 2473477 2437860 2424338 2398262 2492688 2424810 2408370 2403604 2305620 2427638 2473588
15492 2473588 2488651 2538440 2523459 2458059 2461536 2388932 2391414 2463034 2479886 2482220 2447279 2477303
15480 2477303 2492382 2473169 2524845 2523902 2474936 2618361 2527004 2522868 2486366 2497789 2415747 2385733
15468 2385733 2375803 2392248 2406074 2495223 2503333 2397985 2342700 2378286 2485862 2528223 2576129
15457 2576129 2495703 2486450 2511557 2477833 2468234 2493370 2451444 2455632 2585613 2514072 2482068 2472097
15445 2472097 2449328 2415343 2400361 2430632 2454545 2461709 2449089 2621281 2739553 2623010 2453574
15434 2453574 2538099 2501586 2483722 2416039 2502570 2505047 2478654 2492590 2450126 2399293 2470129
15423 2470129 2492533 2461099 2520561 2493852 2412704 2527615 2501651 2419313 2495589 2471489 2402900
15412 2402900 2435978 2526111 2478415 2587621 2467409 2353912 2430570 2509829 2505824 2444005 2476389
15401 2476389 2498604 2537261 2494698 2469715 2567748 2550855 2514746 2546113 2556480 2389342 2455574
15390 2455574 2478099 2410996 2315276 2359070 2514751 2495900 2479776 2423047 2465999 2542470 2579725
15379 2579725 2600710 2442371 2428721 2527001 2533958 2584126 2621289 2638119 2542779 2430532 2357002
15368 2357002 2484447 2573282 2541525 2611456 2623114 2443610 2406570 2448491 2495046 2523371 2551691
15357 2551691 2553961 2535774 2515899 2488779 2530560 2548214 2524627 2515184 2504568 2570715 2621746 2565610
15345 2565610 2465137 2441005 2387082 2438188 2492140 2503609 2418711 2441440 2428191 2489217 2534010
15334 2534010 2472703 2472345 2452342 2521085 2502600 2432380 2470723 2522722 2522604 2474398 2435600 2576703
15322 2576703 2529363 2479628 2477194 2549048 2490028 2443796 2466330 2497677 2519524 2504819 2429048
15311 2429048 2421620 2409936 2451391 2677966 2543608 2504808 2483770 2440571 2470841 2489683 2511489
15300 2511489 2583019 2447745 2502021 2547911 2456380 2547294 2461991 2548366 2481554 2531048 2562120
15289 2562120 2417109 2415600 2543780 2566338 2420064 2445962 2605014 2618334 2466866 2539548
15279 2539548 2557588 2519043 2458201 2347560 2374857 2491144 2512943 2532951 2613093 2668835 2544655
15268 2544655 2471042 2497309 2456928 2461807 2521855 2593857 2496967 2578824 2601019 2536080 2524003
15257 2524003 2646186 2613847 2551250 2577062 2513826 2615174 2582212 2467731 2603898 2557174
15247 2557174 2438968 2500961 2563733 2440614 2470951 2492422 2532221 2508015 2455866 2536630 2570160
15236 2570160 2545652 2599347 2498239 2476330 2485083 2560615 2716349 2538307 2611348 2648191 2558484
15225 2558484 2554302 2527468 2548894 2648955 2605057 2552234 2598807 2569129 2503479 2633740 2572431
15214 2572431 2504353 2444248 2609345 2505861 2486351 2579263 2479950 2484015 2552605 2484605 2498147
15203 2498147 2547011 2478170 2528621 2543741 2542303 2521789 2621585 2506381 2408498 2506418 2568185
15192 2568185 2523888 2504833 2581262 2571344 2462335 2590201 2619805 2589649 2541794 2542796 2571866
15181 2571866 2559340 2534444 2447178 2467822 2507150 2509559 2535610 2517466 2532521 2640526 2489228
15170 2489228 2456230 2522810 2514881 2506099 2526481 2620130 2479288 2594558 2609841 2484440 2359317
15159 2359317 2414187 2521580 2642232 2609804 2660781 2716169 2693082 2665603 2574789 2553004 2557411
15148 2557411 2588487 2574986 2496175 2557715 2599197 2496520 2587711 2580797 2589620 2601844 2558207
15137 2558207 2533838 2517698 2564158 2509601 2495487 2658350 2639447 2471607 2405767 2463871 2520399
15126 2520399 2626640 2612237 2587296 2553063 2622336 2620492 2642048 2649566 2531717 2522898 2608508
15115 2608508 2621487 2640245 2458045 2517538 2576780 2647705 2651350 2589329 2501107 2487504 2510981
15104 2510981 2625517 2519275 2513425 2641373 2667813 2611657 2682546 2567092 2556226 2669547
15094 2669547 2547996 2644970 2610500 2593419 2593250 2591611 2570195 2545552 2428253 2597843 2699139
15083 2699139 2687682 2579417 2635751 2724431 2674142 2666393 2771153 2610108 2484304 2547650 2572461
15072 2572461 2615576 2553001 2593368 2581088 2513823 2418067 2523894 2616026 2593077 2561651 2556649
15061 2556649 2653535 2585195 2583524 2550986 2521642 2601472 2523079 2437699 2490443 2474115 2414945
15050 2414945 2534403 2572500 2392423 2387215 2601969 2574227 2497854 2644684 2585766 2519195 2439639
15039 2439639 2507955 2549127 2463677 2499069 2543369 2490289 2537177 2478584 2486768 2450791 2545866
15028 2545866 2581781 2560336 2626332 2678147 2645175 2599075 2618241 2657098 2584548 2483242 2527874
15017 2527874 2457630 2490458 2431635 2450463 2482637 2597253 2623223 2560352 2530913 2592847 2586828
15006 2586828 2602370 2611912 2536923 2549509 2610901 2553517 2547643 2543839 2461898 2506874 2546031 2635129
14994 2635129 2632913 2586960 2572116 2615083 2502350 2511923 2627724 2629345 2571398 2594651 2641019
14983 2641019 2532958 2614531 2751648 2703942 2699223 2682580 2602443 2561571 2560049 2564239 2568937 2524905
14971 2524905 2508355 2570990 2559750 2498329 2558369 2642501 2663373 2642690 2621692 2521571 2521390
14960 2521390 2612561 2641285 2592824 2630257 2589532 2580386 2565333 2612989 2691707 2702733 2557934
14949 2557934 2471447 2509721 2623958 2610310 2520969 2533357 2460077 2656593 2658895 2588051 2572743
14938 2572743 2574100 2614040 2740414 2599228 2561130 2592117 2540994 2600171 2647573 2557565 2638124
14927 2638124 2720034 2699600 2798079 2728093 2659237 2665715 2611481 2673351 2634272 2720105 2707022
14916 2707022 2764688 2657657 2632830 2672917 2673300 2624481 2616173 2549360 2602389 2649928 2636394 2658296
14904 2658296 2592278 2669859 2579146 2571283 2602461 2616731 2573823 2557533 2653312 2652999 2604458 2581708
14892 2581708 2563715 2573204 2583315 2720679 2654595 2729857 2681794 2641023 2675055 2669617 2568460
14881 2568460 2510569 2634102 2625454 2548757 2463674 2432642 2513833 2522691 2548665 2611111 2634744
14870 2634744 2732523 2695743 2677100 2641645 2664720 2587765 2529439 2518409 2580350 2651957 2621860
14859 2621860 2727437 2702167 2627423 2608972 2545604 2538871 2526333 2548708 2583248 2515135 2550338
14848 2550338 2561229 2471194 2419056 2575280 2673381 2697540 2582487 2608227 2572276 2697290 2689581
14837 2689581 2627323 2710578 2680553 2588300 2551853 2519073 2651324 2690322 2637579 2506157 2486529
14826 2486529 2623470 2603601 2562001 2495050 2579885 2632270 2659759 2838559 2691862 2542658
14816 2542658 2575606 2429254 2534351 2560125 2658590 2675944 2552188 2671717 2797556 2611670
14806 2611670 2572305 2639457 2699704 2724024 2570747 2538249 2612588 2608626 2644958 2580932 2516528
14795 2516528 2574017 2593857 2622539 2515623 2548871 2602635 2609645 2642560 2594007 2559425 2606877
14784 2606877 2594758 2512296 2530864 2560895 2650397 2709857 2605591 2575533 2650876 2624776 2692950
14773 2692950 2739175 2708990 2676499 2637465 2664592 2632422 2693305 2702043 2483059 2419866 2581308
14762 2581308 2636525 2643743 2618823 2496243 2569169 2503402 2568187 2577582 2544408 2540369 2658100
14751 2658100 2734471 2669461 2706774 2715820 2677579 2741822 2774534 2732589 2689965 2603104 2593596 2587674
14739 2587674 2556657 2550966 2557999 2594956 2547937 2556986 2684982 2648411 2662789 2632646 2647329 2666384
14727 2666384 2633172 2578133 2584801 2631858 2600633 2553611 2712917 2716908 2654877 2593494 2601846 2698381
14715 2698381 2604287 2734987 2687457 2553991 2615104 2637069 2674010 2655681 2649909 2691589 2773167
14704 2773167 2744506 2731369 2692995 2633452 2672712 2734378 2684542 2681971 2642720 2661942 2638405
14693 2638405 2702285 2758139 2650799 2615773 2741091 2706622 2605372 2653959 2615144 2603527 2633899
14682 2633899 2660260 2630740 2584186 2628476 2666585 2623088 2655042 2552587 2630194 2715713 2725724
14671 2725724 2723992 2684444 2551006 2466745 2588521 2682121 2714376 2608805 2559277 2580511 2703670
14660 2703670 2722829 2621563 2620414 2646207 2665262 2623772 2714259 2650954 2562803 2670362 2754683
14649 2754683 2594590 2630290 2722781 2721551 2638863 2655573 2621685 2593175 2539277 2581780 2746335
14638 2746335 2724612 2701462 2764108 2695855 2593322 2516542 2607927 2656953 2562690 2606744 2683084
14627 2683084 2700867 2620224 2625006 2626285 2570927 2590387 2696293 2671037 2736432 2771678 2797759
14616 2797759 2767874 2684222 2691993 2668868 2691451 2676202 2669151 2745019 2737989 2748119 2740922 2714197
14604 2714197 2614224 2671646 2676262 2621291 2562806 2563929 2608019 2585878 2714796 2783026 2798181
14593 2798181 2757436 2778032 2755586 2607425 2723661 2695216 2644384 2605470 2611474 2569829 2599827
14582 2599827 2557339 2674778 2620799 2595515 2643258 2684929 2743232 2647843 2739946 2829161 2823641
14571 2823641 2757407 2724740 2712775 2663414 2617425 2606986 2679807 2764136 2636191 2717818 2670316
14560 2670316 2669578 2691156 2765185 2685549 2619901 2688534 2674515 2725213 2709890 2593455 2678038
14549 2678038 2689502 2643634 2689429 2690260 2677467 2679040 2778484 2812284 2841385 2697741 2678484 2685152
14537 2685152 2595765 2692827 2673381 2588336 2570619 2564996 2622760 2497162 2622484 2736748 2715253
14526 2715253 2728987 2677321 2586846 2580570 2637320 2680402 2740804 2760695 2750606 2748243 2650032 2723599
14514 2723599 2686220 2597347 2735320 2774580 2807680 2772083 2753359 2702838 2711783 2689674 2689435 2635374
14502 2635374 2678709 2727006 2698313 2659120 2715535 2664367 2633423 2632993 2698861 2591721 2474159
14491 2474159 2609217 2649179 2698397 2756878 2676005 2734646 2751679 2683303 2656332 2747285 2746448
14480 2746448 2763023 2706516 2727269 2811060 2736481 2868773 2759166 2713130 2672307 2682779 2762085
14469 2762085 2808941 2808270 2804502 2787463 2856834 2848394 2838725 2779045 2782578 2801942 2720000 2633174
14457 2633174 2648640 2628707 2697809 2766979 2831329 2815272 2765496 2741668 2650396 2695381 2569203
14446 2569203 2675631 2774005 2781941 2737314 2725019 2744318 2660691 2698280 2780061 2813533 2815294
14435 2815294 2743088 2783991 2667951 2669911 2672522 2698618 2709566 2706259 2738095 2776644 2780929 2731244
14423 2731244 2707697 2635430 2713418 2817148 2851032 2894274 2966626 2797018 2662115 2650304 2641166
14412 2641166 2708064 2731079 2768620 2870796 2759460 2672446 2752365 2852824 2788296 2701091 2663011
14401 2663011 2713066 2725187 2762085 2785615 2797946 2909080 2822803 2775618 2733815 2795708 2818521
14390 2818521 2792026 2792452 2755135 2697279 2725850 2707949 2659576 2724884 2740537 2736203 2741298 2720108
14378 2720108 2699589 2675128 2703101 2736534 2748535 2775740 2833964 2839953 2852819 2862700 2850484 2777060
14366 2777060 2753955 2616455 2793781 2888452 2718674 2713393 2769918 2772348 2782939 2827109 2779580
14355 2779580 2871052 2826351 2821108 2749855 2763820 2845058 2750000 2668920 2664322 2626910 2668329 2618037
$$ [...]
##END NTUPLES=NMR SPECTRUM
##END=
